##TITLE=1H_EC-3277x-3
 DMSO
 8 sc, 
 27.09.2022
##JCAMPDX= 6.0         $$ Bruker NMR JCAMP-DX V2.0
##DATA TYPE= NMR SPECTRUM
##DATA CLASS= NTUPLES
##ORIGIN= UXNMR, Bruker Analytische Messtechnik GmbH
##OWNER= root
$$ XWIN-NMR		Version 3.5
$$ Tue Sep 27 14:05:48 2022 Russian Standard Time (UT+4h)  she@DPX200
##.OBSERVE FREQUENCY= 200.1313499994
##.OBSERVE NUCLEUS= ^1H
##.ACQUISITION MODE= SIMULTANEOUS
##.ACQUISITION SCHEME= undefined
##.AVERAGES= 8
##.DIGITISER RES= 18
##SPECTROMETER/DATA SYSTEM= spect
##.PULSE SEQUENCE= zg30
##.SOLVENT NAME= DMSO
##.SHIFT REFERENCE= (INTERNAL, DMSO, 0, 15.748)
##AUDIT TRAIL= $$ (NUMBER, WHEN, WHO, WHERE, WHAT)
$$ ##TITLE= Audit trail, XWIN-NMR		Version 3.5
$$ ##JCAMPDX= 5.01
$$ ##ORIGIN= Bruker BioSpin GmbH
$$ ##OWNER= she
$$ F:/spectra/data/she/nmr/H-F/1/pdata/1/auditp.txt
$$ ##AUDIT TRAIL=  $$ (NUMBER, WHEN, WHO, WHERE, WHAT)
(   1,<2022-09-27 14:04:41.62 +0400>,<she>,<DPX200>,
      <created by zg, POWCHK disabled, PULCHK disabled
       configuration hash MD5:
       00 E9 B6 7A A2 85 ED C7 34 08 36 98 17 FE 4E 26
       data hash MD5: 16K
       3D 66 F9 A4 2A 66 35 AF F9 F1 19 9B D6 59 71 7E>)
(   2,<2022-09-27 14:04:44.85 +0400>,<she>,<DPX200>,
      <Start of raw data processing
       efp BC_mod = 2 LB = 0.24 FT_mod = 6 PKNL = 1 PHC0 = -18039.28 PHC1 = 20.60069 SI = 16K 
       data hash MD5: 16K
       C4 AA 9D F5 5F 17 C8 11 32 92 9D 96 7A CB 23 F8>)
(   3,<2022-09-27 14:05:01.42 +0400>,<she>,<DPX200>,
      <pk PHC0 = -1.522952 PHC1 = -6.4 
       data hash MD5: 16K
       18 7D 0B 2D E2 12 DE 42 40 18 5E 9C 23 42 A5 7B>)
(   4,<2022-09-27 14:05:04.42 +0400>,<she>,<DPX200>,
      <abs ABSG = 5 
       data hash MD5: 16K
       36 06 0C 9E 79 91 4C F8 94 6F EA AD 46 45 CA 06>)
$$ ##END=
$$ 
$$ hash MD5
$$ 7D B1 75 47 92 D8 5A AC 74 CC A3 B2 A1 BA 4E 7A
##$RELAX= 
##$RELAX= 
##$RELAX= 
##$RELAX= 
##$RELAX= 
##$RELAX= 
$$ Bruker specific parameters
$$ --------------------------
##$DU= <F:/spectra>
##$EXPNO= 1
##$NAME= <H-F>
##$PROCNO= 1
##$TYPE= <nmr>
##$USER= <she>
##$AMP= (0..31)
100 100 100 100 100 100 100 100 100 100 100 100 100 100 100 100 100 100 
100 100 100 100 100 100 100 100 100 100 100 100 100 100 
##$AQSEQ= 0
##$AQ_mod= 1
##$AUNM= <au_zg>
##$AUTOPOS= <>
##$BF1= 200.13
##$BF2= 200.13
##$BF3= 200.13
##$BF4= 200.13
##$BF5= 200.13
##$BF6= 200.13
##$BF7= 200.13
##$BF8= 200.13
##$BYTORDA= 1
##$CFDGTYP= 0
##$CFRGTYP= 5
##$CHEMSTR= <none>
##$CNST= (0..31)
1 1 145 1 1 1 1 1 1 1 1 1 1 1 1 1 1 1 1 1 1 1 1 1 1 1 1 1 1 1 1 1 
##$CPDPRG= <>
##$CPDPRG1= <>
##$CPDPRG2= <>
##$CPDPRG3= <>
##$CPDPRG4= <mlev>
##$CPDPRG5= <mlev>
##$CPDPRG6= <mlev>
##$CPDPRG7= <mlev>
##$CPDPRG8= <mlev>
##$CPDPRGB= <>
##$CPDPRGT= <>
##$D= (0..31)
0 1.2 0 0 0 0 0 0 0 0.06 0 0.03 0 0 0 0 0.0002 0 0 0 0 0 0 0 0 0 0 0 0 
0 0 0 
##$DATE= 1664273081
##$DBL= (0..7)
120 120 120 120 120 120 120 120 
##$DBP= (0..7)
150 150 150 150 150 150 150 150 
##$DBP07= 0
##$DBPNAM0= <>
##$DBPNAM1= <>
##$DBPNAM2= <>
##$DBPNAM3= <>
##$DBPNAM4= <>
$$ [...]
##$SUBNAM3= <"">
##$SUBNAM4= <"">
##$SUBNAM5= <"">
##$SUBNAM6= <"">
##$SUBNAM7= <"">
##$SUBNAM8= <"">
##$SUBNAM9= <"">
##$SW= 18.0517283424941
##$SWIBOX= (0..15)
0 0 2 0 0 0 0 0 0 0 0 0 0 0 0 0 
##$SW_h= 3612.71676300578
##$TD= 16384
##$TD0= 1
##$TE= 0
##$TE2= 300
##$TE3= 300
##$TEG= 300
##$TL= (0..7)
0 120 120 120 120 120 120 120 
##$TP= (0..7)
150 150 150 150 150 150 150 150 
##$TP07= 0
##$TPNAME0= <>
##$TPNAME1= <>
##$TPNAME2= <>
##$TPNAME3= <>
##$TPNAME4= <>
##$TPNAME5= <>
##$TPNAME6= <>
##$TPNAME7= <>
##$TPOAL= (0..7)
0.5 0.5 0.5 0.5 0.5 0.5 0.5 0.5 
##$TPOFFS= (0..7)
0 0 0 0 0 0 0 0 
##$TUNHIN= 0
##$TUNHOUT= 0
##$TUNXOUT= 0
##$USERA1= <user>
##$USERA2= <user>
##$USERA3= <user>
##$USERA4= <user>
##$USERA5= <user>
##$V9= 5
##$VALIST= <valist>
##$VCLIST= <CCCCCCCCCCCCCCC>
##$VD= 0
##$VDLIST= <DDDDDDDDDDDDDDD>
##$VPLIST= <PPPPPPPPPPPPPPP>
##$VTLIST= <TTTTTTTTTTTTTTT>
##$WBST= 1024
##$WBSW= 4
##$XGAIN= (0..3)
0 0 0 0 
##$XL= 0
##$YL= 0
##$YMAX_a= 82652
##$YMIN_a= -141753
##$ZGOPTNS= <>
##$ZL1= 120
##$ZL2= 120
##$ZL3= 120
##$ZL4= 120
##$ABSF1= 15.73256
##$ABSF2= -2.319289
##$ABSG= 5
##$ABSL= 3
##$ALPHA= 0
##$AQORDER= 0
##$ASSFAC= 0
##$ASSFACI= 0
##$ASSFACX= 0
##$ASSWID= 0
##$AUNMP= <proc_1d>
##$AZFE= 0.1
##$AZFW= 0.1
##$BCFW= 0
##$BC_mod= 2
##$BYTORDP= 0
##$COROFFS= 0
##$CY= -3
##$DATMOD= 1
##$DC= 0
##$DFILT= <>
##$DTYPP= 0
##$F1P= 0
##$F2P= 0
##$FCOR= 1
##$FTSIZE= 16384
##$FT_mod= 6
##$GAMMA= 0
##$GB= 0
##$INTBC= 1
##$INTSCL= 3.70164e-10
##$ISEN= 128
##$LB= 0.24
##$LEV0= 0
##$LPBIN= 0
##$MAXI= 10000
##$MC2= 0
##$MEAN= 0
##$ME_mod= 0
##$MI= 1.114404
##$NCOEF= 0
##$NC_proc= -8
##$NLEV= 6
##$NOISF1= 3.799351
##$NOISF2= 2.8
##$NSP= 0
##$NTH_PI= 0
##$NZP= 0
##$OFFSET= 15.74799
##$PC= 1
##$PHC0= -18040.8
##$PHC1= 14.20069
##$PH_mod= 1
##$PKNL= yes
##$PPARMOD= 0
##$PSCAL= 0
##$PSIGN= 0
##$REVERSE= no
##$SF= 200.130004711439
##$SI= 16384
##$SIGF1= 3
##$SIGF2= 2
##$SINO= 5.538805
##$SIOLD= 16384
##$SREGLST= <1H.CDCl3>
##$SSB= 0
##$STSI= 16384
##$STSR= 0
##$SW_p= 3612.71676300578
##$SYMM= 0
##$S_DEV= 0
##$TDeff= 16384
##$TDoff= 0
##$TI= <>
##$TILT= no
##$TM1= 0
##$TM2= 0
##$TOPLEV= 0
##$USERP1= <user>
##$USERP2= <user>
##$USERP3= <user>
##$USERP4= <user>
##$USERP5= <user>
##$WDW= 1
##$XDIM= 16384
##$YMAX_p= 317745502
##$YMIN_p= -2224586
$$ End of Bruker specific parameters
$$ ---------------------------------
##NTUPLES= NMR SPECTRUM
##VAR_NAME=  FREQUENCY,     SPECTRUM/REAL,   SPECTRUM/IMAG
##SYMBOL=    X,             R,               I
##VAR_TYPE=  INDEPENDENT,   DEPENDENT,       DEPENDENT
##VAR_FORM=  AFFN,          ASDF,            ASDF
##VAR_DIM=   16384,         16384,           16384
##UNITS=     HZ,            ARBITRARY UNITS, ARBITRARY UNITS
##FACTOR=    0.220516191357247, 1,           1
##FIRST=     3151.64524375899, 0,            0
##LAST=      -461.071519246794, 0,           0
##MIN=       -461.071519246794, -2224586,    0
##MAX=       3151.64524375899, 317745502,    0
$$ Real data points
##PAGE= N=1
##DATA TABLE= (X++(R..R)), XYDATA
$$ [...]
$$ plain form
8020 344670 -612262 -465052 403346 355320 274219 513752 269975 310778 443441 347496
8010 347496 276520 -315841 -130462 117935 -24962 -283206 -403093 -402953 -66740 -439073
8000 -439073 -529606 -849632 -924639 -245368 158376 116384 -154064 190733 -294064 141861
7990 141861 453155 -202752 -84846 239374 96293 -32082 -472887 -262217 153025 16658
7980 16658 -29302 249106 144862 489161 877050 288015 -437973 -818948 -338901 -89037
7970 -89037 -204114 -440530 -185941 -351238 -885172 -396597 417768 259415 78616 -335529
7960 -335529 405557 676469 359556 -237435 -440284 264726 -187672 53174 196678 471150
7950 471150 194950 -559505 -259097 -111525 -324980 -510905 -304651 -333515 -161498 193395
$$ packed form
8020C44670r56932J47210Q68398m8026q1101K39533k43777M0803J32663r5945
8010C47496p0976n92361J85379K48397j42897k58244j19887J40L36213l72333
8000d39073r0533l20026p5007O79271M03744m1992k70448L44797m84797M35925
7990A41861L11294o55907J17906L24220j43081j28375m40805K10670M15242j36367
7980A6658m5960K78408j04244L44299L87889n89035p25988l80975M80047K49864
7970h9037j15077k36416K54589j65297n33934M88575Q14365j58353j80799m14145
7960c35529P41086K70912l16913n96991k02849P05010m52398K40846J43504K74472
7950D71150k76200p54455L00408J47572k13455j85925K06254k8864J72017L54893
$$ plain form
7940 193395 546294 775354 545666 382945 91181 -97050 335710 283143 -221109 260988
7930 260988 -343906 -640573 -378185 -533112 -316499 171366 418301 -187327 -153779 26804
7920 26804 428242 121840 -722842 -541576 -277585 99080 562459 483311 312022 -627697
7910 -627697 -470680 -884617 -813439 -718958 -377015 142974 104228 44513 194575 353955
7900 353955 -431 180908 -106392 -84981 -82711 -697867 -1016645 -274130 -242397 -504239
7890 -504239 -83222 -663685 -293407 -427718 -847524 -523435 -436888 -147762 268610 27789
7880 27789 -373168 -226704 163967 824762 968017 185251 766381 817711 532551 360423
7870 360423 -161674 299892 458779 -121145 -396593 -295794 66380 81148 -73488 -869054
$$ packed form
7940A93395L52899K29060k29688j62721k91764j88231M32760n2567n04252M82097
7930B60988o04894k96667K62388j54927K16613M87865K46935o05628L3548J80583
7920B6804M01438l06402q44682J81266K63991L76665M63379p9148j71289r39719
7910f27697J57017m13937P1178R4481L41943N19989l8746n9715J50062J59380
7900C53955l54386J81339k87300K1411K270o15156l18778P42515L1733k61842
7890e04239M21017n80463L70278j34311m19806L24089Q6547K89126M16372k40821
7880B7789m00957J46464L90671O60795J43255p82766N81130N1330k85160j72128
7870C60423n22097M61566J58887n79924k75448J00799L62174J4768j54636p95566
$$ plain form
7860 -869054 -1373585 -1032027 -536102 75781 227934 144100 -759963 -201251 -769883 34779
7850 34779 200203 -454760 -72575 381562 694886 379902 357725 -373326 -406035 -180186
7840 -180186 -714507 -304807 -345176 -556751 -690501 -642920 -41821 159571 241313 -349233
7830 -349233 -272462 254530 653033 578027 -335147 -128131 -155473 -153401 -555149 -179109 345340
7819 345340 391164 -53282 206447 777023 1020445 5610 -537112 46337 71809 232591
7809 232591 -6258 -149587 -319649 -612440 -499529 -167978 -327605 -365750 -411943 -654269
7799 -654269 -750490 -433993 263649 -146687 -196930 -281248 -943196 -39583 -260345 -40374
7789 -40374 326670 174968 -146546 -135885 -388165 -212094 115112 4111 -198141 -165616
$$ packed form
7860h69054n04531L41558M95925O11883J52153q3834r04063N58712n68632Q04662
7850C4779J65424o54963L82185M54137L13324l14984k2177p31051l2709K25849
7840a80186n34321M09700m0369k11575j33750M7581O01099K01392Q1742n90546
7830c49233P6771N26992L98503p5006r13174K07016k7342K072m01748L76040N24449
7819C45340M5824m44446K59729N70576K43422j014835n42722N83449K5472J60782
7809B32591k38849j43329j70062k92791J12911L31551j59627l8145m6193k42326
7799f54269r6221L16497O97642m10336n0243q4318o61948R03613k20762K19971
7789d0374L67044j51702l21514J0661k52280J76071L27206j11001k02252L2525
$$ plain form
7779 -165616 -359588 -924771 -1140252 -602194 -360273 -205942 -472312 -138470 13443 147519
7769 147519 -191187 -288216 278856 110194 -587536 -964500 -386362 -126419 -338009 -158467
7759 -158467 314760 394162 188859 -515481 -594603 -456223 -169344 -965422 -613631 -888879
7749 -888879 -1428224 -1219192 -163509 718066 385012 -733929 -539716 -2852 159509
7740 159509 166909 -326558 296820 80125 -96621 326297 -197809 -157915 -175191 10665
7730 10665 294287 245768 293839 -3267 -520473 -1178933 -759212 -595411 -686542 -745709 -496031
7719 -496031 -852268 -538921 -187451 -242067 -36787 496415 727774 -82223 -742198 -234114
7709 -234114 -334796 -86587 -50393 -376910 -211813 -740402 -441977 134741 731388 57511
$$ packed form
7779a65616j93972n65183k15481N38058K41921J54331k66370L33842J51913J34076
7769A47519l38706r7029N67072j68662o97730l76964N78138K59943k11590J79542
7759a58467M73227P9402k05303p04340p9122J38380K86879p96078L51791k75248
7749h88879n39345K09032J055683Q81575l33054j118941J94213N36864J62361
7740A59509P400m93467O23378k16695j76746M22918n24106L9894j7276J85856
7730A0665K83622m8519M8071k97106n17206o58460M19721J63801r1131n9167K49678
7719d96031l56237L13347L51470n4616K05280N33202K31359q09997o59975N08084
7709b34114j00682K48209L6194l26517J65097n28589K98425N76718N96647o73877
$$ plain form
7699 57511 -330880 183334 305424 104339 428007 583735 448165 -267626 -155111 -146607
7689 -146607 -31446 -63464 -341276 13214 -90469 157866 357689 -132905 -494848 -131849
7679 -131849 12675 -243396 -361843 -125280 241544 410604 243473 345898 222056 259346
7669 259346 255892 -383745 -652888 -39842 -483284 -597291 -407325 95695 422999 331792
7659 331792 234233 -87868 -823308 -555770 71116 -50537 -68290 -22278 245990 533340
7649 533340 84424 -516297 -570477 -14975 619973 666484 -468849 -346607 -19532 -527291
7639 -527291 -426498 85453 346977 490743 318742 340215 262960 -112813 -35741 -103067
7629 -103067 6174 295525 214011 139741 652966 934415 139767 -772672 -515273 -235878
$$ packed form
7699E7511l88391N14214J22090k01085L23668J55728j35570p15791J12515Q504
7689a46607J15161l2018k77812L54490j03683K48335J99823m90594l61943L62999
7679a31849J44524k56071j18447K36563L66824J69060j67131J02425j23842L7290
7669B59346l454o39637k69143O13046m43442j14007J89966N03020L27304r1207
7659C31792r7559l22101p35440K67538O26886j21653j7753M6012K68268K87350
7649E33340m48916o00721n4180N55502O34948M6511j135333J22242L27075n07759
7639e27291J00793N11951K61524J43766j72001K1473p7255l75773P7072o7326
7629a03067J09241K89351q1514p4270N13225K81449p94648r12439K57399K79395
$$ plain form
7619 -235878 -706500 -782258 -106507 -96858 -169522 -247331 -379078 80415 -220603 -202693 -104627
7608 -104627 -79992 255390 -173690 -306810 -178907 -149960 -606397 -326122 -244784 165920
7598 165920 481794 216405 -31046 -97798 425803 544568 65686 134642 225615 -313752
7588 -313752 7604 -223999 329952 665098 318327 -334604 63980 577288 612657 532328
7578 532328 267427 -90537 -586006 -414887 -526634 -350901 -121667 -285036 -219065 305729
7568 305729 -387086 -240537 44980 -132955 -335250 -447026 -580800 -455285 -334370 480330
7558 480330 419681 107681 338585 534157 -82560 -154223 -6626 -30448 -128119 245251
7548 245251 180500 -117602 -319520 -132159 90825 439506 -376387 90741 317467 467251
$$ packed form
7619b35878m70622p5758O75751R649p2664p7809j31747M59493l01018J7910R8066
7608a04627K4635L35382m29080j33120J27903K8947m56437K80275Q1338M10704
7598A65920L15874k65389k47451o6752N23601J18765m78882O8956R0973n39367
7588c13752L21356k31603N53951L35146l46771o52931L98584N13308L5369q0329
7578E32328k64901l57964m95469J71119j11747J75733K29234j63369O5971N24794
7568C05729o92815J46549K85517j77935k02295j11776j33774J25515J20915Q14700
7558D80330o0649l12000K30904J95572o16717p1663J47597k3822r7671L73370
7548B45251o4751k98102k01918J87361K22984L48681q15893M67128K26726J49784
$$ plain form
7538 467251 530596 606997 778218 355729 230703 265896 344663 279770 -168695 -249259 -309157
7527 -309157 -567702 68595 137139 205103 -597943 327943 629622 -183874 -418417 -306098
7517 -306098 -388833 122843 345180 267861 158410 48435 -198816 40031 -43052 190296
7507 190296 -39497 -22525 484316 464722 130884 222328 -15841 100377 722644 196926
7497 196926 -64373 315642 73747 624779 1205846 932647 470817 -66316 127453 596310
7487 596310 535143 137458 126083 606497 243070 -345293 -99624 -403243 -547838 222906
7477 222906 595572 448130 444562 436851 244441 463789 -207391 193632 110209 -339491 51619
7466 51619 202277 250324 -133977 -172920 -204001 -78214 -343755 -413205 -795370 -602235 164523
$$ packed form
7538D67251O3345P6401J71221m22489j25026L5193P8767o4893m48465q0564n9898
7527c09157k58545O36297O8544O7964q03046R25886L01679q13496k34543J12319
7517c06098q2735N11676K22337p7319j09451j09975k47251K38847q3083K33348
7507A90296k29793J6972N06841j9594l33838R1444k38169J16218O22267n25718
7497A96926k61299L80015k41895N51032N81067k73199m61830n37133J93769M68857
7487E96310o1167l97685j1375M80414l63427n88363K45669l03619j44595P70744
7477B22906L72666j47442l568p711j92410K19348o71180M01023q3423m49700L91110
7466E1619J50658M8047l84301l8943l1081J25787k65541o9450l82165J93135P66758
$$ plain form
7455 164523 214271 430277 771515 809439 605308 635301 435474 -85486 405501 84717
7445 84717 -280839 -473761 -287729 45468 -372817 -155991 325522 -262537 -616550 -441126
7435 -441126 59856 -22946 -128629 -194024 476733 975033 689865 898236 519353 156664
7425 156664 -443361 -81440 -66668 99241 87266 461786 -3769 -88046 394830 262502
7415 262502 58019 -399844 -280172 112886 91365 386874 164189 -31500 149072 365065
7405 365065 942360 526342 33035 -487756 -237802 -197126 419097 480794 253436 403314
7395 403314 -42271 74289 -351747 66837 197078 347680 76069 250691 -81567 -356998
7385 -356998 49520 -690056 -387483 209438 -1621 202568 45844 -624465 -411483 -304531
$$ packed form
7455A64523M9748K16006L41238L7924k04131K9993j99827n20960M90987l20784
7445H4717l65556j92922J86032L33197m18285K16826M81513n88059l54013J75424
7435d41126N00982q2802j05683o5395O70757M98300k85168K08371l78883l62689
7425A56664o00025L61921J4772J65909j1975L74520m65555q4277M82876j32328
7415B62502k04483m57863J19672L93058k1521K95509k22685j95689J80572K15993
7405C65065N77295m16018m93307n20791K49954M0676O16223O1697k27358J49878
7395D03314m45585J16560m26036M18584J30241J50602k71611J74622l32258k75431
7385c56998M06518p39576L02573N96921k11059K04189j56724o70309K12982J06952
$$ plain form
7375 -304531 -188771 -387660 392497 -260360 -640380 -654213 -773071 -272081 17093 371791
7365 371791 233551 472341 -197135 542935 508730 752549 217890 -464736 -1634 -111430
7355 -111430 -270448 -896513 42601 269039 311912 107986 -232432 371268 318150 -151538
7345 -151538 345024 131936 899409 107002 -239010 -67091 -258971 -85432 121431 357634
7335 357634 396534 496694 397091 707046 605037 147865 -187446 -615604 -208421 -75910
7325 -75910 28789 151091 382043 226424 647688 570015 633931 345338 207727 198067 -776598
7314 -776598 -371897 635549 529983 225374 -23580 43040 744914 961711 534106 212766
7304 212766 161781 312255 826173 617383 182540 504966 527513 574652 977855 192344
$$ packed form
7375c04531J15760j98889P80157o52857l80020j3833j18858N00990K89174L54698
7365C71791j38240K38790o69476P40070l4205K43819n34659o82626M63102j09796
7355a11430j59018o26065R39114K26438M2873k03926l40418O03700n3118m69688
7345a51538M96562k13088P67473p92407l46012J71919j91880J73539K06863K36203
7335C57634L8900J00160r9603L09955j02009m57172l35311m28158M07183J32511
7325g5910J04699J22302K30952j55619M21264p7673O3916k88593j37611r660r74665
7314g76598M04701J007446j05566l04609k48954O6620P01874K16797m27605l21340
7304B12766n0985J50474N13918k08790m34843L22426K2547M7139M03203p85511
$$ plain form
7294 192344 316769 87151 57141 96361 157773 229148 546205 346163 404737 366838 92949
7283 92949 257233 650423 831725 236601 -184580 -744455 -264449 -84603 -433012 -417172
7273 -417172 -707593 -552410 -259225 283776 591135 -107918 262247 661670 385069 658522
7263 658522 382549 641267 497290 41961 -100132 -286472 70739 220777 -713659 -1032049
7253 -1032049 -212740 250118 574396 451640 311058 268828 214002 261719 93021 -125680
7243 -125680 -124213 620774 489756 166859 -95332 135744 57995 38173 185137 677279
7233 677279 453104 253894 552698 1211763 752931 744664 738434 281028 -404108 350043
7223 350043 636383 318978 713271 252216 861169 1271118 1316983 656123 959290 887384
$$ packed form
7294A92344J24425k29618l0010L9220O1412P1375L17057k00042N8574l7899k73889
7283I2949J64284L93190J81302n95124m21181n59875M80006J79846l48409J5840
7273d17172k90421J55183K93185N43001L07359o99053L70165L99423k76601K73453
7263F58522k75973K58718j43977m55329j42093j86340L57211J50038r34436l18390
7253a032049Q19309M62858L24278j22756j40582m2230n4826M7717j68698k18701
7243a25680J467P44987j31018l22897k62191K31076p7749j9822J46964M92142
7233F77279k24175j99210K98804O59065m58832q267o230m57406o85136P54151
7223C50043K86340l17405L94293m61055O08953M09949M5865o60860L03167p1906
$$ plain form
7213 887384 503011 379780 -51565 65993 65587 591094 684770 584832 528881 647 294476
7202 294476 206011 644865 595051 -248258 -138069 100558 723220 833747 568491 1065207
7192 1065207 742719 93087 689732 1168896 396459 389337 1042919 468294 104445 -48998
7182 -48998 481789 1097561 771320 572949 683184 389610 -282333 -396038 191908 828214
7172 828214 802908 1119490 1014527 579907 672300 605129 472345 397021 284725 589414
7162 589414 419935 347787 339240 -3208 -76404 -242865 -670975 -83543 34771 498060
7152 498060 1234325 802617 454528 744394 602139 505926 36300 -329192 -272440 297487
7142 297487 976103 1153127 796385 -51724 163567 264512 -122179 245157 659796 597115
$$ packed form
7213H87384l84373j23231m31345J17558m06N25507R3676r9938n5951n28234K93829
7202B94476q8465M38854m9814q43309J10189K38627O22662J10527k65256M96716
7192A065207l22488o49632N96645M79164p72437p122O53582n74625l63849j53443
7182d8998N30787O15772l26241j98371J10235k93574o71943j13705N87946O36306
7172H28214k5306L16582j04963m34620R2393o7171j32784p5324j12296L04689
7162E89414j69479p2148q547l42448p3196j66461m28110N87432J18314M63289
7152D98060P36265m31708l48089K89866j42255r6213m69626l65492N6752N69927
7142B97487O78616J77024l56742q48109K15291J00945l86691L67336M14639o2681
$$ plain form
7132 597115 599696 722788 311763 278930 -308334 -680208 -31324 962933 700938 466738
7122 466738 745639 819185 500942 347442 772948 675218 849960 1057987 1058336 908327 892321
7111 892321 1111236 927861 1022050 744579 195785 -304283 -320509 34632 332616 884014
7101 884014 796627 917617 343574 862889 897935 539635 973939 570529 451508 1007362
7091 1007362 1340208 362252 1012394 1311518 1064236 973544 1131614 751741 694461 830342
7081 830342 824660 749520 772540 972149 1116626 1635165 844160 630651 935392 967913 976602
7070 976602 1104356 677484 401173 -55316 987988 1728983 1054057 559313 877420 1491673
7060 1491673 1087766 922977 1279228 1096187 1232360 929895 119828 403920 404017 625272
$$ packed form
7132E97115K581J23092m11025l2833n87264l71874O48884R94257k61995k34200
7122D66738K78901P3546l18243j53500M25506r7730J74742K08027L49j50009j6006
7111H92321K18915j83375R4189k77471n48794n00068j6226L55141K97984N51398
7101H84014q7387J20990n74043N19315L5046l58300M34304m03410j19021N55854
7091A007362L32846r77956O50142K99124k47282r0692J58070l79873n7280J35881
7081H30342n682p5140K3020J99609J44477N18539p91005k13509L04741L2521Q689
7070I76602J27754m26872k76311m56489J043304P40995o74926m94744L18107O14253
7060A491673m03907j64789L56251j83041J36173l02465q10067K84092R7K21255
$$ plain form
7050 625272 662305 777898 1474453 1276438 853704 1076808 735519 775216 863997 424141
7040 424141 795058 916284 879000 731782 1431073 1402694 921090 939318 545412 165503
7030 165503 910112 1297469 1124413 1019528 640325 188567 612225 146251 659843 481943
7020 481943 597042 913293 1294625 1643974 1390900 1057144 860829 1345459 1392004 1433840
7010 1433840 1383853 1553377 1807414 2050272 1477008 1328419 1262051 953298 1399319 1634884
7000 1634884 1659721 1676762 1635125 1384892 1146498 1490906 1636228 1433759 1288511 1553536
6990 1553536 1424017 1439033 1685371 2015406 1833753 1514132 1657249 1769860 1850222 2763490
6980 2763490 2306896 1808127 1765890 1556940 1191194 1818700 1796446 1677872 1293824 1304949
$$ packed form
7050F25272L7033J15593O96555j98015m22734K23104l41289L9697Q8781m39856
7040D24141L70917J21226l7284j47218O99291k8379m81604J8228l93906l79909
7030A65503P44609L87357j73056j04885l79203m51758M23658m65974N13592j77900
7020D81943J15099L16251L81332L49349k53074l33756j96315M84630M6545M1836
7010A433840m9987J69524K54037K42858n73264j48589o6368l08753M46021K35565
7000A634884K4837J7041m1637k50233k38394L44408J45322k02469j45248K65025
6990A553536j29519J5016K46338L30035j81653l19621J43117J12611Q0362R13268
6980B763490m56594m98769m2237k08950l65746O27506k2254j18574l84048J1125
$$ plain form
6970 1304949 1802759 1716296 2048140 1982797 2051622 2159140 2155830 2584537 2487112 2202315 1863154
6959 1863154 1848424 2597164 3047199 2898803 2531374 2557895 2204276 2064722 2264590 2599897
6949 2599897 2795523 2937781 3373270 3374745 3054038 3470388 2623586 1993964 1981810 2314895
6939 2314895 2232446 2578025 2977314 3072591 2813960 2415413 3123258 4405454 3953489 3441064
6929 3441064 2298891 2639396 3096831 3458074 3623219 3050093 3264949 3400612 2977854
6920 2977854 2914396 3477572 3682476 4094740 4240546 3640146 3772015 4186134 4119393 4280525
6910 4280525 4230448 4380049 4509378 4576576 4316112 4739046 4852050 5316300 5001468 5465180
6900 5465180 5038329 4989561 4355877 4328943 4435911 4892516 6010878 6316130 6418663 6225900
$$ packed form
6970A304949M97810q6463L31844o5343O8825J07518l310M28707r7425k84797l39161
6959A863154j4730P48740M50035j48396l67429K6521l53619j39554J99868L35307
6949B599897J95626J42258M35489J475l20707M16350q46802o29622j2154L33085
6939B314895q2449L45579L99289R5277k58631l98547P07845J282196m51965n12425
6929C441064j142173L40505M57435L61243J65145n73126K14856J35663m22758
6920B977854o3458N63176K04904M12264J45806o00400J31869M14119o6741J61132
6910D280525n0077J49601J29329O7198k60464M22934J13004M64250l14832M63712
6900E465180m26851m8768o33684k6934J06968M56605J118362L05252J02533j92763
$$ plain form
6890 6225900 5900386 5671946 5682529 5772102 6133517 6459595 6246699 6071335 6186295 5966884
6880 5966884 6120456 6502213 6802930 6910023 6324634 6073120 6457109 6263836 6130132 6019016
6870 6019016 6209431 6593661 6130538 6132309 6130212 6528583 6092225 6373144 6413730 6318999 6588312
6859 6588312 6586271 6541302 6531638 7188895 6740741 6786510 6798725 6347399 6592223 6100096 5493926
6848 5493926 6152551 6364503 6142541 6425742 6642465 6785286 6768055 6512747 6191663 6437075
6838 6437075 6583332 6953366 6050444 5621135 5830593 6974325 6612115 5968142 6037365 5805788
6828 5805788 5825204 4867948 5607495 5634828 5720989 6586855 6437349 5182912 5650484 5425221
6818 5425221 5227171 5262741 4680034 4884699 4932057 4436943 4355406 4416588 4245744 4366453
$$ packed form
6890F225900l25514k28440J0583Q9573L61415L26078k12896j75364J14960k19411
6880E966884J53572L81757L00717J07093n85389k51514L83989j93273j33704j11116
6870F019016J90415L84230m63123J771k097L98371m36358K80919M0586r4731K69313
6859F588312k041m4969r664O57257m48154M5769J2215m51326K44824m92127o06170
6848E493926O58625K11952k21962K83201K16723J42821j7231k55308l21084K45412
6838F437075J46257L70034r02922m29309K09458J143732l62210o43973O9223k31577
6828E805788J9416r57256P39547K7333Q6161Q65866j49506j254437M67572k25263
6818E425221j98050L5570n82707K04665M7358m95114q1537O1182j70844J20709
$$ plain form
6808 4366453 4771728 4758822 4791087 4973165 4870132 4018632 4180752 3938663 3815748 3756515
6798 3756515 3747558 3702379 3659418 4195533 4613543 4088002 3432542 3663082 3732713 3344827
6788 3344827 3446517 3572846 3893389 3529532 3904523 4301143 3691691 2671651 2426910
6779 2426910 2502623 3425030 3329210 3754861 3406407 3221213 3766445 3379918 3181454 3147264
6769 3147264 2792991 2555565 2722524 2254637 2861528 2754746 2720328 2899491 2664789 1973453
6759 1973453 2430019 3055140 2640718 2515194 2700221 2501917 2293128 2566507 2309701 1992342
6749 1992342 1626004 1763183 2291606 2527457 3155053 2678153 2203310 2079279 2098086 1779361
6739 1779361 2521104 2181149 1804457 2097720 1672859 1312538 1581466 1933476 1569999 1552407
$$ packed form
6808D366453M05275j2906L2265J82078j03033q51500J62120k42089j22915n9233
6798C756515q957m5179m2961N36115M18010n25541o55460K30540O9631l87886
6788C344827J01690J26329L20543l63857L74991L96620o09452j020040k44741
6779B426910P5713R22407r5820M25651l48454j85194N45232l86527j98464l4190
6769C147264l54273k37426J66959m67887O06891j06782l4418J79163k34702o91336
6759A973453M56566O25121m14422j25524J85027j98304k08789K73379k56806l17359
6749A992342l66338J37179N28423K35851O27596m76900m74843j24031J8807l18725
6739A779361P41743l39955l76692K93263m24861l60321K68928L52010l63477j7592
$$ plain form
6729 1552407 2373812 2478475 1737041 1436625 1948034 2300240 2611794 1930295 1928051 2554911
6719 2554911 2215129 1824679 1608995 1249567 999176 1488740 1409318 1432393 1893175 2393012
6709 2393012 1862805 1110259 1137478 1859088 1645640 2257028 1725290 1767777 2326215 1822988
6699 1822988 2153207 2199922 2731018 2760707 2638976 2236949 2633454 2357114 1937959 2366745
6689 2366745 2963405 2298540 2148955 2541113 2317999 2407320 2243532 1952925 1980635 2499228
6679 2499228 3091604 2897477 3164581 2869366 2833744 2676026 2260859 1831522 2135810 2530931
6669 2530931 2925102 3165716 2947694 2963031 2423203 2501176 2810352 2706164 2689816 2386843
6659 2386843 2497340 2290926 2589745 2578543 2368212 2890949 3051984 2347542 2331561 3230149
$$ packed form
6729A552407Q21405J04663p41434l00416N11409L52206L11554o81499k244O26860
6719B554911l39782l90450k15684l59428k50391M89564p9422K3075M60782M99837
6709B393012n30207p52546K7219P21610k13448O11388n31738M2487N58438n03227
6699A822988L30219M6715N31096K9689j21731m02027L96505k76340m19155M28786
6689B366745N96660o64865j49585L92158k23114Q9321j63788k90607K7710N18593
6679B499228N92376j94127K67104k95215l5622j57718m15167m29337L04288L95121
6669B530931L94171K40614k18022J5337n39828P7973L09176j04188j6348l02973
6659B386843J10497k06414K98819j1202k10331N22737J61035p04442j5981Q98588
$$ plain form
6649 3230149 3371808 3070810 2190348 2420669 2691787 2941256 2968303 3379913 3487052 3270009
6639 3270009 3458300 3486678 3441758 3093279 3595889 3212149 2649646 2693267 2368327 2829751
6629 2829751 3241397 2846284 2924495 3353384 2931906 3026914 2488224 2362510 2445833 2473446
6619 2473446 2362296 2262012 2818961 2507535 2354500 2541854 2537449 2866737 2691712 2914518
6609 2914518 2992499 2726265 3400187 3666284 3231427 3174285 3112109 2895428 2623080 2150498
6599 2150498 2391672 2888020 2069563 1824303 1920076 1895025 2414314 2675824 2320898 2295736
6589 2295736 2320321 2811419 2639415 1924122 2525292 3215540 2638577 2468071 2512443 2564944
6579 2564944 2860322 2887822 3178442 2160390 1231942 2101930 1694006 1641821 2008929 2305404
$$ packed form
6649C230149J41659l00998q80462K30321K71118K49469K7047M11610J07139k17043
6639C270009J88291K8378m4920l48479N02610l83740n62503M3621l24940M61424
6629B829751M11646l95113P8211M28889m21478R5008n38690j25714Q3323K7613
6619B473446j11150j00284N56949l11426j53035J87354m405L29288j75025K22806
6609B914518P7981k66234O73922K66097m34857n7142o2176k16681k72348m72582
6599B150498K41174M96348q18457k45260R5773k5051N19289K61510l54926k5162
6589B295736K4585M91098j72004p15293O01170O90248n76963j70506M4372N2501
6579B564944K95378K7500K90620j018052r28448Q69988m07924n2185L67108K96475
$$ plain form
6569 2305404 2119469 1617125 1061879 1143546 2195341 1918489 2542149 2890441 2554121 2520633
6559 2520633 2401247 1858113 1952316 2734171 2427000 2048867 1968788 1568197 1869432 1601747
6549 1601747 1704142 1530758 1318930 1723434 1792022 1996953 1953110 1576884 2122444 1873140
6539 1873140 1493246 1904115 2075718 1581246 1305767 2111274 2285296 2073654 2562183 2437220
6529 2437220 2059660 2290859 2300048 1657338 2045236 1633850 1629913 1750138 1774849 2595295
6519 2595295 2305854 1968327 1611175 1642680 1799932 1689797 1980742 2019935 2017334 2595752
6509 2595752 2147315 2413892 2788774 2312804 1388809 2214621 2154246 2394548 2568729 1836697
6499 1836697 1828260 2271867 2020839 1747413 2080344 2415021 2551652 2693535 2401796 2128031
$$ packed form
6569B305404j85935n02344n55246Q1667J051795k76852O23660L48292l36320l3488
6559B520633j19386n43134R4203P81855l07171l78133q0079m00591L01235k67685
6549A601747J02395j73384k11828M04504O8588K04931m3843l76226N45560k49304
6539A873140l79894M10869J71603m94472k75479Q05507J74022k11642M88529j24963
6529B437220l77560K31199R189o42710L87898m11386l937J20225K4711Q20446
6519B595295k89441l37527l57152L1505J57252j10135K90945L9193k601N78418
6509B595752m48437K66577L74882m75970r23995Q25812o0375K40302J74181p32032
6499A836697q437M43607k51028k73426L32931L34677J36631J41883k91739k73765
$$ plain form
6489 2128031 1966597 2689459 2198647 1603465 1607072 1463157 2187484 2726407 2889794 2900436
6479 2900436 2491651 2270215 1286286 1440581 1888536 1887600 2548850 2480748 2305093 2239868
6469 2239868 2512451 2580774 2839336 2366314 1693767 2221244 2551436 2114964 1773386 1672346
6459 1672346 1746910 1759004 1816802 2510292 2993736 2383700 2758070 2285751 2166975 2348735
6449 2348735 2981732 2573033 2663655 2731567 2930746 3096425 2764628 2247171 2464559 2899877
6439 2899877 2878484 2842551 2941219 2598485 2864798 2813297 2611934 3357353 3117020 3068599
6429 3068599 3362544 2964221 3419010 3525113 3175234 2977266 2939560 3371810 3749741 3860928
6419 3860928 3647115 3271548 3306093 3776557 3813672 4277757 4786318 4673537 4352080 3623221
$$ packed form
6489B128031j61434P22862m90812n95182L607j43915P24327N38923J63387J0642
6479B900436m08785k21436r83929J54295M47955r36O61250o8102j75655o5225
6469B239868K72583O8323K58562m73022o72547N27477L30192m36472l41578j01040
6459A672346P4564J2094N7798O93490M83444o10036L74370m72319j18776J81760
6449B348735O32997m08699R0622O7912J99179J65679l31797n17457K17388M35318
6439B899877k1393l5933R8668l42734K66313n1501k01363P45419k40333m8421
6429C068599K93945l98323M54789J06103l49879j97968l7706M32250L77931J11187
6419C860928k13813l75567L4545M70464L7115M64085N08561j12781l21457p28859
$$ plain form
6409 3623221 3997226 4406074 4975837 4998023 5487163 5602163 5779529 6422414 5960464 5707846
6399 5707846 6084313 6612987 7292503 7552850 7270630 6986974 7073372 7287178 7277132 6906234
6389 6906234 7115470 7069225 6891897 7833978 7960947 7702323 7342274 7553042 7912155 7408251
6379 7408251 7181078 6940123 7453394 7816264 7489802 7367983 7586059 7655982 8158972 7951037
6369 7951037 7242702 7775363 7120625 7192568 7039630 7265886 7317310 6988666 6447230 6958527
6359 6958527 7668005 7336759 6762789 6545438 7108005 7621852 7114618 7470705 7065396 7715298
6349 7715298 8369281 8029745 7600285 8164198 8312181 8538936 9005478 8718419 8621313 8593793
6339 8593793 8093355 8954388 9053553 8689270 8798156 9320909 9815248 9949099 9832778 9799400
$$ packed form
6409C623221L74005M08848N69763K2186M89140J15000J77366O42885m61950k52618
6399E707846L76467N28674O79516K60347k82220k83656Q6398K13806j0046l70898
6389F906234K09236m6245j77328R42081J26969k58624l60049K10768L59113n03904
6379G408251k27173k40955N13271L62870l26462j21819K18076O9923N02990k07935
6369G951037p08335N32661o54738P1943j52938K26256N1424l28644n41436N11297
6359F958527P09478l31246n73970k17351N62567N13847n07234L56087m05309O49902
6349G715298O53983l39536m29460N63913J47983K26755M66542k87059r7106k7520
6339H593793n00438Q61033R9165l64283J08886N22753M94339J33851j16321l3378
$$ plain form
6329 9799400 9834631 10129347 9947023 9706617 9988376 9811245 10105791 10074905 10123252 10122896 10411628
6318 10411628 10481797 10697361 10624041 11125050 10921349 10632931 11210605 11797262 10789212 10706824
6308 10706824 11385515 11379134 11234034 11503879 12076490 11836056 11938650 12355032 12847811 13217819
6298 13217819 12608279 12546528 12449543 12574590 13167080 12515305 12573638 12780357 12829030 13254726
6288 13254726 13787243 13757467 13307974 13128717 13425415 13344988 13645474 13707300 13781819 14206929
6278 14206929 13767439 13594689 14208513 14121171 13870725 13546069 13687639 14239965 13988048 13924760
6268 13924760 14699306 14010084 13834409 13661801 14030337 14182614 15136992 14952055 13881090
6259 13881090 14217113 14451272 14367140 14102131 13821170 13788192 13962926 14377161 14472717 14177452
$$ packed form
6329I799400L5231K94716j82324k40406K81759j77131K94546l0886M8347l56K88732
6318A0411628P0169K15564p3320N01009k03701k88418N77674N86657j008050q2388
6308A0706824O78691o381j45100K69845N72611k40434J02594M16382M92779L70008
6298A3217819o09540o1751r6985J25047N92490o51775N8333K06719M8673M25696
6288A3254726N32517k9776m49493j79257K96698q0427L00486O1826P4519M25110
6278A4206929m39490j72750O13824q7342k50446l24656J41570N52326k51917o3288
6268A3924760P74546o89222j75675j72608L68536J52277R54378j84937j070965
6259A3881090L36023K34159q4132k65009k80961l2978J74734M14235R5556k95265
$$ plain form
6249 14177452 14265502 14282996 14410955 13589771 14148518 14168026 14221395 13607022 13961927 13725057
6239 13725057 14169341 14075350 14184463 14403114 13996145 14121625 13961241 13560116 13929378 13716783
6229 13716783 13487950 13774761 13921232 13478143 13148555 13027978 13653374 13662194 13355909 13168448
6219 13168448 13296742 13269322 12869612 13375255 13594544 13326564 13304063 12981289 13199703 12706815
6209 12706815 12209606 13325775 13525877 13091044 13266363 13219803 13396587 13281054 13066338
6200 13066338 13518400 13733442 13615247 13812837 13241727 13481656 13509117 13650185 13977938 13333650
6190 13333650 13081075 13502398 13180872 13204177 13576984 13447737 13501314 13602919 14273478 14097098
6180 14097098 13416530 13437140 13063538 12747840 12221673 12203321 13009467 13653667 13808866 13688207
$$ packed form
6249A4177452Q8050J7494J27959q21184N58747J9508N3369o14373L54905k36870
6239A3725057M44284r3991J09113K18651m06969J25480j60384m01125L69262k12595
6229A3716783k28833K86811J46471m43089l29588j20577O25396Q820l06285j87461
6219A3168448J28294k7420l99710N05643K19289k67980k2501l22774K18414m92888
6209A2706815m97209J116169K00102m34833J75319m6560J76784j15533k14716
6200A3066338M52062K15042j18195J97590n71110K39929K7461J41068L27753o44288
6190A3333650k52575M21323l21526K3305L72807j29247N3577J01605O70559j76380
6180A4097098o80568K0610l73602l15698n26167j8352Q06146O44200J55199j20659
$$ plain form
6170 13688207 13253467 12887868 12562245 12139139 12507324 12448404 12188793 11778572 11652397 11359039
6160 11359039 11818981 12156229 12757020 12615485 12290461 11979452 11672097 11121019 11551479
6151 11551479 12384241 12934509 13233093 13330841 13190670 13602724 13961605 13971288 13690165 14046032
6141 14046032 14283191 13926735 13659359 13728739 13782678 14259416 13995771 14053888 14041829 13757195
6131 13757195 13772951 13524473 13182962 12974823 13015622 13583243 13616458 13620548 13239859 13318083
6121 13318083 13268199 12950874 12743230 12073965 11822949 12741937 12663716 12493890 12303187 12253735
6111 12253735 12213915 12450895 12262532 11653618 11766132 11949202 11887398 12325381 12157733 12186387
6101 12186387 12405761 12149209 11921735 12275513 12918702 12754652 12281277 12045425 12498248
$$ packed form
6170A3688207m34740l65599l25623m23106L68185n8920k59611m10221j26175k93358
6160A1359039M59942L37248O00791j41535l25024l11009l07355n51078M30460
6151A1551479Q32762N50268K98584R7748j40171M12054L58881R683k81123L55867
6141A4046032K37159l56456k67376O9380N3939M76738k63645N8117j2059k84634
6131A3757195J5756k48478l41511k08139M0799N67621L3215M090l80689P8224
6121A3318083m9884l17325k07644o69265k51016R18988p8221j69826j90703m9452
6111A2253735l9820K36980j88363o08914J12514J83070o1804M37983j67648K8654
6101A2186387K19374k56552k27474L53778O43189j64050m73375k35852M52823
$$ plain form
6092 12498248 13315670 13213717 12441138 12708074 12847785 12596836 12694818 13166352 13289046 13511918
6082 13511918 13011532 12945120 13739421 13258330 12823736 13614096 14265357 14193178 13819084 13857155
6072 13857155 13774060 13302397 13649999 13938245 14222059 14498574 14032806 14129659 13807455 14236658
6062 14236658 14635990 14514903 14349486 14600618 14869266 15114576 15087685 14491680 14353142 14775640
6052 14775640 15268651 15796990 15070516 15090576 15380280 16382634 16803113 16862311 17131381 17116853
6042 17116853 17292791 17544217 17293077 17514872 18377518 18762802 18394391 19293625 19894391
6033 19894391 19996338 19981516 20737457 20872118 21043907 21496363 22023463 22312740 22513229 22849360
6023 22849360 23670310 24239994 24796700 24833678 25353668 26650670 26342883 26537877 26830405
$$ packed form
6092A2498248Q17422j01953p72579K66936J39711k50949R7982M71534J22694K22872
6082A3511918n00386o6412P94301m81091m34594P90360O51261p2179l74094L8071
6072A3857155q3095m71663L47602K88246K83814K76515m65768R6853l22204M29203
6062A4236658L99332j21087j65417K51132K68648K45310k6891n96005j38538M22498
6052A4775640M93011N28339p26474K0060K89704J002354M20479N9198K69070j4528
6042A7116853J75938K51426k51140K21795Q62646L85284l68411Q99234O00766
6033A9894391J01947j4822P55941J34661J71789M52456N27100K89277K00489L36131
6023B2849360Q20950N69684N56706L6978N19990J297002l07787J94994K92528
$$ plain form
6014 26830405 26733642 26891871 27687989 27760286 27918389 29144287 29116171 28544009 28694723 28760647
6004 28760647 28601011 27873636 27720911 27183395 27108963 27032106 27214556 26355444 25196028 25814853
5994 25814853 26275344 25255415 24862188 24503886 23904538 23469147 23084933 23169887 22767329
5985 22767329 22092007 21499843 21192051 20635666 20009249 19330237 19156378 19210091 19012965 18619937
5975 18619937 18668821 18714114 18366891 17136080 16568977 16476632 16225380 16320264 15919554 15235829
5965 15235829 15385968 15806598 15589176 15087312 15742600 15404485 14610732 13951476 13796621
5956 13796621 13876023 13591522 13292151 13156652 13359978 12858614 13116406 13030909 12904355 12834363
5946 12834363 12336015 12294474 12104124 11792166 11717577 12704539 13279996 12440724 12035954 11539691
$$ packed form
6014B6830405r6763J58229P96118P2297J58103J225898k8116n72162J50714O5924
6004B8760647j59636p27375j52725n37516p4432p6857J82450q59112j159416O18825
5994B5814853M60491j019929l93227l58302n99348m35391l84214Q4954m02558
5985B2767329o75322n92164l07792n56385o26417o79012j73859N3713j97126l93028
5975A8619937M8884M5293l47223j230811n67103r2345k51252R4884m00710o83725
5965A5235829J50139M20630k17422n01864O55288l38115p93753o59256j54855
5956A3796621P9402k84501k99371j35499K03326n01364K57792q5497j26554o9992
5946A2834363m98348m1541j90350l11958p4589R86962N75457q39272m04770m96263
$$ plain form
5936 11539691 11791010 11770346 12084029 11759259 12147695 11685092 11096793 11227487 10775698 10909133
5926 10909133 10499608 10675832 11318079 10816626 10427648 10546839 10601494 10369938 10153120 10250914
5916 10250914 10296607 9723105 10191098 10434802 10183150 9998640 9376851 8902528 9545595 9729522
5906 9729522 9821396 9146813 9556547 9445857 9073444 9151645 9027652 8974163 8727574 8584169
5896 8584169 8643504 7877047 8150652 8777288 8373124 8629937 8919633 8892000 7993749 7963266
5886 7963266 8134602 8203450 7765772 7349270 7689758 7567519 6868125 7121978 7351142 7699749
5876 7699749 7817103 7560003 7477892 7552461 7976032 7931718 7856554 7509323 7066145 7035903
5866 7035903 6869049 6642188 6481326 6924895 6576975 7214277 7259068 6916782 6697005 6267981
$$ packed form
5936A1539691K51319k0664L13683l24770L88436m62603n88299J30694m51789J33435
5926A0909133m09525J76224O42247n01453l88978J19191N4655k31556k16818R7794
5916A0250914M5693n73502M67993K43704k51652j84510o21789m74323O43067J83927
5906I729522R1874o74583M09734j10690l72413P8201j23993n3489k46589j43405
5896H584169N9335p66457K73605O26636m04164K56813K89696k7633q98251l0483
5886G963266J71336O8848m37678m16502L40488j22239o99394K53853K29164L48607
5876G699749J17354k57100q2111P4569M23571m4314p5164l47231m43178l0242
5866G035903j66854k26861j60862M43569l47920O37302M4791l42286k19777m29024
$$ plain form
5856 6267981 6496759 6757157 6877291 7072635 6609810 7168437 7437339 7353293 6895949 6210555
5846 6210555 6114590 6280181 6353390 6190482 6781892 7375469 6973182 6457987 6135252 6095158
5836 6095158 6330298 6550777 5891030 5688985 6311318 5514435 5823395 6126988 6295469 6256120
5826 6256120 5889893 5932044 6423428 6361186 6021472 5854194 5732672 5319545 6102360 5946838
5816 5946838 5930932 6541029 6693319 6859204 6620642 6656207 6346210 5875363 5790314 5758083
5806 5758083 6824676 6859342 5690531 4509900 4450648 5256411 5471397 4981056 4865991
5797 4865991 5035653 4845732 4496962 4640729 5146589 5399920 5201485 4590763 4273407 4530190
5787 4530190 5131413 4487210 5308484 5157953 5108915 5141546 5330183 5555554 4837770 4704457
$$ packed form
5856F267981K28778K60398J20134J95344m62825N58627K68902q4046m57344o85394
5846F210555r5965J65591P3209j62908N91410N93577m02287n15195l22735m0094
5836F095158K35140K20479o59747k02045O22333p96883L08960L03593J68481l9349
5826F256120l66227M2151M91384o2242l39714j67278j21522m13127P82815j55522
5816E946838j5906O10097J52290J65885k38562L5565l09997m70847q5049l2231
5806E758083J066593L4666j168811j180631n9252Q05763K14986m90341j15065
5797D865991J69662j89921l48770J43767N05860K53331j98435o10722l17356K56783
5787D530190O01223o44203Q21274j50531m9038L2631J88637K25371p17784j33313
$$ plain form
5777 4704457 4694769 4461053 4903507 4406848 4259388 3712844 3809157 4418682 3923762 3735421
5767 3735421 3621006 3272104 3558468 4231476 4101146 3570725 3424159 3427389 3652409 3643173
5757 3643173 3743195 3596302 3640079 3624677 3563742 3242750 3464674 3320575 3849527 3619976
5747 3619976 3838696 4072429 3896903 3569331 3875069 3484076 2665325 2838126 3513578 3445388
5737 3445388 3136096 3023563 2587867 2983125 3258483 3363354 2840127 2763839 3332688 3773579
5727 3773579 3268949 3146790 3169649 2746697 2890110 3669569 3680058 3805649 3677406 3634027
5717 3634027 2544158 2660638 3264440 3738953 2995891 3164849 3506985 3409686 3467546 3154881
5707 3154881 3109867 3499772 3960804 3786849 3144399 2614298 2954061 3443555 3854156 3483625
$$ packed form
5777D704457r688k33716M42454m96659j47460n46544R6313O09525m94920j88341
5767C735421j14415l48902K86364O73008j30330n30421j46566L230K25020r236
5757C643173J00022j46893M3777j5402o0935l20992K21924j44099N28952k29551
5747C619976K18720K33733j75526l27572L05738l90993q18751J72801O75452o8190
5737C445388l09292j12533m35696L95258K75358J04871n23227p6288N68849M40891
5727C773579n04630j22159K2859m22952J43413P79459J0489J25591j28243m3379
5717C634027j089869J16480O03802M74513p43062J68958L42136r7299N7860l12665
5707C154881m5014L89905M61032j73955o42450n30101L39763M89494M10601l70531
$$ plain form
5697 3483625 3167766 3696697 3251677 2990950 2910910 3145474 3483130 2592394 2344152 2640375
5687 2640375 2787228 3653455 3380237 3083083 2837863 3290615 3243163 3132635 3294384 3344394
5677 3344394 2969136 2845526 3585453 3295981 3326615 3449897 2906261 3120958 3429259 3207814
5667 3207814 3671917 3846700 3450929 3659943 3366917 2607698 3035086 3513493 2712668 3614708
5657 3614708 3249124 3362196 3358021 3893784 4070316 2943544 2969997 3294033 3510312 3371364
5647 3371364 3386589 3219210 3380586 2968198 3753896 3832274 4232460 4511632 3876303 3640319
5637 3640319 3153491 2936600 2728931 3061315 3508735 3211121 3853123 3974683 4333198 4105195
5627 4105195 3957157 4705925 4599622 4726512 4329581 4030550 3634360 3824577 3313540 3532398
$$ packed form
5697C483625l15859N28931m45020k60727q0040K34564L37656q90736k48242K96223
5687B640375J46853Q66227k73218k97154k45220M52752m7452j10528J61749N0010
5677C344394l75258j23610P39927k89472L0634J23282n43636K14697L08301k21445
5667C207814M64103J74783l95771K09014k93026p59219M27388M78407q00825R02040
5657C614708l65584J13072m175N35763J76532j126772K6453L24036K16279j38948
5647C371364J5225j67379J61376m12388P85698P8378M00186K79172o35329k35984
5637C640319m86828k16891k07669L32384M47420k97614O42002J21560L58515k28003
5627D105195j48038P48768j06303J26890l96931k99031l96190J90217n11037K18858
$$ plain form
5617 3532398 3268947 3098403 4000421 3973152 3661592 3611964 3533801 3992613 3980728 4121507
5607 4121507 3942633 4169085 4345293 4152824 3888340 3871106 4230288 3953267 4898069 4499973
5597 4499973 4400642 4229704 4928216 4849099 4513137 4769445 4767528 4408251 3656997 3262962
5587 3262962 3726281 3210987 3782534 4778990 5090996 4943164 5077796 4495128 4250923 4351321
5577 4351321 4859477 4593543 5042559 4631665 4265101 5120450 5217648 5122393 4875657 4596825
5567 4596825 4981740 4953807 4898014 4569058 4902769 5911053 6087165 5502547 5216161 5303039
5557 5303039 5698274 5772914 5662984 5210799 5255690 5815304 5884898 6652668 6023339 5436725
5547 5436725 5501539 4855755 5173980 5310702 5492144 6564929 6155464 5707706 5383177 5614671
$$ packed form
5617C532398k63451j70544R02018k7269l11560m9628p8163M58812j1885J40779
5607D121507j78874K26452J76208j92469k64484j7234L59182k77021R44802l98096
5597D499973r9331j70938O98512p9117l35962K56308j917l59277p51254l94035
5587C262962M63319n15294N71547R96456L12006j47832J34632n82668k44205J00398
5577D351321N08156k65934M49016m10894l66564Q55349R7198r5255k46736k78832
5567D596825L84915k7933n5793l28956L33711J008284J76112n84618k86386Q6878
5557E303039L95235P4640j09930m52185M4891N59614O9594P67770o29329n86614
5547E436725O4814o45784L18225J36722J81442J072785m09465m47758l24529K31494
$$ plain form
5537 5614671 6053779 6876506 6255380 6226773 6370276 6996898 7278536 6759988 6163667 6167238
5527 6167238 6352623 6308306 7055807 7168565 7827393 7572200 6589321 6891076 7194885 7110266
5517 7110266 6875170 6942275 7108052 6857134 7581251 7523192 7428042 7749378 7413829 7545665
5507 7545665 7920115 7512998 7900030 7687786 7969413 7814475 6995237 7698743 7899039 7741058
5497 7741058 7584896 8400063 7584511 7803607 7655402 7716746 8034329 8132435 8570484 8655181
5487 8655181 8032079 8197782 9065006 9066126 8817159 8568383 8419108 8579541 8732713 8321282
5477 8321282 8011475 8157534 8756834 8770065 8356493 8669738 8817966 8828000 8888054 8620359
5467 8620359 9388716 9532058 9338353 9440619 9125253 9570843 10146987 10060912 9826845 9986099
$$ packed form
5537E614671M39108Q22727o21126k8607J43503O26622K81638n18548n96321L571
5527F167238J85385m4317P47501J12758O58828k55193r82879L01755L03809q4619
5517G110266k35096O7105J65777k50918P24117n8059r5150L21336l35549J31836
5507G545665L74450m07117L87032k12244K81627j54938q19238P03506K00296j57981
5497G741058j56162Q15167q15552K19096j48205O1344L17583R8106M38049Q4697
5487H655181o23102J65703Q67224J120k48967k48776j49275J60433J53172m11431
5477H321282l09807J46059N99300J3231m13572L13245J48228J0034O0054k67695
5467H620359P68357J43342j93705J02266l15366M45590N76144q6075k34067J59254
$$ plain form
5457 9986099 9466056 9106873 9347109 9253764 9234030 8682451 8941386 9542100 9412090 9729484
5447 9729484 9463686 9452115 8655643 9663672 9658931 9760484 9966075 10350715 10645951 10392600
5437 10392600 10682044 10651948 10698897 10743908 10943575 11262967 11335939 11241219 11214259 10895218
5427 10895218 11117407 10749117 10792139 10749141 11214158 11545711 11555132 12412486 12129202 11579134
5417 11579134 11672480 12022816 12337032 12077274 11733835 11663623 11874363 12103587 11856316 11743792
5407 11743792 12009673 12055854 12575470 12946953 12250344 12399556 12874928 12384653 12678323 12942521
5397 12942521 13151409 13243369 13480615 13749533 13671798 13380301 13351425 13479158 13766144 13957838
5387 13957838 14216983 14498710 14570459 14021807 14896366 15670794 15672062 15013843 14607108 14701162
$$ packed form
5457I986099n20043l59183K40236r3345j9734n51579K58935O00714j30010L17394
5447I729484k65798j1571p96472J008029m741J01553K05591L84640K95236k53351
5437A0392600K89444l0096M6949M5011J99667L19392P2972r4720k6960l19041
5427A0895218K22189l68290M3022m2998M65017L31553R421Q57354k83284n50068
5417A1579134R3346L50336L14216k59758l43439p0212K10740K29224k47271j12524
5407A1743792K65881M6181N19616L71483o96609J49212M75372m90275K93670K64198
5397A2942521K08888R1960K37246K68918p7735k91497k8876J27733K86986J91694
5387A3957838K59145K81727P1749n48652Q74559P74428J268o58219m06735R4054
$$ plain form
5377 14701162 15166481 15204587 15853791 15782120 15915365 15808695 15324086 15962825 15988353 15754762
5367 15754762 16995141 17850168 17569612 17474458 17029508 16859202 17669734 17735366 18276836 18613688
5357 18613688 18468525 17962637 18838178 19341059 19170497 19366873 19343080 19647518 20614739 20177254
5347 20177254 20195987 20081942 20326131 21136862 21628654 21976690 21614994 22104033 22642327 23398196
5337 23398196 23635719 24585192 25212507 25450868 25384987 25542747 25472620 25705449 26229848 26811008
5327 26811008 26884160 27211266 27695579 27788413 27514048 28209066 29027812 29144448 29282647 30041062
5317 30041062 30425299 29857245 30328164 31294893 31658771 32475799 32798694 33562515 33856317
5308 33856317 34124832 34180301 34740677 34667277 34171367 34935341 36174851 36663718 37096849 37264645
$$ packed form
5377A4701162M65319L8106O49204p1671J33245j06670m84609O38739K5528k33591
5367A5754762J240379Q55027k80556r5154m44950j70306Q10532O5632N41470L36852
5357A8613688j45163n05888Q75541N02881j70562J96376k3793L04438R67221m37485
5347B0177254J8733j14045K44189Q10731M91792L48036l61696M89039N38294P55869
5337B3398196K37523R49473O27315K38361o5881J57760p0127K32829N24399N81160
5327B6811008P3152L27106M84313R2834k74365O95018Q18746J16636J38199P58415
5317C0041062L84237n68054M70919R66729L63878Q17028L22895P63821K93802
5308C3856317K68515N5469N60376p3400m95910P63974J239510M88867M33131J67796
$$ plain form
5298 37264645 37606781 37521826 37622814 37321287 37533079 37666980 38375993 38751399 37728761
5289 37728761 37704130 37959293 38400104 37997399 37815324 37928348 37962570 38768041 38459292 38751970
5279 38751970 38899378 38788724 38673528 39180286 39583309 39036573 39140537 39012010 39437962
5270 39437962 39469987 39552858 39676442 39669810 39561144 39704181 39251730 39267702 39814159 39960770
5260 39960770 39712763 40305387 39999742 40150336 39766414 40110480 40065281 39825600 40389857 40633726
5250 40633726 40437250 40374203 40594842 41161132 41782724 41588622 41606211 42755367 43179624 43483581
5240 43483581 43769764 43502462 44277756 45090381 45206850 45707777 46294899 46085481 46825436
5231 46825436 47420689 47591036 48615130 49303040 50079669 50522205 50828767 52537789 53563127
$$ packed form
5298C7264645L42136q4955J00988l01527K11792J33901P09013L75406j022638
5289C7728761k4631K55163M40811m02705j82075J13024L4222Q05471l08749K92678
5279C8751970J47408j10654j15196N06758M03023n46736J03964j28527M25952
5270C9437962L2025Q2871J23584o632j08666J43037m52451J5972N46457J46611
5260C9960770k48007N92624l05645J50594l83922L44066m5199k39681N64257K43869
5250D0633726j96476o3047K20639N66290O21592j94102J7589J149156M24257L03957
5240D3483581K86183k67302P75294Q12625J16469N00927N87122k09418P39955
5231D6825436N95253J70347J024094O87910P76629M42536L06562J709022J025338
$$ plain form
5222 53563127 53994921 54802293 55698249 56486116 57469107 58146368 58797306 60205909 61388839
5213 61388839 62697039 63975489 64836593 65858585 66646180 68422915 70456941 71654230
5205 71654230 72794327 74685384 76497575 78126980 79929141 81962467 83708574 85374325
5197 85374325 87283761 89215176 90693521 93044843 96185802 98492735 100783433 102967175
5189 102967175 105558345 108161153 111233676 115072294 117893578 121810728 125240305 128062794
5181 128062794 131545316 136269006 140364711 144547725 148177862 152460566 158119843 162539819
5173 162539819 167111629 172729633 177934670 183680717 189583355 196211429 203047401 208726666
5165 208726666 215184170 221745350 228393823 235880238 242873677 250386144 257701926 264021574
$$ packed form
5222E3563127M31794Q07372Q95956P87867R82991O77261O50938J408603J182930
5213F1388839J308200J278450Q61104J021992P87595J776735K034026J197289
5205G1654230J140097J891057J812191J629405J802161K033326J746107J665751
5197H5374325J909436J931415J478345K351322L140959K306933K290698K183742
5189A02967175K591170K602808L072523L838618K821284L917150L429577K822489
5181A28062794L482522M723690M095705M183014L630137M282704N659277M419976
5173A62539819M571810N618004N205037N746047N902638O628074O835972N679265
5165B08726666O457504O561180O648473P486415O993439P512467P315782O319648
$$ plain form
5157 264021574 270946167 277526579 284204939 290279114 295151792 300550468 305837198 309575717
5149 309575717 312740074 315395803 316419544 317745502 317576482 315968605 314397717 311919714
5141 311919714 308770653 304721195 299315475 293702701 287292058 281209839 274652610 267497253
5133 267497253 261040787 252981160 245884721 238198485 230642464 223741287 217040467 210090612
5125 210090612 203011134 196545748 190383396 184019256 177616391 171649332 166384209 160254176
5117 160254176 155285180 150566011 145834509 141311470 136646936 132620708 128309989 123559917
5109 123559917 119480040 116123654 112776345 109526044 106608472 103824610 101566317 98409320
5101 98409320 95076284 92576477 90353952 88077480 85548779 83054168 81889956 80596622
$$ packed form
5157B64021574O924593O580412O678360O074175M872678N398676N286730L738519
5149C09575717L164357K655729J023741J325958j69020j607877j570888k478003
5141C11919714l149061m049458n405720n612774o410643o082219o557229p155357
5133B67497253o456466q059627p096439p686236p556021o901177o700820o949855
5125B10090612p079478o465386o162352o364140o402865n967059n265123o130033
5117A60254176m968996m719169m731502m523039m664534m026228m310719m750072
5109A23559917m079877l356386l347309l250301k917572k783862k258293l156997
5101I8409320l333036k499807k222525k276472k528701k494611j164212j293334
$$ plain form
5093 80596622 78458402 76309559 74270478 72843847 71821027 70181488 68226553 67224512
5085 67224512 66237792 64063627 63363912 61987778 60802903 60017763 58801283 57650920 57234684
5076 57234684 56620146 56315507 54851257 53159277 53700567 53372096 52187681 51624614 51433381
5067 51433381 50898502 50014405 49230813 48836834 48428825 48229307 47967993 47359184 46867280
5058 46867280 46578132 45925427 45354569 45577689 45323707 44812689 44292445 43549490 43367548
5049 43367548 42889425 42817810 41762088 40698688 40368340 40080217 39731825 39377839 38761186
5040 38761186 38022772 37364414 37275787 36915183 36273831 35767828 35679452 34647121 34933433 34804335
5030 34804335 34046577 33706126 32817818 32637445 31504769 29934879 29486931 30077975 29996698
$$ packed form
5093H0596622k138220k148843k039081j426631j022820j639539j954935j002041
5085F7224512r86720k174165o99715j376134j184875p85140j216480j150363m16236
5076E7234684o14538l04639j464250j691980N41290l28471j184415n63067j91233
5067E1433381n34879q84097p83592l93979m08009j99518k61314o08809m91904
5058D6867280k89148o52705n70858K23120k53982n11018n20244p42955j81942
5049D3367548m78123p1615j055722j063400l30348k88123l48392l53986o16653
5040C8761186p38414o58358q8627l60604o41352n06003q8376j032331K86312j29098
5030C4804335p57758l40451q88308j80373j132676j569890m47948N91044q1277
$$ plain form
5021 29996698 29897386 29241799 27725302 27784474 27483850 27115160 26432567 26863067 26185192 25681990
5011 25681990 24897280 23897000 23276813 23480273 22979256 22411272 22293607 22481720 22015952
5002 22015952 20901229 20818191 20816857 19943658 19363056 19552762 19134639 18892028 18476807 18217829
4992 18217829 17921914 17700043 17144672 16970415 16489964 16324964 17011844 16295678 15708195
4983 15708195 15339693 15054105 15329958 15353349 14609490 15164368 14891741 13663087 13367948
4974 13367948 13187935 12963946 12636552 12790626 13190031 12337651 11888859 11551797 11587824 12019970
4964 12019970 11918527 11814330 11307664 11217053 11137960 11557611 10319766 10536883 10816352 10770995
4954 10770995 10361279 10139128 10137881 10450906 10455048 10387992 10246126 9218193 8675699 8899456
$$ packed form
5021B9996698r9312o55587j516497N9172l00624l68690o82593M30500o77875n03202
5011B5681990p84710j000280o20187K03460n01017n67984j17665J88113m65768
5002B2015952j114723q3038j334q73199n80602J89706m18123k42611m15221k58978
4992A8217829k95915k21871n55371j74257m80451j65000O86880p16166n87483
4983A5708195l68502k85588K75853K3391p43859N54878k72627j228654k95139
4974A3367948j80013k23989l27394J54074L99405q52380m48792l37062L6027M32146
4964A2019970j01443j04197n06666r0611p9093M19651j237845K17117K79469m5357
4954A0770995m09716k22151j247L13025M142o7056j41866j027933n42494K23757
$$ plain form
4944 8899456 9050337 8908044 9687945 9763585 9836920 9691378 9277494 9194719 9158188 9236284
4934 9236284 8764942 8988272 9234333 8740449 8230353 8074162 8064474 8368388 8976365 8616495
4924 8616495 8616583 9105913 8553519 8753254 8762680 8406164 7966987 7788845 7938778 7362431 7676423
4913 7676423 7598676 7520144 7959126 7441311 7140859 7101775 7249699 7458350 7521114 7382184
4903 7382184 7408052 7800547 7564132 7474488 7482476 7085641 6966560 7211400 7210893 6720864 7151270
4892 7151270 6843542 6440690 6271648 7101560 6966571 6965249 6410101 6125597 6610425 6906187
4882 6906187 6659627 6413285 6249934 6357501 6605133 6645747 6542001 6134435 6322057 6869948
4872 6869948 7263764 7227440 6808075 6757789 7091379 7844108 7246052 6387116 6632058 6878624
$$ packed form
4944H899456J50881j42293P79901P5640P3335j45542m13884q2775l6531P8096
4934I236284m71342K23330K46061m93884n10096j56191r688L03914O07977l59870
4924H616495Q8M89330n52394J99735R426l56516m39177j78142J49933n76347L13992
4913G676423p7747p8532M38982n17815l00452l9084J47924K08651O2764j38930
4903G382184K5868L92495k36415q9644P988l96835j19081K44840n07m90029M30406
4892G151270l07728m02852j69042Q29912j34989j322n55148k84504M84828K95762
4882F906187k46560k46342j63351J07567K47632M0614j03746m07566J87622N47891
4872F869948L93816l6324m19365n0286L33590P52729n98056q58936K44942K46566
$$ plain form
4862 6878624 6456903 6965315 7040155 6203019 6111044 6224802 5979925 5712410 6379636 6939818
4852 6939818 6325061 6799251 7550304 7582306 7544579 7120391 7692343 7278278 7296000 7341154
4842 7341154 7264402 7589490 7465946 7441900 7758363 7702459 7621698 7788973 8101950 8079011
4832 8079011 8076036 7662625 7251458 7285233 7962679 7484550 7753120 8335836 8362105 7921492
4822 7921492 8363214 8084584 8522514 8693557 8662190 8433365 7840579 8493094 8702694 8485661
4812 8485661 8723892 8992558 9298503 9562276 9250434 8794312 8844452 8938490 9451583 9290733
4802 9290733 9623476 10008668 10432022 10318758 10491105 11058935 10920832 11083709 10676354 10691208
4792 10691208 11399298 11856130 11769936 11388896 11466013 11572438 11611475 11635447 12092273 12117794
$$ packed form
4862F878624m21721N08412P4840q37136r1975J13758k44877k67515O67226N60182
4852F939818o14757M74190P51053L2002l7727m24188N71952m14065J7722M5154
4842G341154p6752L25088j23544k4046L16463n5904q0761J67275L12977k2939
4832H079011k975m13411m11167L3775O77446m78129K68570N82716K6269m40613
4822G921492M41722k78630M37930J71043l1367k28825n92786O52515K09600k17033
4812H485661K38231K68666L05945K63773l11842m56122N0140R4038N13093j60850
4802I290733L32743L85192M23354j13264J72347N67830j38103J62877m07355J4854
4792A0691208P08090M56832q6194l81040P7117J06425L9037K3972M56826K5521
$$ plain form
4782 12117794 12286476 12719297 13251197 13142241 12945217 13127680 13519774 13899211 14780194
4773 14780194 14665740 15357020 15554322 14994018 15966566 16497095 16670137 17003835 17936591
4764 17936591 18204840 19088439 19249495 19485274 19856369 20646971 21872388 22369943 23482579
4755 23482579 24641320 25466289 27363581 28852074 29756338 30942608 32554533 34854166
4747 34854166 37073175 39142096 42132611 44913848 47990650 51841987 55504098 58505137
4739 58505137 62284334 66110134 69787821 73757441 77814143 80742811 84170986 87948480
4731 87948480 91464474 94496964 97173105 98342489 96970488 94171748 89409034 83359868
4723 83359868 77328474 70212509 64106259 58481626 53134790 48321878 44648767 41579592
$$ packed form
4782A2117794J68682M32821N31900j08956j97024J82463L92094L79437Q80983
4773A4780194j14454O91280J97302n60304R72548N30529J73042L33698R32756
4764A7936591K68249Q83599J61056K35779L71095P90602J225417M97555J112636
4755B3482579J158741Q24969J897292J488493R04264J186270J611925K299633
4747C4854166K219009K068921K990515K781237L076802L851337L662111L001039
4739E8505137L779197L825800L677687L969620M056702K928668L428175L777494
4731H7948480L515994L032490K676141J169384j372001k798740m762714o049166
4723H3359868o031394p115965o106250n624633n346836m812912l673111l069175
$$ plain form
4715 41579592 38685437 36460925 34066345 31346644 28829516 27165615 25895583 23928631
4707 23928631 22855887 21874203 20668584 19541066 18819221 17985325 16888463 16189353 16123218
4698 16123218 15363287 14448531 13709173 13414073 13041645 12442960 12476731 11511305 10735221 10640327
4688 10640327 10386482 9778666 9042904 8922453 8289057 8424829 8531508 8666229 8007230
4679 8007230 7574404 7625478 7533791 7069512 7053685 7124071 7093612 7024745 6444971 6467088 6408697
4668 6408697 5987432 5244312 6146604 5426693 5292266 5124442 5472350 4999858 5009307 4498595
4658 4498595 4665778 5112295 5140716 4621091 4048150 4414567 4001110 3773412 3794845 3908985
4648 3908985 4112243 3970738 4050534 3734219 3205189 3609817 3875270 3521847 3313630 3792446
$$ packed form
4715D1579592k894155k224512k394580k719701k517128j663901j270032j966952
4707B3928631j072744r81684j205619j127518p21845q33896j096862o99110o6135
4698A6123218p59931r14756p39358k95100l72428n98685L3771r65426p76084r4894
4688A0640327k53845o07816p35762j20451o33396J35772J06679J34721o58999
4679H007230m32826N1074r1687m64279j5827P0386l0459o8867n79774K2117n8391
4668F408697m21265p43120R02292p19911j34427j67824L47908m72492R449n10712
4658D498595J67183M46517K8421n19625n72941L66417m13457k27698K1433J14140
4648C908985K03258j41505P9796l16315n29030M04628K65453l53423k08217M78816
$$ plain form
4638 3792446 3874201 2924194 3202790 3709185 3580104 3085326 2564653 3249814 2846479 2592166
4628 2592166 3344982 3040147 3123331 2990992 2851735 2505545 3171922 3133312 1837705 1894374
4618 1894374 1792530 1728749 2013401 1927083 2369937 3266161 2501419 2117254 2256625 3109737
4608 3109737 2933436 2102587 1488315 1678979 2035603 1882712 2741377 3022357 2104255 1654003
4598 1654003 1583142 1864457 2418027 2468345 2267766 2450518 2700962 2837495 2728219 2010887
4588 2010887 1959220 2219454 1657428 1944552 2306986 1795707 1623900 1899198 1300312 1593824
4578 1593824 2185272 2443568 1795107 1438073 2407321 1715607 1446951 1485541 1990931 2019213
4568 2019213 2228051 2018878 2650462 2610503 1590132 1161407 1476735 2441135 2027736 2092792
$$ packed form
4638C792446Q1755r50007K78596N06395j29081m94778n20673O85161m03335k54313
4628B592166P52816l04835Q3184j32339j39257l46190O66377l8610j295607N6669
4618A894374j01844o3781K84652q6318M42854Q96224p64742l84165J39371Q53112
4608C109737j76301q30849o14272J90664L56624j52891Q58665K80980r18102m50252
4598A654003p0861K81315N53570N0318k00579J82752K50444J36533j09276p17332
4588B010887n1667K60234n62026K87124L62434n11279j71807K75298n98886K93512
4578A593824N91448K58296o48461l57034R69248o91714k68656L8590N05390K8282
4568B019213K08838k09173O31584l9959j020371m28725L15328R64400m13399O5056
$$ plain form
4558 2092792 1836658 1534090 2064890 1315423 1071253 1234338 1081761 1785639 2486943 1659375
4548 1659375 1531874 1784448 1962436 2046953 1487884 1533161 1276772 2188233 2669036 2503571
4538 2503571 2651648 2359292 2339396 2505729 1993319 1657672 1744051 1611429 2343985 2798347
4528 2798347 2481106 2231977 2545879 2320922 1994536 2141756 1836007 2007951 2134166 2242747
4518 2242747 2416937 3568185 2945775 2792088 2761785 2338885 2224078 2690957 2802240 2532213
4508 2532213 2687458 2567084 2264836 2508985 2258348 2422160 2800672 2654187 3089337 3364634
4498 3364634 3249171 2298916 2356018 3128856 2691770 2598945 2618062 2501430 2172606 1899314
4488 1899314 2583585 2538658 3234241 3731036 2764408 2403486 1788277 2398050 3049090 2865276
$$ packed form
4558B092792k56134l02568N30800p49467k44170J63085j52577P03878P01304q27568
4548A659375j27501K52574J77988Q4517n59069M5277k56389R11461M80803j65465
4538B503571J48077k92356j9896J66333n12410l35647Q6379j32622P32556M54362
4528B798347l17241k49129L13902k24957l26386J47220l05749J71944J26215J08581
4518B242747J74190J151248o22410j53687l0303m22900j14807M66879J11283k70027
4508B532213J55245j20374l02248K44149k50637J63812L78512j46485M35150K75297
4498C364634j15463r50255N7102P72838m37086r2825J9117j16632l28824k73292
4488A899314O84271m4927O95583M96795r66628l60922o15209O09773O51040j83814
$$ plain form
4478 2865276 2618061 2437826 2317851 2461481 2986154 2835115 2657422 2408996 3016135 3264975
4468 3264975 2835501 2899093 3450650 3651597 4179766 3908948 4014665 3480279 3418093 2781045
4458 2781045 3157943 4417707 4793141 4195800 4023507 4044927 4031764 4376508 4008290 4534420
4448 4534420 4441483 4410927 4452722 4547951 4630565 4942650 5362140 5175633 5277794 5479514
4438 5479514 5492371 5278092 5273859 5672796 6038129 6166200 6247879 6612369 6898306 6981358
4428 6981358 6703612 6720136 6726588 7237482 7594400 7328254 7759829 8482845 9057061 9324741
4418 9324741 8799858 8742034 8855564 8886042 9881182 10423483 10145264 10268463 10828474 10993402
4408 10993402 11859546 12279238 12426114 12794193 13544604 13108895 13569186 14376117 14914126
$$ packed form
4478B865276k47215j80235j19975J43630N24673j51039j77693k48426O07139K48840
4468C264975m29474O3592N51557K00947N28169k70818J05717n34386o2186o37048
4458B781045L76898J259764L75434n97341j72293K1420j3163L44744l68218N26130
4448D534420r2937l0556M1795R5229Q2614L12085M19490j86507J02161K01720
4438E479514J2857k14279m233L98937L65333J28071Q1679L64490K85937Q3052
4428F981358k77746J6524O452N10894L56918k66146M31575P23016N74216K67680
4418I324741n24883n7824J13530L0478R95140N42301k78219J23199N60011J64928
4408A0993402Q66144M19692J46876L68079P50411m35709M60291Q06931N38009
$$ plain form
4399 14914126 16332999 16564281 17332407 18239129 19042284 20192855 21473050 22925764 24542694
4390 24542694 26329455 28789341 30311559 34065123 37526524 41563314 46819797 52159180
4382 52159180 57369851 61254704 64145566 67090738 70256519 74157743 79967267 87775657
4374 87775657 95611809 101039243 102754717 101737333 101426936 102976006 107042048 113720070
4366 113720070 120531083 124046230 123188480 117458111 110416919 104489272 100688167 99634404
4358 99634404 100021313 99861970 98288303 92173174 83187915 75200772 69324038 65180795
4350 65180795 62269216 60592949 57933450 54182670 49205074 43359997 38424245 33779241
4342 33779241 30720906 27776813 25749164 24140263 22345103 21800310 21176004 20260824 19583010
$$ packed form
4399A4914126J418873K31282P68126R06722Q03155J150571J280195J452714J616930
4390B4542694J786761K459886J522218L753564L461401M036790N256483N339383
4382E2159180N210671L884853K890862K945172L165781L901224N809524P808390
4374H7775657P836152N427434J715474j017384l10397J549070M066042O678022
4366A13720070O811013L515147q57750n730369p041192n927647l801105j053763
4358I9634404L86909j59343j573667o115129q985259p987143n876734m143243
4350F5180795k911579j676267k659499l750780m977596n845077m935752m645004
4342C3779241l058335k944093k027649j608901j795160n44793o24306r15180o77814
$$ plain form
4333 19583010 19273304 18707970 18020216 17388052 17881392 18043792 18126628 18026084 17737767 17559002
4323 17559002 17334929 17067994 16499145 15317225 14551666 13385384 12036035 11803171 10770357
4314 10770357 10210335 9834759 10113110 9518200 8377319 7894795 7381894 6955519 6584666
4305 6584666 7371677 6953888 6336957 6576940 6856753 7140965 6693381 5684095 6099118
4296 6099118 6019592 5837253 5573866 5581613 5336830 5199980 5096739 4488019 4651444 5085899
4286 5085899 5267817 4296868 4698012 4259976 3864402 4681206 5167330 5136672 4943597 3976678
4276 3976678 4464356 4371961 4150376 3926964 3765153 3459374 3595914 3956551 3931653 4202774
4266 4202774 3948149 3701519 3129559 3146485 3200667 3015721 3056307 2516285 2453607 3090803
$$ packed form
4333A9583010l09706n65334o87754o32164M93340J62400Q2836j00544k88317j78765
4323A7559002k24073k66935n68849j181920p65559j166282j349349k32864j032814
4314A0770357n60022l75576K78351n94910j140881m82524n12901m26375l70853
4305F584666P87011m17789o16931K39983K79813K84212m47584j009286M15023
4296F099118p9526j82339k63387P747k44783j36850j03241o08720J63425M34455
4286E085899J81918r70949M01144m38036l95574Q16804M86124l0658j93075r66919
4276C976678M87678r2395k21585k23412j61811l05779J36540L60637k4898K71121
4266D202774k54625k46630n71960J6926N4182j84946M0586n40022o2678O37196
$$ plain form
4256 3090803 2986471 3244986 2927265 2947820 2900765 3539567 3752480 3211700 2830010 2637237
4246 2637237 2277914 1933928 2611399 3045604 3708432 3725302 3504740 3612224 3122011 2879271
4236 2879271 2312577 2277528 2155113 2170501 2481104 2312647 2501517 2363504 2330239 2845336
4226 2845336 2615373 2731786 3309990 3426894 3840377 3658596 3148695 2624792 2383455 2402964
4216 2402964 2193708 3055719 3392259 3017688 2766657 2649982 2878014 2611737 2405515 2674023
4206 2674023 2491305 2721468 2720778 2656805 3411263 3320614 2834069 3149061 2793313 3006926
4196 3006926 3460428 3355387 3310344 3756779 3670978 2542328 2923730 3540439 3288593 3779967
4186 3779967 4260635 3974968 3389264 3334442 3815480 3632949 3244111 3855721 4151302 4211243
$$ packed form
4256C090803j04332K58515l17721K0555m7055O38802K12913n40780l81690j92773
4246B637237l59323l43986O77471M34205O62828J6870k20562J07484m90213k42740
4236B879271n66694l5049j22415J5388L10603j68457J88870j38013l3265N15097
4226B845336k29963J16413N78204J16904M13483j81781n09901n23903k41337J9509
4216B402964k09256Q62011L36540l74571k51031j16675K28032k66277k06222K68508
4206B674023j82718K30163o90o3973P54458r0649m86545L14992l55748K13613
4196C006926M53502j05041m5043M46435q5801j128650L81402O16709k51846M91374
4186C779967M80668k85667n85704n4822M81038j82531l88838O11610K95581N9941
$$ plain form
4176 4211243 4436952 4188058 4264255 4355984 4638119 4586601 5086674 5279612 4881662 4909385
4166 4909385 5326741 5410301 5360404 5014534 5124101 6244317 6260956 6123505 5509730 5659757
4156 5659757 6020650 6282564 6642560 6385450 6659044 7233902 6019625 6096733 6920937 7095853
4146 7095853 7744831 7310232 7236505 7656117 7569843 7467564 8459297 8586125 9094335 9449991
4136 9449991 9726607 9663096 10292413 11066915 11233279 11021768 10862005 11323103 11644114 12328116
4126 12328116 13028810 13262438 12721966 13012223 13570566 13847272 14366785 14910992 15818470
4117 15818470 16565107 17402175 17507091 18717335 19355440 19071231 19825780 21040006 21471915
4108 21471915 22016416 22352202 23456953 24934416 25503622 26374930 26814879 27876574 28522257
$$ packed form
4176D211243K25709k48894P6197R1729K82135n1518N00073J92938l97950K7723
4166D909385M17356Q3560m9897l45870J09567J120216J6639j37451o13775J50027
4156E659757L60893K61914L59996k57110K73594N74858j214277P7108Q24204J74916
4146G095853O48978m34599p3727M19612q6274j02279R91733J26828N08210L55656
4136I449991K76616o3511O29317P74502J66364k11511j59763M61098L21011O84002
4126A2328116P00694K33628n40472K90257N58343K76706N19513N44207R07478
4117A5818470P46637Q37068J04916J210244O38105k84209P54549J214226M31909
4108B1471915N44501L35786J104751J477463N69206Q71308M39949J061695O45683
$$ plain form
4099 28522257 29239323 30250333 31202648 31730993 32317205 33369076 34467451 34605456 34954853
4090 34954853 35525781 36300567 37133092 37524390 38543466 39268814 39370374 39668660 40328419
4081 40328419 40861912 40819805 40261085 40523994 40911166 40814906 40991915 40110309 40266042 40675216
4071 40675216 40775359 40787047 39924916 39229917 38936862 38380425 38143382 37807005 37233704 36235740
4061 36235740 35535232 35314400 34857297 34173210 33450912 32787098 31748010 31400390 30594143
4052 30594143 30007441 30203200 29696687 28583051 27843458 27255395 26131989 25570727 25251120
4043 25251120 25540937 25761907 25000111 24884856 23979272 23477023 23182470 23204007 22792994 22907211
4033 22907211 23324240 23254502 23157287 22082617 21571954 21989417 22139493 22147381 22340465 22447979
$$ packed form
4099B8522257P17066J011010R52315N28345N86212J051871J098375J38005L49397
4090C4954853N70928P74786Q32525L91298J019076P25348J01560K98286O59759
4081D0328419N33493m2107n58720K62909L87172r6260J77009q81606J55733M09174
4071D0675216J00143J1688q62131o94999k93055n56437k37043l36377n73301r97964
4061C6235740p00508k20832m57103o84087p22298o63814j039088l47620q06247
4052C0594143n86702J95759n06513j113636p39593n88063j123406n61262l19607
4043B5251120K89817K20970p61796j15255r05584n02249k94553K1537m11013J14217
4033B2907211M17029o9738r7215j074670n10663M17463J50076P888J93084J07514
$$ plain form
4023 22447979 22738418 22111644 21951133 22352505 23267059 24104299 23881340 23532631 23367838
4014 23367838 24308525 24739085 25025666 25373573 25524504 25861446 26288194 26695866 26258805
4005 26258805 26751290 27034924 27485169 27940781 27412482 27448920 28022754 29173503 29455561
3996 29455561 30327230 30795458 30832816 32126211 34448473 37926752 41386814 45590841 51548181
3987 51548181 59940717 66809417 62575350 52753094 43885195 37324740 33326685 29780226
3979 29780226 27300166 25374419 23374805 22135468 21166086 19818945 19618736 18590549
3971 18590549 17731764 16725096 16157263 15480627 15617768 14822732 14030004 14010285 13929239 14199020
3961 14199020 14115724 13598194 13553362 13243260 13311729 12949795 12591465 12266879 12157578 12437756
$$ packed form
4023B2447979K90439o26774j60511M01372R14554Q37240k22959l48709j64793
4014B3367838R40687M30560K86581L47907J50931L36942M26748M07672m37061
4005B6258805M92485K83634M50245M55612n28299L6438N73834J150749K82058
3996B9455561Q71669M68228L7358J293395K322262L478279L460062M204027N957340
3987E1548181Q392536O868700m234067r822256q867899o560455l998055l546459
3979B9780226k480060j925747j999614j239337r69382j347141k00209j028187
3971A8590549q58785j006668n67833o76636J37141p95036p92728j9719q1046K69781
3961A4199020q3296n17530m4832l10102O8469l61934l58330l24586j09301K80178
$$ plain form
3951 12437756 12323192 11944152 11827496 11609309 11553202 11637490 11828710 11904384 11526350 11225788
3941 11225788 11357643 11285789 11171179 11409204 12052476 12542364 12142077 12230977 12494474 12778845
3931 12778845 12357403 12351168 12778431 13186231 13017241 13258400 13480312 14071111 14571911 14824531
3921 14824531 14793385 14624734 15174757 15252241 14729177 16068361 16156836 16302998 16318616 16847501
3911 16847501 17080183 16722869 16989015 17022912 17319728 18528985 19119677 19727341 20019128
3902 20019128 19940473 20335604 21158116 21862540 22288837 22990134 22930434 23206070 23246338 24023223
3892 24023223 24598441 25702790 25816584 26361394 26967653 26765484 27591246 28372708 29582499
3883 29582499 30802945 31184231 31463935 32029972 33125138 34537901 35192263 36304074 37385425
$$ packed form
3951A2437756j14564l79040j16656k18187n6107Q4288J91220P5674l78034l00562
3941A1225788J31855p1854j14610K38025O43272M89888m00287Q8900K63497K84371
3931A2778845m21442o235M27263M07800j68990K41159K21912N90799N00800K52620
3921A4824531l1146j68651N50023P7484n23064J339184Q8475J46162J5618N28885
3911A6847501K32682l57314K66146L3897K96816J209257N90692O07664K91787
3902B0019128p8655L95131Q22512P04424M26297P01297n9700K75636M0268P76885
3892B4023223N75218J104349J13794N44810O06259k02169Q25762P81462J209791
3883B9582499J220446L81286K79704N66037J095166J412763O54362J111811J081351
$$ plain form
3874 37385425 38342479 39443326 40033597 41237887 42283068 43421010 44255494 45434412 47183482
3865 47183482 48312226 49346588 50408449 51567997 52647326 54553168 56333319 57796367
3857 57796367 59456413 60596270 62223445 64300040 65516488 66414015 67567804 68222393
3849 68222393 68637413 69819050 70592512 70975987 70634701 70568079 70931163 70841856 70525872 70768729
3839 70768729 70115422 69129196 68982232 69020415 68093664 67395894 66797464 65764402 65581071
3830 65581071 64759922 62725259 61230481 61280347 60081459 59153540 57933638 57119076 56635400
3821 56635400 55985736 54751060 54740148 53934022 52597158 52237757 51935644 51406298 50506691
3812 50506691 50215413 49621301 48977203 48650209 49041925 48937700 47871072 47996362 47552906
$$ packed form
3874C7385425R57054J100847N90271J204290J045181J137942Q34484J178918J749070
3865D7183482J128744J034362J061861J159548J079329J905842J780151J463048
3857E7796367J660046J139857J627175K076595J216448Q97527J153789O54589
3849F8222393M15020J181637P73462L83475l41286o6622L63084q9307l15984K42857
3839G0768729o53307r86226j46964L8183r26751o97770n98430j033062j83331
3830F5581071q21149k034663j494778M9866j198888r27919j219902q14562m83676
3821E6635400o49664j234676j0912q06126j336864l59401l02113n29346q99607
3812E0506691k91278n94112o44098l26994L91716j04225j066628J25290m43456
$$ plain form
3803 47552906 46687674 46379047 46329438 45918034 44902241 44790956 44367282 43606855 42608208
3794 42608208 42083327 41594217 40569740 40195068 39429240 38605791 38151287 38149385 37636152 36497730
3784 36497730 35830584 35259691 34662167 33946001 34059984 33042607 32157202 31359301 30751146
3775 30751146 30137905 29772929 29642446 28248369 27811498 27717576 26764928 26024402 26341157
3766 26341157 26210280 25482369 25162445 25077028 24309636 23214497 22164486 21787059 21666900
3757 21666900 21338402 21175354 20933905 20309997 19502223 19120386 18604956 18718901 17756755
3748 17756755 17832839 17856933 17150514 17243940 17179328 16910999 16714367 16636782 16656688 15803780
3738 15803780 15572808 15227343 15057046 14494128 14491150 14728824 13961031 14218273 14349810 13963197
$$ packed form
3803D7552906q65232l08627m9609m11404j015793j11285m23674p60427r98647
3794D2608208n24881m89110j024477l74672p65828q23449m54504j902n13233j138422
3784C6497730o67146n70893n97524p16166J13983j017377q85405p97901o08155
3775C0751146o13241l64976j30483j394077m36871r3922r52648p40526L16755
3766B6341157j30877p27911l19924q5417p67392j095139j050011l77427j20159
3757B1666900l28498j63048k41449o23908q07774l81837n15430J13945r62146
3748A7756755P6084K4094p06419R3426o4612k68329j96632p7585J9906q52908
3738A5803780k30972l45465j70297n62918k978K37674p67793K57242J31537l86613
$$ plain form
3728 13963197 13774312 14169058 13877470 13737888 14009136 13834365 13746755 13286919 12795239 13212133
3718 13212133 13090734 12576241 12318646 12952632 12751648 12490454 12824475 12988905 13186199
3709 13186199 13081218 12447808 12980119 13309778 13339440 13400858 13406138 12905778 12419662 12758371
3699 12758371 13067527 13774657 13996190 13407016 13749101 14250102 13799996 13632101 14373165
3690 14373165 14908969 15058949 15242041 15016253 15646959 15736343 15588164 15551687 16105333 15957353
3680 15957353 16653142 16975553 16938807 17450541 17099879 17684514 17626034 18922560 18939369 18773646
3670 18773646 18795509 19827025 20025073 19987681 20361062 20178505 20532742 20007607 19994508 20700348
3660 20700348 21160971 20805960 21105665 21962003 22116839 22369665 22856356 22590508 22772809
$$ packed form
3728A3963197j88885L94746k91588j39582K71248j74771q7610m59836m91680M16894
3718A3212133j21399n14493k57595O33986k00984k61194L34021J64430J97294
3709A3186199j04981o33410N32311L29659K9662O1418N280n00360m86116L38709
3699A2758371L09156P07130K21533n89174L42085N01001m50106j67895P41064
3690A4373165N35804J49980J83092k25788O30706Q9384j48179l6477N53646j47980
3680A5957353O95789L22411l6746N11734l50662N84635n8480J296526J6809j65723
3670A8773646K1863J031516J98048l7392L73381j82557L54237n25135j3099P05840
3660B0700348M60623l55011K99705Q56338J54836K52826M86691k65848J82301
$$ plain form
3651 22772809 23405723 24034245 24905662 25732825 26489456 27476870 28271837 28899231 29825803
3642 29825803 30363952 30784246 31789210 32741445 34059545 35095140 36316840 37559279 38980224
3633 38980224 40153025 41370203 43442156 45465102 46879589 49027201 51154295 52247940
3625 52247940 53387754 55289594 56964062 58460548 60546132 62508119 64664674 65873174
3617 65873174 66694974 68364892 70092749 71317593 72458857 72877170 73959686 75070104
3609 75070104 76487370 77101267 76882625 77485379 78123503 78909341 78803755 79603844 79710553
3600 79710553 79252883 79136971 78770746 78456851 78030018 77226585 76425500 75551597 75154197
3591 75154197 74317094 74341019 73942100 72825161 71286552 70186475 69161425 68246784 66868247
$$ packed form
3651B2772809O32914O28522Q71417Q27163P56631R87414P94967O27394R26572
3642B9825803N38149M20294J004964R52235J318100J035595J221700J242439J420945
3633C8980224J172801J217178K071953K022946J414487K147612K127094J093645
3625E2247940J139814J901840J674468J496486K085584J961987K156555J208500
3617F5873174Q21800J669918J727857J224844J141264M18313J082516J110418
3609G5070104J417266O13897k18642O02754O38124P85838j05586Q00089J06709
3600G9710553m57670j15912l66225l13895m26833q03433q01085q73903l97400
3591G5154197q37103K3925l98919j116939j538609j100077j025050r14641j378537
$$ plain form
3582 66868247 66030257 65148647 63885315 62873803 61578333 59417610 58671888 57650046 55819328
3573 55819328 54995306 54145245 53371377 52286017 50923837 49116415 48223937 47597329 46645837
3564 46645837 45209951 44256550 43283462 42095400 41248558 41190135 40738029 40501723 39565611
3555 39565611 38295198 38665621 38701763 37530385 37185589 36378173 35671199 35267305 35476179
3546 35476179 35727394 35137546 34858195 34801949 33718848 33691870 33319438 32958572 32372758 31583072
3536 31583072 30562436 30212038 30728405 29888235 29117840 28432857 27455183 26525191 25643792
3527 25643792 25349286 25133766 24441957 23448090 22191095 20753908 20529617 20126861 19472415
3518 19472415 18794860 18145050 17569428 16587454 16175118 15297328 14627755 13939690 13396425
$$ packed form
3582F6868247q37990q81610j263332j011512j295470k160723p45722j021842j830718
3573E5819328q24022q50061p73868j085360j362180j807422q92478o26608r51492
3564D6645837j435886r53401r73088j188062q46842n8423m52106k36306r36112
3555C9565611j270413L70423L6142j171378l44796q07416p06974m03894K08874
3546C5476179K51215n89848k79351n6246j083101k6978l72432l60866n85814p89686
3536C1583072j020636l50398N16367q40170p70395o84983r77674r29992q81399
3527B5643792k94506k15520o91809r93867j256995j437187k24291m02756o54446
3518A9472415o77555o49810n75622r81974m12336q77790o69573o88065n43265
$$ plain form
3509 13396425 13226589 13034242 12482239 11966401 11881192 11095404 11497845 11438979 11210072 10782922
3499 10782922 9747620 9416068 9543754 9601222 9199606 9578463 9544336 9470590 9372940 9521071
3489 9521071 9499703 9170691 8380941 7770285 7533282 7673925 8384908 8452257 8035467 8184706
3479 8184706 8161407 8094618 7794554 7226370 7110534 6759603 6758113 6473393 5907124 6488462
3469 6488462 6189054 5598992 5814803 5816096 5108013 4358899 5179795 5732503 5174270 4865076
3459 4865076 4177938 4044059 3670392 3629193 3880731 3823104 3748265 3129336 2926894 2876286
3449 2876286 3293933 3386034 3031302 3000653 3142142 2863522 2538785 2849037 3066112 2785362
3439 2785362 2422072 2463589 2101284 2497334 2484357 2123949 2547768 2590468 2018729 2347717
$$ packed form
3509A3396425j69836j92347n52003n15838q5209p85788M02441n8866k28907m27150
3499A0782922j035302l31552J27686N7468m01616L78857l4127p3746r7650J48131
3489I521071k1368l29012p89750o10656k37003J40643P10983O7349m16790J49239
3479H184706k3299o6789l00064n68184j15836l50931j490k84720n66269N81338
3469F488462k99408n90062K15811J293p08083p49114Q20896N52708n58233l09194
3459D865076o87138j33879l73667m1199K51538n7627p4839o18929k02442n0608
3449B876286M17647R2101l54732l0649J41489k78620l24737L10252K17075k80750
3439B785362l63290M1517l62305L96050j2977l60408M23819M2700n71739L28988
$$ plain form
3429 2347717 2127542 2132176 1718006 2010275 2364212 2359178 2189141 1506463 1557952 1560822 2187091
3418 2187091 1748122 1865579 1389270 1105589 1264098 1210217 1405237 1490918 1642404 1833226
3408 1833226 1520592 975886 1447762 1510525 937375 967962 897758 920546 851067 932839 1138712
3397 1138712 893045 1222876 1051010 612447 258444 148482 316020 271430 784290 553489
3387 553489 463121 1171566 1267667 956180 521118 800365 693162 1356058 1639314 916347
3377 916347 485477 632067 1157386 1078525 1076489 1064832 869644 489318 867662 1198385
3367 1198385 1539400 1106986 1147627 1093603 1238985 584003 985742 1123425 554931 1071579
3357 1071579 919069 676820 475973 526731 655545 1178109 999762 489317 545886 874599
$$ packed form
3429B347717k20175M634m14170K92269L53937n034j70037o82678N1489K870O26269
3418B187091m38969J17457m76309k83681J58509n3881J95020Q5681J51486J90822
3408A833226l12634n44706M71876O2763n73150L0587p0204K2788o9479Q1772K05873
3397A138712k45667L29831j71866m38563l54003j09962J67538m4590N12860k30801
3387E53489r0368P08445R6101l11487m35062K79247j07203O62896K83256p22967
3377I16347m30870J46590N25319p8861k036j1657j95188l80326L78344L30723
3367A198385L41015m32414M0641n4024J45382o54982M01739J37683n68494N16648
3357A071579j52510k42249k00847N0758J28814N22564j78347n10445N6569L28713
$$ plain form
3347 874599 638567 801380 1162676 950199 551176 859233 177570 662284 954390 1415099
3337 1415099 1408768 1563387 1827926 750253 587052 448607 723316 1037512 1082452 965922
3327 965922 294630 476732 552105 514611 881237 1067509 1526670 838018 967804 1288977
3317 1288977 654662 535681 1070138 504426 392081 818095 1014920 1121494 1320003 722020
3307 722020 919583 1197069 1493867 2022286 2205820 1259579 956233 727672 395638 966547
3297 966547 630012 824107 666634 633547 568311 721850 623580 121298 93283 609122
3287 609122 182395 329176 736391 863625 724037 902390 880969 964686 716734 488585
3277 488585 464110 -8009 309790 445027 197317 361728 -134216 73586 488877 328995
$$ packed form
3347H74599k36032J62813L61296k12477l99023L08057o81663M84714K92106M60709
3337A415099o331J54619K64539j077673j63201j38445K74709L14196M4940j16530
3327I65922o71292J82102P5373l7494L66626J86272M59161o88652J29786L21173
3317A288977o34315j18981N34457n65712j12345M26014J96825J06574J98509n97983
3307G22020J97563K77486K96798N28419J83534r46241l03346k28561l32034N70909
3297I66547l36535J94095j57473l3087o5236J53539r8270n02282k8015N15839
3287F09122m26727J46781M07215J27234j39588J78353k1421Q3717k47952k28149
3277D88585k4475m72119L17799J35237k47710J64411m95944K07802M15291j59882
$$ plain form
3267 328995 291538 590712 585498 1032371 1099625 727580 114866 -459996 -264773 151757
3257 151757 912072 595706 516625 548477 752951 253857 769118 708726 439380 327606
3247 327606 146642 404715 466961 574242 433807 -108192 -386001 -216827 347995 692886
3237 692886 620403 653809 717480 595669 772159 615707 1221945 795827 870468 883631 1070749
3226 1070749 948978 656907 938675 854108 646743 977075 1421827 953938 993058 1407691
3216 1407691 1193178 762522 823920 466528 363642 570169 912417 387389 832659 1164431
3206 1164431 1069685 889713 200657 354822 281323 -306751 -431274 -13637 361236 82752
3196 82752 628737 684279 701498 636688 472783 31870 157526 -187629 395592 168647
$$ packed form
3267C28995l7457K99174n214M46873O7254l72045o12714n74862J95223M16530
3257A51757P60315l16366p9081L1852K04474m99094N15261o0392k69346j11774
3247C27606j80964K58073O2246J07281j40435n41999k77809J69174N64822L44891
3237F92886p2483L3406O3671j21811J76490j56452O06238m26118P4641J3163J87118
3226A070749j21771k92071K81768q4567k07365L30332M44752m67889L9120M14633
3216A407691k14513m30656O1398l57392j02886K06527L42248n25028M45270L31772
3206A164431r4746j79972o89056J54165p3499n88074j24523M17637L74873k78484
3196H2752N45985N5542J7219o4810j63905m40913J25656l45155N83221k26945
$$ plain form
3186 168647 83478 369015 -430461 103267 371721 93978 -101336 -387372 1740 295939
3176 295939 314703 145894 -579122 -325991 -215169 64835 220388 -111165 -58523 227193
3166 227193 302924 -94915 -285351 -73261 -169534 201926 219534 29304 477296 218851
3156 218851 349207 386362 505428 182096 -35306 197315 147872 206683 318897 413239
3146 413239 421043 140014 436841 858795 522667 576442 749554 534658 424438 1087655
3136 1087655 1234813 1796603 1696832 788632 766972 567017 1398721 1269792 814929 758481
3126 758481 210171 780882 836952 699146 584439 755531 585608 232781 47851 221995
3116 221995 171130 151958 263957 110754 284857 322214 -44548 393529 279184 -269650
$$ packed form
3186A68647q5169K85537p99476N33728K68454k77743j95314k86036L89112K94199
3176B95939J8764j68809p25016K53131J10822K80004J55553l31553N2642K85716
3166B27193P5731l97839j90436K12090r6273L71460J7608j90230M47992k58445
3156B18851J30356L7155J19066l23332k17402K32621m9443N8811J12214R4342
3146D13239P804k81029K96827M21954l36128N3775J73112k14896j10220O63217
3136A087655J47158N61790r9771r08200k1660j99955Q31704j28929m54863n6448
3126G58481n48310N70711N6070j37806j14707J71092j69923l52827j84930J74144
3116B21995n0865j9172J11999j53203J74103L7357l66762M38077j14345n48834
$$ plain form
3106 -269650 -110980 -74139 295898 597731 859603 -64391 272275 372234 22405 278418
3096 278418 715497 590941 32922 139980 -255074 -283146 83733 208209 153060 178750
3086 178750 -198278 -14119 430271 -26172 181372 219907 -150914 -358023 -399056 -293722
3076 -293722 -68215 396618 358504 23299 -126310 -102885 -164326 234486 -403843 -216914
3066 -216914 -397407 -272962 -300254 158785 285342 359400 754542 206273 91475 44750
3056 44750 618321 641703 295278 263228 -16654 -28017 -369920 50272 -284773 -286437 -375195
3045 -375195 -958767 -817815 -463280 -344710 127318 233634 520620 722986 -13716 -9890
3035 -9890 319744 484128 -462888 -533087 -366262 -2675 2316 436220 40061 -19763 459341
$$ packed form
3106b69650J58670L6841L70037L01833K61872r23994L36666R9959l49829K56013
3096B78418M37079j24556n58019J07058l95054k8072L66879J24476n5149K5690
3086A78750l77028J84159M44390m56443K07544L8535l70821k07109m1033J05334
3076b93722K25507M64833l8114l35205j49609K3425o1441L98812o38329J86929
3066b16914j80493J24445k7292M59039J26557P4058L95142n48269j14798m6725
3056D4750N73571K3382l46425l2050k79882j1363l41903M20192l35045j664q8758
3045c75195n83572J40952L54535J18570M72028J06316K86986K02366p36702L826
3035i890L29634J64384r47016p0199J66825L63587M991M33904l96159n9824M79104
$$ plain form
3024 459341 -206504 -280438 -45858 299356 323794 -341870 -228149 -80288 -907153 -528063
3014 -528063 -268300 -251681 -257731 172859 -304633 -379509 177188 103590 -57515 -99932 297114
3003 297114 -409359 -136828 -111764 -114262 379366 -7100 -47757 323123 -205866 -128387 -193032
2992 -193032 570255 158999 -48076 -137703 -8571 604975 540319 711798 -301396 -266778
2982 -266778 -102711 -288124 139575 538586 559831 558130 -120702 -224565 -153513 217793
2972 217793 421446 -273083 -42836 -631550 -372425 -107558 -344761 -339092 -468851 -551072
2962 -551072 -344357 -113233 59311 404112 -38817 -460035 -314560 -195237 437512 -142523
2952 -142523 -758504 -594256 -548210 -503442 -262543 -295773 -691249 -153814 38850 -15078
$$ packed form
3024D59341o65845p3934K34580L45214K4438o65664J13721J47861q26865L79090
3014e28063K59763J6619o050M30590m77492p4876N56697p3598j61105m2417L97046
3003B97114p06473K72531K5064k498M93628l86466m0657L70880n28989P7479o4645
2992a93032P63287m11256k07075q9627J29132O13546o4656J71479j013194L4618
2982b66778J64067j85413M27699L99011K1245j701o78832j03863P1052L71306
2972B17793K03653o94529K30247n88714K59125K64867k37203N669j29759q2221
2962e51072K06715K31124J72544L44801m42929m21218J45475J19323O32749n80035
2952a42523o15981J64248M6046M4768K40899l3230l95476N37435J92664n3928
$$ plain form
2942 -15078 461268 291094 216549 -3195 -319682 -351823 71245 76773 -127347 110064 666380
2931 666380 112604 265961 -18595 -136081 135716 75130 466612 239836 37424 -311222
2921 -311222 -227337 -633861 -233749 -125390 475858 784779 772145 650148 146996 19465
2911 19465 341919 -285431 99550 425174 539519 650568 858915 1169104 300729 171408
2901 171408 108138 273940 737092 1049092 1353427 772971 836662 871113 849994 679904
2891 679904 1078229 677731 -255453 51986 397163 434755 563593 155568 109873 103913
2881 103913 569919 246874 -354604 -613375 -589223 29610 267424 41850 -479117 -223882
2871 -223882 -254719 33147 251878 930778 1190916 874720 254876 -82448 324582 337851
$$ packed form
2942a5078M76346j70174p4545k19744l16487l2141M23068N528k04120K37411N56316
2931F66380n53776J53357k84556j17486K71797o0586L91482k26776k02412l48646
2921c11222Q3885m06524M00112J08359O01248L08921j2634j21997n03152j27531
2911A9465L22454o27350L84981L25624J14345J11049K08347L10189q68375j29321
2901A71408o3270J65802M63152L12000L04335n80456O3691L4451k1119j70090
2891F79904L98325m00498r33184L07439L45177L7592J28838m08025m5695n960
2881A03913M66006l23045o01478k58771K4152O18833K37814k25574n20967K55235
2871b23882l0837K87866K18731O78900K60138l16196o19844l37324M07030J3269
$$ plain form
2861 337851 155118 46464 10878 323871 552927 389178 495159 260693 -18252 -591622
2851 -591622 -242547 259914 639464 369004 381312 356347 314980 -351455 -489223 184329
2841 184329 -196275 72206 -21536 498464 -149317 -41830 -43310 335734 353654 280312 160093
2830 160093 240468 555215 22877 165437 1028358 1008557 153338 -15124 -268205 -631
2820 -631 147841 -255835 -826660 -710880 -207429 -119966 97262 -352361 6879 220904
2810 220904 127899 97571 -194165 -244842 580180 816830 262751 145790 -418337 -345215
2800 -345215 -460390 -272096 55648 -67876 470398 131771 48092 18030 -415352 -683300
2790 -683300 328299 225570 323312 376336 244200 102715 -447422 -499979 -501810 -416627 -697871
$$ packed form
2861C37851j82733j08654l5586L12993K29056j63749J05981k34466k78945n73370
2851e91622L49075N02461L79550k70460J2308k4965m1367o66435j37768O73552
2841A84329l80604K68481r3742N20000o47781J07487j480L79044J7920p3342j20219
2830A60093Q0375L14747n32338J42560Q62921j9801q55219j68462k53081K67574
2820f31J48472m03676n70825J15780N03451Q7463K17228m49623L59240K14025
2810B20904r3005l0328k91736n0677Q25022K36650n54079j16961n64127P3122
2800c45215j15175J88294L27744j23524N38274l38627q3679l0062m33382k67948
2790f83300J011599j02729R7742N3024j32136j41485n50137n2557j831Q5183k81244
$$ plain form
2779 -697871 -5292 -268950 -340172 205576 597851 233465 -148353 -3471 216812 -522508
2769 -522508 131203 360733 524276 347216 -178188 -413866 -140096 -155504 -225654 -114491
2759 -114491 -381423 -609339 -349579 154089 515565 259360 98627 501054 433667 512712
2749 512712 384429 263573 199302 194067 74457 757778 317451 -138404 -92147 -147798 -181467
2738 -181467 -659520 -584593 -5814 190976 -57109 66331 -278794 -381049 -44971 52621
2728 52621 -102550 -269102 173006 235825 705020 187259 272408 670045 408231 55148
2718 55148 -289735 -40269 -143820 229731 102639 329278 15979 -274649 -220525 186489
2708 186489 293123 -448279 -295212 -534222 -59742 128395 -313248 -276736 -148037 -301157
$$ packed form
2779f97871O92579k63658p1222N45748L92275l64386l81818J44882K20283p39320
2769e22508O53711K29530J63543j77060n25404k35678K73770j5408p0150J11163
2759a14491k66932k27916K59760N03668L61476k56205j60733M02427o7387P9045
2749E12712j28283j20856o4271n235j19610O83321m40327m55855M6257n5651l3669
2738a81467m78053P4927N78779J96790k48085J23440l45125j02255L36078R7592
2728E2621j55171j66552M42108O2819M69195n17761Q5149L97637k61814l53083
2718E5148l44883K49466j03551L73551j27092K26639l13299k90628N4124M07014
2708A86489J06634p41402J53067k39010M74480J88137m41643L6512J28699j53120
$$ plain form
2698 -301157 -239768 -194564 278123 533049 285293 -117207 -74733 -154991 -99548 410206 392261
2687 392261 909955 530050 249841 -107833 -583026 -545634 -553812 -799469 -1108256 -876552
2677 -876552 -818513 100236 374831 484482 455912 -756869 -640686 -119373 -138106 -129141
2667 -129141 -805278 -501683 -86328 -219315 -523639 -70470 79493 -10036 -556673 -842769
2657 -842769 -22764 356673 -62841 -344125 193679 134999 103858 536776 282321 -531465
2647 -531465 -387762 -335662 -222915 -216796 -149982 -477549 -302684 350452 -199111 -346184
2637 -346184 -223634 -116950 180490 -312366 -93819 172769 101355 283294 613525 252763
2627 252763 74951 4871 -518434 -993392 -721971 -784877 -348080 -468717 -262796 -88493
$$ packed form
2698c01157O1389M5204M72687K54926k47756m02500M2474q0258N5443N09754j7945
2687C92261N17694l79905k80209l57674m75193L7392q178k45657l08787K31704
2677h76552N8039R18749K74595J09651k8570j212781J16183N21313j8733Q965
2667a29141o76137L03595M15355j32987l04324M53169J49963q9529n46637k86096
2657h42769Q20005L79437m19514k81284N37804n8680l1141M32918k54455q13786
2647e31465J43703N2100J12747O119O6814l27567J74865O53136n49563j47073
2637c46184J22550J06684K97440m92856K18547K66588p1414J81939L30231l60762
2627B52763j77812p0080n23305m74958K71421o2906M36797j20637K05921J74303
$$ plain form
2617 -88493 253078 81274 -21412 703184 605924 1077366 697950 51349 565109 634743
2607 634743 234232 141830 -354487 -380843 5252 -318785 -314069 -292776 34806 601290 712908
2596 712908 188971 -7899 125101 -442736 -908090 -665613 -351436 -353521 -172084 -870431
2586 -870431 -357659 -557117 -814336 -283974 -182362 -307130 -977743 -385925 120785 -20442
2576 -20442 -45722 -198133 63880 -210894 31024 278500 545568 -368724 -520768 -426329
2566 -426329 -451765 -463347 226045 29484 -418916 -672531 -713489 -363826 -186609 138789
2556 138789 -564721 -184525 14811 94234 -316868 176179 232938 -320462 -546406 -432517
2546 -432517 -218653 -156238 -334248 76649 -122141 -261850 228720 -652885 -786028 -245412
$$ packed form
2617h8493L41571j71804j02686P24596r7260M71442l79416o46601N13760O9634
2607F34743m00511r2402m96317k6356L86095l24037M716K1293L27582N66484J11618
2596G12908n23937j96870J33000n67837m65354K42477L14177k085J81437o98347
2586h70431N12772j99458k57219N30362J01612j24768o70613N91818N06710j41227
2576b0442k5280j52411K62013k74774K41918K47476K67068r14292j52044R4439
2566d26329k5436j1582O89392j96561m48400k53615m0958L49663J77217L25398
2556A38789p03510L80196J99336P9423m11102M93047N6759n53400k25944J13889
2546d32517K13864O2415j78010M10897j98790j39709M90570q81605j33143N40616
$$ plain form
2536 -245412 366227 326467 464029 85745 -88948 -118886 62937 188636 -356808 -720678
2526 -720678 -532474 -513809 -597427 -375916 -813825 -694826 -536403 -209403 267659 102397
2516 102397 497051 -134112 -365979 66365 11730 52257 -364844 -370088 -179855 -120487 -253035
2505 -253035 158310 -107398 -477238 387366 628687 -77668 -186904 233590 115119 -516333
2495 -516333 -640808 -264996 -117560 -355442 -10094 135395 540557 -394438 -721992 -698965
2485 -698965 -126831 253123 599776 271124 -163574 142697 -130907 -303809 190904 247660
2475 247660 -227073 142768 -42979 -194795 -87585 104471 -372832 208519 126762 -39243
2465 -39243 -812054 -829619 -892739 -542531 -24654 -47692 -525840 -282536 -454378 -88510
$$ packed form
2536b45412O11639l9760J37562l78284j74693k9938J81823J25699n45444l63870
2526g20678J88204J8665q3618K21511m37909J18999J58423L27000M77062j65262
2516A02397L94654o31163k31867M32344n4635M0527m17101n244J90233N9368j32548
2505b53035M11345k65708l69840Q64604K41321p06355j09236M20494j18471o31452
2495e16333j24475L75812J47436k37882L45348J45489M05162r34995l27554K3027
2485f98965N72134L79954L46653l28652m34698L06271k73604j72902M94713N6756
2475B47660m74733L69841j85747j51816J07210J92056m77303N81351q1757j66005
2465c9243p72811j7565o3120L50208N17877k3038m78148K43304j71842L65868
$$ plain form
2455 -88510 684904 -179397 -826980 -738577 -87931 472421 -45705 -133849 95500 190223
2445 190223 545632 725407 162855 -418015 -182310 -80549 165285 -324818 118377 185158
2435 185158 178135 109123 -25027 318682 924511 -133348 -43854 -617953 10976 237707
2425 237707 -469493 -124610 44604 136122 -241943 -146821 281873 -13657 -455034 183183
2415 183183 -68236 9866 377359 78886 -144199 21769 500336 498137 55669 -356242
2405 -356242 308178 208917 -199812 190551 -262603 77381 249553 263320 189497 -54505
2395 -54505 332539 556916 476671 466100 -131636 -301599 157738 138879 958292 1120680
2385 1120680 6834 104116 -122341 284114 120413 -453224 -136113 -342464 -404230 -621705
$$ packed form
2455h8510P73414q64301o47583Q8403O50646N60352n18126q8144K29349R4723
2445A90223L55409J79775n62552n80870K35705J01761K45834m90103M43195O6781
2435A85158p023o9012j34150L43709O05829j057859Q9494n74099O28929K26731
2425B37707p07200L44883J69214R1518l78065R5122M28694k95530m41377O38217
2415A83183k51419P8102L67493k98473k23085J65968M78567k199m42468m11911
2405c56242O64420r9261m08729L90363m53154L39984J72172J3767p3823k44002
2395e4505L87044K24377q0245j0571n97736j69963M59337j8859Q19413J62388
2385A120680j113846R7282k26457M06455j63701n73637L17111k06351o1766k17475
$$ plain form
2375 -621705 -829816 -486838 -189312 -333682 -470648 -47105 -251253 -815082 301916 370628
2365 370628 32261 537018 88705 -181411 62957 -699594 -8977 348736 91325 73916
2355 73916 97873 593642 12506 -49506 210160 372269 -84148 630621 305370 197963
2345 197963 191995 295387 319983 43889 168426 570346 609430 607343 123536 -72110 894588
2334 894588 877941 530333 261224 373784 -116427 42819 100246 -484906 151432 227229
$$ packed form
2375f21705k08111L42978K97526j44370j36966M23543k04148n63829J116998O8712
2365C70628l38367N04757m48313k70116K44368p62551O90617L57713k57411j7409
2355G3916K3957M95769n81136o2012K59666J62109m56417P14769l25251j07407
2345A97963n968J03392K4596k76094J24537M01920L9084k087m83807j95646R66698
2334H94588j6647l47608k69109J12560m90211J59246N7427n85152O36338P5797
$$ [...]
##END NTUPLES=NMR SPECTRUM
##END=
