##TITLE=1H_EC-3277x-2
 DMSO-d6
 8 sc, 
 22.09.2022
##JCAMPDX= 6.0         $$ Bruker NMR JCAMP-DX V2.0
##DATA TYPE= NMR SPECTRUM
##DATA CLASS= NTUPLES
##ORIGIN= UXNMR, Bruker Analytische Messtechnik GmbH
##OWNER= root
$$ XWIN-NMR		Version 3.5
$$ Thu Sep 22 13:42:21 2022 Russian Standard Time (UT+4h)  she@DPX200
##.OBSERVE FREQUENCY= 200.1313499994
##.OBSERVE NUCLEUS= ^1H
##.ACQUISITION MODE= SIMULTANEOUS
##.ACQUISITION SCHEME= undefined
##.AVERAGES= 8
##.DIGITISER RES= 18
##SPECTROMETER/DATA SYSTEM= spect
##.PULSE SEQUENCE= zg30
##.SOLVENT NAME= DMSO
##.SHIFT REFERENCE= (INTERNAL, DMSO, 0, 15.7469)
##AUDIT TRAIL= $$ (NUMBER, WHEN, WHO, WHERE, WHAT)
$$ ##TITLE= Audit trail, XWIN-NMR		Version 3.5
$$ ##JCAMPDX= 5.01
$$ ##ORIGIN= Bruker BioSpin GmbH
$$ ##OWNER= she
$$ F:/spectra/data/she/nmr/H-F/1/pdata/1/auditp.txt
$$ ##AUDIT TRAIL=  $$ (NUMBER, WHEN, WHO, WHERE, WHAT)
(   1,<2022-09-22 13:40:47.76 +0400>,<she>,<DPX200>,
      <created by zg, POWCHK disabled, PULCHK disabled
       configuration hash MD5:
       00 E9 B6 7A A2 85 ED C7 34 08 36 98 17 FE 4E 26
       data hash MD5: 16K
       41 D4 65 23 66 F8 F1 E7 2A 0D 04 18 D5 9E 5C 36>)
(   2,<2022-09-22 13:40:50.51 +0400>,<she>,<DPX200>,
      <Start of raw data processing
       efp BC_mod = 2 LB = 0.24 FT_mod = 6 PKNL = 1 PHC0 = -18036.33 PHC1 = 12.00069 SI = 16K 
       data hash MD5: 16K
       A3 9A FE 5E E1 11 14 97 D7 B0 F7 5B C1 55 D6 F7>)
(   3,<2022-09-22 13:41:09.64 +0400>,<she>,<DPX200>,
      <pk PHC0 = -4.773737 PHC1 = 0 
       data hash MD5: 16K
       32 75 DA 4E 50 E6 BC 3B B4 68 F6 CD CB F6 C9 8C>)
(   4,<2022-09-22 13:41:12.81 +0400>,<she>,<DPX200>,
      <abs ABSG = 5 
       data hash MD5: 16K
       B0 6E B7 E9 4C A5 CB 2F 46 09 AD 15 5A 0E 76 96>)
$$ ##END=
$$ 
$$ hash MD5
$$ 68 FC 86 09 EC 55 4D C0 4F 88 3F C2 D8 20 04 F6
##$RELAX= 
##$RELAX= 
##$RELAX= 
##$RELAX= 
##$RELAX= 
##$RELAX= 
$$ Bruker specific parameters
$$ --------------------------
##$DU= <F:/spectra>
##$EXPNO= 1
##$NAME= <H-F>
##$PROCNO= 1
##$TYPE= <nmr>
##$USER= <she>
##$AMP= (0..31)
100 100 100 100 100 100 100 100 100 100 100 100 100 100 100 100 100 100 
100 100 100 100 100 100 100 100 100 100 100 100 100 100 
##$AQSEQ= 0
##$AQ_mod= 1
##$AUNM= <au_zg>
##$AUTOPOS= <>
##$BF1= 200.13
##$BF2= 200.13
##$BF3= 200.13
##$BF4= 200.13
##$BF5= 200.13
##$BF6= 200.13
##$BF7= 200.13
##$BF8= 200.13
##$BYTORDA= 1
##$CFDGTYP= 0
##$CFRGTYP= 5
##$CHEMSTR= <none>
##$CNST= (0..31)
1 1 145 1 1 1 1 1 1 1 1 1 1 1 1 1 1 1 1 1 1 1 1 1 1 1 1 1 1 1 1 1 
##$CPDPRG= <>
##$CPDPRG1= <>
##$CPDPRG2= <>
##$CPDPRG3= <>
##$CPDPRG4= <mlev>
##$CPDPRG5= <mlev>
##$CPDPRG6= <mlev>
##$CPDPRG7= <mlev>
##$CPDPRG8= <mlev>
##$CPDPRGB= <>
##$CPDPRGT= <>
##$D= (0..31)
0 1.2 0 0 0 0 0 0 0 0.06 0 0.03 0 0 0 0 0.0002 0 0 0 0 0 0 0 0 0 0 0 0 
0 0 0 
##$DATE= 1663839647
##$DBL= (0..7)
120 120 120 120 120 120 120 120 
##$DBP= (0..7)
150 150 150 150 150 150 150 150 
##$DBP07= 0
##$DBPNAM0= <>
##$DBPNAM1= <>
##$DBPNAM2= <>
##$DBPNAM3= <>
##$DBPNAM4= <>
$$ [...]
##$SUBNAM3= <"">
##$SUBNAM4= <"">
##$SUBNAM5= <"">
##$SUBNAM6= <"">
##$SUBNAM7= <"">
##$SUBNAM8= <"">
##$SUBNAM9= <"">
##$SW= 18.0517283424941
##$SWIBOX= (0..15)
0 0 2 0 0 0 0 0 0 0 0 0 0 0 0 0 
##$SW_h= 3612.71676300578
##$TD= 16384
##$TD0= 1
##$TE= 0
##$TE2= 300
##$TE3= 300
##$TEG= 300
##$TL= (0..7)
0 120 120 120 120 120 120 120 
##$TP= (0..7)
150 150 150 150 150 150 150 150 
##$TP07= 0
##$TPNAME0= <>
##$TPNAME1= <>
##$TPNAME2= <>
##$TPNAME3= <>
##$TPNAME4= <>
##$TPNAME5= <>
##$TPNAME6= <>
##$TPNAME7= <>
##$TPOAL= (0..7)
0.5 0.5 0.5 0.5 0.5 0.5 0.5 0.5 
##$TPOFFS= (0..7)
0 0 0 0 0 0 0 0 
##$TUNHIN= 0
##$TUNHOUT= 0
##$TUNXOUT= 0
##$USERA1= <user>
##$USERA2= <user>
##$USERA3= <user>
##$USERA4= <user>
##$USERA5= <user>
##$V9= 5
##$VALIST= <valist>
##$VCLIST= <CCCCCCCCCCCCCCC>
##$VD= 0
##$VDLIST= <DDDDDDDDDDDDDDD>
##$VPLIST= <PPPPPPPPPPPPPPP>
##$VTLIST= <TTTTTTTTTTTTTTT>
##$WBST= 1024
##$WBSW= 4
##$XGAIN= (0..3)
0 0 0 0 
##$XL= 0
##$YL= 0
##$YMAX_a= 127560
##$YMIN_a= -229061
##$ZGOPTNS= <>
##$ZL1= 120
##$ZL2= 120
##$ZL3= 120
##$ZL4= 120
##$ABSF1= 15.73697
##$ABSF2= -2.314879
##$ABSG= 5
##$ABSL= 3
##$ALPHA= 0
##$AQORDER= 0
##$ASSFAC= 0
##$ASSFACI= 0
##$ASSFACX= 0
##$ASSWID= 0
##$AUNMP= <proc_1d>
##$AZFE= 0.1
##$AZFW= 0.1
##$BCFW= 0
##$BC_mod= 2
##$BYTORDP= 0
##$COROFFS= 0
##$CY= -3
##$DATMOD= 1
##$DC= 0
##$DFILT= <>
##$DTYPP= 0
##$F1P= 0
##$F2P= 0
##$FCOR= 1
##$FTSIZE= 16384
##$FT_mod= 6
##$GAMMA= 0
##$GB= 0
##$INTBC= 1
##$INTSCL= 3.70164e-10
##$ISEN= 128
##$LB= 0.24
##$LEV0= 0
##$LPBIN= 0
##$MAXI= 10000
##$MC2= 0
##$MEAN= 0
##$ME_mod= 0
##$MI= 1.114404
##$NCOEF= 0
##$NC_proc= -8
##$NLEV= 6
##$NOISF1= 3.799351
##$NOISF2= 2.8
##$NSP= 0
##$NTH_PI= 0
##$NZP= 0
##$OFFSET= 15.74689
##$PC= 1
##$PHC0= -18041.1
##$PHC1= 12.00069
##$PH_mod= 1
##$PKNL= yes
##$PPARMOD= 0
##$PSCAL= 0
##$PSIGN= 0
##$REVERSE= no
##$SF= 200.130004932605
##$SI= 16384
##$SIGF1= 3
##$SIGF2= 2
##$SINO= 5.538805
##$SIOLD= 16384
##$SREGLST= <1H.CDCl3>
##$SSB= 0
##$STSI= 16384
##$STSR= 0
##$SW_p= 3612.71676300578
##$SYMM= 0
##$S_DEV= 0
##$TDeff= 16384
##$TDoff= 0
##$TI= <>
##$TILT= no
##$TM1= 0
##$TM2= 0
##$TOPLEV= 0
##$USERP1= <user>
##$USERP2= <user>
##$USERP3= <user>
##$USERP4= <user>
##$USERP5= <user>
##$WDW= 1
##$XDIM= 16384
##$YMAX_p= 287289578
##$YMIN_p= -4878161
$$ End of Bruker specific parameters
$$ ---------------------------------
##NTUPLES= NMR SPECTRUM
##VAR_NAME=  FREQUENCY,     SPECTRUM/REAL,   SPECTRUM/IMAG
##SYMBOL=    X,             R,               I
##VAR_TYPE=  INDEPENDENT,   DEPENDENT,       DEPENDENT
##VAR_FORM=  AFFN,          ASDF,            ASDF
##VAR_DIM=   16384,         16384,           16384
##UNITS=     HZ,            ARBITRARY UNITS, ARBITRARY UNITS
##FACTOR=    0.220516191357247, 1,           1
##FIRST=     3151.42518699288, 0,            0
##LAST=      -461.291576012904, 0,           0
##MIN=       -461.291576012904, -4878161,    0
##MAX=       3151.42518699288, 287289578,    0
$$ Real data points
##PAGE= N=1
##DATA TABLE= (X++(R..R)), XYDATA
$$ [...]
7981e25256j63803m35669K58310K71364L1714N36508m20408j69569l71684L58210
7971f30283J05162J44230J24834k61719L21325m67517L47225M21638M95816n33626
7961F7085m85370K332J29493K05641q4526n68336Q69292L10048o78182l32044
7951e64567K85332M97160r6852K3775k10699l54447J98846k70472J18036K10779
7941a63109R2063m59178k34822O5732O3411N64470j59771m64697M95215l2973
7931b33659n91352k28821L26409M64817L8906n74075K21335Q11829N3926p66422
7921d77107l65742l90854K91735j36920K61470K34277L30299m72357n28494L70172
7911h83521M21700L51585n62483K82860O6030K32405k51594m68736k31089K99874
$$ plain form
7981 -525256 -689059 -1124728 -866418 -595054 -563340 -26832 -447240 -616809 -988493 -630283
7971 -630283 -525121 -380891 -256057 -517776 -196451 -663968 -316743 104895 600711 67085
7961 67085 -418285 -415953 -286460 -80819 -165345 -733681 135611 445659 -232523 -564567
7951 -564567 -279235 217925 121073 144848 -65851 -420298 -221452 -491924 -373888 -163109
7941 -163109 -71046 -530224 -765046 -699314 -635903 -71433 -231204 -695901 -200686 -233659
7931 -233659 -825011 -1053832 -727423 -262606 -223700 -797775 -576440 235389 289315 -477107
7921 -477107 -842849 -1233703 -941968 -1078888 -817418 -583141 -252842 -725199 -1253693 -883521
7911 -883521 -461821 -110236 -672719 -389859 -323829 -91424 -343018 -811754 -1042843 -742969
7901g42969j84087J86980K55919K54116L798M60258L47472l92357m89909j01555
7891d02334l88974j01417O3273P89549K85994j27658l91948K2273m85655J5224
7881g21673L23812l5891M3938J87876L63751P04731p84939j56537l5775m6602
7871a57309J45443m26311k09977l8747P23309M13765j08428p41593K50564j04716
7861b54000j185099L38689L53877L9949L99065L09877o45751K67269M76957J18338
7851B19171m96430k07835K18306J27044j80598J44046M7398l0742j89680k79352
7841f28672M17816n98700J31550j20161j11751L98173J51133K35159K00927J83633
7831B59107l13577k4298r3053l14444M93583m2230M37524K695o63707m4904M12616
$$ plain form
7901 -742969 -927056 -740076 -484157 -230041 -226243 234015 581487 189130 -300779 -402334
7891 -402334 -791308 -892725 -829452 -39903 246091 118433 -273515 -251242 -736897 -721673
7881 -721673 -397861 -433752 -389814 -201938 161813 866544 81605 -74932 -110707 -157309
7871 -157309 -11866 -438177 -648154 -686901 36408 450173 341745 -399848 -149284 -254000
7861 -254000 -1439099 -1100410 -746533 -706584 -307519 2358 -643393 -376124 100833 219171
7851 219171 -277259 -485094 -266788 -139744 -320342 -176296 -128898 -159640 -349320 -628672
7841 -628672 -210856 -809556 -678006 -798167 -909918 -511745 -360612 -125453 75474 259107
7831 259107 -54470 -78768 -171821 -486265 7318 -34912 402612 405307 -258400 -303304 109312
7820A09312k54298M96886n14907J10758q15917M6229o4396Q05320o58881k82228
7810a022122l35446o73971J853627K4462q04935L85526N82099K14236k38764K72461
7800B57173o15938j0519N21786k82206o111L66512j78298j79860N63609n18168
7790h2020J05305M91266N36264q39720r16828j63988n2259P89321K58872k26206
7780i9993M04300L32873N7041n48100J41313O3031O0936j92671m36090m34917
7770f52277k87535O10079N14696k83483K41556k37296r95j89517M02336l89040
7760b71476r9622L67044k33705m98587J11049k11758L20892j47931l61195N76562
7750d48727n6974l2716k04227P3861m3128Q86407L39850M54578n91151m55183
$$ plain form
7820 109312 -144986 351900 -163007 -52249 -868166 -821937 -886333 -81013 -739894 -1022122
7810 -1022122 -1357568 -2031539 -177912 -153450 -958385 -572859 9240 223476 -15288 257173
7800 257173 -358765 -369284 152502 -129704 -135815 230697 52399 -127461 436148 -82020
7790 -82020 23285 514551 1050815 211095 -705733 -869721 -921980 -132659 126213 -99993
7780 -99993 304307 637180 694221 146121 287434 350465 411401 218730 -217360 -652277
7770 -652277 -939812 -329733 184963 -98520 143036 -94260 -95255 -284772 117564 -271476
7760 -271476 -371098 -4054 -237759 -736346 -625297 -837055 -516163 -664094 -1025289 -448727
7750 -448727 -505701 -538417 -742644 -668783 -711911 174496 514346 968924 377773 -77410
7740g7410Q6044p88896K26624N93058j46064l55227o1159M19281k59073L33608
7730b9214N09071o41915j15883K53685k69176n474N16951n0529r59132P50405
7720d1211j20036p0172q01775m43733J019348J91648l79511k46050Q5390l71708
7710a177810P36976M5469k08857j84356N67506k9769K43999M16842n68176k584
7700a60760r3451o15103l5276K65636K70974L05251j61015l73880J92162N12320
7690A06858M80629K2392j31103j70624R4385j51848L0782j1445o8485J59535k19972
7679A41104l35352J43985j00587K59708q23519K54654K22125k44751J28417N421
7669c48795M92626R4517n67342k14609L46194o90J72127k76440n92533K4676N88952
$$ plain form
7740 -77410 8634 -780262 -553638 39420 -106644 -461871 -523030 -103749 -362822 -29214
7730 -29214 479857 -162058 -277941 -24256 -293432 -298906 218045 167516 -791616 -41211
7720 -41211 -161247 -231419 -1033194 -1476927 -457579 -265931 -645442 -891492 -806102 -1177810
7710 -1177810 -440834 -395365 -604222 -788578 -221072 -250841 -6842 410000 -158176 -160760
7700 -160760 -254211 -869314 -904590 -638954 -367980 -62729 -223744 -597624 -405462 106858
7690 106858 587487 609879 478776 308152 402537 250689 281471 270026 201541 361076 141104
7679 141104 -194248 -50263 -150850 108858 -714661 -460007 -237882 -482633 -354216 -348795
7669 -348795 143831 238348 -328994 -543603 -197409 -198099 -25972 -302412 -894945 -870269 -281317
7658b81317K95405J17559m22116N3223N39513j15458k37878L41443k39827M1560
7648I2107l29293k92336m5473Q49429j77856k16492J11038j65037m94183k16658
7638h84754K10602J07050R1496Q5114J42297J79121N02440k32527Q4240K66253
7628E51332n71297M7020M64501K039k50974k52439R5492k92758R2662m22750M5707
7617d91465J91282J83408k69868l85498O53821l30223O3081O43445l72956J55002
7607D0029k29787J31450M43281L14883j65923J53666k95111l86859k29548m18089
7597f42008L19483P8915J91107O0996k54569n33869P07229l22580J84293j2587
7587b23590J90045k41360J28569k46207M7919o3632L6765N29377r7680L7785j17877
$$ plain form
7658 -281317 14088 131647 -290469 -237246 302267 186809 -51069 290374 50547 92107
7648 92107 -237186 -529522 -574995 274434 96578 -119914 -8876 -173913 -668096 -884754
7638 -884754 -674152 -567102 -475606 -390492 -248195 -69074 433366 200839 285079 551332
7628 551332 -19965 27055 491556 493595 242621 -9818 85674 -207084 -114422 -537172 -491465
7617 -491465 -300183 -116775 -386643 -772141 -118320 -448543 -385462 257983 -114973 40029
7607 40029 -189758 -58308 384973 699856 533933 687599 392488 5629 -223919 -642008
7597 -642008 -322525 -243610 -52503 8493 -246076 -779945 -72716 -395296 -211003 -223590
7587 -223590 -33545 -274905 -146336 -392543 -344624 -408256 -371491 157886 60206 97991 -19886
7576a9886K21153P4044J83355j21024M45074o71830p3588K54885m42060o38137
7566g88014n60843Q06953Q77097k94322j27568P5867p8159O63678k51122m97532
7556a73965q9342Q95095l53019l2658o4482j135085P31880O43101m57367M72751
7546D36909J58189p3600Q64n69970k09541k43083O93239K72881o56543K09861
7536A9206J441m13562L66825K56663L3674J19525l78109p24168J45848N94348
7526B1691O22601r0585l25769l46232J75987l99021l76975O09683J19809J00161
7516A11350M37101o06723L92501O03562m50929m03003n56584M6581M39618J29211
7506A42685o20319L76176L99369k71747P20082K23744m28212p84819K61910Q0537
$$ plain form
7576 -19886 201267 275311 458666 337642 782716 110886 37298 292183 -149877 -788014
7566 -788014 -1348857 -541904 335193 40871 -86697 -10830 -88989 574689 323567 -173965
7556 -173965 -263307 631788 278769 246111 181629 -953456 -221576 421525 -35842 436909
7546 436909 595098 521498 522362 -47608 -257149 -500232 193007 465888 -190655 19206
7536 19206 20647 -392915 -26090 230573 264247 383772 5663 -718505 -572657 21691
7526 21691 644292 553707 227938 -118294 57693 -341328 -718303 -108620 11189 111350
7516 111350 548451 -58272 334229 937791 486862 83859 -472725 -426144 13474 142685
7506 142685 -477634 -101458 297911 26164 746246 969990 541778 -243041 18869 99406
7496I9406M22514l1227k29983n36879m2523N47537K02186o3640q9546l51654m4808
7485a18617Q19165M25551n74763k42857m13636k2725N78181L90448m49153k26808
7475A64786L66804k46764k33280P70935J75933k75914M16878n63084K787J87533
7465G66614k03780k99038m44351m919N43087n07534J1483M52076J05030Q2115
7455E00783L53100O565j39958l50858M27845j5111m84824o23657O1383K07860
7445e6872Q9192P62049k84447k91551L4656L19123m9318J80763k57679m20672
7435B5244p6390M23783L565O3311P3189j46322m03042n10222R98728J47938m95559
7424A04223K0694j78525J29374K58445M23093N4033p4798m8000J03011j84356
$$ plain form
7496 99406 521920 490693 260710 -276169 -318692 228845 431031 367391 277845 -73809 -118617
7485 -118617 700548 1126099 551336 308479 -105157 -127882 450299 840747 391594 164786
7475 164786 531590 284826 51546 822481 998414 722500 1139378 576294 579081 766614
7465 766614 562834 263796 -180555 -185474 357613 -149921 -138438 313638 418668 500783
7455 500783 853883 860448 720490 369632 797477 782366 297542 -326115 -264732 -56872
7445 -56872 32320 794369 509922 218371 253027 572150 522832 703595 445916 25244
7435 25244 -51146 372637 376202 439513 512702 366380 -36662 -546884 451844 599782 104223
7424 104223 124917 -53608 75766 334211 757304 811337 736539 688539 791550 607194
7414F07194o62217N12249J48792l39393j98441R7571J66674L99150l59887K9966
7404D01658m53445J69399J3040K62949j34718k47626M44222n47475j42364O86401
7394D52041l9884n28743N84210J82026k89328j26513J110o3916m10237L06574
7384F7340k76033J740J64155o22265K39649N62269j54114K56500M70704m31564
7374B78381o15618n0334l7880j61549M49210R01647k15818M8256M03952l6572
7364I63675j24595m82109K67782m08987L74507l59316J94098O17265k50922l95802
7354C95596n51923O13567K08821L95618r9620o13348k53887J60782j12077k05710
7344f2181k03608M54868P7093L25785K40089L14763K86850l38430o68814l16732
$$ plain form
7414 607194 -55023 457226 606018 266625 68184 165755 332429 731579 371692 401658
7404 401658 -51787 117612 130652 393601 258883 11257 455479 -91996 -234360 452041
7394 452041 412157 -116586 467624 649650 360322 233809 234919 171003 -239234 67340
7384 67340 -208693 -206953 -42798 -665063 -425414 136855 -17259 239241 709945 278381
7374 278381 -337237 -387571 -425451 -587000 -137790 763857 548039 596295 1000247 963675
7364 963675 839080 356971 624753 215766 590273 230957 425055 1042320 791398 395596
7354 395596 -156327 457240 666061 1061679 962059 348711 94824 255606 143529 -62181
7344 -62181 -265789 189079 266172 591957 832046 1146809 1433659 1095229 426415 109683
7334A09683p5007j29119K68376N13090l79102L52582J17608r04448k47448K76646
7324i7139M64425K95958K09867n27402j63959N27224o98020k83702J87739m96289
7314e81298K35062o55214O23518M33090m95417K99231J005971m6883k17482p0871
7304E29707J50974l39946K9570J18375K90345o97946n6238m62545N00569M62853
7294E25718L65456K11663M05019P5753k60447o11475k29205K57235l62200L22643
7284G00160R9054P283l99188m36943N88573N35267j24845p6181o50150r7852M89927
7273F35105j50882k54129K18583M6978k22831O10267m76712m59259j20732P15629
7263E42017R77422J39350k97086p31224L01899k99327Q7015l05186r959j2682
$$ plain form
7334 109683 34676 -94443 173933 687023 307921 660503 778111 -126337 -373785 -97139
7324 -97139 367286 663244 873111 345709 181750 708974 10954 -272748 -85009 -581298
7314 -581298 -346236 -1001450 -377932 55158 -440259 -141028 864943 818060 600578 529707
7304 529707 680681 340735 370305 488680 779025 81079 24841 -437704 62865 525718
7294 525718 891174 1102837 1507856 1583609 1323162 711687 482482 739717 377517 700160
7284 700160 799214 806497 407309 -29634 558939 1094206 969361 893180 243030 145178 635105
7273 635105 484223 230094 448677 495655 272824 883091 406379 -52880 -173612 542017
7263 542017 1519439 1658789 1361703 630479 932378 633051 720066 414880 404921 392239
7253C92239n11310O80931M88429p3173L26j53465J40997J78400l77665m53475
7243C12234P314J68570L89307K99844K37508m86702O5137k91174l51642N54785
7233I05181j17444k50650k55236J42816j46549L36839K24069m44354L39429q0980
7223F53121n99788L25568l96102J49532P41458l22776L57798m037J98176k0750
7213A082200j77081j067348J12537L76334J83510L32314L29083k17666k19128
7204G34755P0915M60687k25240j9120l93656r1318J13758L1364m38754q1587N33667
7193F95471Q1151k62339N2238j11172J89386j55595O12997m13891m05837P92426
7183A074835k26688l90576M74990k57882L52860j31457k56298M6083l83263N56793
$$ plain form
7253 392239 -119071 561860 1050289 977116 977442 823977 964974 1143374 765709 312234
7243 312234 319548 488118 877425 1177269 1414777 928075 993212 702038 350396 905181
7233 905181 787737 537087 281851 424667 278118 614957 839026 394672 734101 653121
7223 653121 53333 378901 -17201 132331 873789 551013 908811 904774 1102950 1082200
7213 1082200 905119 -162229 -49692 326642 510152 842466 1171549 953883 734755
7204 734755 805670 1266357 1041117 1021997 628341 537023 650781 682145 243391 161804 695471
7193 695471 776622 514283 566521 455349 644735 489140 1102137 688246 282409 1074835
7183 1074835 848147 457571 932561 674679 1027539 896082 639784 685867 302604 859397
7173H59397J66159p57577K13912N00795l20154N3350m12854l6206N9847L2001
7163C58670L62521P51483l02248m75101m43952j44314k97424M77606j60894K14691
7153C41038N56537m82847O51296L43896j77018k26805m08342M57261K64086M5985
7143A365087l72735r8990N67728N7678k68487M89204p67343r310k6883k12318
7133G23631j20746K76952j19590K29041K61190J41633p16143l372J30027L06313
7123A108936n7305l70807l08255o5805N61658l6332N89511k62818l43154N08989
7113A324618j47227L53626j95357q25436p68092M08477L64478o56919M23741J92230
7103D74139M97841l25288j59203k79426L50125M47832M21182j86173n93419n8121
$$ plain form
7173 859397 1025556 267979 481891 982686 662532 715882 303028 266822 326669 358670
7163 358670 721191 1472674 1170426 695325 251373 107059 -190365 287241 126347 341038
7153 341038 897575 414728 1066024 1409920 1232902 1006097 597755 1055016 1319102 1365087
7143 1365087 992352 893362 1461090 1518768 1250281 1739485 972142 962832 935949 723631
7133 723631 602885 879837 760247 989288 1250478 1392111 675968 672596 802623 1108936
7123 1108936 1051631 680824 372569 306764 868422 832090 1421601 1158783 815629 1324618
7113 1324618 1177391 1531017 1335660 510224 -257868 150609 515087 -141832 281909 474139
7103 474139 971980 646692 487489 208063 558188 1006020 1427202 1241029 647610 589489
7093E89489J02504M04093J38889M00023o4076k95980n3886j08257j31600K01423
7083A182622l31493J48064K53276N37434m01152l02817J61806J5514o9515m42884
7073G50855J25063N17639k75545m93843L00091n7471K45058k01562k28482L95497
7063A077300m5929j52299k36744M32311j33149M95947O69796n20525k24839j05326
7053A256543M84655j52958k39881j68454N26866K40422j93038J10820K3701l24901
7043A563775m82668K23064N32890r8544l22366j29525J12117j07227K43554P96667
7033B331737l52342k5971l82982K64547K0584k83777K22332l93579N73257N21058
7023B494864J68260q18693j41491J30724K61646L43293M57828N0511K78662j20979
$$ plain form
7093 589489 691993 1096086 1234975 1634998 1570922 1274942 1221056 1112799 981199 1182622
7083 1182622 851129 999193 1252469 1789903 1388751 1085934 1247740 1263254 1193739 750855
7073 750855 875918 1393557 1118012 624169 924260 866789 1111847 910285 681803 1077300
7063 1077300 1031371 879072 642328 1074639 941490 1437437 2107233 1586708 1361869 1256543
7053 1256543 1741198 1588240 1348359 1179905 1706771 1947193 1754155 1864975 1888676 1563775
7043 1563775 1081107 1304171 1837061 1738517 1416151 1286626 1398743 1291516 1535070 2331737
7033 2331737 1979395 1953424 1570442 1834989 1855573 1571796 1794128 1400549 1973806 2494864
7023 2494864 2663124 1844431 1702940 1833664 2095310 2438603 2896431 2946942 3225604 3104625
7013C104625k36778o48228K50857k1773K73847O0727L17105n65285o56153N74794
7003B453738M69631J17363n95514R7180M27805j79211k94418K08975R3483l35347
6993B463685N21842L21911n46854j34401q2788J76558M8151j47349J92693R76386
6983C789834j60230Q6938l12158j98892j38493K30614k37791R57683P4375p81672
6973C310208L06306J56935O21340k68194J55924J21141j43201k14221k38398K95095
6963D102935N26110J01849j55698N21653L96357p10545l28500r2833o7823J191549
6953E485054J67021m32259M0754J99867K34779k69162J18841L41583P79706N77021
6943G243205p09539K60302l79123k9905Q37685l84252K66678K79274P3760o84614
$$ plain form
7013 3104625 2867847 2219619 2470476 2448703 2722550 2783277 3100382 2535097 1878944 2453738
7003 2453738 2923369 3040732 2445218 2542398 2970203 2790992 2496574 2705549 2799032 2463685
6993 2463685 2985527 3307438 2760584 2626183 2543395 2719953 2768104 2620755 2813448 3789834
6983 3789834 3629604 3716542 3404384 3205492 3066999 3297613 3059822 4017505 4091880 3310208
6973 3310208 3616514 3773449 4394789 4126595 4282519 4403660 4260459 4046238 3807840 4102935
6963 4102935 4629045 4730894 4575196 5096849 5493206 4782661 4454161 4361328 4293505 5485054
6953 5485054 5652075 5219816 5260570 5460437 5695216 5426054 5544895 5886478 6666184 7243205
6943 7243205 6533666 6793968 6414845 6384940 7222625 6838373 7105051 7384325 7458085 6773471
6933F773471K6374L89404R73098L39530l16640N2331M1043O65241o15846j41048
6923H186958N19268k89173K6351K85573Q2944R9011L39771r0652N38034J13861
6913I811946n03384K51723j54498M23898m08880M44968N54989k51996j76776L19265
6903A0311255L44308K59542O2996J03615O1387N82314K85397k37390j23627K33146
6893A1882943k94315K2660P62402k26380M06450k02302o35541J05657K08627J03575
6883A2133776J0562m04419L70853J59135n77523k88344K18211o186p5417J44209
6873A1684857k899N7876P4103J69188N94896j4075j78141j55698M61158M3270
6863A2734535p01410J84413K17310k23876l25673j46160P7082P6993J09272l47313
$$ plain form
6933 6773471 6799845 7189249 8162347 8501877 8185237 8237568 8278611 8943852 8328006 8186958
6923 8186958 8706226 8417053 8443404 8728977 8811921 8910932 9250703 9160051 9698085 9811946
6913 9811946 9308562 9560285 9405787 9829685 9420805 9865773 10420762 10168766 9991990 10311255
6903 10311255 10655563 10915105 10978101 11081716 11143103 11725417 12010814 11773424 11649797 11882943
6893 11882943 11588628 11611288 12373690 12147310 12553760 12351458 11715917 11821574 12030201 12133776
6883 12133776 12144338 11739919 12110772 12269907 11692384 11404040 11622251 11616065 11540648 11684857
6873 11684857 11681958 11739834 11813937 11983125 12578021 12563946 12385805 12230107 12691265 12734535
6863 12734535 12033125 12217538 12434848 12210972 11885299 11739139 11816221 11893214 12002486 11655173
6853A1655173K16996K37471K88400M1837L05040k69749m51518l93613L45047K62237
6843A2237321j32718k19946n55854K27788m9881N10377k70315j049728m80825
6834A0216219J89651J40881K86934m39227l70360J62064k9128r1764O13472K41674
6824A0920416p73632n65558J08728k55806k19322k27356R20438J28448l30508
6815I705848o62090J55622O44863q40012k15778q74162p27751P67696m47204L97681
6805G904713K28488p16653j03694O53120k85279p18286J88860O69564n64308J25407
6795G381932l40817p85131K03582P5058L62671J73019m55590m44782n085j87936
6785E976921q38190O0555O15748l77074p91764L8189O28932n2313P3159l58000
$$ plain form
6853 11655173 11872169 12109640 12398040 12439877 12744917 12475168 12023650 11630037 11975084 12237321
6843 12237321 12104603 11884657 11328803 11556591 11506710 12017087 11746772 10697044 10216219
6834 10216219 10405870 10546751 10833685 10394458 10024098 10186162 10157034 10065270 10678742 10920416
6824 10920416 10146784 9581226 9689954 9434148 9214826 8987470 9907908 10036356 9705848
6815 9705848 9043758 9199380 9844243 9004231 8788453 7914291 7186540 7954236 7507032 7904713
6805 7904713 8133201 7416548 7312854 7965974 7680695 6962409 7151269 7820833 7256525 7381932
6795 7381932 7041115 6255984 6459566 6534624 6897295 7070314 6614724 6169942 6164857 5976921
6785 5976921 5138731 5199286 5815034 5437960 4646196 4684385 5313317 5261004 5334163 4976163
6775D976163K12283k65267j35441j32941l2322q9879N5070l01504P7671M99416
6765D863249K41792q38716m2734l64897N71877k75750k11062r8711m40164j51830
6755C253054l80053M00564L5236k61666M06736m85669k03301O7827P37784M8486
6745C618998K36252k17009r44997N32575N62710l64832l02687N23943P2046j85657
6735C531342M8455j51684m15365J75157J69738j27247R31248l04449n19274j7957
6725C319964M15100J38198n36494m07405k44007O21365K49209j78629j77112N88482
6715C788671m31996j20524R23466n89151L93222j76918r22196J47105p99278R33210
6705C145611O26351M52496l01279K72672k36486j31777L04175j62882n37989J89319
$$ plain form
6775 4976163 5188446 4923179 4787738 4654797 4622475 4532596 4587666 4286162 4363833 4863249
6765 4863249 5105041 4266325 4223591 3858694 4430571 4154821 3943759 3845048 3404884 3253054
6755 3253054 2873001 3273565 3308801 3047135 3453871 2968202 2764901 2832728 3570512 3618998
6745 3618998 3855250 3638241 2693244 3225819 3788529 3423697 3121010 3644953 3716999 3531342
6735 3531342 3579797 3428113 3012748 3187905 3357643 3230396 4161644 3857195 3337921 3319964
6725 3319964 3735064 3873262 3336768 2929363 2685356 3306721 3555930 3377301 3200189 3788671
6715 3788671 3356675 3236151 4159617 3570466 3963688 3786770 2864574 3011679 2212401 3145611
6705 3145611 3771962 4224458 3923179 4195851 3959365 3827588 4131763 3968881 3430892 3620211
6695C620211N50734p02988n088M61055L42192P8787k2199j4394o51045j58357
6685C498908P20791k34912l61169Q79041J82681k32198j61206n89846L5769R47426
6675D685285k56384J04903R2273K12115K01310k03382k56631n73171P6056K39596
6665D321970N2081L91597o72270m45447R90842l04799K4183L70046l00810l31681
6655D095712M35138k3060k46102P48885k30163j55922J38474j14305M53826p8932
6645E023551j19131m45842L83973J28098o39209Q64986O09844n72994k55296J43276
6635E121256o52120M9750O61568J67700q37762M707M89375N4142j96245J85272
6625E047643j25647k08958K52929l52503m47750K78205K87986k26268N7359J73346
$$ plain form
6695 3620211 4170945 3467957 3462869 3923924 4266116 4344903 4322704 4308310 3657265 3498908
6685 3498908 4219699 3984787 3623618 4502659 4685340 4453142 4291936 3702090 3737859 4685285
6675 4685285 4428901 4533804 4626077 4838192 5039502 4836120 4579489 4006318 4082374 4321970
6665 4321970 4374051 4765648 4093378 3647931 4638773 4333974 4358157 4728203 4427393 4095712
6655 4095712 4530850 4507790 4261688 5010573 4780410 4624488 4762962 4648657 5102483 5023551
6645 5023551 4904420 4458578 4842551 4970649 4331440 5196426 5806270 5233276 4977980 5121256
6635 5121256 4469136 4518886 5180454 5348154 4510392 4515099 5004474 5058616 4862371 5047643
6625 5047643 4921996 4713038 4965967 4613464 4165714 4443919 4731905 4505637 4562996 4736342
6615D736342l801k8979m7760m84174N69655N4238O153O898k62825L57905m10321
6604D493331J72599k8670j9725j80261k9357Q8257j59435k29241K01573K70330
6594D579401m3855k07242m87834j69431K3020J1327J97656k95644L90293J10177
6584D107868n50408o718J90346N75077j58319n72915L62761j1036l67190j55878
6574C413588l45769O52173p34570K3553r5253M18913R44871L2176p29623q9977
6564C490082m18138m17763M28335J6288P3808K15499j42312n70727j19507M5179
6554B600744j27800N0099Q24552K07801k24938m79424K74679L63391j199008L97639
6544B687735K47244J34397m22311L80942j85838k51491k2438O12714N58339p24572
$$ plain form
6615 4736342 4732541 4703562 4655802 4171628 4741283 4795521 4801674 4808572 4545747 4903652 4493331
6604 4493331 4665930 4637260 4617535 4437274 4407917 4496174 4336739 4107498 4309071 4579401
6594 4579401 4535546 4328304 3840470 3671039 3694059 3705386 3903042 3607398 3997691 4107868
6584 4107868 3557460 3550742 3741088 4316165 4157846 3584931 3947692 3936656 3569466 3413588
6574 3413588 3067819 3719992 2985422 3008975 2913722 3332635 4277506 4309682 3580059 3490082
6564 3490082 3071944 2654181 3082516 3098804 3172612 3388111 3245799 2675072 2555565 2600744
6554 2600744 2472944 2523043 3347595 3555396 3330458 2851034 3125713 3489104 2290096 2687735
6544 2687735 2934979 3069376 2647065 3028007 2842169 2590678 2568240 3180954 3739293 3014721
6534C014721N02362Q7533p66765l42453J68403L38534P57697l08670n65070L49216
6524C235508j20381L8217k68614j52137L88343k67428K6127K22477M2630R39826
6514D084568k92274K8618K19720n98491l16304k62118M49451O3941N5542L73236
6504C805889r2182j15221o9873j18131O32268L48151n18621M0692n23067L81863
6494C771768O62329n07320l38783l31627J70297N49859K31608j82959N26053m82817
6484D068408M60620j130894O7006J6169J45133R23658J4120k71199J69753L35565
6474D798339k38892J21616m28564o5262L73571N0718o38961P3097J86154P1348
6464D303164L44792o55454N3199L52292Q36177j13548N1117J31990j43551o5114
$$ plain form
6534 3014721 3517083 3604616 2837851 2495398 2663801 3002335 3760032 3451362 2886292 3235508
6524 3235508 3115127 3153344 2884730 2732593 3120936 2853508 2879635 3102112 3144742 4084568
6514 4084568 3792294 3820912 4040632 3442141 3125837 2863719 3313170 3377111 3432653 3805889
6504 3805889 3713707 3598486 3528613 3410482 4042750 4390901 3872280 3912972 3389905 3771768
6494 3771768 4434097 3926777 3587994 3256367 3426664 3976523 4208131 4025172 4551225 4068408
6484 4068408 4529028 3398134 3465140 3481309 3626442 4550100 4564220 4293021 4462774 4798339
6474 4798339 4559447 4681063 4252499 4187237 4560808 4611526 3972565 4045662 4231816 4303164
6464 4303164 4647956 3992502 4045701 4397993 5234170 5120622 5171739 5303729 5160178 5095064
6454E095064M89091R05901k14609o36251o51165K23448L72557O15237J2715j62277
6444F049711o09550j44035K06618j77340N83078N48824m1763M8490n79800n28703
6434E355530Q46177N82473L38523p30915q0830N25631K46282J11753j00144m62973
6424F631507K90087M98765Q8543j4064N24378K00319J86720L09898M76353j17807
6414I074699L51058J28870M38778J3648o05695L5261j76165P90767K30439N45257
6404A0826917O47842L22498L23427M78777K00976O63699P0945N05991M11171N74048
6394A5026291K22815P69798k8317M41046O29024m92900m91000L63741N63014l28364
6384A6675148l14643o5765l12853K54082L0644O25322O33601j26044o41730J40743
$$ plain form
6454 5095064 5584155 6490056 6275447 5639196 4988031 5211479 5584036 6199273 6211988 6049711
6444 6049711 5440161 5296126 5502744 5325404 5908482 6457306 6415543 6464033 5884233 5355530
6434 5355530 6201707 6784180 7122703 6391788 6310958 6836589 7082871 7194624 7094480 6631507
6424 6631507 6921594 7420359 7508902 7494838 8019216 8219535 8406255 8716153 9192506 9074699
6414 9074699 9425757 9554627 9993405 10007053 9401358 9436619 9260454 10051221 10281660 10826917
6404 10826917 11474759 11797257 12120684 12599461 12800437 13464136 13535081 14041072 14452243 15026291
6394 15026291 15249106 16018904 15990587 16431633 17060657 16567757 16076757 16440498 17003512 16675148
6384 16675148 16360505 16294740 15981887 16235969 16266613 16891935 17525536 17399492 16757762 16898505
6374A6898505k71415M3621l26144p70201m2998J79863K81500j72322p2724J66645
6364A5914330N7656o95973J53609l51198k45152K29987M52026O00996N44972M86964
6354A7148217k49570J69710n48754J58886J8798K30386O0417K52439O72589p07977
6344A7205141K08565Q50207J45821M8323N77571K68189M31376l84229J042265
6335B0393229O54188k20704J39481L45232O76402k3582l58307O56458L06857L96334
6325B2965588Q44689J67364L98970L40749j47885L3118l0334N93755L69894J45009
6315B5680917J0178O27349K46242N15311K96740M52392L16931M2508L37623L38050
6305B8864241M77299j4458K65934Q95744L90677k89415k36844N0867J83678K10969
$$ plain form
6374 16898505 16627090 16670711 16344567 15574366 15531368 15711231 15992731 15820409 15747685 15914330
6364 15914330 15971986 15276013 15429622 15078424 14833272 15063259 15515285 16116281 16661253 17148217
6354 17148217 16898647 17068357 16519603 16678489 16697287 16927673 16988090 17240529 17913118 17205141
6344 17205141 17413706 18263913 18409734 18458057 19035628 19303817 19735193 19350964 20393229
6335 20393229 21047417 20826713 20966194 21311426 21987828 21964246 21605939 22262397 22569254 22965588
6325 22965588 23810277 23977641 24376611 24717360 24569475 24602593 24572259 25166014 25535908 25680917
6315 25680917 25691095 26318444 26564686 27079997 27376737 27829129 28146060 28188568 28526191 28864241
6305 28864241 29341540 29327082 29593016 30488760 30879437 30590022 30353178 30404045 30587723 30798692
6295C0798692M81067M74428J19686j73985r8346Q7997J50385N7103Q43144O45536
6285C3385707K5283o27317K15840M9612k0954k85825J82993M79173K88998m27482
6275C3266028M15914R60314l07900q1889P5362N9850m20613o01055O24186k06059
6265C3784138p82376L58223K41259P9339J61758L12644L21606p4057J02269l01270
6255C4203533k56009j87452K93105k76111l69392n3473N710l43699j028573M50311
6245C2437950K87726j90161J86343R229l7808j27325n23699r9477p88003n3027
6235C1101748j99015j99447k35652n45485K69597J42168j34791j13548L63778
6226C0449353L20248o64628j69358n57839J87080L68434q93220L8540j38552Q6926
$$ plain form
6295 30798692 31279759 31754187 31873873 31699888 31601542 31689539 31839924 31897027 32740171 33385707
6285 33385707 33410990 32783673 32999513 33049125 33028171 32742346 32925339 33404512 33693510 33266028
6275 33266028 33681942 34642256 34334356 34252467 34327829 34387679 33967066 33366011 33990197 33784138
6265 33784138 33001762 33359985 33601244 33680583 33842341 34154985 34476591 34402534 34504803 34203533
6255 34203533 33947524 33760072 34053177 33777066 33407674 33354201 33359911 33016212 31987639 32437950
6245 32437950 32725676 32535515 32721858 32731087 32693279 32565954 32042255 31942778 31154775 31101748
6235 31101748 30902733 30703286 30467634 29922149 30191746 30333914 30199123 30085575 30449353
6226 30449353 30769601 30104973 29935615 29377776 29564856 29933290 29040070 29078610 28940058 29026984
6216B9026984J54043j31847l30383N04086O895o35744k61109o62478n14606m05824
6206B6750017J65930P1632l74950J58371N05430m00983k04962k75579l70240l7747
6196B5986919j90481k11277r97936O62036l93776l06102p60337N14127M20137
6187B4723310m94137l61774n33805J34258l98193k8809o4068l97251J93187R76583
6177B3749301j21163o00015l20013N51098j97458k72260l70321M36711J82354
6168B3038234M35089l08208R31039j74336L18023l54548l23236O70225m42581
6159B3789701j1598m92027J39905J03862K33611l93996j22494j04133l2771J89862
6149B3299922J49308J2485J87695l39086p91194N69813l00579m10066o62223k33730
$$ plain form
6216 29026984 29181027 29049180 28718797 29222883 29229778 28594034 28332925 27670447 27155841 26750017
6206 26750017 26915947 26987579 26612629 26771000 27276430 26875447 26670485 26394906 26024666 25986919
6196 25986919 25796438 25585161 24587225 25249261 24855485 24549383 23789046 24303173 24723310
6187 24723310 24229173 23867399 23333594 23467852 23069659 23040850 22976782 22579531 22772718 23749301
6177 23749301 23628138 23028123 22708110 23259208 23061750 22789490 22419169 22855880 23038234
6168 23038234 23473323 23165115 24096154 23921818 24239841 23885293 23562057 24232282 23789701
6159 23789701 23778103 23286076 23425981 23529843 23763454 23369458 23246964 23142831 23110060 23299922
6149 23299922 23449230 23461715 23649410 23310324 22519130 23088943 22788364 22378298 21716075 21482345
6139B1482345j9421n0299K81640N030p31949k40818J073252j70574q66497k5183
6129B0737526l91566m02518K089M38261J39117N37421L3489m47847J38397k3098
6119B0761271J09230o86023L19301J39914k94624J111433N93605j307233k757
6110B0744117M28367j34265j20403Q86791M78135M67634K73945J47592m31865
6101B2740048P50625l4299q1945O87233K11880Q4180M72612J99158M43036k35745
6091B5236783R6084O36221k60991K28871M89102M03208m00451K60269P54466M2271
6081B7485833P8403j9362m11855J0453R45465J90450K74817J90437l91397k13108
6071B8140136K17198P30225L59941k36222j60324Q40126J39636J10150j63290
$$ plain form
6139 21482345 21462924 21412625 21694265 21699295 20967346 20726528 21799780 21629206 20762709 20737526
6129 20737526 20345960 19943442 19945531 20383792 20522909 21060330 21093819 20645972 20784369 20761271
6119 20761271 20870501 20184478 20503779 20643693 20349069 21460502 22054107 20746874 20744117
6110 20744117 21172484 21038219 20917816 21804607 22282742 22750376 23024321 23171913 22740048
6101 22740048 23490673 23456374 23374429 24061662 24273542 24357722 24830334 25029492 25472528 25236783
6091 25236783 25332867 25969088 25708097 25936968 26426070 26829278 26428827 26689096 27443562 27485833
6081 27485833 27564236 27544874 27133019 27143472 28088937 28279387 28554204 28744641 28353244 28140136
6071 28140136 28357334 29087559 29447500 29211278 29050954 29891080 30030716 30140866 29977576
6062B9977576L26840K8858M46678J292539K09217n47946M34565J208659M36008
6053C3812994R51985K29127Q30318M027L25192K40262K6111R97350O03065L73407
6043C8393838N40653Q34192O72851P20123Q67489Q08052O50009N63737O23752
6034D4674696J584798L58897J231389O58693M05954O40712P56961J157153j34526
6025E1334727P61769L77338P47152R02023O06407N3373j30180R15279J87541L65385
6015E6120814J89611o35274j13148K18045o44151m61157o29185n22161r91575
6006E2531819k612j52472j460302j411487n53458p8492n51822j426996j4661p42719
5996D6136798r98967j202928o80753j378660j053932o45776j203145l98609l24361
$$ plain form
6062 29977576 30304416 30333274 30779952 32072491 32281708 31733762 32168327 33376986 33812994
6053 33812994 34764979 34994106 35824424 35828451 36153643 36393905 36420016 37417366 38020431 38393838
6043 38393838 38934491 39768683 40441534 41161657 42029146 42837198 43487207 44050944 44674696
6034 44674696 46259494 46618391 47849780 48508473 48914427 49555139 50312100 51469253 51334727
6025 51334727 52096496 52473834 53220986 54123009 54729416 54782789 54652609 55567888 55755429 56120814
6015 56120814 56310425 55675151 55562003 55780048 55135897 54674740 54045555 53523394 52531819
6006 52531819 52529207 52376735 50916433 49504946 48951488 48872996 48321174 46894178 46879517 46136798
5996 46136798 45137831 43934903 43254150 41875490 40821558 40175782 38972637 38574028 38249667
5987C8249667l64535m98005n43988q52937n37502o33023q78299o81825m33066
5978C2826487r8952q47396K2745j74796q48180l14134n74396k88089l1480l92526
5968B9279283n74195k05732m52291o22463P6530L12290l08328n55284m56460k27556
5958B6265794p46919q80770k97051K91219j55138m37821r01440K31907J3561O68602
5948B4051944O5275j159315j09131r6718m81409J15272j3619L4245m12348j36588
5938B1857608k15004n25581j15332K60535j70719q0394l41165n28587m08862J95841
5928A9928340O45763o85533l03237K14908L69334j82069R2625l24674m17486j14248
5918A9223723m15700L30717K37705k22022m41797J1446O6500l66933L2115n34875
$$ plain form
5987 38249667 37885132 37387127 36843139 35990202 35452700 34819677 33941378 33259553 32826487
5978 32826487 32727535 31880139 31902884 31728088 30879908 30565774 29991378 29703289 29671809 29279283
5968 29279283 28705088 28499356 28047065 27424602 27501132 27813422 27505094 26949810 26493350 26265794
5958 26265794 25518875 24638105 24341054 24632273 24477135 24039314 23137874 23369781 23383342 24051944
5948 24051944 24117219 22957904 22848773 22752055 22270646 22385918 22372299 22406544 21994196 21857608
5938 21857608 21642604 21117023 21001691 21262226 21091507 21011113 20669948 20141361 19732499 19928340
5928 19928340 20574103 19888570 19585333 19800241 20169575 19987506 20080131 19755457 19337971 19223723
5918 19223723 18808023 19138740 19376445 19154423 18712626 18724072 18790572 18423639 18455754 17920879
5908A7920879p85336Q38780k03780j81357o32843n83158O1028M05110k64664K00318
5898A6774977K79697o98317j65336J14604R1515k59344n8198l87279L31433L89524
5888A6413276l32015j96463l4334K33280l47036r1844J63188m61686m40912Q8385
5878A4993839J18532r3024K10720J8234k11966J26263j19733m2040L23811k24933
5868A5099703p3897J22625k98417k20826j4371N45006P08613l86528J36230O5719
5858A5683857l23387m74601j23286L27276Q9876J20154J65229J8097r8803j76802
5848A5207610j7343m04090o46820P68031l49675k83014J9540o91751N95042l00052
5838A3897478N92360j29365k08286J9380l05661O41426l75619k63304O6924L12281
$$ plain form
5908 17920879 17135543 17974323 17770543 17589186 16956343 16373185 16434213 16839323 16574659 16774977
5898 16774977 17054674 16356357 16191021 16305625 16397140 16137796 16079598 15692319 16023752 16413276
5888 16413276 16081261 15884798 15850464 16083744 15736708 15644864 15808052 15346366 14905454 14993839
5878 14993839 15112371 15019347 15230067 15248301 15036335 15162598 15042865 15000825 15324636 15099703
5868 15099703 15025806 15148431 14850014 14629188 14614817 15159823 15868436 15481908 15618138 15683857
5858 15683857 15360470 14885869 14762583 15089859 15179735 15299889 15465118 15483215 15384412 15207610
5848 15207610 15190267 14786177 14139357 14907388 14557713 14274699 14294239 13602488 14197530 13897478
5838 13897478 14489838 14360473 14152187 14171567 13865906 14507332 14131713 13868409 13935333 14247614
5828A4247614j01961L41527o25664k98225m37279M15310O69504l05974k91982
5819A3612870k58814K65397L56071j43531n03432K52955m02306o68315N06192
5810A3017087M68736m54511J13392K7734K31484j36273J9458l19139m10113n80927
5800A1976928m14595J6608L77563o22730l74122N3069n80849m54613m19125L39569
5790I897703N08777p49077J94324l90875n07173m82479J22739M33976M37962j6022
5780I449855o62577J18785p02687M1790Q93748m77181n08096n64855m73121L20279
5770G435940n40382j8244M41133o88782R6483J22134j16714m91319R63235j83260
5760G020224l65494m4074l52254N35560O3033K47187j115621M87724K28971k23892
$$ plain form
5828 14247614 14145653 14487180 13861516 13563291 13126012 13541322 14210826 13904852 13612870
5819 13612870 13354056 13619453 13975524 13831993 13328561 13581516 13179210 12510895 13017087
5810 13017087 13485823 13031312 13144704 13172438 13403922 13267649 13287107 12967968 12557855 11976928
5800 11976928 11562333 11578941 11956504 11333774 10959652 11012721 10431872 9977259 9558134 9897703
5790 9897703 10406480 9657403 9851727 9460852 8953679 8471200 8593939 9027915 9465877 9449855
5780 9449855 8787278 8906063 8203376 8245166 9138914 8661733 8153637 7588782 7115661 7435940
5770 7435940 6895558 6877314 7318447 6629665 6726148 6848282 6731568 6240249 7203484 7020224
5760 7020224 6654730 6610656 6258402 6793962 6856995 7104182 5988561 6476285 6705256 6481364
5750F481364l04079R7613k56482j26782L16179J61769q31O8352K04643q938j038677
5739E594131J55216l50382o2914O63631J60639j62771n51612m7473n8073l21870
5729E018522n508L94594R3875K4407j29655l03686K6138L40021j7523N51577m07379
5718E585383K67328K86431o16922O16135j45130r84215n9383L52812j6937l03442
5708D982060J85454l6523M62087O10833k51798n15000K65782M69633k63904m08576
5698E500048j56950K57615j86818l60933n48894K56154J10442j17107M03930R9835
5688E257322Q1292L92768j088560l97395N25268M63846j46761p9932m50488M20954
5678D978314N36211l30400K06729N9346j18666k47191j61653J10341L23327J63758
$$ plain form
5750 6481364 6177285 6274898 6018416 5891634 6207813 6369582 6368751 6437103 6641746 6632808 5594131
5739 5594131 5749347 5398965 5336051 5999682 6160321 5997550 5445938 5398465 5340392 5018522
5729 5018522 5013014 5407608 5501483 5525890 5396235 5092549 5118687 5458708 5441185 5992762 5585383
5718 5585383 5852711 6139142 5522220 6138355 5993225 5009010 4949627 5302439 5285502 4982060
5708 4982060 5167514 5130991 5593078 6203911 5952113 5437113 5702895 6172528 5908624 5500048
5698 5500048 5343098 5600713 5413895 5052962 4504068 4760222 4870664 4753557 5157487 5257322
5688 5257322 5338614 5731382 4642822 4245427 4770695 5234541 5087780 5007848 4557360 4978314
5678 4978314 5514525 5184125 5390854 5450200 5331534 5084343 4922690 5033031 5356358 5520116
5668E520116k95318K02401M93402l18871o55162l39578L767K50714N59641o5926
5658E355186l77395J64883j00739p84118M12514O45504K91068n29687N3414K60369
5648E390999l22615p9507J25809L14794J08000k32476k59381K90267N6273k52373
5638E139790M46110k93642k16000m49558M86105P99146j56142l57715n26841k80843
5628D590410N56474P40165l23344j02911K01491k2133M9723k48201k09814J13331
5618E345191L25948Q8676L52317J11569m84935J35053K06048M51426k49811o82789
5608E598693J10166J009390k47224K20665k5160O2104l54526p14580K74905K14283
5598F148716O41896N6878r6145O55223l13424n02184K36739M20145R204n71065
$$ plain form
5668 5520116 5224798 5427199 5920601 5601730 4946568 4606990 4610757 4861471 5421112 5355186
5658 5355186 4977791 5142674 5041935 4257817 4670331 5315835 5606903 5077216 5130630 5390999
5648 5390999 5068384 4988877 5114686 5429480 5537480 5305004 5045623 5335890 5392163 5139790
5638 5139790 5585900 5292258 5076258 4626700 5112805 5911951 5755809 5398094 4871253 4590410
5628 4590410 5146884 5887049 5563705 5460794 5662285 5640152 5689875 5441674 5231860 5345191
5618 5345191 5671139 5759815 6112132 6223701 5738766 5873819 6079867 6531293 6281482 5598693
5608 5598693 5708859 6718249 6471025 6691690 6666530 6728634 6374108 5659528 5934433 6148716
5598 6148716 6790612 6847490 6751345 7406568 7093144 6590960 6827699 7247844 7257048 6685983
5588F685983P12875j00192N4905j41736j02959K10297k43577k17219J085842j61610
5578G782609K70390q1967o61333o09258N64707O10311m03013K61437l7508n05056
5568G191319p18433O44162M12709k75647M11650N11026L5609j37879M99677o7602
5558H506591m94452L65627L27239M93008Q0909p99198j9540O65422J00687L03290
5548I529583k12286m80026L11462L58190J6824j07189N29978k84191J51650K00494
5538A0014489j84173M10989M13121L95528m16116K61770L10172m9343k18134J08846
5528A1047149J50545l42933P3564j07139m36118N77250J98986M24376J76358R0390
5518A1852428l59396L85732J24028n74459L27359J81105o87094J06905j44794
$$ plain form
5588 6685983 7398858 7298666 7353571 7211835 7108876 7319173 7075596 6858377 7944219 7782609
5578 7782609 8052999 7971032 7309699 6700441 7265148 7875459 7472446 7733883 7696375 7191319
5568 7191319 6472886 7117048 7529757 7254110 7665760 8176786 8212395 8074516 8574193 8506591
5558 8506591 8012139 8377766 8705005 9198013 9278922 8479724 8460184 9125606 9226293 9529583
5548 9529583 9317297 8837271 9148733 9506923 9523747 9416558 9946536 9662345 9813995 10014489
5538 10014489 9830316 10241305 10654426 11049954 10633838 10895608 11205780 11156437 10938303 11047149
5528 11047149 11197694 10854761 10928325 10821186 10385068 10962318 11161304 11585680 11762038 11852428
5518 11852428 11493032 11878764 12002792 11428333 11755692 11936797 11249703 11356608 11211814
5509A1211814L83582M98832K55765K19826j54011J45416m2510r1573M9060j17511
5499A2358690R81545l57069k57793K61204q32447N0592O34053N7442k72343L82335
5489A3006209K93724P0716m43457K92005n3881K39720L36329o70404Q1517P476
5479A3159954K68464M63555k88645k10535k14450O82865k10883o31795O28241
5470A3646771K00384K78845L3629m37033M3914N76471k55741l9465o00131L65952
5460A3813596Q38024p68581M99058L98135q2067k39801P15396j65258J60844J37494
5450A5306840j07908L05847L43915j40409l77085M05941O7906J73579N18776J43392
5440A6640794J008K153o83346j0449j39165P30971J8776P92615K29827l47766
$$ plain form
5509 11211814 11595396 12094228 12349993 12569819 12415808 12561224 12518714 12427141 12476201 12358690
5499 12358690 13340235 12983166 12725373 12986577 12154130 12204722 12838775 12896217 12623874 13006209
5489 13006209 13299933 13370649 12927192 13219197 13165316 13405036 13741365 13070961 13152478 13159954
5479 13159954 13428418 13891973 13603328 13392793 13178343 13861208 13650325 13018530 13646771
5470 13646771 13847155 14126000 14159629 13722596 13766510 14342981 14087240 14047775 13447644 13813596
5460 13813596 14651620 13883039 14382097 14780232 14698165 14458364 15173760 15008502 15169346 15306840
5450 15306840 15198932 15504779 15848694 15708285 15331200 15737141 15805047 15978626 16497402 16640794
5440 16640794 16641802 16643955 15960609 15950160 15810995 16541966 16560742 17353357 17583184 17235418
5430A7235418k0426n45652O67404K0101O14326K18035L00110o75560j48752p734
5420A7657270J94038K24219N12873k10190K46297p7018j7384L19263K77165N90748
5410A9717281k27Q76228l75904P1373R8950M68278K53941l39841O9559n4174O05339
5399B1390803l20554K1984o244P3421L47311j16864M56673M45490N03978Q48463
5389B3644461o52860l52367P24568J03714O7561l01231Q01311L55248K07758K49149
5379B4847312K77457N06338K56872M29873P10044K43155J97418j35467J47834
5370B7480836Q29286L17807N03757p0053N18160L22692M79296L14493K95507N88443
5360C1580224N65337k85433J22509N45834L698Q41344M49276L25016K68080O09871
$$ plain form
5430 17235418 17214992 16669340 17336744 17356845 17971171 18189206 18489316 17813756 17665004 17657270
5420 17657270 17851308 18075527 18588400 18378210 18624507 18547489 18530105 18849368 19126533 19717281
5410 19717281 19717054 20593282 20217378 20288751 20387701 20855979 21109920 20770079 20839638 20785464 21390803
5399 21390803 21070249 21092233 21085989 21159410 21506721 21389857 21846530 22292020 22795998 23644461
5389 23644461 22991601 22639234 23363802 23467516 23535077 23233846 24035157 24390405 24598163 24847312
5379 24847312 25124769 25631107 25887979 26317852 27027896 27271051 27468469 27333002 27480836
5370 27480836 28310122 28627929 29131686 29061633 29579793 29902485 30381781 30696274 30991781 31580224
5360 31580224 32145561 31860128 31982637 32528471 32532169 33373513 33822789 34147805 34415885 35025756
5350C5025756J44241J083797P61861N7421N03425O11114O61907O06901J253780
5341D0710203J19548R00679L80361K0374J090899l58140L31983Q74975J193417
5332D5264299l11043Q10930J166492L59290O73882P97292n3724J555428P75552
5323E1038398J0744L17430N91647J431268K83860K05198K20579O63012L94898
5314E5157034P23504o3903P6701N27218P31609P53423n151J060591L05534J06063
5304E9372623L26166q9699J77668N26230k67079k36359N83766j86112N3118J84938
5294F0445260l31745p2350K67833k67475o13412k18538K07950K06975l84467r74646
5284E8265385O98905P0937l84680j94721l03347k55235N09080m7290m63406N84192
$$ plain form
5350 35025756 35169997 36253794 37015655 37073076 37576501 38187615 38849522 39456423 40710203
5341 40710203 40829751 41730430 42110791 42131165 43222064 42863924 43195907 44070882 45264299
5332 45264299 44953256 45764186 46930678 47289968 47963850 48761142 48707418 50262846 51038398
5323 51038398 51049142 51366572 51958219 53389487 53673347 53878545 54099124 54762136 55157034
5314 55157034 55880538 55816635 55893336 56420554 57152163 57905586 57900435 58961026 59266560 59372623
5304 59372623 59698789 59609090 59786758 60312988 60045909 59809550 60393316 60207204 60260322 60445260
5294 60445260 60113515 60041165 60308998 60041523 59428111 59209573 59417523 59624498 59240031 58265385
5284 58265385 58964290 59035227 58650547 58455826 58152479 57897244 58406324 58359034 57895628 58479820
5274E8479820m36152j110998j95881l5915L93423k77145n89155p5890j12778K2707
5264E6062036J53384m43119n54434L05983J05206K95578K30525k71041J14970
5255E5999088m13569j62600K22685L60415J39732K03409l36156M44483m2114L71070
5245E6786443l1301J79727N49729M87322J70411M11909N16300j51459O23775L54525
5235E9897381J199474M58540K98113M94924M74624J320918O82468M74493J147498
5226F6448433N16249Q32801K54157J092266J496313L43960P65031J291814J197434
5217G4238458J233932R63784N44234J085085J140610J437210J870439J129761
5209H3643513J338675J685705J666184P02573J265183J614108J690094J934349
$$ plain form
5274 58479820 58043668 56932670 56736789 56700874 57094297 56817152 56227997 56152107 56039329 56062036
5264 56062036 56215420 55772301 55217867 55523850 55629056 55924634 56155159 55884118 55999088
5255 55999088 55585519 55422919 55645604 56006019 56145751 56349160 56013004 56457487 56415373 56786443
5245 56786443 56755142 56934869 57484598 57971920 58142331 58554240 59070540 58919081 59542856 59897381
5235 59897381 61096855 61555395 61853508 62348432 62823056 64143974 64826442 65300935 66448433
5226 66448433 66964682 67797483 68051640 69143906 70640219 70984179 71749210 73041024 74238458
5217 74238458 75472390 76436174 76980408 78065493 79206103 80643313 82513752 83643513
5209 83643513 84982188 86667893 88334077 89036650 90301833 91915941 93606035 95540384
5201I5540384J252944J323266J991187K131607K706504J824505K038720K509590
5193A11318707K205456K311353K277143J685612K858266K448852K410947K942294
5185A30458630L273845L014729K077982L134095L297417K522824K778966L474596
5177A54033084L675567M461596L928971L320754M064450L398987M024288M278297
5169A85185994M291397M409554M568414L761811M311254M442025M414763N034798
5161B20420010M585689M133598M304037M344112M495435M495359M318626M342719
5153B55439585L571511M532922M145050L295155L275635K461349K507366K721613
5145B81950186J697835J537529N44577J325889J14534J19028n03274q02996j592117
$$ plain form
5201 95540384 96793328 98116594 100107781 102239388 104945892 106770397 108809117 111318707
5193 111318707 113524163 115835516 118112659 119798271 122656537 125105389 127516336 130458630
5185 130458630 133732475 136747204 138825186 141959281 145256698 147779522 150558488 154033084
5177 154033084 157708651 162170247 166099218 169419972 173484422 176883409 180907697 185185994
5169 185185994 189477391 193886945 198455359 202217170 206528424 210970449 215385212 220420010
5161 220420010 225005699 229139297 233443334 237787446 242282881 246778240 251096866 255439585
5153 255439585 259011096 263544018 267689068 270984223 274259858 276721207 279228573 281950186
5145 281950186 283648021 285185550 285730127 287056016 287170550 287289578 286786304 285983308 284391191
5136B84391191j789531j671803l057508l281223k673696m401241l857024l447690
5128B60211475l888517l655830n458902m526577m233655m764616m900608m635356
5120B24147414l960667m754969m604909m174901m575180n059134m271872m437976
5112A88307806m018611m500186l889345l670153l759107l120967l759220l148646
5104A58441571l321791l579348k763129k840033l076616l062577l132327k373318
5096A34292432k249557k339386k269461k717532k361263j469088k211878j754138
5088A16920129j024248j821763j817968j641236j488908j536191j390631j247211
5080A04951973j950197j251829j359013j475972q98342j002920p76220j242056
$$ plain form
5136 284391191 282601660 280929857 277872349 274591126 271917430 267516189 263659165 260211475
5128 260211475 256322958 252667128 247208226 242681649 238447994 233683378 228782770 224147414
5120 224147414 220186747 215431778 210826869 206651968 202076788 197017654 192745782 188307806
5112 188307806 184289195 179789009 175899664 172229511 168470404 165349437 161590217 158441571
5104 158441571 155119780 151540432 148777303 145937270 142860654 139798077 136665750 134292432
5096 134292432 132042875 129703489 127434028 124716496 122355233 120886145 118674267 116920129
5088 116920129 115895881 114074118 112256150 110614914 109126006 107589815 106199184 104951973
5080 104951973 103001776 101749947 100390934 98914962 98016620 97013700 96237480 94995424
5072I4995424j501268p06930q08696q65192j333293n38864m58647j000554j275354
5063H6506626j120926j96406p80235q51253r51840j412892j23989q30900j183045
5054G9055140q02041q17564n22133r21732j007676j229136j013194p34824j014324
5045G0992516j58951j199465j619029q15039q2473o92139m45032r35394j014707
5036F4030287k81582m35614j301533r59925p65291j144795r14845j022701p20217
5027E6483784r74611j029752p31215l04934j72496r76632r26433o03574j236847
5018D9527290R8731r63418j144173o93606j328510o93635J77627k37359j137135
5009D3605812q61774o62649r18615k20964K22589j377177o11711p94598k570P95701
$$ plain form
5072 94995424 93494156 92787226 91978530 91113338 89780045 89241181 88782534 87781980 86506626
5063 86506626 85385700 85189294 84409059 83557806 82605966 81193074 81069085 80238185 79055140
5054 79055140 78253099 77435535 76913402 75991670 74983994 73754858 72741664 72006840 70992516
5045 70992516 70833565 69634100 68015071 67200032 67117559 66425420 65980388 65044994 64030287
5036 64030287 63748705 63313091 62011558 61051633 60286342 59141547 58226702 57204001 56483784
5027 56483784 55509173 54479421 53748206 53443272 53270776 52294144 51367711 50764137 49527290
5018 49527290 49626021 48662603 47518430 46824824 45496314 44802679 44980306 44742947 43605812
5009 43605812 42744038 42081389 41162774 40941810 41164399 39787222 39175511 38380913 38378343 39174044
4999C9174044j109333p09850r0993p41196J32917M8548k37410k13882r128l55736
4989C5887981m74710K14961M33137o0921L34921L95650L03023O75386Q46558Q67330
4979C9423316M08676K86892L30891Q6985l009j41086L55396J56297q82306m91555
4969C9530497J49666J0023p86530q87331k15508K98830n1712n13987n89765p42598
4959C6201585o84778L96229n34406n37410j351104j241818l50841r79683r41130
4950B9976644j153142j609586j168087j082244n03951o13525m09728q92482m21234
4941B2122665n79203o98411l77707n24167l99769Q53006q477q68151q74780l22674
4931A8322332o80301k65809k31805k56455O4803J81823K94869Q9428p50391k69175
$$ plain form
4999 39174044 38064711 37354861 37263868 36522672 36655589 36704137 36466727 36252845 36243717 35887981
4989 35887981 35413271 35628232 36061369 36000448 36335369 36731019 37034042 37709428 38555986 39423316
4979 39423316 39831992 40118884 40449775 40536760 40533751 40392665 40748061 40904358 40022052 39530497
4969 39530497 39680163 39690186 38903656 38016325 37800817 38099647 38047935 37533948 36944183 36201585
4959 36201585 35516807 35913036 35378630 34841220 33490116 32248298 31897457 30917774 29976644
4950 29976644 28823502 27213916 26045829 24963585 24459634 23846109 23436381 22543899 22122665
4941 22122665 21543462 20845051 20467344 19943177 19543408 20396414 20387937 19519786 18645006 18322332
4931 18322332 17642031 17376222 17144417 16887962 16952765 17134588 17429457 17518885 16768494 16499319
4921A6499319j55214l08658L7306N0872l35662k09077k27389M22137m95219m30301
4911A4848114J32771l45556J029571p8893n2010j22018k59611n45398p30778M04881
4901A4281073j22185L1806l28209J51308j3377l35369K13869r73154j27712J68668
4891A2946718Q53372K69645m38752p4678k48768p02653L23260N42787p07635M13238
4881A3176534J95882r26566J10452P70373N18325p27368l6461k59716J61894K795
4871A2986144L11605l68304Q07039n95286o16719P45154j88125j07920m57413
4862A2516175n58057P53626J72010N44178J05430j80719K18889n0755k1499q2664
4852A3416614n31771J14896j68189L00806N55163J09537K01709J8784M25530n52271
$$ plain form
4921 16499319 16344105 16035447 16072753 16123625 15787963 15578886 15351497 15773634 15278415 14848114
4911 14848114 14980885 14635329 15664900 15586007 15533997 15411979 15152368 14606970 13876192 14281073
4901 14281073 14158888 14190694 13862485 14013793 14000416 13665047 13878916 12905762 12778050 12946718
4891 12946718 13800090 14069735 13630983 13556305 13307537 12604884 12928144 13470931 12763296 13176534
4881 13176534 13372416 12445850 12556302 13326675 13845000 13117632 13081171 12821455 12983349 12986144
4871 12986144 13297749 12929445 13736484 13141198 12524479 13269633 13081508 12973588 12516175
4862 12516175 11958118 12711744 12883754 13427932 13533362 13352643 13571532 13520777 13499278 13416614
4852 13416614 12884843 12999739 12831550 13132356 13687519 13797056 13998765 14017549 14443079 13890808
4842A3890808p41498L81531M74140O2713J78132r1056n41401J23455Q43463M67662
4832A5047949K06397q8751K65722J916N89586L99667K39628K94413R8785M604
4822A7059916l94513j81809O89433j94238R5719Q33035K06491j49244j06844N85216
4812A8443162m5479J54761k23079K49581R83869P14554O73622N18490k96642l5848
4802B1136991M2102K31979L39732J06534O47996K7770L84752J109561M42068K36255
4792B4705740Q875m74139O35004K4759J027136P10782p5242L28563J024062M32996
4782B8348536k16691K41684R49287M9792P27537J134919P17168N00770J72688
4773C2625690O69101J649932R53658R90270M54673J263757J052181L89246J571842
$$ plain form
4842 13890808 13149310 13530841 14004981 14067694 14245826 14154770 13613369 13736824 14580287 15047949
4832 15047949 15254346 15165595 15431317 15433233 16022819 16422486 16662114 16956527 17055312 17059916
4822 17059916 16665403 16483594 17173027 16978789 17074508 17907543 18114034 17964790 17857946 18443162
4812 18443162 18397683 18552444 18329365 18578946 19562815 20277369 20950991 21469481 21172839 21136991
4802 21136991 21179093 21411072 21750804 21857338 22505334 22533104 22917856 24027417 24469485 24705740
4792 24705740 24714615 24240476 24875480 24900239 25927375 26638157 26562915 26891478 27915540 28348536
4782 28348536 28131845 28373529 29322816 29372608 30100145 31235064 31952232 32453002 32625690
4773 32625690 33294791 34944723 35898381 36888651 37343324 38607081 39659262 40048508 41620350
4764D1620350J637537J019920J181362J852518J789611J868512J566285K437918
4756E4974013K070824J686691J960514K653486L338028L089453L854290M177582
4748G7804881M478953M416587N784185N225249O381132P108679O242056O946934
4740A24388656P787765P036094P280487O903895P280724O596471O125898M547629
4732A77947619K957202R28007k064398m790792q230718q767889j0595147j1051833
4724A36332051j1446244j0046406r196684q101446q166787p009711o272083n522422
4716G0570268n210394m171158k897196l633994l741946k743197k452004k893545
4708D2826834j845584j348591j757942j627128k151922j761766r53356p51136
$$ plain form
4764 41620350 43257887 44277807 45459169 47311687 49101298 50969810 52536095 54974013
4756 54974013 57044837 58731528 60692042 63345528 66683556 69773009 73627299 77804881
4748 77804881 82283834 86700421 92484606 97709855 104090987 111199666 117441722 124388656
4740 124388656 132176421 139212515 146493002 153396897 160677621 167274092 173399990 177947619
4732 177947619 180904821 181832828 179768430 174977638 166746920 157979031 147383884 136332051
4724 136332051 124885807 114839401 105642717 97541271 89374484 82364773 76092690 70570268
4716 70570268 65359874 61188716 58291520 54657526 50915580 48172383 45720379 42826834
4708 42826834 40981250 39632659 37874717 36247589 34095667 32333901 31380545 30629409
4700C0629409j572618j228220j155243p41315o89376q92830o49125j052803r58624
4691B1689255L83413r16154j208752m22113l67937k56435l09597r81703r04756
4682A6705221M95504n43013n79507o13819j62356o47057k05117l26617p28626
4673A3394613k29041m90959J26608m3171j19314j172574k35721O43639p92023
4664A1082057Q6059p2355o59767o0853K85708k8630r45540l32272K40446l10427
4654I284426p4874J36078o80605n95958r452M88467m52233j50503M5753K22785
4644H213884m90049l94545m22897L35596k05966j44649Q08830j09939m89189P885
4634G108961J49671O57721m44286l85648k17345l98312j09636j05911L42577L05124
$$ plain form
4700 30629409 29056791 27828571 26673328 25932013 25242637 24349807 23700682 22647879 21689255
4691 21689255 22072668 21156514 19947762 19525649 19157712 18901277 18591680 17609977 16705221
4682 16705221 17200725 16657712 16078205 15464386 15302030 14654973 14449856 14123239 13394613
4673 13394613 13165572 12674613 12801221 12758050 12638736 11466162 11230441 11874080 11082057
4664 11082057 11168116 11095761 10435994 10375141 10660849 10632219 9686679 9354407 9594853 9284426
4654 9284426 9209552 9345630 8665025 8069067 8059615 8548082 8095849 7945346 7991099 8213884
4644 8213884 7723835 7329290 6906393 7241989 7036023 6891374 7700204 7590265 7101076 7108961
4634 7108961 7258632 7916353 7472067 7086419 6869074 6470762 6361126 6255215 6597792 6902916
4624F902916n73490m92508L93974j00060l05608m17003L91127k76837J73610m40
4614E695681j00221m22496P8677O327M40726K37017j43317m07744o6092j32930
4604E185628M01829k46652k51334N73156l51225n80856k36825N02309J88889m45401
4594D739518K31115n45441k23699J07651p0064l07430n90695J86955K51345M26946
4584D206201J13317j25356m25973J40606l22848o72456K46323K30285J4181J6328
4574C420608P48539j47944m64093j22243N49428j99795N80304m17611k45441K03329
4564C905081J77644K47693m9416n4112r5184m85613K92512M5062k22288N03653
4554D265032j137469j99883O7306O47439J442n55353q3854J111253M06219l86092
$$ plain form
4624 6902916 6329426 5836918 6230892 6130832 5825224 5408221 5799348 5522511 5696121 5695681
4614 5695681 5595460 5172964 5251641 5257968 5698694 5935711 5792394 5384650 5318558 5185628
4604 5185628 5587457 5340805 5089471 5662627 5311402 4730546 4493721 4996030 5184919 4739518
4594 4739518 4970633 4425192 4201493 4309144 4239080 3931650 3340955 3527910 3779255 4206201
4584 4206201 4319518 4194162 3768189 3908795 3585947 2913491 3159814 3390099 3404280 3420608
4574 3420608 4169147 4021203 3557110 3434867 3984295 3784500 4364804 3947193 3701752 3905081
4564 3905081 4082725 4330418 4281002 4226890 4131706 3646093 3938605 3983667 3761379 4265032
4554 4265032 3127563 2927680 2994986 3642425 3643867 3088514 3004660 4115913 4522132 4136040
4544D136040M11558L98965m93804J76574m46237l67841n29344K2068L23025m56187
4534C174817Q8742j04806J72477K78947l27097l15961N53512M31628l82718M35940
4524D005481n72189j94805J60614K98018K36693m60094n2030m7467K99661J86191
4514C860073r0634k43540K43547l29565M64979R5260K1642K61949n3158n16563
4504C713990J62394k07039K85700M57360L6289k46543j52025l76058L29306O48241
4494D651615J71837N17067r40995K19015n09466n70455Q86904M7153m51197N7646
4484D079124o68381M41007L19446j35761J05845L93168N51900k03613o3100M90467
4474E310102q5544J21777j41719K47114j32428O69634M9527q7928J59185K8177
$$ plain form
4544 4136040 4547598 4946563 4452759 4629333 4183096 3815255 3285911 3307979 3631004 3174817
4534 3174817 3263559 3158753 3331230 3610177 3283080 2967119 3520631 3952259 3569541 4005481
4524 4005481 3433292 3238487 3399101 3697119 3933812 3473718 3421688 3374221 3673882 3860073
4514 3860073 3769439 3525899 3769446 3439881 3904860 4000120 4021762 4283711 4230553 3713990
4504 3713990 3876384 3669345 3955045 4412405 4448694 4202151 4050126 3674068 4003374 4651615
4494 4651615 4823452 5340519 4399524 4618539 4109073 3538618 4425522 4472675 4021478 4079124
4484 4079124 3410743 3851750 4171196 4035435 4141280 4534448 5086348 4882735 4819635 5310102
4474 5310102 5224558 5346335 5204616 5451730 5319302 5988936 6038463 5950535 6109720 6137897
4464F137897j79568l89715Q99920j24376K32308L08929p68291M528J06691O81650
4454F909973P62084n51192j33581k29115N06018P93625Q7321k88131N84515L16935
4444H758452P5915M64623J19439m27418O62852O7990J59809k55758J92770N83078
4434A0401752R4775Q89809N86835m2250l8279M70443R577m29428O18352L82715
4424A2944301M09480Q07801K55219L62445O27587j04825k08927Q13817P50856
4415A6657754K47963N59567J037921Q89175Q26934J98787R8627L41895J184644
4406B2043267N82152R69321Q19922K53653J253366J669962O18040J068719P83220
4397C0061622J524406J377392P99260J717375K017101K840510K844247K874837
$$ plain form
4464 6137897 5958329 5568614 6468534 6344158 6576466 6885395 6117104 6121632 6228323 6909973
4454 6909973 7672057 7120865 6987284 6758169 7264187 8057812 8145133 7857002 8441517 8758452
4444 8758452 8834367 9298990 9418429 8991011 9653863 9721853 9881662 9625904 9818674 10401752
4434 10401752 10496527 11386336 11973171 11930921 11892642 12363085 12372662 11943234 12561586 12944301
4424 12944301 13353781 14161582 14416801 14779246 15406833 15302008 15093081 15906898 16657754
4415 16657754 16905717 17465284 18503205 19392380 20219314 20418101 20516728 20858623 22043267
4406 22043267 22625419 23594740 24414662 24668315 25921681 27591643 28209683 29278402 30061622
4397 30061622 31586028 32963420 33762680 35480055 37497156 40337666 43181913 46056750
4389D6056750L321725L132459L418549M788824N180128O617538N973363O027317
4381H4516653O065778M913800M772428N290134N897850O696540P664028P392356
4373A33209567O457156M107537K514211J935119J707297L505010M047488M771135
4365A62254520L844542Q26487k440106m975131o121036o000220n173695l360786
4357A38854575k669748l274648n631142o669101p265507q075395p222848o448791
4349I1597395n382469l970254m640775n513820o035889o123520n637655m680829
4341D9612184l545354l185005k033475k119479j552448q69786n90928q04145l28703
4332C4582861p57176K50396N96249l31182N53489L52357J10273l48784j377749
$$ plain form
4389 46056750 49378475 52510934 55929483 60718307 65898435 72515973 78489336 84516653
4381 84516653 90582431 95496231 100268659 105558793 111456643 118153183 125817211 133209567
4373 133209567 139666723 143774260 146288471 148223590 149930887 153435897 157483385 162254520
4365 162254520 166099062 166925549 164485443 159510312 153389276 147389056 142215361 138854575
4357 138854575 136184827 132910179 127279037 120609936 113344429 105269034 98046186 91597395
4349 91597395 86214926 82244672 77603897 72090077 66054188 59930668 54293013 49612184
4341 49612184 46066830 42881825 40848350 38728871 37176423 36306637 35715709 34911564 34582861
4332 34582861 33825685 34076081 34672330 34341148 34894637 35246994 35357267 35008483 33630734
4323C3630734o48849j504558j968743j801722r51977j512993j815462j968487
4315B1457943j299100j001471n10855n62307n17841p64316j318346o63629m71733
4306A4348345j31918J46337r17055j048966m01539m69774n9828o91914j12982
4297A0660706l63523n48907P9189M35663o6222o018q61261l49008K10552n82325
4287H608846n00809K13958J48866J74297n97089j78392M1176M21828k21150n13830
4277G597701K60088l68191m6122m64576J96482j79208K08741k00138O62255k07648
4267G459384Q9038j1036n83836l60522k70120P24813n19808L71578o33713n00006
4257E765772J26642n78952K2651k80461m48203L36451O18713P10691q03972k30609
$$ plain form
4323 33630734 32981885 31477327 29508584 27706862 26754885 25241892 23426430 21457943
4315 21457943 20158843 19157372 18646517 18084210 17566369 16802053 15483707 14820078 14348345
4306 14348345 14216427 14362764 13445709 12396743 11995204 11525430 11465602 10773688 10660706
4297 10660706 10297183 9748276 9827465 10263128 10196906 10190888 9329627 8980619 9191171 8608846
4287 8608846 8108037 8321995 8470861 8645158 8048069 7869677 7910853 8332681 8111531 7597701
4277 7597701 7857789 7489598 7443476 6978900 7175382 6996174 7204915 7004777 7667032 7459384
4267 7459384 7548422 7537386 6953550 6593028 6322908 7047721 6527913 6899491 6265778 5765772
4257 5765772 5892414 5313462 5336113 5055652 4607449 4943900 5562613 6273304 5469332 5238723
4247E238723o63649L81510K51352j44294J2186j43993M35480L81471j19393n82978
4237E046415l20476J55120L48057j34594N32968k49716j10316L30934o44149P4666
4227E028909l17043N07703N44395k0291r76694q4762M71640j16205L45327J85819
4217E568798Q09157l96466j75563j1745r3272J0004k06794O67144N00423n46530
4207F125156j47876J4906M45344j79037J10500j0724M45829J30497j71432K31071
4197F994234N04309j07025k02126n09663n50733M93784K16938o8267M10104J006409
4187H187964j91414k8297n1884k81727J9056J75410Q4234J91981n30141J95873
4177G771055N07379J99838M16531k85090P10450K51440n3957l83754J27688N63511
$$ plain form
4247 5238723 4575074 4956584 5207936 5063642 5075828 4931835 5367315 5748786 5629393 5046415
4237 5046415 4725939 4881059 5229116 5094522 5627490 5377774 5267458 5598392 4954243 5028909
4227 5028909 4711866 5219569 5763964 5743673 4766979 4682217 5153857 5037652 5382979 5568798
4217 5568798 6377955 5981489 5805926 5794181 5700909 5710913 5504119 6171263 6671686 6125156
4207 6125156 5977280 5992186 6437530 6258493 6368993 6358269 6804098 6934595 6763163 6994234
4197 6994234 7498543 7391518 7189392 6679729 6128996 6622780 6839718 6771451 7181555 8187964
4187 8187964 7996550 7968253 7916369 7634642 7653698 7829108 7913342 8105323 7575182 7771055
4177 7771055 8278434 8478272 8894803 8609713 9320163 9571603 9517646 9133892 9261580 9825091
4167I825091K38245l68890l0687Q40726N31662l86335L10028P86629Q6444p0463
4157A1762450L90793L70521Q26447K44538J16718m147o46748M24603R96197O21928
4147A5103300Q36390K14484K13802J067053L23987J43593J00938N22392R49225
4138A9475164K82655P74805J71349J153122Q89984p6008L49956J087728M66881
4129B4575636P77620J001365J355592P65113P96401J087406P74293J157270J175457
4120C3466153J303571J289552J178355O65149J678201J249002J338320J193544
4112D3361847J402509J564270J692053J453010J549221J388338J980878J534298
4104E5926424J620395J226082J889916K042586P12845R04057J689962J872071
$$ plain form
4167 9825091 10063336 9694446 9663759 10504485 11036147 10649812 10959840 11746469 11832913 11762450
4157 11762450 12153243 12523764 13350211 13594749 13711467 13707320 13060572 13485175 14481372 15103300
4147 15103300 15939690 16154174 16367976 17435029 17759016 17902609 18003547 18525939 19475164
4138 19475164 19757819 20532624 20703973 21857095 22747079 22671071 23021027 24108755 24575636
4129 24575636 25353256 26354621 27710213 28475326 29271727 30359133 31133426 32290696 33466153
4120 33466153 34769724 36059276 37237631 37902780 39580981 40829983 42168303 43361847
4112 43361847 44764356 46328626 48020679 49473689 51022910 52411248 54392126 55926424
4104 55926424 57546819 58772901 60662817 62705403 63418248 64322305 66012267 67884338
4096F7884338K098329J404160J144821N19082J930755j29642R32953R17900Q50018
4087G7552714P08151Q48930N92931j21574J136213J237141M1299o95829L10104
4078H1610080j55027m16675n41191k53620n76244p88144j040895o85001j073669
4069G6079614o88676j245856p51094m16818j202618j349996p37139j073805j737274
4060F6876338r49118j820366j701643j136981j428820j159669r46007j213904
4052E6519830n91369j518553j146770j435222j386154r35866j179743n54114p61499
4043D7010540j164910j393299m2637r57232q16501m36550k93042j60922j030837
4034D0714610j012373J89306j116274j80624K96483o3915p87775J89754j94768
$$ plain form
4096 67884338 69982667 71386827 72531648 73050730 74981485 74851843 75784796 76702696 77552714
4087 77552714 78260865 79109795 79702726 79581152 80717365 81954506 81995805 81299976 81610080
4078 81610080 81455053 81038378 80497187 80243567 79667323 78879179 77838284 77153283 76079614
4069 76079614 75390938 74145082 73393988 72977170 71774552 70424556 69687417 68613612 66876338
4060 66876338 65927220 64106854 62405211 61268230 59839410 58679741 57733734 56519830
4052 56519830 55928461 54409908 53263138 51827916 50441762 49505896 48326153 47772039 47010540
4043 47010540 45845630 44452331 44409694 43452462 42635961 42199411 41906369 41745447 40714610
4034 40714610 39702237 39891543 38775269 38594645 38891128 38827213 38039438 38229192 38034424
4025C8034424m19608j9384n6473K35938M86793J68439p0541L78789K19343O84231
4015C9641951j19735N5572O22861o5180J99984j96945K15216K9923J59130P2536
4005D0615313k74595K44667l27632n1332O67434j51446l08978j03085p24900n35231
3995C9050215K4799n10403n83713L64791l73505k68780J60818n67151j022246
3986C6274825k96935m43963p85559n10057j949704l43707m52670q01039n82487
3977C0108704l86659r30992j13505p7441j396798n99434j92307l97354m54213
3968B5560001p49990p0643K43665J54998K09958j266798k56434j35374j86467
3959B3502916o99580j65959J0793J45284k61172R2097n8854K4901J20389K54141
$$ plain form
4025 38034424 37614816 37595432 37538959 37774897 38261690 38430129 38359588 38738377 38957720 39641951
4015 39641951 39522216 39577788 40200649 40135469 40335453 40138508 40353724 40383647 40542777 40615313
4005 40615313 40340718 40585385 40257753 40206421 40873855 40722409 40413431 40310346 39585446 39050215
3995 39050215 39075014 38564611 37980898 38345689 37972184 37703404 37864222 37297071 36274825
3986 36274825 35977890 35533927 34748368 34238311 32288607 31944900 31492230 30691191 30108704
3977 30108704 29722045 28791053 28677548 28600107 27203309 26603875 26411568 26014214 25560001
3968 25560001 24810011 24739368 24983033 25138031 25347989 24081191 23824757 23689383 23502916
3959 23502916 22803336 22637377 22648170 22793454 22532282 22624379 22565525 22590426 22710815 22964956
3949B2964956k84179J133933K73413P0609K98383k76092M24806J50133J69601
3940B4925563r7210L96837M71240l1599P21040M59575N71328J051120L75309k03904
3930B8639299K87454Q90685P35499O57760K19307K38072M77093R20549J270199
3921C4335917R00081Q67059Q79059K94617Q36177M88680J9592R74926J179794
3912D0775902Q00806J096996M97445J200684J174669R98133P55056N55602J016015
3903D8871308P53406Q92349J813531J654106J652784J257239P19690J991980J337526
3894F0943919J312926J265365J898870K428735J442056J682075J471501J273447
3886G3718894K470525J908259K180093J846034J861893J761704K275336L029862
$$ plain form
3949 22964956 22680777 23814710 24088123 24158732 24457115 24181023 24605829 24755962 24925563
3940 24925563 24828353 25225190 25696430 25664831 26385871 26845446 27416774 28467894 28843203 28639299
3930 28639299 28926753 29817438 30552937 31210697 31430004 31668076 32145169 33065718 34335917
3921 34335917 35235998 36103057 36982116 37276733 38112910 38601590 38621182 39596108 40775902
3912 40775902 41576708 42673704 43171149 44371833 45546502 46544635 47299691 47855293 48871308
3903 48871308 49624714 50517063 52330594 53984700 55637484 56894723 57614413 59606393 60943919
3894 60943919 62256845 63522210 65421080 67849815 69291871 70973946 72445447 73718894
3886 73718894 76189419 78097678 80277771 82123805 83985698 85747402 88022738 91052600
3878I1052600L106331J739547J411384K538394K033181K819934K513652J298180
3870A08513203K430521K870055K300125L775088K167470K253972L019289K469497
3862A29799220J664086J969650J868630J254861J424156J015832N99498R28562
3854A40524495P42273M95297m27245n8830K59699p85750K54176l01910j965505
3845A38736700j127840q30010j562020j612226j596155k044417j810118j463262
3837A26690652k044274j970958j808253j937247j141052j774361k080531j195155
3829A12738821k207501r21013j311617j416567j320676j417121j060603j632562
3821A01451161q42667j012980p71603j303695j704634o12118j297265j330669
$$ plain form
3878 91052600 94158931 95898478 97309862 99848256 101881437 104701371 107215023 108513203
3870 108513203 110943724 113813779 116113904 119888992 122056462 124310434 127329723 129799220
3862 129799220 131463306 133432956 135301586 136556447 137980603 138996435 139595933 140524495
3854 140524495 141266768 141762065 141334820 141275990 141535689 140749939 141004115 140702205 138736700
3845 138736700 137608860 136778850 135216830 133604604 132008449 129964032 128153914 126690652
3837 126690652 124646378 122675420 120867167 118929920 117788868 116014507 113933976 112738821
3829 112738821 110531320 109610307 108298690 106882123 105561447 104144326 103083723 101451161
3821 101451161 100608494 99595514 98823911 97520216 95815582 95203464 93906199 92575530
3813I2575530k65049r66104k25765k92881j465313r58179j06776q93728j494001
3804H5907734j405750p60891j003306j232812j029690j175741o96245j650819
3796G6952480j305351p96620j294737j162642j432131j445834k749098j276472
3788F5489595k17038j434705j361309j389364j270203j442225j810525o09341
3780E5954885j659684j875302r18466j183103j407702j272232l50293p24509o24147
3771D5939447p32303p41368j361086q86326o62149j192577o43473m14128n46319
3762C8759718o61174q26887p11099l95053o02869n78857o39099m42609p60677
3753C3141394j021131n85623j071753j92134l90045j9083k10971n34748q38357
$$ plain form
3813 92575530 92310481 91344377 91118612 90825731 89360418 88402239 88295463 87401735 85907734
3804 85907734 84501984 83741093 82737787 81504975 80475285 79299544 78603299 76952480
3796 76952480 75647129 74850509 73555772 72393130 70960999 69515165 66766067 65489595
3788 65489595 65272557 63837852 62476543 61087179 59816976 58374751 56564226 55954885
3780 55954885 54295201 52419899 51501433 50318330 48910628 47638396 47288103 46563594 45939447
3771 45939447 45207144 44465776 43104690 42218364 41556215 40363638 39720165 39306037 38759718
3762 38759718 38098544 37271657 36560558 36165505 35562636 34983779 34344680 33902071 33141394
3753 33141394 32120263 31534640 30462887 30270753 29880708 29861625 29650654 29115906 28277549
3744B8277549n60829k74193K4307n00256K00318k44554m07383J92541n23218n86532
3734B5597750m59920m75566q2787O45359k07522K61531J16639p44650L57510m39071
3724B4569273R025k47727k57893o6849L29471m20946j21585M37283o35862L22770
3714B3916960R0902K13569k78440L80989j96733k50401p0235J103017J68677l26725
3704B4751580J38238L06026q9148L84179j29206O76342N58768l6038K84127K69025
3694B7113893q9568K25294O43468J073133L32116j49928J66802J74144K17003
3685B9706357J550234J367099k16432K66810M47030O61994K81961J181425L47384
3676C5593862L21269N35931P74465N31655J164026J44869M68720Q89597J40945
$$ plain form
3744 28277549 27716720 27442527 27466834 26966578 27166896 26922342 26514959 26707500 26184282 25597750
3734 25597750 25137830 24662264 24579477 25224836 25017314 25278845 25395484 24650834 25008344 24569273
3724 24569273 24578298 24330571 24072678 24005829 24335300 23914354 23792769 24230052 23594190 23916960
3714 23916960 24007862 24221431 23942991 24323980 24127247 23876846 23806611 24909628 25078305 24751580
3704 24751580 24889818 25195844 25106696 25490875 25361669 26038011 26596779 26560741 26844868 27113893
3694 27113893 27024325 27249619 27893087 28966220 29298336 29148408 29315210 29489354 29706357
3685 29706357 31256591 32623690 32407258 32674068 33121098 33783092 34065053 35246478 35593862
3676 35593862 35915131 36451062 37225527 37757182 38921208 39066077 39534797 40424394 40565339
3667D0565339N47168J181134J30370K94158O17484P6310J287839L66037O41969
3658D5707808R23616R46833J134277Q74145J200702P8284P89608J331888L36804
3649E3323965J537241J605218J424579J505063J821344J983777K147810J642356
3641F6991353K546478J837378J919759K639813K442359L008977K933715K402682
3633H6722514K843559L352483K783671L345380K824419L586082L759726K612475
3625A11830309K842821K980490L468228L380634K725258K376267L077752L119464
3617A35801223K830754K536220J846588K279974K585097K394503J827016J102013
3609A53203388N93640J461248N21596l284M84368R45103k22228m16670O9935L44556
$$ plain form
3667 40565339 41112507 42293641 42424011 42718169 43335653 43411963 44699802 45065839 45707808
3658 45707808 46631424 47578257 48712534 49586679 50787381 50865665 51655273 52987161 53323965
3649 53323965 54861206 56466424 57891003 59396066 61217410 63201187 65348997 66991353
3641 66991353 69537831 71375209 73294968 75934781 78377140 81386117 84319832 86722514
3633 86722514 89566073 92918556 95702227 99047607 101872026 105458108 109217834 111830309
3625 111830309 114673130 117653620 121121848 124502482 127227740 129604007 132681759 135801223
3617 135801223 138631977 141168197 143014785 145294759 147879856 150274359 152101375 153203388
3609 153203388 153797028 155258276 155779872 155776588 156260956 157206059 156983831 156567161 156637096 156981652
3599A56981652n42746j192257r13537j124955j771696r06038j588735k296185
3591A46645503j567435j675586j028534k478827k147337j946712k536119j780646
3583A31484307k940472k547531j981481k173126k448914k231397k347940k127306
3575A12686140k031125l019608l531579k105347j716701k059029k053266k031114
3567I4138371k433579k112928j685377j354207j682524j880074k091032q81756
3559H0016894j084968j289959r51911r56269j223099j516109j017020j240456
3551G0737103o71875n80931J92979j285799p96681j294436q32576m47582p9859
3542F4940343j085686l16316p16954j257750j211563j007250m96116o81940j628460
$$ plain form
3599 156981652 156438906 155246649 154333112 153208157 151436461 150530423 148941688 146645503
3591 146645503 145078068 143402482 142373948 139895121 137747784 135801072 133264953 131484307
3583 131484307 128543835 125996304 124014823 121841697 119392783 117161386 114813446 112686140
3575 112686140 110655015 107635407 104103828 101998481 100281780 98222751 96169485 94138371
3567 94138371 91704792 89591864 87906487 86552280 84869756 82989682 80898650 80016894
3559 80016894 78931926 77641967 76690056 75733787 74510688 72994579 71977559 70737103
3551 70737103 70065228 69484297 69677276 68391477 67594796 66300360 65467784 65020202 64940343
3542 64940343 63854657 63538341 62821387 61563637 60352074 59344824 58848708 58166768 56538308
3533E6538308j010214j083629k096312q36799j679941k125455j492944o22588
3525D5590426j225041j712650r24898j025187q14584j262131j998687j658868
3517C4968380j353577j017740j115568j154441j860672j201385j90502r66028
3509B6108467q00399p51646q1939m47609l86466j208218n23916k36030o88168
3500B0984076j010909o06929m82589l03283K37925j053363M4986k88971K95705
3491A7816648P41258j118856p3020k72132m28069P30847m5497j019660o51602
3482A5679917r6717j50865k30784J9566j89519o65095l16066m03029K81528r69629
3472A2959307m17719J08215q95520m59702l69566M11950K84795j71454j181341
$$ plain form
3533 56538308 55528094 54444465 52348153 51511354 49831413 47705958 46213014 45590426
3525 45590426 44365385 42652735 41727837 40702650 39888066 38625935 36627248 34968380
3517 34968380 33614803 32597063 31481495 30327054 28466382 27264997 27074495 26108467
3509 26108467 25308068 24556422 24474483 24026874 23640408 22432190 21908274 21672244 20984076
3500 20984076 19973167 19366238 18883649 18580366 18818291 17764928 17809914 17520943 17816648
3491 17816648 18557906 17439050 17366030 17093898 16665829 17396676 17351179 16331519 15679917
3482 15679917 15583200 15432335 15201551 15221117 15031598 14366503 14050437 13647408 13928936 12959307
3472 12959307 12541588 12649803 11754283 11294581 10925015 11336965 11621760 11450306 10268965
3463A0268965o03513J39382l10864j13966k33682L41274o29224p16457J9548k6720
3453H134743m31078L76318m49433n58636o88505O70638N7697n6475j01941p24575
3443F228753l00324p23771j30327J57349k11325L52671N4030k80079K7285l11700
3433D862562j72249k08404J68127l0924n41262L11180k20210J58275l73541j01383
3423C852171O2893J38602L21423l29017l82226k2419J45885j66247r1156L82803
3413C912712q5274o725r2540k34421k88873n02071Q82815k91321k9074n61565
3403B703663j80659m23591n1983J28639O42148M0219l3635j40370j92426N7496
3393B549501l36585j27506L7140m27383l55525K7610k83352Q83227O25622m219
$$ plain form
3463 10268965 9665452 9804834 9493970 9380004 9146322 9487596 8858372 8141915 8161463 8134743
3453 8134743 7703665 8079983 7630550 7071914 6383409 7054047 7111744 7055269 6953328 6228753
3443 6228753 5928429 5204658 5074331 5231680 5020355 5373026 5427056 5146977 5174262 4862562
3433 4862562 4690313 4481909 4650036 4619112 4077850 4389030 4168820 4327095 3953554 3852171
3423 3852171 3915064 4053666 4375089 4046072 3663846 3641427 3787312 3621065 3529909 3912712
3413 3912712 3827438 3820713 3728173 3493752 3204879 2702808 3585623 3294302 3265228 2703663
3403 2703663 2523004 2099413 2047430 2176069 2818217 2858436 2824801 2684431 2492005 2549501
3393 2549501 2212916 2085410 2122550 1695167 1339642 1367252 1083900 1967127 2592749 2588530
3383B588530q08732p01347P79790N34726m25477K65096n09933K41986L66993K69375
3373B601007M17376p22109m55866k72124P53325K02076o48177j54536K55310n20464
3363A455818k37477K0473l42811P196q8621M04212K62183Q25446j01048k4149
3353B181222o5871o20771j69107K87092P18207m74033j99712l19548N33963M40168
3343B311610l13218K55961j397987M8947M94174k26127J87135m24239J42013o4672
3333A013597O05810j89992o1247j22276J20586K97651l86867m00549K18709J51152
3323A246574j04538M81218J20412L49515o95603k64596L72697j26086P724o96077
3313F91240K43789L56434k33132l54692j09850K51776M20299P15071k33119q7371
$$ plain form
3383 2588530 1779798 1078451 1858241 2392967 1967490 2232586 1722653 1964639 2331632 2601007
3373 2601007 3018383 2296274 1840408 1568284 2321609 2523685 1875508 1720972 1976282 1455818
3363 1455818 1218341 1238814 896003 903199 814578 1218790 1480973 2306419 2205371 2181222
3353 2181222 2115351 1494580 1325473 1612565 2330772 1856739 1657027 1337479 1871442 2311610
3343 2311610 1998392 2254353 856366 905313 1399487 1173360 1360495 936256 1078269 1013597
3333 1013597 1619407 1429415 1368168 1245892 1366478 1664129 1277262 876713 1095422 1246574
3323 1246574 1142036 1623254 1743666 2093181 1397578 1132982 1505679 1379593 1387317 691240
3313 691240 935029 1291463 1058331 703639 593789 845565 1265864 1980935 1747816 1660445
3303A660445p6112j6013j22560J46539O7816l49820q0679L42479M43417n98173
3293A417339j59188l50817K10349j19392J10047P01384K55860k62436q72814m8284
3283H82048l31566l1380N39672L7602k28590n7189K87578l59532l76187J78673
3273E41129O07046q4110J32643N2679m17436l42224K66754L11047j41755O48993
3263A574766J34579k14711p36429o40560L18225K21474O39053K49013l43758j029856
3253A71796k55002K02890N34208J45516Q6539q1082n13365L08173M47735l75307
3243F72101n80434L57799o6489L24140M37337k79614K59181M16437q1767R8666
3233A557357p77393l57170j57394k6700J07001j61065j42253N15888l3245J36586
$$ plain form
3303 1660445 1584333 1568320 1445760 1592299 1660115 1310295 1229616 1572095 2015512 1417339
3293 1417339 1258151 907334 1117683 998291 1108338 1809722 2065582 1803146 930332 882048
3283 882048 550482 519102 1058774 1096376 867786 810597 1098175 738643 362456 541129
3273 541129 1148175 1064065 1196708 1249387 831951 489727 756481 1067528 925773 1574766
3263 1574766 1709345 1494634 758205 117645 435870 657344 1296397 1545410 1201652 171796
3253 171796 -83206 119684 653892 799408 885947 804865 291500 599673 1047408 672101
3243 672101 91667 449466 382977 707117 1144454 864840 1124021 1540458 1458691 1557357
3233 1557357 779964 422794 265400 238700 345701 184636 42383 558271 525026 661612
3223F61612p56398L03838J87734n6489J07359L38211K3477K72716j89453j01253
3213G91354l68688L99855K83273K10708m04172k36792O04180o89076p31154N8498
3203h2014N1290M95763M04532L95658j01009j000422M81086o0368j8605n6165
3193E09746n77108L27359L50641J46540M69380j67563k43906o89903j86038K17444
3183A56592K0795L13608J59858L94702k34652m75331K81827K13557p15816q37851
3173g22711R46431l48558m28186J91264K18079K35011L40630m22168J70108J4849
3163A94749k5865l30966O6720J98094O38845j45925n22866J6700N75023L13677
3153I78186J33846l04036l84451k42278J23811q6879j81571r397k31622J49783
$$ plain form
3223 661612 -94786 209052 396786 340297 447656 785867 809344 1082060 892607 791354
3213 791354 422666 822521 1105794 1316502 912330 675538 1279718 590642 -140512 -82014
3203 -82014 -30724 465039 869571 1265229 1164220 163798 644884 584516 565911 509746
3193 509746 -67362 259997 610638 757178 1226558 1058995 815089 125186 -60852 156592
3183 156592 177387 490995 650853 1045555 810903 335572 617399 830956 115140 -722711
3173 -722711 223720 -124838 -553024 -361760 -143681 91330 431960 9792 179900 194749
3163 194749 168884 -162082 -95362 102732 741577 595652 72786 89486 664509 978186
3153 978186 1112032 807996 423545 181267 305078 218199 36628 27231 -204391 -54608
3143e4608p1782O72693j14104N0694J66655l32723L54963k89430q4561O52644
3133I50441r498P9679m7377L10131K69984k90777J79033k46013l31831N4710K79669
3122A198151n70582k95559M23585K4722l4096k37059j67251L67172k06751k41693
3112B60639k1578J84780M5209j91746K6875R5664N5219o205n60081l04508O84534
3101B68802k85385J56609M19714m75007l41218L47817O3621K03243k08057O0357
3091B10496L844l03224Q2256N39963k04047L15912m27034M62697l73135N130R09820
3080A222678J06016k44178O2156j40640o96493l03851J52683J3130K76732L2289
3070D80522r5791K39796p4585K29441L49332l38435l82148N18204j07686n60707
$$ plain form
3143 -54608 -126390 546303 432199 482893 649548 316825 671788 382358 297797 950441
3133 950441 940943 1020622 973245 1283376 1553360 1262583 1441616 1195603 863772 918482 1198151
3122 1198151 627569 332010 755595 780317 746221 509162 341911 709083 502332 260639
3112 260639 239061 423841 469050 277304 304179 399843 455062 448857 -111224 -415732 268802
3101 268802 -16583 140026 559740 84733 -256485 91332 154953 358196 150139 210496
3091 210496 214340 -88884 -6628 533335 329288 645200 218166 680863 307728 312858 1222678
3080 1222678 1328694 1084516 1146672 1006032 309539 5688 158371 171501 448233 480522
3070 480522 384731 624527 549942 779383 1128715 790280 408132 926336 818650 257943
3060B57943N18375j12916j36784j25147K71233J16319M01164N76478m11935Q03299
3050B158029K27394L40653L88859m51760o67683o15834j022520K44941J05249
3041G07328m979K7807r5600l52676K974O72478l97630n85972K67945J60979Q60861
3030A263515m51951R0956k26614j102524L73882J133045K36213n04659m51831
3021C60032K00111Q4800P94159J31663K07543n05706o92253K9146O64036k15462
3011A058069o09140O8977J47186R47990o89875r77135M1614K92593P25135J823
3001A007237n24734k85258M04690k45407m34367Q5289j49490N06249n70282m01735
2991f07808k45875M92001l24612L38899J42556k92326J81141m51456M01698J008626
$$ plain form
3060 257943 776318 663402 526618 401471 672704 789023 1190187 1766665 1354730 2158029
3050 2158029 2385423 2726076 3114935 2663175 1995492 1379658 357138 602079 707328
3041 707328 702349 730156 634556 281880 284854 957332 559702 -26270 241675 402654 1263515
3030 1263515 811564 902520 675906 -426618 -52736 1080309 1316522 811863 360032
3021 360032 560143 644943 1439102 1570765 1778308 1272602 580349 609495 1273531 1058069
3011 1058069 448929 517906 665092 1613082 923207 -53928 -12314 280279 1005414 1007237
3001 1007237 482503 197245 601935 356528 -77839 7450 -142040 364209 -206073 -607808
2991 -607808 -853683 -361682 -686294 -347395 -204839 -497165 -316024 -767480 -365782 642844
2981F42844l5923m73203k70019Q983m60438J66567K29589j131N41213l9328k14000
2970I5154K33595j08928k29521L1278O01411m30100k42467r8128K01258j4492
2960C9060k86353j79059M50333O6873R8651n31988R3301K34778J25581L64544
2950D75721Q0887K12147n4021k32347J67336l45130n02929K91768l02024r221
2940b17813j34094j76885l18081L51934O65745j77710j66172O8107p63037J32369
2930g35637L47491P3019J16752K94154m44312J56160J84910j7157J96360K18276
2920C90016j85124k18964J73332K9673M3830j75249m10122k31266L47076K029
2910b34769k94137q7694P2050O09539m66144n67197M03274N41324J08404j77794
$$ plain form
2981 642844 606921 133718 -136301 -127318 -587756 -421189 -191600 -192731 348482 309154 95154
2970 95154 328749 219821 -9700 21578 622989 192889 -49578 -147706 53552 39060
2960 39060 -247293 -426352 23981 90854 189505 -342483 -249182 -14404 111177 475721
2950 475721 556608 768755 714734 482387 649723 304593 -198336 93432 -208592 -217813
2940 -217813 -351907 -528792 -846873 -494939 170806 -6904 -173076 -104969 -868006 -735637
2930 -735637 -388146 -315127 -198375 95779 -348533 -192373 -7463 -24620 171740 390016
2920 390016 204892 -14072 159260 188933 232763 57514 -352608 -583874 -236798 -234769
2910 -234769 -528906 -616600 -544550 64989 -401155 -968352 -565078 -23754 84650 -93144
2900i3144r1175j10592m11895k40204O02310J80720M21987P3804o63313k36130
2890e67632N53423M12299q51593k14782L80395P42233k55358J22360l12309k92867
2880b83831M82885O41225o60387J12395J04768p23337J31464K17563M11505k16271
2870B17979r4796O0910j1672J50254L256n54904k05958M79328p1739m80047L49786
2859a57603j71828J30583j36283N41482m58332L26578K98340m43520J87903Q5392
2849B02712L98389n9113j15574n52667m7737K08427K79899k08068R7596M38031
2839F41895n79484q68491L11573J02891K10223K4625j2237m64650J02562K12567
2829c18526k43605k9891K45073L20521J82757M92554n85800p1550M11756l26625
$$ plain form
2900 -93144 -184319 -294911 -706806 -947010 -344700 -163980 258007 331811 -331502 -567632
2890 -567632 -14209 398090 -453503 -668285 -287890 454343 198985 321345 9036 -283831
2880 -283831 199054 840279 179892 292287 397055 -326282 -194818 22745 434250 217979
2870 217979 123183 184093 172421 322675 325931 -228973 -434931 44397 -27342 -507389 -157603
2859 -157603 -329431 -198848 -335131 206351 -251981 74597 372937 -70583 117320 202712
2849 202712 601101 541988 426414 -126253 -173990 34437 314336 106268 203864 641895
2839 641895 62411 -806080 -494507 -391616 -181393 -156768 -169005 -633655 -531093 -318526
2829 -318526 -562131 -592022 -346949 -26428 156329 648883 63083 -8467 403289 76664
2819G6664j58667j62341K73262J93424o34192L86501o9367M24513L48849m93096
2809A85550m69308J16926j07489K48632j24701n65918L62138M16947K62721n66220
2799b40722l12664j00183L26431q0303P6178j6969p7279R3969j56277J6506O65207
2788A93894N25128r00375R1996L11290k467l82088j5604O9925l19998P446k10804
2777f31657p1048L96105j13017j38942m52282P87129J75014m87504M31885k71697
2767c76014l93097J19612K81072M06666o0053L96655j59438p41032K24721P25164
2757D24256l33220j926q6131m28134j57759m2409O17439l08140J26530J31562
2747e7932j06342j45090l86201o5382N19102N03569L74801p1453l51921p0790
$$ plain form
2819 76664 -82003 -244344 28918 222342 -411850 -25349 -94716 329797 678646 185550
2809 185550 -283758 -166832 -274321 -25689 -150390 -716308 -354170 62777 325498 -240722
2799 -240722 -553386 -653569 -327138 -407441 -331263 -348232 -425511 -331542 -487819 -471313 193894
2788 193894 719022 -181353 -89357 221933 219466 -162622 -178226 -108301 -428299 -420853 -631657
2777 -631657 -702705 -306600 -419617 -558559 -1010841 -223712 -48698 -536202 -104317 -376014
2767 -376014 -769111 -649499 -368427 38239 -21814 374841 215403 -525629 -300908 424256
2757 424256 91036 89110 2979 -425155 -582914 -625323 -7884 -316024 -189494 -57932
2747 -57932 -164274 -309364 -695565 -760947 -241845 261724 636525 565072 213151 142361
2737A42361J70173N3550k65223m16714o0752o37395o7789J80044J02924j0687
2727h09508M37280M49968j104631L12186P11126K63710l85220J94726K45409l93742
2717g8696p4966m00812Q1458M0229J30876o6616K12710K76115l96938o4818J50242
2706a91216L32159l15169k39100M61321o6029l32499M47719M18386m25346O11252
2696G01478j8294M6972k19624j136317l58916M51364O2202k73042r5257J2499
2686h26935N37664j39025k00677M48521O7263o85147j08617P71296Q5993J77431
2676A27767k75486n37565l30754J90216j82214L22628M43355J57499K43727q9108
2666G0065n27979k69155R77135O13486M6035p74543k75411j53748l72115l04428
$$ plain form
2737 142361 312534 366084 100861 -315853 -376605 -1014000 -1081789 -901745 -798821 -809508
2727 -809508 -372228 77740 -1026891 -714705 -3579 260131 -125089 69637 315046 -78696
2717 -78696 -153662 -554474 -473016 -432787 -301911 -368527 -155817 120298 -276640 -341458 -191216
2706 -191216 140943 -174226 -413326 47995 -18034 -350533 97186 515572 90226 701478
2696 701478 683184 730156 510532 -625785 -984701 -533337 -471135 -744177 -839434 -826935
2686 -826935 -289271 -428296 -628973 -180452 -113189 -798336 -906953 -135657 -49664 127767
2676 127767 -147719 -685284 -1016038 -825822 -1008036 -685408 -242053 -84554 159173 70065
2666 70065 -457914 -727069 250066 863552 909587 135044 -140367 -294115 -666230 -970658
2656i70658O31823n9152j99239N30410j33430K89503o0152k59345N3346M3352
2646a33542j32642m51374j80972N3570K26674J36691l53728K77874J56820K72121
2636a28508k06493K7671j36535k20327L76442Q30179l74389o45825k7767l81970
2626h87522M17302M54558R9589J55715k79301k19102k78425J055314m167j35043
2616C78918K92930j45308j88289O392L02095q3485l73195J17965q776n38518k21489
2605d60760N83683j59391n61991j18823P1425Q90025j9945q55718j86480R4223
2595g23752J88306K01189o99539Q84679M3998O93581n66325j06168K48833J42283
2585C07085k16753l20726L3389N137j051698P32022L46726J15530N41503l58095
$$ plain form
2656 -970658 -338835 -397987 -597226 -66816 -200246 89257 29105 -230240 -176894 -133542
2646 -133542 -266184 -717558 -898530 -844960 -618286 -481595 -835323 -557449 -400629 -128508
2636 -128508 -335001 -307330 -443865 -664192 -287750 542429 168040 -477785 -505552 -887522
2626 -887522 -470220 -15662 83927 239642 -39659 -258761 -537186 518128 513961 378918
2616 378918 671848 526540 338251 344643 646738 563253 190058 308023 299247 -239271 -460760
2605 -460760 122923 -36468 -598459 -717282 -645857 244168 224223 -631495 -817975 -723752
2595 -723752 -535446 -334257 -1033796 -149117 -105119 588462 22137 -84031 164802 307085
2585 307085 90332 -230394 -197005 -191868 -1243566 -511544 -164818 -49288 492215 134120
2575A34120J44320o81550L89531k83102L28373K14882p41228L80619J07985j9650
2565b5700l19573k72439K28533M23079J085j92882j23151J76289m37331j27761
2555f69851P36038l32845M7292j98972K00664K46088J77281q92291L99219K439
2545b84938L25695L77130p20833m6864M0665N09525q6494n67973j01934K21591
2535c34430l12784J91679m44197L61233n718O8850P0625O73590n57107j65962
2525d54221J64640j87814K55147L45359K25289j24466o1027n1852k95704J00367
2515h4282K2773j79168l55730P050K25789J04528K77925N20014o59975n22499
2505f43575L23180K44995N26691j052970J25810P4352k17019K35330L23361m85594
$$ plain form
2575 134120 278440 -403110 -13579 -296681 31692 246574 -494654 -114035 -6050 -25700
2565 -25700 -345273 -617712 -389179 33900 34985 -157897 -281048 -104759 -542090 -669851
2555 -669851 66187 -266658 -219366 -418338 -217674 28414 205695 -686596 -287377 -284938
2545 -284938 40757 417887 -302946 -349810 -309145 200380 113886 -454087 -556021 -334430
2535 -334430 -647214 -455535 -899732 -538499 -544217 -475367 -404742 268848 -288259 -454221
2525 -454221 -289581 -477395 -222248 123111 348400 223934 162907 111055 -184649 -84282
2515 -84282 -61509 -240677 -596407 -589357 -363568 -259040 18885 538899 -121076 -643575
2505 -643575 -320395 -75400 451291 -601679 -475869 -401517 -618536 -383206 -59845 -545439
2495e45439O92250K20501m7388l80499L9670l53251K49800M1231j82643L02049
2485C6281m25882J23415K26173p00013O32885J01341M18306k25776n08696l58266
2475f80232M84972P5940M07182m15828m87499L14096j74513K22358M69363j054771
2465h38932K68367N35429l5793k9596j19759k84682m80881O47115J60918p7607
2455b55421k36093M03437n5262J35292J30707j3246n24303M9514J68782N72054
2445C75461j97102o3610l08321J82599k19458K17017K38033j22559L62442l93353
2435G1149l95260N29920j45804m92080L2484Q13601o51895l07914M10800K17218
2425H2219J39166j53190m87137L19417l80369K00921P50214n19796m18953l87477
$$ plain form
2495 -545439 146811 367312 319924 -60575 -20905 -374156 -124356 -83125 -265768 36281
2485 36281 -389601 -266186 -40013 -740026 -107141 -5800 412506 186730 -321966 -680232
2475 -680232 -195260 -119320 287862 -127966 -615465 -301369 -475882 -253524 215839 -838932
2465 -838932 -570565 -35136 -70929 -100525 -220284 -504966 -985847 -338732 -177814 -255421
2455 -255421 -491514 -88077 -143339 -8047 122660 109414 -414889 -365375 -196593 375461
2445 375461 178359 114749 -193572 -10973 -230431 -13414 224619 102060 464502 71149
2435 71149 -324111 205809 60005 -432075 -399591 414010 -237885 -545799 -134999 82219
2425 82219 221385 68195 -418942 -99525 -479894 -278973 471241 -48555 -467508 -854985
2415h54985K52543M23589N27347j4207L1909R1018j91580o49681n21503K67361
$$ plain form
2415 -854985 -602442 -178853 348494 334287 366196 457214 265634 -384047 -905550 -638189
$$ [...]
##END NTUPLES=NMR SPECTRUM
##END=
