##TITLE=1H_EC-3277-ox
 CDCl3
 8 sc, 
 23.09.2022
##JCAMPDX= 6.0         $$ Bruker NMR JCAMP-DX V2.0
##DATA TYPE= NMR SPECTRUM
##DATA CLASS= NTUPLES
##ORIGIN= UXNMR, Bruker Analytische Messtechnik GmbH
##OWNER= root
$$ XWIN-NMR		Version 3.5
$$ Fri Sep 23 13:01:48 2022 Russian Standard Time (UT+4h)  she@DPX200
##.OBSERVE FREQUENCY= 200.1313499994
##.OBSERVE NUCLEUS= ^1H
##.ACQUISITION MODE= SIMULTANEOUS
##.ACQUISITION SCHEME= undefined
##.AVERAGES= 8
##.DIGITISER RES= 18
##SPECTROMETER/DATA SYSTEM= spect
##.PULSE SEQUENCE= zg30
##.SOLVENT NAME= CDCl3
##.SHIFT REFERENCE= (INTERNAL, CDCl3, 0, 15.7326)
##AUDIT TRAIL= $$ (NUMBER, WHEN, WHO, WHERE, WHAT)
$$ ##TITLE= Audit trail, XWIN-NMR		Version 3.5
$$ ##JCAMPDX= 5.01
$$ ##ORIGIN= Bruker BioSpin GmbH
$$ ##OWNER= she
$$ F:/spectra/data/she/nmr/H-F/1/pdata/1/auditp.txt
$$ ##AUDIT TRAIL=  $$ (NUMBER, WHEN, WHO, WHERE, WHAT)
(   1,<2022-09-23 13:00:30.01 +0400>,<she>,<DPX200>,
      <created by zg, POWCHK disabled, PULCHK disabled
       configuration hash MD5:
       00 E9 B6 7A A2 85 ED C7 34 08 36 98 17 FE 4E 26
       data hash MD5: 16K
       3A 34 5F DE 66 A1 31 00 F9 4B 2F AE 5E FA E2 8C>)
(   2,<2022-09-23 13:00:32.46 +0400>,<she>,<DPX200>,
      <Start of raw data processing
       efp BC_mod = 2 LB = 0.24 FT_mod = 6 PKNL = 1 PHC0 = -18044.41 PHC1 = 30.20069 SI = 16K 
       data hash MD5: 16K
       02 78 2A 2A 99 B7 93 4B 40 D0 01 01 2A F5 9E 48>)
(   3,<2022-09-23 13:00:54.98 +0400>,<she>,<DPX200>,
      <pk PHC0 = 8.431065 PHC1 = -17.8 
       data hash MD5: 16K
       4C 3E 2F 95 16 6C 4D 8A 10 98 EC 1E A5 5B F0 90>)
(   4,<2022-09-23 13:00:58.28 +0400>,<she>,<DPX200>,
      <abs ABSG = 5 
       data hash MD5: 16K
       B7 93 F6 C5 D2 D1 E5 D0 CD B3 87 D3 F9 91 6D 65>)
$$ ##END=
$$ 
$$ hash MD5
$$ D6 A9 5A 50 F2 3C FE 72 F7 A9 20 76 42 03 8A C5
##$RELAX= 
##$RELAX= 
##$RELAX= 
##$RELAX= 
##$RELAX= 
##$RELAX= 
$$ Bruker specific parameters
$$ --------------------------
##$DU= <F:/spectra>
##$EXPNO= 1
##$NAME= <H-F>
##$PROCNO= 1
##$TYPE= <nmr>
##$USER= <she>
##$AMP= (0..31)
100 100 100 100 100 100 100 100 100 100 100 100 100 100 100 100 100 100 
100 100 100 100 100 100 100 100 100 100 100 100 100 100 
##$AQSEQ= 0
##$AQ_mod= 1
##$AUNM= <au_zg>
##$AUTOPOS= <>
##$BF1= 200.13
##$BF2= 200.13
##$BF3= 200.13
##$BF4= 200.13
##$BF5= 200.13
##$BF6= 200.13
##$BF7= 200.13
##$BF8= 200.13
##$BYTORDA= 1
##$CFDGTYP= 0
##$CFRGTYP= 5
##$CHEMSTR= <none>
##$CNST= (0..31)
1 1 145 1 1 1 1 1 1 1 1 1 1 1 1 1 1 1 1 1 1 1 1 1 1 1 1 1 1 1 1 1 
##$CPDPRG= <>
##$CPDPRG1= <>
##$CPDPRG2= <>
##$CPDPRG3= <>
##$CPDPRG4= <mlev>
##$CPDPRG5= <mlev>
##$CPDPRG6= <mlev>
##$CPDPRG7= <mlev>
##$CPDPRG8= <mlev>
##$CPDPRGB= <>
##$CPDPRGT= <>
##$D= (0..31)
0 1.2 0 0 0 0 0 0 0 0.06 0 0.03 0 0 0 0 0.0002 0 0 0 0 0 0 0 0 0 0 0 0 
0 0 0 
##$DATE= 1663923629
##$DBL= (0..7)
120 120 120 120 120 120 120 120 
##$DBP= (0..7)
150 150 150 150 150 150 150 150 
##$DBP07= 0
##$DBPNAM0= <>
##$DBPNAM1= <>
##$DBPNAM2= <>
##$DBPNAM3= <>
##$DBPNAM4= <>
$$ [...]
##$SUBNAM3= <"">
##$SUBNAM4= <"">
##$SUBNAM5= <"">
##$SUBNAM6= <"">
##$SUBNAM7= <"">
##$SUBNAM8= <"">
##$SUBNAM9= <"">
##$SW= 18.0517283424941
##$SWIBOX= (0..15)
0 0 2 0 0 0 0 0 0 0 0 0 0 0 0 0 
##$SW_h= 3612.71676300578
##$TD= 16384
##$TD0= 1
##$TE= 0
##$TE2= 300
##$TE3= 300
##$TEG= 300
##$TL= (0..7)
0 120 120 120 120 120 120 120 
##$TP= (0..7)
150 150 150 150 150 150 150 150 
##$TP07= 0
##$TPNAME0= <>
##$TPNAME1= <>
##$TPNAME2= <>
##$TPNAME3= <>
##$TPNAME4= <>
##$TPNAME5= <>
##$TPNAME6= <>
##$TPNAME7= <>
##$TPOAL= (0..7)
0.5 0.5 0.5 0.5 0.5 0.5 0.5 0.5 
##$TPOFFS= (0..7)
0 0 0 0 0 0 0 0 
##$TUNHIN= 0
##$TUNHOUT= 0
##$TUNXOUT= 0
##$USERA1= <user>
##$USERA2= <user>
##$USERA3= <user>
##$USERA4= <user>
##$USERA5= <user>
##$V9= 5
##$VALIST= <valist>
##$VCLIST= <CCCCCCCCCCCCCCC>
##$VD= 0
##$VDLIST= <DDDDDDDDDDDDDDD>
##$VPLIST= <PPPPPPPPPPPPPPP>
##$VTLIST= <TTTTTTTTTTTTTTT>
##$WBST= 1024
##$WBSW= 4
##$XGAIN= (0..3)
0 0 0 0 
##$XL= 0
##$YL= 0
##$YMAX_a= 356195
##$YMIN_a= -603492
##$ZGOPTNS= <>
##$ZL1= 120
##$ZL2= 120
##$ZL3= 120
##$ZL4= 120
##$ABSF1= 15.73257
##$ABSF2= -2.31928
##$ABSG= 5
##$ABSL= 3
##$ALPHA= 0
##$AQORDER= 0
##$ASSFAC= 0
##$ASSFACI= 0
##$ASSFACX= 0
##$ASSWID= 0
##$AUNMP= <proc_1d>
##$AZFE= 0.1
##$AZFW= 0.1
##$BCFW= 0
##$BC_mod= 2
##$BYTORDP= 0
##$COROFFS= 0
##$CY= -3
##$DATMOD= 1
##$DC= 0
##$DFILT= <>
##$DTYPP= 0
##$F1P= 0
##$F2P= 0
##$FCOR= 1
##$FTSIZE= 16384
##$FT_mod= 6
##$GAMMA= 0
##$GB= 0
##$INTBC= 1
##$INTSCL= 3.70164e-10
##$ISEN= 128
##$LB= 0.24
##$LEV0= 0
##$LPBIN= 0
##$MAXI= 10000
##$MC2= 0
##$MEAN= 0
##$ME_mod= 0
##$MI= 1.114404
##$NCOEF= 0
##$NC_proc= -6
##$NLEV= 6
##$NOISF1= 3.799351
##$NOISF2= 2.8
##$NSP= 0
##$NTH_PI= 0
##$NZP= 0
##$OFFSET= 15.73257
##$PC= 1
##$PHC0= -18035.98
##$PHC1= 12.40069
##$PH_mod= 1
##$PKNL= yes
##$PPARMOD= 0
##$PSCAL= 0
##$PSIGN= 0
##$REVERSE= no
##$SF= 200.130007799887
##$SI= 16384
##$SIGF1= 3
##$SIGF2= 2
##$SINO= 5.538805
##$SIOLD= 16384
##$SREGLST= <1H.CDCl3>
##$SSB= 0
##$STSI= 16384
##$STSR= 0
##$SW_p= 3612.71676300578
##$SYMM= 0
##$S_DEV= 0
##$TDeff= 16384
##$TDoff= 0
##$TI= <>
##$TILT= no
##$TM1= 0
##$TM2= 0
##$TOPLEV= 0
##$USERP1= <user>
##$USERP2= <user>
##$USERP3= <user>
##$USERP4= <user>
##$USERP5= <user>
##$WDW= 1
##$XDIM= 16384
##$YMAX_p= 391203721
##$YMIN_p= -437722
$$ End of Bruker specific parameters
$$ ---------------------------------
##NTUPLES= NMR SPECTRUM
##VAR_NAME=  FREQUENCY,     SPECTRUM/REAL,   SPECTRUM/IMAG
##SYMBOL=    X,             R,               I
##VAR_TYPE=  INDEPENDENT,   DEPENDENT,       DEPENDENT
##VAR_FORM=  AFFN,          ASDF,            ASDF
##VAR_DIM=   16384,         16384,           16384
##UNITS=     HZ,            ARBITRARY UNITS, ARBITRARY UNITS
##FACTOR=    0.220516191357247, 1,           1
##FIRST=     3148.55929567636, 0,            0
##LAST=      -464.157467329418, 0,           0
##MIN=       -464.157467329418, -437722,     0
##MAX=       3148.55929567636, 391203721,    0
$$ Real data points
##PAGE= N=1
##DATA TABLE= (X++(R..R)), XYDATA
$$ [...]
6449G89442k667O69j3977M629K34082j399j19204m3966j17547j2336j733k9402
$$ 789442 786775 787444 773467 778096 1012178 1010779 891575 847609 730062 717726 715993 686591
6437F86591m4127o1427N0120R7271K18747M7867l8166r351n0122J12174m8754
$$ 686591 642464 581037 631157 728428 947175 995042 956876 947525 897403 1009577 960823
6426I60823L5958r9115J74393n8069k52937R6129R9928j43525r6705P3589R6540
$$ 960823 996781 897666 1072059 1013990 761053 857182 957110 813585 716880 790469 887009
6415H87009p2012o39N6368p436j06796J22420O5414q3007m7591J17648P7301M9226
$$ 887009 814997 814358 870726 863290 756494 878914 944328 861321 813730 931378 1008679 1057905
6403A057905k012L5093j44788j45887j2530J73225N6551j56188R8502O3827j17920
$$ 1057905 1055893 1090986 946198 800311 787781 961006 1017557 861369 959871 1023698 905778
6392I05778p8755j1732L0445O4326m425J30420k6908r2383K9333N4681M1649P8648
$$ 905778 827023 815291 845736 910062 905637 1036057 1009149 916766 946099 1000780 1042429 1121077
6380A121077p5466J75702L8739n7212L2011K24825J9476j27534Q8147q4509N7881
$$ 1121077 1045611 1221313 1260052 1202840 1234851 1459676 1479152 1351618 1439765 1355256 1413137
6369A413137j30765J27137K5620K4685K44320K5128N9905J56370j11840r4595
$$ 1413137 1282372 1409509 1435129 1459814 1704134 1729262 1789167 1945537 1833697 1739102
6359A739102J92398L9263J55176O7154Q7906K84652Q3907q036J58204K2095J15635
$$ 1739102 1931500 1970763 2125939 2193093 2280999 2565651 2649558 2641522 2799726 2821821 2937456
6348B937456J4111L28167J96548Q4212R4824L03919K68706L50132O44624M34732
$$ 2937456 2951567 3279734 3476282 3560494 3655318 3959237 4227943 4578075 5222699 5657431
6338E657431M68717P66003R99580R90149J180778J298925J608240J798597J774878
$$ 5657431 6126148 6892151 7891731 8881880 10062658 11361583 12969823 14768420 16543298
6329A6543298J442952P91319m29874j159127j839448k248648j893945j661406
$$ 16543298 17986250 18777569 18347695 17188568 15349120 13100472 11206527 9545121
6321I545121j237488j060614j012774o16910m91553m19922m02895k81724l35119
$$ 9545121 8307633 7247019 6234245 5617335 5125782 4705860 4302965 4021241 3686122
6312C686122l41960j60275k88909l28344r9987k67910J00551L6756j93816o0465
$$ 3686122 3344162 3183887 2894978 2566634 2466647 2198737 2299288 2336044 2142228 2081763
6302B081763j16494R8697K0583j16183k41554j62408o8407k6480P2150p1973j4159
$$ 2081763 1965269 2063966 2084549 1968366 1726812 1564404 1495997 1469517 1541667 1469694 1455535
6291A455535N5984j35102n3855J00949p0255j8115j30750k7484N4828j439K5103
$$ 1455535 1511519 1376417 1322562 1423511 1353256 1335141 1204391 1176907 1231735 1230296 1255399
6280A255399j58082J62990N3024j35722r1571k46746Q8899p3087O2412J08151
$$ 1255399 1097317 1260307 1313331 1177609 1086038 839292 928191 855104 917516 1025667
6270A025667r030j89478l0318J40682J26531j75061K5121r6457l8500J5878M8795
$$ 1025667 1016637 827159 796841 937523 1064054 888993 914114 817657 779157 795035 843830
6259H43830M1434o6080j11604l7282J37522M4348Q9272o4834j9719j05825J28814
$$ 843830 885264 819184 707580 670298 807820 852168 941440 876606 856887 751062 879876
6248H79876j19900j15994j07264K12434l215M9281m6875j65359L9796J28112q5986
$$ 879876 759976 643982 536718 749152 745937 795218 748343 582984 622780 750892 664906
6237F64906m5192J6228j12859r4486n1081K21421n9329K2729m9086n4882L5972
$$ 664906 619714 635942 523083 428597 377516 598937 539608 562337 513251 458369 494341
6226D94341j1191J74850M9647j33944Q55J43745j34735o609n9929Q2312R3891
$$ 494341 483150 658000 707647 573703 574558 718303 583568 576959 517030 599342 693233
6215F93233r3228L5352N7924m9887M7754o4239l4353L1520J1744j69407M3605
$$ 693233 600005 635357 693281 643394 691148 626909 592556 624076 635820 466413 510018
6204E10018j29823j02642N2014Q457j353j4929Q8555m3324p4843o8204O7633K05732
$$ 510018 380195 277553 329567 338024 336671 321742 410297 366973 292130 223926 291559 497291
6192D97291j79440k1609J24042l2844j05594K4932r0737j3682K16941O7201r5135
$$ 497291 317851 296242 420284 387440 281846 306778 216041 202359 419300 486501 391366
6181C91366q3957n1957L2634K2104J28073M9065j29864o0795j80805K20087J47408
$$ 391366 307409 255452 288086 310190 438263 487328 357464 296669 115864 335951 483359
6170D83359l3559M3783n2287L3158j25226R702J2738O888j28920r2701N6073J76168
$$ 483359 449800 493583 441296 474454 349228 358930 371668 378556 249636 156935 213008 389176
6158C89176J48460k47774L4739j62141J4061J11979M0059j17926R4730k47483
$$ 389176 537636 289862 324601 162460 176521 288500 328559 210633 305363 57880
6148E7880K01367J35985k1118R9753j33684n1290l115m2027L1243j89187k211
$$ 57880 259247 395232 374114 473867 340183 288893 285778 243751 274994 85807 83596
6137H3596J06063R6417K10694q8689l09787R0288N3343N9990J9000j04855j09084
$$ 83596 189659 286076 496770 408081 98294 188582 241925 301915 320915 216060 106976
6126A06976M6246J37321L4223J19119k20240p7564O5249K922O0728l0602q3388
$$ 106976 153222 290543 324766 443885 223645 146081 211330 214252 274980 244378 160990
6115A60990k2474K6389M7388O4084Q2672j24367J22120j08389M5457J59363p9356
$$ 160990 138516 164905 212293 276377 359049 234682 356802 248413 293870 453233 373877
6104C73877j67384j81997J28405J81808o5231K7170J74185j09079O7002p959k7080
$$ 373877 206493 24496 152901 334709 269478 296648 470833 361754 428756 420797 393717
6093C93717J01735L2927j48624p4953J106n7525J3007J61625o6411j96490M475
$$ 393717 495452 528379 379755 304802 305908 248383 261390 423015 356604 160114 164589
6082A64589J19371m477j0396j3221J868J17006j63389q9230N3067N7359j9023
$$ 164589 283960 279483 269087 255866 257734 374740 211351 122121 175188 232547 213524
6071B13524j2006R860R8305o9767J0540o3103Q3024J42947k1763j11368j0961
$$ 213524 201518 211378 309683 239916 250456 187353 270377 413324 391561 280193 269232
6060B69232p7532J1568N9818r0627L6719q59O1131J00356j41426J03541P6064
$$ 269232 191700 203268 263086 172459 209178 208319 269450 369806 228380 331921 407985
6049D07985j37214j63328J5399J37522Q527M5897L9715J56423p1960k11699J12473
$$ 407985 270771 107443 122842 260364 268891 314788 354503 510926 438966 227267 339740
6038C39740n4686k7130n3215O0408J04365k1221r5531M8691K02447k8910Q724
$$ 339740 285054 257924 204709 265117 369482 348261 252730 301421 503868 474958 483682
6027D83682j17796j18633L4371O2853o2078J86951J2625J9585j63455q5298Q7946
$$ 483682 365886 247253 281624 344477 282399 469350 481975 501560 338105 252807 340753
6016C40753j10344L3538n9869L2161J31828l9136j13588j22912R1032J43640n1535
$$ 340753 230409 263947 204078 236239 368067 328931 215343 92431 183463 327103 275568
6005B75568Q5352k6783J08095J15103j09884m0319J836j5859j4869P809l6718
$$ 275568 360920 334137 442232 557335 447451 407132 408968 393109 378240 386049 349331
5994C49331O1467k3438J20841r6570n0242J1538l1819o872O4586J4282N469l9455
$$ 349331 410798 387360 508201 411631 361389 372927 341108 334236 398822 413104 418573 379118
5982C79118j48398J48930n8763o5538J13585o0534J04485O8732p6326Q6689k05850
$$ 379118 230720 379650 320887 255349 368934 308400 412885 481617 405291 491980 286130
5971B86130N5555m9210k8782k1747K11561P6964K3902J20789j36709J14776m9176
$$ 286130 341685 292475 263693 241946 453507 530471 554373 675162 538453 653229 604053
5960F04053j2189P6723j57975n3226q9066n0648J55806J55013j27255J47385m7005
$$ 604053 591864 668587 510612 457386 368320 317672 473478 628491 501236 648621 601616
5949F01616L1806k3356q3369J20608j2253r5286R6566n7890l0276J5086q6154
$$ 601616 633422 610066 526697 647305 635052 539766 636332 578442 548166 563252 477098
5938D77098K8191k3828O3240j06750J71715o4703j39424J34674j01p9324M4621
$$ 477098 505289 481461 544701 437951 609666 544963 405539 540213 540112 460788 505409
5927E05409J7065j13262O1704M0362j8691N4938q7321K13384p53L3589m7836N0497
$$ 505409 522474 409212 470916 511278 492587 547525 460204 673588 672835 706424 658588 709085
5915G09085m1676n235Q667J60328O4263m0509j11915J32833K6512j02106j76845
$$ 709085 667409 662174 670841 831169 895432 854923 743008 875841 902353 800247 623402
5904F23402j88993L1277N5711K2714k7180K7429L8578O5120J571J21346Q777m2368
$$ 623402 434409 465686 521397 544111 516931 544360 582938 648058 649629 770975 779752 737384
5892G37384j8485P968j87456j27234J12032p1518O9365Q8471n4662K02359p993
$$ 737384 718899 726867 539411 412177 524209 452691 522056 610527 555865 758224 750231
5881G50231r2223Q2602O3798R1725j7708l6715o5186L5903K9166p9877k3489K883
$$ 750231 658008 740610 804408 896133 878425 841710 776524 812427 841593 761716 738227 741110
5869G41110j17499m1220J2579M541J06501j54510R5508P2206k8704o466j2801
$$ 741110 623611 582391 594970 599511 706012 551502 647010 719216 690512 684046 671245
5858F71245J23787j10150l5837O4087j40678N87M6347M7458P4842j04611m9833
$$ 671245 795032 684882 649045 713132 572454 573041 619388 666846 741688 637077 587244
5847E87244n4715J50304P583j22835R2300J4442N1870p3849m2915J74927J3803
$$ 587244 532529 682833 690416 567581 659881 674323 726193 652344 609429 784356 798159
5836G98159j32853K8550J1396K04928Q0760m2962l0773n9042j14372J19342J14433
$$ 798159 665306 693856 705252 910180 990940 947978 917205 858163 743791 863133 977566
5825I77566L8874m3292q6285J25472q652r477K9189m3157j2875n7439r7748O9663
$$ 977566 1016440 973148 886863 1012335 1003683 994206 1023395 980238 967363 909924 812176 881839
5813H81839l8717j40789K12592o977J76505J42977O4277r2953p3544J05508K2
$$ 881839 843122 702333 914925 907948 1084453 1227430 1291707 1198754 1125210 1230718 1230740
5802A230740q659k6659k0331l7572P4649n3462J5305N9908O0780m0686R1572o6855
$$ 1230740 1222081 1195422 1175091 1137519 1212168 1158706 1174011 1233919 1294699 1254013 1345585 1278730
5790A278730j93871J33619K2529n6156j5975Q4628R3716L2746o60K1981Q9386
$$ 1278730 1084859 1218478 1241007 1184851 1168876 1253504 1347220 1379966 1379306 1401287 1490673
5779A490673O6662j26738j5736L320O8695M2573o5805J36140Q5689l7735j397
$$ 1490673 1557335 1430597 1414861 1418181 1486876 1529449 1463644 1599784 1685473 1647738 1646341
5768A646341p450L9765m9633N1059r7771J18005J625n380K79145j60968r5707
$$ 1646341 1638891 1678656 1629023 1680082 1582311 1700316 1701941 1696561 1975706 1814738 1719031
5757A719031K6616n3822j45489J58197J10782n9306k6590J06240K3822j70597
$$ 1719031 1745647 1691825 1546336 1704533 1815315 1756009 1729419 1835659 1859481 1688884
5747A688884J6528j5205Q4558N4773N0104j40568O6653K80574j3937M2115l5930
$$ 1688884 1705412 1690207 1774765 1829538 1879642 1739074 1805727 2086301 2072364 2114479 2078549
5736B078549N6120k05914K6930L2449J42775N2329J2182j21662L0785Q2251J8493
$$ 2078549 2134669 1928755 1955685 1988134 2130909 2183238 2195420 2073758 2104543 2186794 2205287
5725B205287j853J1692K1745N7393m1213M0883Q8378J8380R5302Q1621J12907
$$ 2205287 2203434 2215126 2236871 2294264 2253051 2293934 2382312 2400692 2495994 2577615 2690522
5714B690522O6273p4271j25367L0818J95739J0400R5101J14379J26323J60720
$$ 2690522 2756795 2682524 2557157 2587975 2783714 2794114 2889215 3003594 3129917 3290637
5704C290637M5051j8265R618J51478Q3422J12909K8530M3634k8295L8724R2504
$$ 3290637 3335688 3317423 3327041 3478519 3561941 3674850 3703380 3747014 3718719 3757443 3849947
5693C849947L25425J95444m7398j47834J04500J55738J38526L11438N1790N7967
$$ 3849947 4175372 4370816 4323418 4175584 4280084 4435822 4574348 4885786 4937576 4995543
5683D995543J16710J44496J92600j29226M1128R348J68819J93518K33283K72139
$$ 4995543 5112253 5256749 5449349 5320123 5361251 5370599 5539418 5732936 5966219 6238358
5673F238358M30483K27469P0706K94809N20234L18503K67357K71427K47971L65524
$$ 6238358 6668841 6896310 6967016 7261825 7782059 8100562 8367919 8639346 8887317 9252841
5663I252841M29816J97299J48716L72769L65755L24518K78149Q6077K59862L89601
$$ 9252841 9682657 9879956 10028672 10401441 10767196 11091714 11369863 11455940 11715802 12105403
5653A2105403O5323M33734M27695M11116M48476L74732P16652Q96219O86842R01580
$$ 12105403 12170726 12604460 13032155 13443271 13891747 14266479 14983131 15879350 16566192 17467772
5643A7467772J244896J363374J598660J778349K144852K360226K433609L175818
$$ 17467772 18712668 20076042 21674702 23453051 25597903 27958129 30391738 33567556
5635C3567556L369372L320682K986377K228150R57414q4960j066154r59700r05193
$$ 33567556 36936928 40257610 43243987 45472137 46429551 46344591 45278437 44318737 43413544
5626D3413544o27697o47774q57176j221047j511267j374190j129554r05229o39494
$$ 43413544 42785847 42138073 41280897 40059850 38548583 37174393 36044839 35139610 34500116
5617C4500116j96482J36337N09046J054386J499776J704448K264835K930677L397219
$$ 34500116 34303634 34439971 34949017 36003403 37503179 39207627 41472462 44403139 47800358
5608D7800358L594028L924532L738174L534654L289109L465694M294956M748423
$$ 47800358 51394386 55318918 59057092 62591746 65880855 69346549 73641505 78389928
5600G8389928M508136L294513J067032j758357m255188n305560n732273n180970
$$ 78389928 82898064 86192577 87259609 85501252 81246064 75940504 70208231 65027261
5592F5027261m339306l814016l511035l230308l068084k895698k529698j989454
$$ 65027261 60687955 56873939 53362904 50132596 47064512 44168814 41639116 39649662
5584C9649662j867268j275247r91408p64194p5019K68875O35661J023811J356436
$$ 39649662 37782394 36507147 35515739 34751545 34676526 34945401 35581062 36604873 37961309
5575C7961309K008333K115898K188250J973885J861609J581413J183213J315245
$$ 37961309 39969642 42085540 44273790 46247675 48109284 49690697 50873910 52189155
5567E2189155J300398J202410L84231j210423k916372m103607m421174m166853
$$ 52189155 53489553 54691963 55076194 53865771 50949399 46845792 42424618 38257765
5559C8257765l832768l324765k766990k172870j929530j615698j285970j211690
$$ 38257765 34424997 31100232 28333242 26160372 24230842 22615144 21329174 20117484
5551B0117484j065986r61315p19174r19563o26869o29259p55050m38349l18791
$$ 20117484 19051498 18090183 17371009 16451446 15824577 15195318 14440268 14001919 13683128
5542A3683128l49986l31935l14955p0237k82931l55052j58269j20595j63816r8848
$$ 13683128 13333142 13001207 12686252 12616015 12333084 11978032 11819763 11699168 11535352 11436504
5532A1436504l8105j42430k35248k4550q0173n9239j45148n1336Q0436q3572n3456
$$ 11436504 11398399 11255969 11020721 10996171 10915998 10856759 10711611 10660275 10740711 10657139 10603683
5521A0603683q9921J22124K7351l765p4003J43795J17460R6215J0491K8137n4448
$$ 10603683 10513762 10635886 10663237 10659472 10585469 10729264 10846724 10942939 10953430 10981567 10927119
5510A0927119P0604n5821Q146K47636L26512J85468L43203J09565K06284L90049
$$ 10927119 10997723 10941902 10950048 11197684 11524196 11709664 12052867 12162432 12368716 12758765
5500A2758765K78763L24929N27202L90677N75951N80055N17229M08361L96040
$$ 12758765 13037528 13362457 13889659 14280336 14856287 15436342 15953571 16361932 16757972
5491A6757972M77175M20466L14439N54637N93046N97047Q26081M23892N95946
$$ 16757972 17235147 17655613 17970052 18524689 19117735 19714782 20540863 20964755 21560701
5482B1560701N13692L20163N75766O68761O16804O64146J339572J206606J527730
$$ 21560701 22074393 22394556 22970322 23639083 24255887 24920033 26259605 27466211 28993941
5473B8993941K020636K235363K532299L071868L794440M276770M773578N121200
$$ 28993941 31014577 33249940 35782239 38854107 42648547 46925317 51698895 56820095
5465E6820095M944981M112984K223860P4939j807292k438900k023105j558442
$$ 56820095 61765076 65878060 68101920 68176859 66369567 63930667 61907562 60349120
5457F0349120j393995j607505j906747k437007k471112k486455j871330j555299
$$ 60349120 58955125 57347620 55440873 53003866 50532754 48046299 46174969 44619670
5449D4619670q72395m73733l8723O06212R07329J334890K055027K548172K907870
$$ 44619670 43747275 43273542 43234819 43841031 44748360 46083250 48138277 50686449 53594319
5440E3594319L563539M080775L918193M061571M128863M455562N099824N507441
$$ 53594319 57157858 61238633 65156826 69218397 73347260 77802822 82902646 88410087
5432H8410087N140006L522112N54157k876325n278218o125806n810499m894806
$$ 88410087 93550093 97072205 97626362 94750037 89471819 83346013 77535514 72640708
5424G2640708m037645l788738l758471l690625l670469l341105k715271k099626
$$ 72640708 68603063 64814325 61055854 57365229 53694760 50353655 47638384 45538758
5416D5538758j759503j472347p84687o98264m41770J94768O90977Q73674J117813
$$ 45538758 43779255 42306908 41522221 40823957 40382187 40576955 41267932 42141606 43259419
5407D3259419J402269J389875J139069J099984P71793O94030J025154J166160
$$ 43259419 44661688 46051563 47190632 48290616 49062409 49756439 50781593 51947753
5399E1947753J052404L53915r56041k091736k854007l135343k889052k363031
$$ 51947753 53000157 53354072 52398031 50306295 47452288 44316945 41427893 39064862
5391C9064862j778407j433538j028209q44133l44795k42646K5026L02105L59557
$$ 39064862 37286455 35852917 34824708 33980575 33635780 33393134 33418160 33720265 34079822
5382C4079822N14845Q31853P23085J060780J042043J491842J973501K065461K314393
$$ 34079822 34594667 35426520 36149605 37210385 38252428 39744270 41717771 43783232 46097625
5373D6097625K973515L404198L949661M610352N547693O417407P186642P903970
$$ 46097625 49071140 52475338 56424999 61035351 66583044 73000451 80187093 88091063
5365H8091063Q194961Q135698P802621P427476P128404O723787N951082M501561
$$ 88091063 96286024 104421722 112224343 119651819 126780223 133504010 139455092 143956653
5357A43956653J981496r62921m075133o483046p616179p743877p962864p582433
$$ 143956653 145938149 144975228 140900095 134417049 126800870 119056993 111094129 103511696
5349A03511696p575792p502633p508555p467359o872171o013644n292108m511091
$$ 103511696 95935904 88433271 80924716 73457357 66585186 60571542 55279434 50768343
5341E0768343l855037l320188k700436k328373k118444j557706j458830j614896
$$ 50768343 46913306 43593118 40892682 38564309 36445865 34888159 33429329 31814433
5333C1814433j297930j384938j352712j403345j260439r59597j051735j033474
$$ 31814433 30516503 29131565 27778853 26375508 25115069 24155472 23103737 22070263
5325B2070263j008411q05603p76806p52055p06309m91012l59827l94631k58171
$$ 22070263 21061852 20256249 19479443 18727388 18021079 17530067 17170240 16775609 16517438
5316A6517438j51149j02552p4199j18585k63520m0684M0955p4084J56213n3709
$$ 16517438 16366289 16263737 16189538 16070953 15807433 15766749 15807704 15733620 15889833 15836124
5306A5836124l37949k05935j53976j76138l01940j92548k48389m22492m07198
$$ 15836124 15498175 15292240 15138264 14962126 14660186 14467638 14219249 13796757 13389559
5297A3389559n36184m20396l98374m03350l76889l13346k40741k28965m95079
$$ 13389559 12853375 12432979 12034605 11631255 11254366 10941020 10700279 10471314 9976235
5288I976235l46828j05712j18234k35496j56288j22065r9699j07546p6678r5453
$$ 9976235 9629407 9523695 9405461 9169965 9013677 8891612 8791913 8684367 8607689 8512236
5278H512236j37936j39026m5596j40927j55069j42638j17612k33328k52961k41128
$$ 8512236 8374300 8235274 8189678 8048751 7893682 7751044 7633432 7400104 7147143 6906015
5268F906015m00248m57615j53936j40023j70355k30190l05156j64547r4206j26484
$$ 6906015 6505767 6048152 5894216 5754193 5583838 5353648 5048492 4883945 4789739 4663255
5258D663255q9454k46855N5483j5281o042p7841j79508m1374m2215k544m1427
$$ 4663255 4573801 4326946 4382429 4367148 4361106 4283265 4103757 4062383 4020168 4017624 3976197
5247C976197n1702n5683r9229n2898j9713n5531q4635r1847J20886J6118l1935
$$ 3976197 3924495 3868812 3769583 3716685 3696972 3641441 3556806 3464959 3585845 3601963 3570028
5236C570028k36014o074l6162j01184o3732j06053n1359J42394p9946q9090k81859
$$ 3570028 3334014 3327940 3291778 3190594 3126862 3020809 2969450 3111844 3031898 2942808 2660949
5225B660949J08251J55656j56171m31618R1462J41279n1603M2309j10589j8585
$$ 2660949 2769200 2924856 2768685 2337067 2428529 2569808 2518205 2560514 2449925 2431340
5215B431340J5966Q7115n4140n6829p2331j5202k307o4621Q1637j05315M347m7226
$$ 2431340 2447306 2534421 2480281 2423452 2351121 2335919 2333612 2268991 2350628 2245313 2249660 2202434
5203B202434p3344J94149j40736N1476J54259n0059o6162l3764j20223j52980
$$ 2202434 2129090 2323239 2182503 2233979 2388238 2338179 2272017 2238253 2118030 1965050
5193A965050Q3418q0489j00380k26803O59J82567N825j06865l6245p3414Q5873
$$ 1965050 2048468 1967979 1867599 1640796 1641455 1824022 1829847 1722982 1686737 1613323 1699196
5182A699196N1704k53380m649J97832n5081J3110n5053j32327J02909J79104j25650
$$ 1699196 1750900 1497520 1492871 1690703 1635622 1648732 1593679 1461352 1564261 1743365 1617715
5171A617715j38081j5382Q4936q2626n3793j5549P5646O8612o2K5136j20948j21291
$$ 1617715 1479634 1464252 1549188 1466562 1412769 1397220 1472866 1541478 1541416 1566552 1445604 1324313
5159A324313l0977l1510L4765R0710k39727K0486J71178K4963l0912L6189M3261
$$ 1324313 1293336 1261826 1296591 1387301 1147574 1168060 1339238 1364201 1333289 1369478 1412739
5148A412739n968J8008r4056j14236n6364J47841M6276n901k8844q6990P3034
$$ 1412739 1406771 1424779 1330723 1216487 1160123 1307964 1354240 1348339 1319495 1232505 1305539
5137A305539j6859l6690o72O5121j34452M2383P6786j69796n2988J05061r1747
$$ 1305539 1288680 1251990 1251318 1316439 1181987 1224370 1301156 1131360 1078372 1183433 1091686
5126A091686q3129J95106J98263k33928N3532k8002J00357j0541K3447j182j29512
$$ 1091686 1008557 1203663 1401926 1167998 1221530 1193528 1293885 1283344 1306791 1305609 1176097
5115A176097R8749m472J4088n0764j21999J68721M9161J606j01895J52241n751
$$ 1176097 1274846 1270374 1284462 1233698 1111699 1280420 1329581 1331187 1229292 1381533 1375782
5104A375782j3147o9968k7902K04194o0709K8056n1730j79701m9139M9498P1835
$$ 1375782 1362635 1292667 1264765 1468959 1408250 1436306 1384576 1204875 1155736 1205234 1277069
5093A277069K7856L2339j32369N9507R0077J3422o7561j099L0962o5929j6480
$$ 1277069 1304925 1337264 1204895 1264402 1354479 1367901 1300340 1299241 1330203 1264274 1247794
5082A247794J53427k973j53925M6609j8425m1236J2155O7181K9590j03943k9856
$$ 1247794 1401221 1398248 1244323 1290932 1272507 1231271 1243426 1310607 1340197 1236254 1206398
5071A206398J64905l261O6851p3826L4069Q8948n7525R655P0325O5734M3493J03647
$$ 1206398 1371303 1368042 1434893 1361067 1395136 1484084 1426559 1436214 1506539 1572273 1615766 1719413
5059A719413Q8174n3k635J22053j14143O7378R8710O6341p1675k13532k8656o5872
$$ 1719413 1807587 1807534 1804899 1926952 1812809 1880187 1978897 2045238 1973563 1760031 1731375 1665503
5047A665503P6889M202j14413j7335j26336j76208J5379Q5651Q8588r2300M6938
$$ 1665503 1742392 1746594 1632181 1614846 1488510 1312302 1327681 1413332 1501920 1409620 1456558
5036A456558j75752J09954M5627R9566p582P070o4345o7268l7308R9960P3575
$$ 1456558 1280806 1390760 1436387 1535953 1528371 1535441 1471096 1403828 1366520 1466480 1540055
5025A540055m0969m3185J38934j34657k32685O3444N9566P333M3358j50815m3372
$$ 1540055 1499086 1455901 1594835 1460178 1227493 1290937 1350503 1357836 1401194 1250379 1207007
5014A207007O6188p730O204l4244j16837J00402N6642l5486M2452p9558J05084
$$ 1207007 1273195 1265465 1271669 1237425 1120588 1220990 1277632 1242146 1284598 1205040 1310124
5003A310124M1789n9287k6746k204j08791J27334K00793r3785L1297j4862l4031
$$ 1310124 1351913 1292626 1265880 1263676 1154885 1282219 1483012 1389227 1420524 1405662 1371631
4992A371631k6982j42201J68305J04151p72j49247N528k3675J42659L8777r1685
$$ 1371631 1344649 1202448 1370753 1474904 1474132 1324885 1330413 1306738 1449397 1488174 1396489
4981A396489K8325L149J7753p070N6242J11806k1871j47035J01529n9776j73200
$$ 1396489 1424814 1427963 1445716 1438646 1494888 1606694 1584823 1437788 1539317 1479541 1306341
4970A306341J12415K9201j56373J99630J13609L8074k1195l9176q557q2059J50727
$$ 1306341 1418756 1447957 1291584 1491214 1604823 1642897 1621702 1582526 1573969 1491910 1642637
4959A642637j14035M4251M5530n6840J5981L9441O5253M6273Q003p336k3707j7752
$$ 1642637 1528602 1572853 1618383 1561543 1577524 1616965 1682218 1728491 1736494 1729158 1705451 1687699
4947A687699N2171k7401k0346j13982j09152O2020P2670J4826Q5297o0128j75120
$$ 1687699 1739870 1712469 1692123 1578141 1468989 1531009 1603679 1618505 1703802 1643674 1468554
4936A468554k5554J61175j9026p8821j20978N1391J38731O0538Q9842j20404M9834
$$ 1468554 1443000 1604175 1585149 1506328 1385350 1436741 1575472 1636010 1725852 1605448 1655282
4925A655282R6127l0698L1863K42204j76773j74511j42530J04883J04818n1663
$$ 1655282 1751409 1720711 1752574 1994778 1818005 1643494 1500964 1605847 1710665 1659002
4915A659002m1659J3824p3872R9459J9522o7646n5684m2270J30151N0546M8324
$$ 1659002 1617343 1631167 1557295 1656754 1676276 1608630 1552946 1510676 1640827 1691373 1739697
4904A739697J27657l3223j0015j0604L3459j96M6426l696j24391Q0631J6014Q0871
$$ 1739697 1867354 1834131 1824116 1813512 1846971 1846775 1893201 1889505 1765114 1845745 1861759 1942630
4892A942630P0006n5873j26953O9608p3404l6636J18786J17695O8138o8225O9414
$$ 1942630 2012636 1956763 1829810 1899418 1826014 1789378 1908164 2025859 2093997 2025772 2095186
4881B095186M8284l7276j1519J70049o0584K6445n8363p9933K56673J7118Q6732
$$ 2095186 2143470 2106194 2094675 2264724 2204140 2230585 2172222 2092289 2348962 2366080 2452812
4870B452812P1493p5566Q1882P7083j6813J01881P4520N0937K50407N9683l4613
$$ 2452812 2524305 2448739 2530621 2607704 2590891 2692772 2767292 2818229 3068636 3128319 3093706
4859C093706J94969j25210J3622J04269K12983P218J92186j43175Q321P3283J12156
$$ 3093706 3288675 3163465 3177087 3281356 3494339 3501557 3693743 3550568 3558889 3632172 3744328
4848C744328m034k674L44155J04702p9153K3506J53024J98434K32332n0645J21670
$$ 3744328 3740294 3737620 4081775 4186477 4107324 4130830 4283854 4482288 4714620 4663975 4785645
4837D785645K63459P1385J36288J88462L4546J28709K49592K34075J51732L10097
$$ 4785645 5049104 5120489 5256777 5445239 5479785 5608494 5858086 6092161 6243893 6553990
4827F553990L18676J37885O9059K90319L00818L94003L42943N18733N61788O28121
$$ 6553990 6872666 7010551 7079610 7369929 7670747 8064750 8407693 8926426 9488214 10116335
4817A0116335P37697Q42737Q43676P84146Q58236Q30779R49633Q87158J047674
$$ 10116335 10854032 11696769 12540445 13324591 14182827 15013606 15963239 16850397 17898071
4808A7898071J034274J081314J405618J377122J606901J560657J127933P04829
$$ 17898071 18932345 20013659 21419277 22796399 24403300 25963957 27091890 27796719
4800B7796719R0452o86823j323646j552158j564967j511032j343194j008100j031283
$$ 27796719 27887171 27200348 25876702 24324544 22759577 21248545 19905351 18897251 17865968
4791A7865968q05699n74311q14301q30789o82594o48141q98915o39568n03619
$$ 17865968 17060269 16485958 15671657 14840868 14158274 13510133 12611218 11971650 11468031
4782A1468031m19417m86039k88271j57793j86040k31300r8608r898r4602k06294
$$ 11468031 11048614 10562575 10274304 10116511 9930471 9699171 9600563 9590665 9496063 9289769
4772I289769k3971K24078j12752R5925K8079K8690J36772K76746K5127N9548Q2575
$$ 9289769 9265798 9489876 9377124 9473049 9501128 9529818 9666590 9943336 9968463 10028011 10110586
4761A0110586J74405J20145R2306J77968J58505J73049K27401M09578K57881L21149
$$ 10110586 10284991 10405136 10497442 10675410 10833915 11006964 11234365 11643943 11901824 12222973
4751A2222973K44920L25755O41896M54663M85479L67981M75658Q12868Q84994
$$ 12222973 12467893 12793648 13435544 13890207 14375686 14743667 15219325 16032193 16917187
4742A6917187N97690P09120P09087Q39773R74463P84144P78652P21753Q53101
$$ 16917187 17514877 18223997 18933084 19772857 20747320 21531464 22310116 23031869 23884970
4733B3884970Q97145P76474P74468Q15886R19517R85863R79958R46900Q98695
$$ 23884970 24782115 25558589 26333057 27148943 28068460 29054323 30034281 30981181 31879876
4724C1879876J084221J028020J179754J090219J141691J064153Q83669R37538
$$ 31879876 32964097 33992117 35171871 36262090 37403781 38467934 39351603 40289141
4716D0289141J033204R28768J229805J229047J235150J402638J646340J947309
$$ 40289141 41322345 42251113 43480918 44709965 45945115 47347753 48994093 50941402
4708E0941402K074220K167106K285468K385013K086596K333744K209986K294672
$$ 50941402 53015622 55182728 57468196 59853209 61939805 64273549 66483535 68778207
4700F8778207K293866K085688J772525J491235O72144J53077J25013L82518O87463
$$ 68778207 71072073 73157761 74930286 76421521 77093665 77246742 77371755 77754273 78441736
4691G8441736Q91480J352374J547184J471472J602524J655346J764595K081753
$$ 78441736 79333216 80685590 82232774 83704246 85306770 86962116 88726711 90808464
4683I0808464J962011K095177J826666J422745N96091J56060n09532r97996j265941
$$ 90808464 92770475 94865652 96692318 98115063 98711154 98867214 98357682 97359686 96093745
4674I6093745j599409j813091j644892j073925p59518j52585N90282J133316K226519
$$ 96093745 94494336 92681245 91036353 89962428 89202910 89050325 89640607 90773923 93000442
4665I3000442L031245L572553L539586L354523K458039J166283l56463j853136
$$ 93000442 96031687 99604240 103143826 106498349 108956388 110122671 109766208 107913072
4657A07913072l468725m725904n541448n754977n011328m242379l383812k209698
$$ 107913072 104444347 99718443 94176995 88422018 83410690 79168311 75784499 73574801
4649G3574801j156610k68171Q38897J969123K799476L676325L805684K923285
$$ 73574801 72418191 72150020 72988917 74958040 77757516 81433841 85239525 88162810
4641H8162810J148056j567453m026700o060784o627094o336681n634930m750056
$$ 88162810 89310866 87743413 83716713 77655929 71028835 64692154 59057224 54307168
4633E4307168l787800l128459k456903j938420j345190j124844q41120n73776
$$ 54307168 50519368 47390909 44934006 42995586 41650396 40525552 39684432 39110656
4625C9110656n37537m53936m72883l45329l98081n78307o04392p22488j106714
$$ 39110656 38573119 38119183 37646300 37300971 36902890 36324583 35720191 34997703 33890989
4616C3890989j267928j327293j311746j325269j304413j065143p87905p00693
$$ 33890989 32623061 31295768 29984022 28658753 27354340 26289197 25501292 24800599
4608B4800599p76938n51504n94030o07918q84155p87641j011959j048691r31088
$$ 24800599 24023661 23472157 22878127 22270209 21386054 20598413 19586454 18537763 17606675
4599A7606675j101737r54053p98528o73923o72073m37709m15240l58987m59547
$$ 17606675 16504938 15550885 14752357 14078434 13406361 12968652 12553412 12194425 11734878
4590A1734878k79218m31511k70950k13158l72603k80408k29528J1215k19352l67204
$$ 11734878 11455660 11024149 10753199 10540041 10167438 9887030 9657502 9668717 9449365 9082161
4580I082161l73810k79496j51961q5123p1696r2761k05417k67381j26252j35666
$$ 9082161 8708351 8428855 8276894 8191771 8120075 8027314 7821897 7554516 7428264 7292598
4570G292598j67555j40051j80837j38343j04530k39686k64695K5822m8942k9547
$$ 7292598 7125043 6984992 6804155 6665812 6561282 6321596 6056901 6082723 6033781 6004234
4560F004234L4301O940j55049j01972k8939k1653j36719O5824M011N3467l2218
$$ 6004234 6038535 6045475 5890426 5788454 5759515 5737862 5601143 5666967 5670978 5724445 5692227
4549E692227j55079p6005M5051m0363r1844J23640m4413j6751P6755K4453k10893
$$ 5692227 5537148 5461143 5506194 5465831 5373987 5497627 5453214 5436463 5513218 5537671 5326778
4538E326778j66640j978R6299o0311k8767P4778j45737q5362N3968R4343j80169
$$ 5326778 5160138 5158160 5254459 5194148 5165381 5240159 5094422 5009060 5063028 5157371 4977202
4527D977202p3721M817J8866l5675R2865J29648j43999K6884J27569N1900r4423
$$ 4977202 4903481 4908298 4927164 4891489 4984354 5114002 4970003 4996887 5124456 5176356 5081933
4516E081933J27950N2517O6859J55968j5075N6885N9573J43838Q5826L3922J33007
$$ 5081933 5209883 5262400 5329259 5485227 5470152 5527037 5586610 5730448 5816274 5850196 5983203
4505E983203O6050M1006O3208P9930J92225J64030J40894L5664L1926J33602J57448
$$ 5983203 6049253 6090259 6153467 6233397 6425622 6589652 6730546 6766210 6798136 6931738 7089186
4494G089186N1917N5583J99439J2656K10391J53816J44845L78227K07061Q7821
$$ 7089186 7141103 7196686 7396125 7408781 7619172 7772988 7917833 8296060 8503121 8590942
4484H590942Q6444J17594L02347K47957M56315K09649J41407K64326K47757K96797
$$ 8590942 8677386 8794980 9097327 9345284 9801599 10011248 10152655 10416981 10664738 10961535
4474A0961535K16063L60822M08421J73641K82919J80013K97221L39461K48341
$$ 10961535 11177598 11538420 11946841 12120482 12403401 12583414 12880635 13220096 13468437
4465A3468437K29181M95982L66535K81613L57217L73853M19412M32100M61894
$$ 13468437 13697618 14193600 14560135 14841748 15198965 15572818 15992230 16424330 16886224
4456A6886224M80453N54916N74296N32669R88789P40896P77993Q02733R01820
$$ 16886224 17366677 17921593 18495889 19028558 20017347 20758243 21536236 22338969 23240789
4447B3240789Q87970J116471R62781J023291J349293J321426J504764J718760
$$ 23240789 24128759 25245230 26208011 27231302 28580595 29902021 31406785 33125545
4439C3125545J827484K019366K325810K490571K814960L075734L509187M015409
$$ 33125545 34953029 36972395 39298205 41788776 44603736 47679470 51188657 55204066
4431E5204066M598380N019109N373648N365150M880256L616965J816040J173894
$$ 55204066 59802446 64821555 70195203 75560353 80440609 84057574 85873614 87047508
4423H7047508K235508L516770N320643P253180R347942J1494961J3943951J6813199
$$ 87047508 89283016 92799786 98120429 105373609 114721551 126216512 140160463 156973662
4415A56973662K0478478K4554554K8257433K9237712K5139108J3872177m235099
$$ 156973662 177452140 202006694 230264127 259501839 284640947 298513124 294278025
4408B94278025k3074493l3539207l4906814l0737149k4979504j9875021j5810872
$$ 294278025 271203532 237664325 202757511 172020362 147040858 127165837 111354965
4401A11354965j2629034j0043639p854514o548996n727969n082043m562393m276802
$$ 111354965 98725931 88682292 80827778 74278782 68550813 63468770 58906377 54629575
4393E4629575l743253l389872l329645k802837k324518k273476j849133j559040
$$ 54629575 50886322 47496450 44166805 41363968 39039450 36765974 34916841 33357801
4385C3357801j600638j432306j345978j074910j299945j038556r03661r75085
$$ 33357801 31757163 30324857 28978879 27903969 26604024 25565468 24661807 23686722
4377B3686722q26945r98808j016850q77861n79248o53087o25854o91535m33990
$$ 23686722 22859777 21860969 20844119 19966258 19387010 18733923 18108069 17416534 16982544
4368A6982544m94647m55912m72513l38987l14325l33487k42714l52392m72630
$$ 16982544 16487897 16031985 15559472 15220485 14906160 14572673 14329959 13977567 13504937
4359A3504937l96096k31021k09773k03104l34163k85905l26796k29531k04093
$$ 13504937 13108841 12877820 12668047 12464943 12130780 11844875 11518079 11288548 11084455
4350A1084455l32060k12572m5017j82881l8888j22914j25167k03206j87225k29132
$$ 11084455 10752395 10539823 10494806 10311925 10273037 10150123 10024956 9821750 9634525 9405393
4340I405393j04732P9954q1996o4881j66401o7951j42103k23814j63908j79620
$$ 9405393 9300661 9380615 9298619 9233738 9067337 8999386 8857283 8633469 8469561 8289941
4330H289941j50311j51357j79138j08947p41q584j59704l26585m6946r9777J04284
$$ 8289941 8139630 7988273 7809135 7700188 7699447 7690863 7531159 7204574 7157628 7057851 7162135
4319G162135j36022q1253K8400j30445j96493n2215J72755p765n102j5490J7398
$$ 7162135 7026113 6944860 6973260 6842815 6646322 6594107 6766862 6759097 6753995 6738505 6755903
4308F755903m5491P4287M1311K4814j8451j17351J44227L9099k1155Q1451J45891
$$ 6755903 6710412 6784699 6826010 6850824 6832373 6715022 6859249 6898348 6877193 6958644 7104535
4297G104535k40594k49305P9628Q1569P2688r3242r1118K56864P9805j39999J9931
$$ 7104535 6863941 6614636 6694264 6775833 6848521 6755279 6664161 6921025 7000830 6860831 6880762
4286F880762K0221J16914J39473J60174J18276n9437l0208K1235J86132M5025
$$ 6880762 6900983 7017897 7157370 7317544 7435820 7376383 7346175 7367410 7553542 7598567
4276G598567K62366J00653j12113L7208J66884J24235K21947J60063K39560m8786
$$ 7598567 7860933 7961586 7849473 7886681 8053565 8177800 8399747 8559810 8799370 8750584
4266H750584P3523K58011M6839L14158K64927o9145P2641K26070J28356K1328
$$ 8750584 8824107 9082118 9128957 9443115 9708042 9638897 9711538 9937608 10065964 10087292
4256A0087292m0374O1218J62921K76311L24453J27256Q3639k34928l8128K03723
$$ 10087292 10046918 10108136 10271057 10547368 10871821 10999077 11082716 10847788 10809660 11013383
4246A1013383J14545J34755n1323j23157j73541J54200L0463o6614K581j99009
$$ 11013383 11127928 11262683 11211360 11088203 10914662 11068862 11099325 11032711 11035292 10836283
4236A0836283k84076j1836K0751o2848j49940j11118j61815o479j65454k37641
$$ 10836283 10552207 10540371 10561122 10498274 10348334 10237216 10075401 10068922 9903468 9665827
4226I665827j84049j43181o1591j79083l01767j80087n9160m3919R296j55781
$$ 9665827 9481778 9338597 9277006 9097923 8796156 8616069 8556909 8512990 8522286 8366505
4216H366505k06721l17605j66781J0194j73963l1269j02221k50127r5289K7559
$$ 8366505 8159784 7842179 7675398 7685592 7511629 7480360 7378139 7128012 7032723 7060282
4206G060282O7603o0068j70265k61374k60016j000P1694j32980k42590p2603k3311
$$ 7060282 7127885 7067817 6897552 6636178 6376162 6375162 6446856 6313876 6071286 5998683 5975372
4195E975372N7307l03701o2483j00855j29278J04272n7530p2054l7836L9274j59573
$$ 5975372 6032679 5728978 5666495 5565640 5436362 5540634 5483104 5411050 5373214 5412488 5252915
4184E252915k7927j04132k81571K239r8219P9914j05664k3533m5322R9245k0085
$$ 5252915 5224988 5120856 4839285 4841524 4743305 4823219 4717555 4694022 4648700 4747945 4727860
4173D727860j18239n367J13127J65426n859j2272m6699m6522o9054j91341j05442
$$ 4727860 4609621 4604254 4717381 4882807 4876948 4864676 4817977 4771455 4702401 4511060 4405618
4162D405618o2490J50246N7735N4252K0350q7410J21692N6579o2953j93680J14210
$$ 4405618 4343128 4493374 4551109 4605361 4625711 4538301 4659993 4716572 4653619 4459939 4574149
4151D574149P7589m5484j34717N858Q2263L47J12230K60912M6174l6157r4658
$$ 4574149 4651738 4606254 4471537 4477395 4559658 4560005 4672235 4933147 4979321 4943164 4848506
4140D848506J51263P9150K5481J1352K6288J46164J11901N3186J38949J8915k1434
$$ 4848506 4999769 5078919 5104400 5115752 5142040 5288204 5400105 5453291 5592240 5611155 5589721
4129E589721N2041J10497K25845L2516K00068J70760M1749J18259P3671K74221
$$ 5589721 5641762 5752259 5978104 6010620 6210688 6381448 6423197 6541456 6615127 6889348
4119F889348J64803n9646J09777K58372K54051J92097J91040K46514M00670M09171
$$ 6889348 7054151 6994505 7104282 7362654 7616705 7808802 7999842 8246356 8647026 9056197
4109I056197P8325K26230L96547K67704L05475N8272r6361J90496J32873J21502
$$ 9056197 9134522 9360752 9757299 10025003 10330478 10388750 10292389 10482885 10615758 10737260
4099A0737260J97967J70966J74230J98190M38689M30755L41743K61098K21993
$$ 10737260 10935227 11106193 11280423 11478613 11917302 12348057 12689800 12950898 13172891
4090A3172891M64942M85315M84466M80671N07356O03468P49157N64044O54395
$$ 13172891 13637833 14123148 14607614 15088285 15595641 16199109 16948266 17512310 18166705
4081A8166705Q69582Q15986Q52138J128631Q53679J155276J239120J265859J317443
$$ 18166705 19036287 19852273 20704411 21833042 22686721 23841997 25081117 26346976 27664419
4072B7664419J446010J557428J428802J649856J841927J727333J941963K170645
$$ 27664419 29110429 30667857 32096659 33746515 35588442 37315775 39257738 41428383
4064D1428383K255423K264987K324393K495771K602474K645129K499004K807734
$$ 41428383 43683806 45948793 48273186 50768957 53371431 56016560 58515564 61323298
4056F1323298K730314K976040L016093L097036L044495L025952L264903L232710
$$ 61323298 64053612 67029652 70045745 73142781 76187276 79213228 82478131 85710841
4048H5710841K918899K925037K954373K738257K660701K427051K378179K179157
$$ 85710841 88629740 91554777 94509150 97247407 99908108 102335159 104713338 106892495
4040A06892495K039704J989180J945525J639203J486383J483690R88889Q35295
$$ 106892495 108932199 110921379 112866904 114506107 115992490 117476180 118465069 119300364
4032A19300364O27259J03892j32658n34860q20906q79737j118777j505964j653780
$$ 119300364 119927623 120031515 119898857 119363997 118543091 117663354 116544577 115038613 113384833
4023A13384833j515855j503304k058761k219419k180911k467181k732146k712856
$$ 113384833 111868978 110365674 108306913 106087494 103906583 101439402 98707256 95994400
4015I5994400k859822l211140l128252l190317l212444l205612l197609l100361
$$ 95994400 93134578 89923438 86795186 83604869 80392425 77186813 73989204 70888843
4007G0888843l008342k730668k814000k972818k853081k786910k475550k668241
$$ 70888843 67880501 65149833 62335833 59363015 56509934 53723024 51247474 48579233
3999D8579233k516668k594114k114233k239998k030733j999734j868301j825063
$$ 48579233 46062565 43468451 41354218 39114220 37083487 35083753 33215452 31390389
3991C1390389j622065j446584j489603j177424j111956j325384j169861q82269
$$ 31390389 29768324 28321740 26832137 25654713 24542757 23217373 22047512 21165243
3983B1165243j058771r56078p90028r40749p73466o03517n65228o74718p17573
$$ 21165243 20106472 19150394 18360366 17419617 16646151 16042634 15477406 14802688 14085115
3974A4085115m74008m08568m52875m43994m10689l03799k98343l89895m16999
$$ 14085115 13611107 13202539 12749664 12305670 11894981 11591182 11292839 10902944 10485945
3965A0485945k68792r1359m63108r6247j48803l42545k31941j23027j63262j38106
$$ 10485945 10217153 10125794 9662686 9566439 9417636 9075091 8843150 8720123 8556861 8418755
3955H418755k68202k79050m32238l2070r3522k87529r8314j98677j81779N6090
$$ 8418755 8150553 7871503 7439265 7407195 7313673 7026144 6927830 6729153 6547374 6603464
3945F603464l48769n0157j10098j34037k7101j37243j7994j0647q4872j94942
$$ 6603464 6254695 6204538 6094440 5960403 5933302 5796059 5778065 5767418 5682546 5487604
3935E487604j76744q5540J37983j69150j17266j10353O1433j2459j74487j25968
$$ 5487604 5310860 5225320 5363303 5194153 5076887 4966534 5027967 5015508 4841021 4715053
3925D715053N9718n092p0684j4648O6748J02619l2731N0171R6322j02478l9945
$$ 4715053 4774771 4769679 4698995 4684347 4751095 4853714 4820983 4871154 4967476 4864998 4825053
3914D825053o5670Q3707k6394n4563l3246m8385M6462j44789r8475p6311O0854
$$ 4825053 4759383 4843090 4816696 4762133 4728887 4680502 4726964 4582175 4483700 4407389 4468243
3903D468243j96561o8338j5143m7723M4998J52677q3651p2121p4372j5019Q2770
$$ 4468243 4271682 4203344 4188201 4140478 4185476 4338153 4254502 4182381 4108009 4092990 4175760
3892D175760o1382l3935j7189K4606K26j28984j49016j78416k428J75632j2728
$$ 4175760 4114378 4080443 4063254 4087860 4088086 3959102 3810086 3631670 3629242 3804874 3792146
3881C792146N1975J5089Q770K15M6986M6255L9968j4003J2946p3375r243M7475
$$ 3792146 3844121 3859210 3867980 3868195 3915181 3961436 4001404 3987401 4000347 3926972 3917729 3965204
3869C965204J7934L2956P5644k8789K7249R6065J9307r5539J11141K87575J5203
$$ 3965204 3983138 4016094 4091738 4062949 4090198 4186263 4205570 4110031 4221172 4508747 4523950
3858D523950N2131l455L7840p384K3273k5222p2528j0033p1768l5195J33744k6013
$$ 4523950 4576081 4572626 4610466 4603082 4626355 4601133 4528605 4518572 4446804 4411609 4545353 4519340
3846D519340k16310R415N2797o8608m9636k4263j01659J3641N3755n3518j23845
$$ 4519340 4303030 4312445 4365242 4296634 4246998 4222735 4121076 4134717 4188472 4134954 4011109
3835D011109k8437j95932n2729K857O708p2918l8086O868j19632J4338J14054
$$ 4011109 3982672 3786740 3734011 3736868 3743576 3670658 3632572 3639440 3519808 3534146 3648200
3824C648200m9794M953L1484n3093n2006q8240J28208J6084q2281J45432m0293
$$ 3648200 3598406 3603359 3634843 3581750 3529744 3441504 3569712 3585796 3503515 3648947 3608654
3813C608654j38570J76736O950J19629m0404P9930n8955j54505J05161M9030L9148
$$ 3608654 3470084 3646820 3653770 3773399 3732995 3812925 3753970 3599465 3704626 3753656 3792804
3802C792804j30394J01884J00266P8064J56903q1894l27076R8835J58068l0818
$$ 3792804 3662410 3764294 3864560 3942624 4099527 4017633 3690557 3789392 3947460 3916642
3792C916642J41366j10194L1543J44659J42807j68495M0807J37488L2025O8425
$$ 3916642 4058008 3947814 3979357 4124016 4266823 4098328 4139135 4276623 4308648 4377073
3782D377073J53380Q0337k5126M3181J11849J16450j33947j31002J28220J90987
$$ 4377073 4530453 4610790 4585664 4628845 4740694 4857144 4723197 4592195 4720415 4911402
3772D911402r912J99639J17532j24807Q3187K86542K7156N8266J27794R0802N8574
$$ 4911402 4901490 5101129 5218661 5093854 5177041 5463583 5490739 5549005 5676799 5767601 5826175
3761E826175K00652Q3156N9644J42350K65711K0503J30934J12717J19519M9388
$$ 5826175 6026827 6109983 6169627 6311977 6577688 6598191 6729125 6841842 6961361 7010749
3751G010749J70994K50241Q860J00557J02856K23612K68388J82231P0061O6728
$$ 7010749 7181743 7431984 7440844 7541401 7644257 7867869 8136257 8318488 8388549 8455277
3741H455277K03467J58938k8147K09294L5441L07604L35549N8847K84572K71282
$$ 8455277 8658744 8817682 8789535 8998829 9034270 9341874 9677423 9736270 10020842 10292124
3731A0292124J75114K93742L5859K02917K37713J30390K56143K31486N57022K04295
$$ 10292124 10467238 10760980 10796839 10999756 11237469 11367859 11624002 11855488 12412510 12616805
3721A2616805J76023K37763K36987M69670M45094K73563L16381L19843M53315
$$ 12616805 12792828 13030591 13267578 13737248 14182342 14455905 14772286 15092129 15545444
3712A5545444O24694M83508O90366O36756N91260Q34684Q50750J050323R94421
$$ 15545444 16170138 16653646 17344012 17980768 18572028 19406712 20257462 21307785 22302206
3703B2302206J038364J316796J192996J104038J329846J187008J301787J559090
$$ 22302206 23340570 24657366 25850362 26954400 28284246 29471254 30773041 32332131
3695C2332131J466111J454230J164011J117468J263241R78285J185489J216783
$$ 32332131 33798242 35252472 36416483 37533951 38797192 39775477 40960966 42177749
3687D2177749R54192J030297R42114J025336R29436Q74422Q83186P25039K42838
$$ 42177749 43131941 44162238 45104352 46129688 47059124 47933546 48816732 49541771 49784609
3678D9784609K96531K3285j34786j48366J9542j15132m19548r4993M543L0549
$$ 49784609 50081140 50104425 49969639 49821273 49840815 49725683 49306135 49211142 49215685 49246234
3668D9246234k6090R776j0798J93355O0327Q0232K23085K13787M69438N70731
$$ 49246234 49220144 49229920 49219122 49412477 49472804 49553036 49776121 49989908 50459346 51030077
3658E1030077P02800P79249J094271J383805J537203J741089K157837K357588
$$ 51030077 51732877 52512126 53606397 54990202 56527405 58268494 60426331 62783919
3650F2783919K459055K694031L328183L477641L728543M126499M375252M575033
$$ 62783919 65242974 67937005 71265188 74742829 78471372 82597871 86973123 91548156
3642I1548156M871886M955674M666094M794578M711382M518763M540793M417886
$$ 91548156 96420042 101375716 106041810 110836388 115547770 120066533 124607326 129025212
3634A29025212M432405M335151M487906M420480M396999M413098M146765L946952
$$ 129025212 133457617 137792768 142280674 146701154 151098153 155511251 159658016 163604968
3626A63604968L735293L396599K853541K511174K059369J684202J508896J455599
$$ 163604968 167340261 170736860 173590401 176101575 178160944 179845146 181354042 182809641
3618A82809641J298991J501349J667613J900485K045014K131880K104205K143833
$$ 182809641 184108632 185609981 187277594 189178079 191223093 193354973 195459178 197603011
3610A97603011K121522K070046J742962J600619J629991J346535J463729J605542
$$ 197603011 199724533 201794579 203537541 205138160 206768151 208114686 209578415 211183957
3602B11183957J770250J853381K056402J870249K123842K213101K111513K444724
$$ 211183957 212954207 214807588 216863990 218734239 220858081 223071182 225182695 227627419
3594B27627419K199469K310989K223632K221107K438835K817870L037097L432470
$$ 227627419 229826888 232137877 234361509 236582616 239021451 241839321 244876418 248308888
3586B48308888L876830M413865N031903N942838O966443P968218R322288J0610554
$$ 248308888 252185718 256599583 261631486 267574324 274540767 282508985 291831273 302441827
3578C02441827J1711681J2889374J3245709J3346027J2509258J0564741Q010535
$$ 302441827 314153508 327042882 340288591 353634618 366143876 376708617 384719152
3571C84719152M971310J513259j496962l629258n050786n602227n467947m984637
$$ 384719152 389690462 391203721 389706759 386077501 381026715 375424488 369956541 364971904
3563C64971904m505692l946580l791532m176944n281950p180252r706561j2421525
$$ 364971904 360466212 356519632 352728100 348551156 343269206 336088954 326382393 313960868
3555C13960868j4844142j6846906j8116741j8522604j8224434j7173802j5718600
$$ 313960868 299116726 282269820 264153079 245630475 227406041 210232239 194513639
3548A94513639j4013360j2163310j0850486r361367q199365p284490o297691n849942
$$ 194513639 180500279 168336969 157486483 148125116 139925751 132641261 126343570 120493628
3540A20493628m922939m603799l988831l442045l272205k889935k760265k628124
$$ 120493628 115570689 110966890 106978059 103536014 100263809 97373874 94613609 91985485
3532I1985485k573957k661603k279178k398962k489745k583315k602464k487396
$$ 91985485 89411528 86749925 84470747 82071785 79582040 76998725 74396261 71908865
3524G1908865k337232k215199k300617k369570k038380k034586j882338j832981
$$ 71908865 69571633 67356434 65055817 62686247 60647867 58613281 56730943 54897962
3516E4897962j905412j903386j877756j998990j799022j705220j902432j611436
$$ 54897962 52992550 51089164 49211408 47212418 45413396 43708176 41805744 40194308
3508D0194308j574739j447155j380348j195532j360527j107036j264909j060586
$$ 40194308 38619569 37172414 35792066 34596534 33236007 32128971 30864062 29803476
3500B9803476q63951q49264j022672j035006p57458o68585n86832n42933p43449
$$ 29803476 28939525 28090261 27067589 26032583 25275125 24606540 24019708 23476775 22733326
3491B2733326q01011m79831m04551o37541m82084l66745n89520m28538n22116
$$ 22733326 21932315 21452484 21047933 20410392 19928308 19561563 18972043 18543505 18021389
3482A8021389m53969m74252k46132l24800m82308l22098l59879l85656k71893
$$ 18021389 17567420 17093168 16847036 16522236 16039928 15717830 15357951 14972295 14700402
3473A4700402k31743l13804k30362k08703k36263k80341m10600j63413j28266
$$ 14700402 14468659 14154855 13924493 13715790 13479527 13199186 12788586 12625173 12496907
3464A2496907j66811k81371k58741k18405k60880j85580j71593k10892k03026
$$ 12496907 12330096 12048725 11789984 11571579 11310699 11125119 10953526 10742634 10539608
3455A0539608k76259l16895j76667j76409l01184k38564j7392j53478j82039k47222
$$ 10539608 10263349 9946454 9769787 9593378 9292194 9053630 9036238 8882760 8700721 8453499
3445H453499m8535k3936k47336l63557j60550j04214j2246n5790k58578j15029
$$ 8453499 8404964 8381028 8133692 7770135 7609585 7505371 7493125 7437335 7178757 7063728
3435G063728j32663O6799J6697r0653k90065j32134K5590j88974j18995l3232
$$ 7063728 6931065 6997864 7014561 6923908 6633843 6501709 6527299 6338325 6219330 6186098
3425F186098L6037N2716k37135j76460j0250k37836R9510l0170j35557l3482k7139
$$ 6186098 6222135 6274851 6037716 5861256 5851006 5613170 5712680 5682510 5546953 5513471 5486332
3414E486332j05492J0935k18943k27981N6753k4205q5100j80441J19624m4040
$$ 5486332 5380840 5391775 5172832 4944851 5001604 4977399 4892299 4711858 4831482 4787442
3404D787442q4289n0254j09371j54088O4640p9297o3395J9123m9138R085J8301
$$ 4787442 4703153 4652899 4543528 4389440 4454080 4374783 4311388 4330511 4281373 4290458 4308759
3393D308759j14844r0232m9031M3461o8332j23169r4727j18083O4208o7614l7210
$$ 4308759 4193915 4103683 4054652 4098113 4029781 3906612 3811885 3693802 3758010 3690396 3653186
3382C653186L9726J7678j7461l6730J9792j26371L0886m3841k5176m3228k9178
$$ 3653186 3692912 3710590 3693129 3656399 3676191 3549820 3580706 3536865 3511689 3468461 3439283
3371C439283n8426j3909j50184r0620Q8369M8592J02729m7792Q1364k016j33228
$$ 3439283 3380857 3366948 3216764 3126144 3214513 3263105 3365834 3318042 3399406 3397390 3264162
3360C264162o8855K77648l3085Q7450j42734l9959Q6143l8115r8732P6109J4768
$$ 3264162 3195307 3472955 3439870 3527320 3384586 3344627 3430770 3392655 3293923 3370032 3384800
3349C384800J54816j07943m3738J05923p7470j7635j70168M5931p8848J76315
$$ 3384800 3539616 3431673 3387935 3493858 3416388 3398753 3228585 3274516 3195668 3371983
3339C371983J23234j6289L0239n9138n9237k5960J69754m5702m4522L497M1251
$$ 3371983 3495217 3478928 3509167 3450029 3390792 3364832 3534586 3488884 3444362 3447859 3489110
3328C489110l0799j1127k0518k5330l9734O4037l7719J53136J2833N4053J25305
$$ 3489110 3458311 3447184 3426666 3401336 3361602 3425639 3387920 3541056 3553889 3607942 3733247
3317C733247k9571j73275m4743J22547m4610r0546q3454P4187l5169O4666j39784
$$ 3733247 3703676 3530401 3485658 3608205 3563595 3473049 3389595 3463782 3428613 3493279 3353495
3306C353495Q4938J13645P5797k36276L1945N1849R0424J16225j20067J84814
$$ 3353495 3438433 3552078 3627875 3391599 3423544 3475393 3565817 3682042 3561975 3746789
3296C746789N8928J47383K7014R2085P86J4128J9374J09212K04438r5808R869
$$ 3746789 3805717 3953100 3980114 4072199 4072985 4087113 4106487 4215699 4420137 4324329 4334198
3285D334198j56079J29637P3659O6495K1727j03816k1891N2818n6039R1291n4106
$$ 4334198 4178119 4307756 4381415 4447910 4469637 4365821 4343930 4396748 4340709 4432000 4377894
3274D377894j32843l9583Q5427O9841O0103j18590K3654k3728L3214J66119j78589
$$ 4377894 4245051 4205468 4290895 4360736 4420839 4302249 4325903 4302175 4335389 4501508 4322919
3263D322919j862m5637j25761N0410O6186m8258j3491Q1206O9805N6273M5574
$$ 4322919 4321057 4275420 4149659 4200069 4266255 4217997 4204506 4285712 4355517 4411790 4457364
3252D457364N4012L28425J42589J33063L41840L26676O5370J35484M06279M91023
$$ 4457364 4511376 4839801 4982390 5115453 5457293 5783969 5849339 5984823 6391102 6882125
3242F882125L54545L50482J97967j67910m46997o22881o24810m96008k55414l56682
$$ 6882125 7236670 7587152 7785119 7617209 7170212 6547331 5922521 5426513 5171099 4814417
3232D814417l06440j63717k24752l13483j2792j15570o2574j46108K9646O9542
$$ 4814417 4507977 4344260 4119508 3806025 3793233 3677663 3615089 3468981 3498627 3568169
3222C568169n6897m3596J33250J07068L180J33993N8311L44598L00619J42293
$$ 3568169 3511272 3467676 3600926 3707994 3711174 3845167 3903478 4248076 4548695 4690988
3212D690988N90761N71567Q14388P29368L11478k05827j051739j032510p20655
$$ 4690988 5281749 5853316 6667704 7397072 7708550 7502723 6450984 5418474 4697819
3203D697819o77049l88455j06955m29426k37821o2655n2788j88906p5087o4731
$$ 4697819 4020770 3632315 3525360 3095934 2858113 2795458 2742670 2553764 2478677 2413946
3193B413946q986o1963j9610j34219Q5486J46203j17636j54671J92187L1766J13250
$$ 2413946 2404960 2342997 2323387 2189168 2274654 2420857 2303221 2148550 2340737 2372503 2485753
3182B485753K87856J02927K92347L01187K28179K70466J83726j81431m63180m39710
$$ 2485753 2773609 2876536 3168883 3470070 3698249 3968715 4152441 3971010 3507830 3068120
3172C068120m37043l37943k13010k37833Q528k4938j43078k12811j03639J0071
$$ 3068120 2631077 2293134 2080124 1842291 1850819 1825881 1682803 1469992 1366353 1376424
3162A376424r1252q9294r6016P7211l3828j07117O3860m3591k4490Q6649j25789
$$ 1376424 1285172 1195878 1099862 1177073 1143245 1036128 1099988 1056397 1031907 1118556 992767
3151I92767J20724k5081n325J1396k14671L4646N617j01925J00112l1959n6156
$$ 992767 1113491 1088410 1083085 1094481 879810 914456 920073 818148 918260 886301 830145
3140H30145R0902P4307j424l9363q410j20834l9975n0588j882N3400j19116j5117
$$ 830145 921047 995354 993930 954567 946157 825323 785348 734760 732878 786278 667162 652045
3128F52045K867P9084N0727q0497r387J47715j58834m5569J61190m4537L1704
$$ 652045 654912 733996 784723 704226 694839 842554 683720 638151 799341 754804 786508
3117G86508j03107j16566J01198M0884k80104J20689L3933j57742J56517N3055
$$ 786508 683401 566835 668033 708917 428813 549502 583435 425693 582210 635265
3107F35265l1004P7324J5173j4660j52448j98662K63868J38385r3218k4704K1249
$$ 635265 604261 681585 696758 682098 529650 330988 594856 733241 640023 615319 636568
3096F36568k9826k3501j04344K7758l4831o1137N0784r4152l5575J955J41862
$$ 636568 606742 583241 478897 506655 471824 410687 461471 367319 331744 333699 475561
3085D75561m5730r3349J9194J5374n583J38444J2148l9383m5662O8253q3489P7720
$$ 475561 429831 336482 355676 371050 365467 503911 516059 476676 431014 499267 415778 493498
3073D93498k8572n4942k5002J22862l2566m8911J76397j03142j63042J22649n7127
$$ 493498 464926 409984 384982 507844 475278 426367 602764 499622 336580 459229 402102
3062D02102q2896J26019O2924j60048M8098K82640o7576n5835r1327j4509J04542
$$ 402102 319206 445225 508149 348101 396199 678839 611263 555428 464101 449592 554134
3051E54134l9658p8914R5548k77394M7647J75196k2399J11427j42649p9915p0886
$$ 554134 514476 435562 531110 253716 301363 476559 454160 565587 422938 343023 272137
3040B72137j0135J3427K08014j50033J7472o5916R9944K1624j33730K8138J02006
$$ 272137 262002 275429 483443 333410 350882 284966 384910 406534 272804 300942 402948
3029D02948l8988j223k358Q450K3290Q6646j1936J9223J35891n6229j38376K7037
$$ 402948 363960 362737 360379 368829 392119 478765 466829 486052 621943 565714 427338 454375
3017D54375J5459j27017J24327N9888N4131l132P578j29502P8765K7643J26527
$$ 454375 469834 342817 467144 527032 581163 578031 585609 456107 534872 562515 689042
3006F89042Q4613l9827q7087j5770L8898k6059k3749K33732j95768j06679P0490
$$ 689042 773655 733828 646741 630971 669869 643810 620061 853793 658025 551346 621836
2995F21836R8558j09962k5270N3262o517R1944j46076q6701J68918J45666p5028
$$ 621836 720394 610432 585162 638424 631907 723851 577775 491074 659992 805658 730630
2984G30630m0117Q703k26552R3067L2027k1727P7884L3612R5958q0850L2585M6905
$$ 730630 690513 699216 472664 565731 597758 576031 653915 687527 783485 702635 735220 782125
2972G82125K2516l5755K7807J53360J36640j7030J8456k0608k3388o024r1312
$$ 782125 804641 768886 796693 950053 1086693 1069663 1088119 1067511 1044123 1038099 946787
2961I46787l7912o9693k2794M3188o895p641N8932J0034p7166n2887N5442q1274
$$ 946787 908875 839182 816388 859576 852681 845040 903972 914006 836840 783953 839395 758121
2949G58121k073K1012J4805l6684M3559n9263n4877J54504J670P4789J76401p1671
$$ 758121 756048 777060 791865 755181 798740 739477 684600 839104 840774 915563 1091964 1020293
2937A020293J52889j45039n1015R4692J05258j42366r1916N8509O9719N0676M672
$$ 1020293 1173182 1028143 977128 1071820 1177078 1034712 942796 1001305 1071024 1121700 1126372
2926A126372R3158o0258l8086k7678j3928L6810j20523K2144n761M7589k8598
$$ 1126372 1219530 1159272 1121186 1093508 1079580 1116390 995867 1018011 1012250 1059839 1031241
2915A031241k00910R3510Q5771k709L5156n3430j0528o539J93305J34410j05656
$$ 1031241 830331 923841 1009612 1006903 1042059 988629 978101 971562 1164867 1299277 1193621
2904A193621P0493j52737M4323q4116L5873j04016n0441J36596J77206k2741j17440
$$ 1193621 1264114 1111377 1155700 1071584 1107457 1003441 953000 1089596 1266802 1244061 1126621
2893A126621j59714q0982J14424R2123P43L0513o9618L9602m1962o8439o515K16758
$$ 1126621 966907 885925 1000349 1092472 1093215 1123728 1054110 1093712 1051750 983311 976796 1193554
2881A193554q862p6300l7161j694N362q0221Q6971J24134k7935q4207r8468J13103
$$ 1193554 1184692 1108392 1071231 1069537 1074899 994678 1081649 1205783 1177848 1093641 995173 1108276
2869A108276J1274j93167j69184N9500J3085n5848o3684k8030j29975P2369J9608
$$ 1108276 1119550 926383 757199 816699 829784 773936 710252 682222 552247 624616 644224
2858F44224m1254J81074j61998k7686M1588m1433J10759l893M6424q3797n3618
$$ 644224 602970 784044 622046 594360 635948 594515 705274 701381 747805 664008 610390
2847F10390n7110o8883J4692P4356j07906j28295J98758K9000J1993j62424J8083
$$ 610390 553280 484397 499089 573445 465539 337244 536002 565002 576995 414571 432654
2836D32654l384p8230J08360j0787j07167p3572J11618R8315k452J51335j22632
$$ 432654 429270 351040 459400 448613 341446 267874 379492 477807 475355 626690 504058
2825E04058j80408N4611j59153K2224J17958L0007n4906j88823M5921J42484N0003
$$ 504058 323650 378261 219108 241332 359290 389297 334391 145568 191489 333973 383976
2814C83976k0248J9838K7321j24113k78329n4993J23957J22202J35959j11404
$$ 383976 363728 383566 410887 286774 8445 -46548 77409 199611 335570 224166
2804B24166N319m8617K5045N7299n9275J3488m8539N8981M428q3932O4516Q7560
$$ 224166 229485 180868 205913 263212 203937 217425 168886 227867 232295 148363 212879 300439
2792C00439j15065l0376o7625N6589J27288J04321k7952m4590n2241P0270o3720
$$ 300439 185374 154998 87373 143962 271250 375571 347619 303029 250788 321058 257338
2781B57338j34035K4999p0106j31839O5377P2840O9854p7351j9185Q031p7127
$$ 257338 123303 148302 78196 -53643 11734 84574 154428 77077 57892 65923 -11204
2770a1204M72J50350l7232N1232j22442j07557Q9362J23622m5071R735q9543o4940
$$ -11204 -10732 139618 102386 153618 31176 -76381 12981 136603 91532 101267 11724 -53216
2758e3216K26639K9341l3826q867j83379j8621K5833n2511J58179m5774n3421
$$ -53216 173423 202764 168938 160071 -23308 -41929 -16096 -68607 89572 43798 -9623
2747i623j7515L1451n606L4469M4530j09839K47676j47285p7242J57590R9294
$$ -9623 -27138 4313 -1293 33176 77706 -32133 215543 68258 -8984 148606 247900
2736B47900r5651j2536m9562M060L9360r8244J8218J15791R455r2267L2154m5727
$$ 247900 152249 139713 90151 94211 133571 35327 53545 169336 178791 86524 118678 72951
2724G2951p2079J11673k0781r4386n7295k6300J85179r0803n2322J04049m2077
$$ 72951 872 112545 91764 -2622 -59917 -86217 98962 8159 -44163 59886 17809
2713A7809J01707J46984j12109R6275Q2968j43794k03237J73472j980l8043j77561
$$ 17809 119516 266500 154391 250666 333634 189840 -13397 160075 158095 120052 -57509
2702e7509M7332K23108o3556O989n1993p3076l27j15519J76216J25641J7986J9919
$$ -57509 -10177 212931 149375 156364 104371 31295 30968 -84551 91665 217306 235292 255211
2690B55211j26634j60361P3697L4518K0805P2628j17113Q10N6687R4497J6999
$$ 255211 128577 -31784 41913 76431 97236 169864 52751 53561 110248 204745 221744
2679B21744k05473O4400J6620j33938K1546J50250j24688J1014J41216j54278
$$ 221744 16271 80671 97291 -36647 -15101 135149 10461 21475 162691 8413
2669H413j02782K07164j39894n879J1936O693l4395p6353J32736n231N0948k3941
$$ 8413 -94369 112795 -27099 -32978 -21042 -14349 -48744 -125097 7639 2408 53356 29415
2657B9415J5361J1951P9256j51834J08718M5908J9468j51207p309J32366p5984
$$ 29415 44776 56727 135983 -15851 92867 138775 158243 7036 -273 132093 56109
2646E6109n2533q8620R4536N0222L5127J3821q833P5781J69338n0994q6575j77974
$$ 56109 3576 -85044 9492 59714 94841 108662 99829 175610 344948 293954 207379 29405
2634B9405O051l0034L6492k6810J59912J01543O1779q4120k10663J1416J48205
$$ 29405 35456 5422 41914 15104 175016 276559 338338 254218 43555 54971 203176
2623B03176j8739P9831j08847j46268R0843J3026P7597K0948l270K219j14479
$$ 203176 184437 264268 155421 9153 99996 113022 190619 211567 208297 210516 96037
2612I6037O660J38320K7772j56075M4048N7312l1086J72516j91662p2795P2789
$$ 96037 102697 241017 268789 112714 156762 214074 182988 355504 163842 91047 163836
2601A63836O4910j52847Q8843J2557l9446J71442N1941N4689j18058r6411p8274
$$ 163836 228746 75899 164742 177299 137853 309295 361236 415925 297867 201456 123182
2590A23182Q2053R4670j7829j07379j40776J94282n4973N7566M9980l2619j33647
$$ 123182 205235 299905 282076 174697 33921 228203 173230 230796 280776 248157 114510
2579A14510L3198m8241J45878j29236m8619R7592K1629j70115l254K12200M8007
$$ 114510 147708 99467 245345 116109 67490 165082 186711 16596 13342 225542 273549
2568B73549l2002j17346q05R73J59620r8195j58905J7208Q3435O6163J19026L7592
$$ 273549 241547 124201 123396 124369 283989 185794 26889 44097 127532 193695 312721 350313
2556C50313j7745q6685N4716j83956j94303K08039j20163N0430j8503M5510n1156
$$ 350313 332568 245883 300599 116643 -77660 130379 10216 60646 42143 87653 36497
2545C6497J15478M4758j12084j21489p9243J80311L023m7078J15958L9499j8428
$$ 36497 151975 196733 84649 -36840 -116083 64228 67251 20173 136131 175630 157202
2534A57202J09333J6130j07456o2162k6928J3843J8078k0350j52938Q2967k9154
$$ 157202 266535 282665 175209 113047 86119 99962 118040 97690 -55248 27719 -1435
2523a435k0177J01915L6765j4560o4411J0067p4075J42526j50067n7086J190p9112
$$ -1435 -21612 80303 117068 102508 38097 48164 -25911 116615 -33452 -90538 -89348 -168460
2511a68460L6512J10740L6329o1338J37538l7521r6290P9112J17762p5884l2155
$$ -168460 -131948 -21208 15121 -46217 91321 53800 -42490 36622 154384 78500 46345
2500D6345K25532j02481N1875r0510J2723q0929j22755n1776M5235K1284m6761
$$ 46345 271877 169396 221271 130761 143484 62555 -60200 -111976 -66741 -45457 -92218
2489i2218J17097m2284n3638k2968j54J36963O2447J250j29644J12548J32286
$$ -92218 24879 -17405 -71043 -94011 -94165 42798 105245 106495 -23149 89399 221685
2478B21685q3000k9093k6253q7413j37423N3038J58260r6898J2891J21567o5822
$$ 221685 138685 109592 83339 -4074 -141497 -88459 69801 -27097 -14206 107361 41539
2467D1539k38701J53603o72r8426m6420J6420K04147o7334n831M3126M4570q3159
$$ 41539 -197162 -43559 -44231 -142657 -189077 -172657 31490 -35844 -41675 1451 46021 -37138
2455c7138n3394K1625k5027r6J61755k1078L7391l0736j35054p9506m0895P3314
$$ -37138 -90532 -68907 -93934 -94030 67725 46647 84038 53302 -81752 -161258 -202153 -128839
2443a28839Q4931K0898j74973r6758K65154q1242k0099K20348L5787j12753q0367
$$ -128839 -43908 -23010 -197983 -294741 -29587 -110829 -130928 89420 125207 12454 -67913
2432f7913J43748R1509k4471p7415o213j8398o9234N3974J7801N0048j55031l9641
$$ -67913 75835 167344 142873 65458 59245 40847 -28387 25587 43388 93436 -61595 -101236
2420a01236M6170j09084J91712n3610Q4240K0708j82111j06898J45357K1049Q5193
$$ -101236 -55066 -164150 27562 -26048 58192 78900 -103211 -210109 -64752 -43703 41490
2409D1490L4052j02552r7980O4351J60280l5633j72818Q8192L6755j15419J43096
$$ 41490 75542 -27010 -124990 -60639 99641 64008 -108810 -20618 16137 -99282 43814
2398D3814O6634j03949l0290O6780N6468o7042l4757k1437j3056L04916J06608
$$ 43814 110448 6499 -23791 42989 99457 32415 -2342 -23779 -36835 268081 374689
2387C74689j48092L2241j64535o9147N1593N834N5625j09960N1417J67771n6696
$$ 374689 226597 258838 94303 25156 76749 82583 138208 28248 79665 247436 190740
2376A90740K6780R9033j044J19016K5810j1237o5158l8891k7265j06529j23432
$$ 190740 217520 316553 315509 434525 460335 449098 383940 345049 317784 211255 87823
2365H7823M3385J09442Q4960j75346R56l6507j3638j4108m1738q6634K1184L9692
$$ 87823 131208 240650 325610 150264 151220 114713 101075 86967 45229 -41405 -20221 19471
2353A9471R4550P8296k03172J25964J1360J3713k4225l9900O6344o802j30357
$$ 19471 114021 192317 -10855 115109 126469 140182 115957 76057 142401 135599 5242
2342E242K2568N8743j0457j37494N4384J30105j60449R6155o2322R1994P4232
$$ 5242 27810 86553 76096 -61398 -7014 123091 -37358 58797 -3525 88469 162701
2331A62701R4330K3458j02617j5863J20172o5275j55144p502q505K7935Q1611
$$ 162701 257031 280489 177872 162009 282181 216906 61762 54260 45755 73690 155301
2320A55301R240k02241j73473K06182J73715r5733k0437Q2265j54453J2782R9244
$$ 155301 164541 -37700 -211173 -4991 168724 72991 52554 134819 -19634 -6852 92392
2309I2392K8946k39070J35108Q0078J24856r944j07553r0611N7303J33208q3523
$$ 92392 121338 -117732 17376 97454 222310 212366 104813 14202 71505 204713 121190
2298A21190p4809m2573j7227Q2542q1899J6514M8615K6777J02681o4230l3594
$$ 121190 46381 3808 -13419 69123 -12776 3738 52353 79130 181811 117581 83987
2287H3987l8398J60002M5557m2620j58783J59859O541L5580k7016J88299N6602
$$ 83987 45589 205591 251148 208528 49745 209604 216145 251725 224709 413008 469610
2276D69610j84694n9111j37547P8276j3080j06901J12452P4087j02879p0834J41773
$$ 469610 284916 225805 88258 166534 153454 46553 159005 233092 130213 59379 201152
2265B01152N1163n8003J2699o6022j4541M8936L4744j6671l1545p152m1784J07962
$$ 201152 252315 194312 207011 140989 126448 175384 210128 193457 161912 154760 112976 220938
2253B20938Q4584J25133J5919o1416p142q0220k22644J03620J9796j0453o0411
$$ 220938 305522 430655 446574 385158 378016 297796 75152 178772 198568 188115 127704
2242A27704J18162J980Q7331L1886L4479j43180n0291J81335J29609j04023n1581
$$ 127704 245866 247846 335177 367063 401542 258362 208071 389406 519015 414992 363411
2231C63411o7299P4207L4180o2854o9661k2198q0378P1227J64527p5577J78064
$$ 363411 296112 370319 404499 341645 271984 249786 169408 240635 405162 329585 507649
2220E07649k7812N1250n8563O723k11608l4735O3910k0804J09553O2734p2700
$$ 507649 479837 531087 472524 479247 267639 232904 296814 276010 385563 448297 375597
2209C75597P0896R3753k03430o0141J22812J48034j0639N7038M1313q4290q775
$$ 375597 446493 540246 336816 276675 399487 547521 536882 593920 635233 550943 542168
2198E42168N7552J7942O9392R7994j26442n7549K7482J12903l0774L8146Q1773
$$ 542168 599720 617662 687054 785048 658606 601057 628539 741442 710668 748814 830587
2187H30587k2750J06122p740N998J20053O3216j85868J20066J3669J1223J74238
$$ 830587 807837 913959 906219 912217 1032270 1095486 909618 1029684 1043353 1054576 1228814
2176A228814n5165N4930Q4944n6720r5754K32610M8377N4740R2980R5649n9483
$$ 1228814 1173649 1228579 1313523 1256803 1161049 1393659 1442036 1496776 1589756 1685405 1625922
2165A625922l4331N5761m7562J19724R4893J44939J659R8433j32431J13592R9974
$$ 1625922 1591591 1647352 1599790 1719514 1814407 1959346 1961005 2059438 1927007 2040599 2140573
2154B140573N7667j7196J06044J25961j287N5372Q9312R9839J21896J80955n392
$$ 2140573 2198240 2181044 2287088 2413049 2411762 2467134 2556446 2656285 2778181 2959136 2953744
2143B953744J64526K08271K20008J54040K37690J82371N7227K25899K28944J31013
$$ 2953744 3118270 3326541 3546549 3700589 3938279 4120650 4177877 4403776 4632720 4763733
2133D763733L74580L86589M91182K37639K33587M54001N51091N20530K62326M25449
$$ 4763733 5138313 5524902 6016084 6253723 6487310 6941311 7492402 8012932 8275258 8700707
2123H700707N09584P46211P55602O69183Q14811O95663J152665J377469J986678
$$ 8700707 9210291 9956502 10712104 11381287 12196098 12891761 14044426 15421895 17408573
2114A7408573K458600K990112L159771M090901N365763P987211R662954J1356430
$$ 17408573 19867173 22857285 26017056 30107957 35473720 43460931 53123885 64480315
2106F4480315R518437N405188p322255j5410584j2569660r890167o391447m527712
$$ 64480315 73998752 79403940 72081685 56671101 44101441 34211274 27819827 23292115
2098B3292115l305905k845277j797399j422002q76143o89926n04930m78135m43581
$$ 23292115 19986210 17140933 15343534 13921532 13045389 12355463 11850533 11372398 10928817
2089A0928817r14110j006020r37664o69038p06041l30954m12486m94909k54863
$$ 10928817 10014707 9008687 8071023 7401985 6695944 6364990 5952504 5457595 5202732
2080E202732k02874j16582j32648k35037j60924l06131k82206p6038j78330k01476
$$ 5202732 4999858 4883276 4750628 4515591 4354667 4048536 3766330 3690292 3511962 3310486
2070C310486k37220j33426j43582j69110N6283l5840K5827l0310n7148j52701
$$ 3310486 3073266 2939840 2796258 2627148 2683431 2647591 2673418 2643108 2585960 2433259
2060B433259M5610j87406j69384k41685m3335j06420J35464N0973l0580m6075
$$ 2433259 2478869 2291463 2122079 1880394 1837059 1730639 1866103 1917076 1886496 1840421
2050A840421m482j65118j22454l2971n6773j5214k4588L0969j00111K3179k5693
$$ 1840421 1835939 1670821 1548367 1515396 1458623 1443409 1418821 1449790 1349679 1372858 1347165
2039A347165q3633l7484N575l0660j9387j23581j11557M5690P0000M4210N6986
$$ 1347165 1263532 1226048 1231623 1200963 1181576 1057995 946438 992128 1062128 1106338 1163324
2028A163324m1647k65493o5928J896L5382M2941M3489k87021k01666J16219L3730
$$ 1163324 1121677 856184 790256 792152 827534 870475 913964 626943 425277 541496 575226
2017E75226r6160n1226P5736R6632m4844p6952L6639q102L7812Q7855R1655j81555
$$ 575226 479066 427840 503576 600208 555364 478412 515051 506949 544761 632616 724271 542716
2005E42716q0414p3947J75040j47883p81J35078M5416j30397j13333o4450R8510
$$ 542716 462302 388355 563395 415512 414731 549809 595225 464828 351495 287045 385555
1994C85555J05021K5002p0555o4984j3637m9630m3303N8344N5144j15574J38184
$$ 385555 490576 515578 445023 380039 366402 316772 273469 331813 386957 271383 409567
1983D09567m6798O3444k4011j05769N4230j09881J5143O5487o2404P9912p2061
$$ 409567 362769 426213 402202 296433 350663 240782 255925 321412 259008 338920 266859
1972B66859j78572J00454p5j66709M8992M0196J95641J00729p8870J483q1540
$$ 266859 88287 188741 188666 21957 70949 111145 306786 407515 328645 330128 248588
1961B48588J10479L2410j45595m5933O3375J07189n4279n0226n8080j20878N551
$$ 248588 359067 391477 245882 199949 263324 370513 316234 266008 207928 87050 92601
1950I2601l6742J13751O5931N472R7102R2179j43468K1616k07610j79983J43215
$$ 92601 55859 169610 235541 241013 338115 430294 286826 308442 100832 -79151 64064
1939F4064Q1517J13521K7769r1616j17423n8922M2002O03J69906j94421J29020
$$ 64064 145581 259102 286871 195255 77832 18910 60912 61515 231421 37000 166020
1928A66020J80270j89569n5009P1284j47300M1710J14813r4548l6533m7785K4662
$$ 166020 346290 156721 101712 172996 25696 67406 182219 87671 51138 3353 28015
1917B8015K36917j1272j94283J61684J3311k73370M3820O1953J47811O775j24013
$$ 28015 264932 253660 59377 221061 234372 -38998 4822 66775 214586 221361 97348
1906I7348M9557r4942j6428k3841J51838Q6914J09279p1730j74520K7584J56727
$$ 97348 146905 51963 35535 11694 163532 250446 359725 287995 113475 141059 297786
1895B97786q2245j04407q4752j0511L9980M1413r617L5390l4196R521n1098L295
$$ 297786 215541 111134 26382 15871 55851 97264 87647 123037 88841 98362 47264 50559
1883E0559Q7544N4088j68796j11087Q5633m3470P5835K1685l9195n4459n9445
$$ 50559 138103 192191 23395 -87692 -2059 -45529 30306 51991 12796 -41663 -101108
1872a01108J47792m2107J79510P8793j48237j00022J00180P1196j62003j39151
$$ -101108 46684 4577 184087 262880 114643 14621 114801 185997 23994 -115157
1862a15157O4498J15467m8925K05239l3730p4279p3017o9130M5986J41783j22928
$$ -115157 -50659 64808 15883 221122 187392 113113 40096 -29034 16952 158735 35807
1851C5807n9638m099J18626M2152l9720J61178j9182K8772K3071M5640k592l1208
$$ 35807 -23831 -27930 90696 132848 93128 254306 235124 263896 286967 332607 330015 298807
1839B98807j9494J39015O5213P3479r7148r5822j24294j63426M968J40929Q9899
$$ 298807 279313 418328 483541 557020 459872 364050 239756 76330 81298 222227 312126
1828C12126p5301q5285K9348R9729j69918j8267J10973j13919k3189J61434j11345
$$ 312126 236825 151540 180888 280617 110699 92432 203405 89486 66297 227731 116386
1817A16386p1510K7167j09351j9525M2747P4922P9711m7274o5270O1554m3622
$$ 116386 44876 72043 -37308 -56833 -14086 60836 140547 93273 28003 89557 45935
1806D5935K1218J8327m5315K6212M7918j25010n5366j01983J09299L6497m0867
$$ 45935 67153 85480 40165 66377 114295 -10715 -66081 -168064 -58765 -22268 -63135
1795f3135L9602j57037k1638J31008J94275k2143j55861q521J31417N5096k8213
$$ -63135 -23533 -180570 -202208 -71200 123075 100932 -54929 -63450 67967 123063 94850
1784I4850q1391m0622n6749J66992K52915p5766p066j50898p3988Q1593j62000
$$ 94850 13459 -27163 -83912 83080 335995 260229 253163 102265 28277 109870 -52130
1773e2130j12449J19912m5429J06224J42000q6682O3402l9721J4900m1590q6365
$$ -52130 -164579 -44667 -90096 16128 158128 71446 134848 95127 110027 68437 -17928
1762a7928Q3370k4808l7167j8519m5735N5472N6383j07192p9644N1219O0299j51544
$$ -17928 65442 40634 3467 -15052 -60787 -5315 51068 -56124 -135768 -84549 -24250 -175794
1750a75794N1199J74073m3535j52926n3884K40355K8330M5450j27863k61353J12372
$$ -175794 -124595 49478 5943 -146983 -200867 39488 67818 113268 -14595 -275948 -163576
1739a63576J56811k0810r294n3315L4826J5266J2672K9715N9049p6762J17431
$$ -163576 -6765 -27575 -36869 -90184 -55358 -40092 -27420 2295 61344 -15418 102013
1728A02013j5112n2781j04969J32593p1948J2369N7883n887j26263j48846R791
$$ 102013 86901 34120 -70849 61744 -10204 2165 60048 54161 -72102 -220948 -211157
1717b11157J05852J57521p8999j8489J05056j29703m9636k0875l729m2271N8962
$$ -211157 -105305 52216 -26783 -45272 59784 -69919 -119555 -140430 -144159 -186430 -127468
1706a27468J54079o9798N2248o0812k8177L6754J35650n6692j52284L147k3436
$$ -127468 26611 -43187 9061 -51751 -79928 -43174 92476 35784 -116500 -113353 -136789
1695a36789Q2508P7810k7197R1442r6089r2040j13527J00188r8665N9998r167
$$ -136789 -54281 23529 -3668 87774 -8315 -100355 -213882 -113694 -212359 -152361 -161528
1684a61528R1798N3472j46266p6135M4679O9668J68620r5682Q8362R7577j39289
$$ -161528 -69730 -16258 -162524 -238659 -193980 -124312 44308 -51374 36988 134565 -4724
1673d724o0067j25531O6787K40816l5254k16099Q6494Q1656j11226m0925l785
$$ -4724 -64791 -190322 -123535 117281 82027 -134072 -47578 34078 -77148 -118073 -121858
1662a21858J2010J5838K7013J31908j0710j02001l5398j15140j8489J28652m2174
$$ -121858 -109848 -94010 -66997 64911 54201 -47800 -83198 -198338 -216827 -88175 -130349
1651a30349R5L3415N142N0588k6339M2447J0243q3032k0775J41747K06444r2828
$$ -130349 -130254 -96839 -91697 -41109 -67448 -25001 -14758 -97790 -118565 23182 229626 136798
1639A36798j14832j64288M252P9363J7148r3110l2603O1845J23199l9682N6632
$$ 136798 21966 -142322 -138070 -58707 -41559 -134669 -167272 -105427 17772 -21910 34722
1628C4722j53770k4519J37871j2282K0109q805q6126O4618M2822J28383q1496
$$ 34722 -119048 -143567 -5696 -17978 2131 -6674 -92800 -28182 14640 143023 61527
1617F1527j47310M4882p1835J90427J2630n2556Q410J34422j14128j84753M6218
$$ 61527 -85783 -40901 -112736 77691 90321 37765 46175 180597 66469 -118284 -72066
1606g2066k2357N7292r0098M3885N6436l7001O0909Q302p9905Q9893P0481j02850
$$ -72066 -94423 -37131 -127229 -83344 -26908 -63909 -3000 5302 -74603 15290 85771 -17079
1594a7079j1266O5043j13559P3439J90452j42672M9667K001n3930j34213m7472
$$ -17079 -28345 36698 -76861 -3422 187030 44358 94025 96026 42096 -92117 -139589
1583a39589Q9594q690q9936l7971K3817N6386k4911m7598K41555m8952p6383J2708
$$ -139589 -49995 -58685 -148621 -186592 -162775 -106389 -131300 -178898 62657 13705 -62678 -49970
1571d9970k00458J62219J37904O5740q2622o4337j37629J09432L1392j81257R7263
$$ -49970 -250428 -88209 49695 115435 32813 -31524 -169153 -59721 -28329 -209586 -112323
1560a12323M138R5466J26714n4907M3592n2282j47661J33286J42492j91577j47579
$$ -112323 -108185 -12719 113995 59088 102680 50398 -97263 36023 178515 -13062 -160641
1549a60641K4432k1539L5274n7929N8350P0816m8213j20958k4205K69264J05931
$$ -160641 -136209 -157748 -122474 -180403 -122053 -51237 -99450 -220408 -244613 24651 130582
1538A30582r3133k86748j17317J31869K00847n8665K1668J10781n7900K2439m1980
$$ 130582 37449 -249299 -366616 -234747 -33900 -92565 -70897 39884 -18016 4423 -37557
1527c7557o9286K5850l868J5322J07234j24173j14555J26012R3313n5939r778
$$ -37557 -106843 -80993 -84861 -69539 37695 -86478 -201033 -75021 18292 -37647 -47425
1516d7425P3204J4752M6396K2502j30045R0785L855J43231j59723l22582O3174
$$ -47425 25779 40531 86927 109429 -20616 70169 74024 217255 57532 -265050 -201876
1505b01876J81210P2410r3224j37521J00390R8449r827R8956l3420l6144K3116
$$ -201876 -20666 51744 -41480 -179001 -78611 19838 10011 108967 75547 39403 62519
1494F2519j08264K7377j8768j03267P492j32021K64145N5876R2160K09402j73781
$$ 62519 -45745 -18368 -37136 -140403 -132911 -264932 -787 55089 147249 356651 182870
1483A82870k23656J39294N8426k51878N570Q1522M7048j8238j7285M4616n6057
$$ 182870 -40786 98508 156934 -94944 -89374 -7852 39196 20958 3673 48289 -7768
1472g768o6424p9310o0695J78322L1356J15520n7925o2143J29610o5886j9709
$$ -7768 -74192 -153502 -214197 -35875 -4519 111001 53076 -9067 120543 54657 34948
1461C4948K9776M219q6455L1518R3879j0747k2254K4909j48736p5628P6468n6903
$$ 34948 64724 68943 -17512 14006 107885 97138 74884 99793 -48943 -124571 -48103 -105006
1449a05006l0966J07834J38689j41363K36759l04210N4402N0439p9181J45511
$$ -105006 -135972 -28138 110551 -30812 205947 -98263 -43861 6578 -72603 72908
1439G2908m8579O5367l2216M3483L0239o1590K7446p5818p9105P9965p3613P615
$$ 72908 24329 89696 57480 100963 131202 69612 97058 21240 -57865 22100 -51513 -43898
1427d3898R9110j16855k3616M1578O2917j11746J5284m1345p3692J24280q5086
$$ -43898 55212 -61643 -85259 -43681 19236 -92510 -77226 -118571 -192263 -67983 -153069
1416a53069K4630J32088N1965j39246O496J0811J30997j16450l2894l1514k0054
$$ -153069 -128439 3649 55614 -83632 -77136 -66325 64672 -51778 -84672 -116186 -136240
1405a36240J0163n8550N5639J37310j88001J09186Q0009j4024M7090M8328j1040
$$ -136240 -126077 -184627 -128988 8322 -179679 -70493 9516 -4508 42582 90910 79870
1394G9870M3056J38598k133r0307j06398l6868M778J0430P4185Q2381J21833j80149
$$ 79870 122926 261524 259391 169084 62686 25818 30596 41026 115211 197592 319425 139276
1382A39276r1852q6365O2473Q4031K7713J0906j38831m6286j07725P785J65294
$$ 139276 47424 -38941 23532 107563 135276 146182 7351 -38935 -146660 -138875 26419
1371B6419L6770j04591J46082q1927j49061N8805Q2725N8485O4595j94751j07832
$$ 26419 63189 -41402 104680 22753 -126308 -67503 15222 73707 138302 -56449 -164281
1360a64281J17692l2397k3898J0964O3526j4447R500J4977J02608o357j3603n3893
$$ -164281 -46589 -78986 -102884 -91920 -28394 -42841 -33341 -18364 84244 77887 64284 10391
1348A0391N9154K4329r297j2847n4051K0248L5470l7268l2472J57670l7375k458
$$ 10391 69545 93874 84577 71730 17679 37927 73397 36129 3657 161327 123952 121494
1336A21494m8690j053r6639J23705j10991m9000j79108M9556M5546P9957p232
$$ 121494 72804 71751 -24888 98817 -12174 -61174 -240282 -190726 -145180 -65223 -72455
1325g2455p4883j48431Q218J35322q4819J96505L591J32336j94619n3745K25001
$$ -72455 -147338 -295769 -287551 -152229 -237048 -40543 -36952 95384 -99235 -152980 72021
1314G2021L8915r5922j72389M4303J71106k2836n6590J33456k3242j59385j63413
$$ 72021 110936 15014 -157375 -113072 58034 35198 -21392 112064 88822 -70563 -233976
1303b33976N9270L03230j19714q9466J69755L8898n5083n9009r1480P2671J28115
$$ -233976 -174706 128524 8810 -80656 89099 127997 72914 13905 -77575 -4904 123211
1292A23211k7354p7665j52799k29291J7909K53340J38088J31978l04762J3755
$$ 123211 95857 18192 -134607 -363898 -345989 -92649 45439 177417 -127345 -113590
1282a13590N3447J9758N563m5328m4277M2844j4016J3769n3153j3996j09943J24596
$$ -113590 -60143 -40385 -34822 -80150 -124427 -81583 -95599 -81830 -134983 -148979 -258922 -134326
1270a34326K63070m1221N9465n3680j24959j62796q459P4927N1508j7757K8799
$$ -134326 128744 87523 146988 93308 -31651 -194447 -202906 -127979 -76471 -94228 -65429
1259f5429j33755J58877j8923J1501j9307j90847P3381Q8036p5348J83305N4135
$$ -65429 -199184 -40307 -59230 -47729 -67036 -257883 -184502 -96466 -171814 11491 65626
1248F5626n9537r8500r7810M6517K01614J1715j10965j64619Q8430R2971M0362
$$ 65626 6089 -92411 -190221 -143704 57910 69625 -41340 -205959 -117529 -24558 15804
1237A5804N2223j55637P4753P624j0872M3625j68584M2496J97646L568J0375r3642
$$ 15804 68027 -87610 -12857 -5233 -16105 27520 -141064 -98568 99078 102646 113021 19379
1225A9379o1648l5038J19708j25575j18820l7028K17096J17796j22686m4770n8692
$$ 19379 -42269 -77307 42401 -83174 -201994 -239022 -21926 95870 -26816 -71586 -130278
1214a30278J0064l3436J2392q2654o634J11451l1016M920J43866j45811p8494
$$ -130278 -120214 -153650 -141258 -223912 -230546 -119095 -150111 -145191 -1325 -147136 -225630
1203b25630J97521j4406n9888N3321j04512l2343J80875J1411J4088O1276j73859
$$ -225630 -28109 -42515 -102403 -49082 -153594 -185937 -5062 6349 20437 81713 -92146
1192i2146M1347k18875M9722J43749m4169K1791n5231R4817L992J4448K28398
$$ -92146 -50799 -269674 -219952 -76203 -120372 -98581 -153812 -58995 -55003 -40555 187843
1181A87843m0062k00800m4286Q3782K9303j47866O113J26940n415L5879J88307
$$ 187843 147781 -53019 -97305 -13523 15780 -132086 -125973 967 -4448 31431 219738
1170B19738j08000q0841q5527n2154l2169J59303N4034N9972p6818j20530P6311
$$ 219738 111738 30897 -54630 -106784 -138953 20350 74384 134356 57538 -62992 13319
1159A3319o4390M7444j7831m5674L4137o0174R7731O0122R940m6171l4955m8542
$$ 13319 -51071 -3627 -21458 -67132 -32995 -93169 4562 64684 74624 28453 -6502 -55044
1147e5044O5294O1413p0233l1196l9441J44888P7302m7343o6050M1553p7383m9259
$$ -55044 10250 71663 1430 -29766 -69207 75681 152983 105640 39590 81143 3760 -45499
1135d5499m4306L2356P580R5709K3813L1546j00770r3226q3909k5857l9814M2073
$$ -45499 -89805 -57449 -49869 45840 69653 101199 429 -92797 -176706 -202563 -242377 -200304
1123b00304M4621J2175k0490O0072J74280o9529P1212r7394l0118P940O7884m0495
$$ -200304 -155683 -143508 -163998 -103926 70354 825 72037 -25357 -55475 -47535 20349 -20146
1111b0146o273J04232j0709o5858k126q1108j03563K2313R9172q0435r849J34117
$$ -20146 -26419 77813 67104 1246 -880 -81988 -185551 -163238 -64066 -144501 -154350 -20233
1099b0233J80350k4429n3503j6308j66036J6465P3826o533O4936N7960J0317r4247
$$ -20233 160117 135688 82185 65877 -100159 -83694 -9868 -16401 48535 106495 116812 22565
1087B2565Q7308M3495j16347r0372R8197n9197n3935l3583J21743j62260J64670
$$ 22565 109873 153368 37021 -53351 44846 -14351 -68286 -101869 19874 -142386 22284
1076B2284l6056l6672J05290m2999k110K0637r672j74036P1594q5075Q7648L4738
$$ 22284 -13772 -50444 54846 11847 9737 30374 20702 -153334 -81740 -166815 -79167 -44429
1064d4429O5848K9614J02962r6390q2368K7279J18590r4285j05816j5465J16838
$$ -44429 21419 51033 153995 57605 -24763 2516 121106 26821 -78995 -94460 22378
1053B2378K5357p9781N6042j9654j43749Q6798n6128J01756n2744k0126j4905
$$ 22378 47735 -32046 23996 4342 -139407 -52609 -108737 -6981 -59725 -79851 -94756
1042i4756R079m7701N4163J24172p9318l6287N3027j66945L0057J15139j39901
$$ -94756 -85677 -133378 -79215 44957 -34361 -70648 -17621 -184566 -154509 -39370 -179271
1031a79271K5100J80073O9553j6283N9265j16183n9428j7257J21301q7403J2474
$$ -179271 -154171 25902 95455 79172 138437 22254 -37174 -54431 66870 -20533 -8059
1020h059J3576l1927j9291r4603J04502L825P5011o8274n5229N2149l6386L7294
$$ -8059 5517 -26410 -45701 -140304 -35802 -31977 43034 -25240 -80469 -28320 -64706 -27412
1008b7412k6832j21606O9034j094R7456J45469j86292N1379J1601j00438r5908
$$ -27412 -54244 -175850 -106816 -107910 -10454 135015 -51277 102 11703 -88735 -184643
997a84643L8183j4224K78347j07271p0259J50041j27528J26417L189m8238r264
$$ -184643 -146460 -160684 117663 10392 -59867 90174 -37354 89063 92252 44014 34750
986C4750N5218j39883q129J14502N942n6717m7057R4956M3808Q3352k46768M3568
$$ 34750 89968 -49915 -58044 56458 62400 5683 -41374 53582 97390 180742 -66026 -22458
974b2458N2913r2437K2583J21970k9259r9676J32824n5834r3770J17196K2191
$$ -22458 30455 -61982 -39399 82571 53312 -46364 86460 30626 -63144 54052 76243
963G6243k5127K725K929j14218p87Q7747Q0945P8288j11588j13143j08568J38299
$$ 76243 51116 53841 56770 -57448 -58235 29512 110457 188745 77157 -35986 -144554 -6255
951f255l316K5747r605O8946K9356k35849P9791k6259o111Q5530J7958Q0385M3701
$$ -6255 -9571 16176 6571 75517 104873 -130976 -51185 -77444 -83555 1975 19933 100318 144019
938A44019j15879O2274Q7357o6244n3190k5074O1345q931M7416L8603j90560k30968
$$ 144019 28140 90414 177771 111527 58337 33263 94608 85677 133093 171696 -18864 -249832
926b49832J70136k9593k1331J26792O070j13053O9897N6724q1751n1190r6100
$$ -249832 -79696 -109289 -130620 -3828 2242 -110811 -40914 15810 -65941 -117131 -213231
915b13231J84563K208j16513L5023J11421R8901l7937l738K0802p2751r2353N0287
$$ -213231 -28668 -26460 -142973 -107950 3471 102372 64435 60697 81499 8748 -83605 -33318
903c3318Q2807r8367J63210l7876K81534j67134j58481J2825j45434M4755p4447
$$ -33318 49489 -48878 114332 76456 357990 190856 32375 45200 -100234 -55479 -129926
892a29926O8693m1151J36481m2259n3678j10386J27642J07427l1026J04481j8099
$$ -129926 -61233 -102384 34097 -8162 -61840 -172226 -44584 62843 31817 136298 118199
881A18199q165m647J1342O3254j07074k6122K005j06179M3426R8799j6350Q9031
$$ 118199 110034 105387 116729 179983 72909 46787 48792 -57387 -13961 84838 68488 157519
869A57519o1123p7196j11065n9783J59781j18333n1322N1400J02074L0486j0674
$$ 157519 96396 19200 -91865 -151648 8133 -110200 -161522 -110122 -8048 22438 11764
858A1764r9613j52313K82114Q1269j98781N206Q3645j9399r1039J443r748p9085
$$ 11764 -87849 -240162 41952 123221 -75560 -70354 13291 -6108 -97147 -95704 -105452 -184537
846a84537J41791j04966o3984J58790P123P4872Q8295J56551J596j56179n3165
$$ -184537 -42746 -147712 -211696 -52906 -45783 29089 117384 273935 275531 119352 66187
835F6187r3603Q8881j15750k740p5178J1187J44319k2107q0622K8276M3321J29848
$$ 66187 -27416 61465 -54285 -57025 -132203 -121016 23303 1196 -79426 -51150 -7829 122019
823A22019q5836j7369N4140l5449k338r9643q4157k599M4986j91910J12779j392
$$ 122019 36183 18814 72954 37505 35167 -64476 -148633 -151232 -106246 -298156 -185377 -186769
811a86769O0231K9712N5822l5308J15971j4079J55977j92511j39807P2077K733
$$ -186769 -126538 -96826 -41004 -76312 39659 25580 181557 -10954 -150761 -78684 -75951
800g5951L6897k533P4390K7948j01090K8335l9823M3032P395o6231L8445k6926
$$ -75951 -39054 -41587 32803 60751 -40339 -12004 -51827 -8795 -1400 -67631 -29186 -56112
788e6112J29857k01619j4603L4483J37558r948j18447m0194m2074j248J69174
$$ -56112 73745 -127874 -142477 -107994 29564 19616 -98831 -139025 -181099 -182347 -13173
777a3173o3752q3873J20491l7365O3321J28631L083n4672p0556l1802j1355Q1572
$$ -13173 -76925 -160798 -40307 -77672 -14351 114280 117363 62691 -7865 -39667 -51022 30550
765C0550J04449j05712r2259Q5920M2178L0979n4996K4534M3640m8788M7569k8865
$$ 30550 134999 29287 -62972 22948 65126 96105 41109 65643 109283 60495 108064 79199
753G9199O8627l6651j69874N0831m7492n8393P602R3166M5375L8604o3656K425
$$ 79199 147826 111175 -58699 -7868 -55360 -113753 -106151 -12985 32390 70994 7338 9763
741I763l2775m2227l845K1549J0373K5642M8468Q8239O2031r6842l5300J00125
$$ 9763 -23012 -65239 -69084 -47535 -37162 -11520 36948 125187 187218 90376 55076 155201
729A55201M7756l3315k872L071j33172q989J7865l1125j22769M277J19977o1965
$$ 155201 202957 169642 166770 169841 36669 27680 45545 14420 -108349 -104072 15905 -46060
717d6060q811O0896N9385k03761J77964n0970m8591M7425k6815q0177Q6351n2147
$$ -46060 -54871 6025 65410 -138351 39613 -11357 -59948 -12523 -39338 -119515 -33164 -85311
705h5311k3741J04918p695k27260J20367q5342Q894J50807m1170k8293J11247
$$ -85311 -109052 -4134 -11829 -239089 -118722 -204064 -195170 -44363 -85533 -113826 -2579
694b579p9567R7660R3192j19914J15264j34405K9895j22372n9501k6705M2869
$$ -2579 -82146 15514 108706 -11208 104056 -30349 -454 -122826 -182327 -209032 -166163
683a66163K61256J20862Q499K6325j82044o8632k6453K0571l3451l0195J07664
$$ -166163 95093 215955 224454 250779 68735 103 -26350 -5779 -39230 -69425 38239
672C8239j24945L4573Q6141q2085J45925j03123K8528j45536j883J69104r950
$$ 38239 -86706 -52133 34008 -48077 97848 -5275 23253 -122283 -124166 44938 34988
661C4988J052l9975q4526M1385P4133m305N7745K0742n7447m1922k0492J24442
$$ 34988 36040 -3935 -88461 -47076 27057 22752 80497 101239 43792 1870 -18622 105820
649A05820O9122m9275j86653j01286K04427J459o4026j5296J7006J34456J0264
$$ 105820 174942 125667 -60986 -162272 42155 43614 -20412 -35708 -18702 115754 126018
638A26018j34338k4041J30261p435q6391N6481Q4019p6384m9042K3580k2403O4715
$$ 126018 -8320 -32361 97900 90465 4074 60555 144574 68190 19148 42728 20325 85040
626H5040J9877j9351n188L8342n7551j55893N4555J38786j4290r4235L1999p8940
$$ 85040 104917 85566 80378 118720 61169 -94724 -40169 98617 84327 -9908 22091 -56849
614e6849m5659J07141J4841j11543J07452J24388J4265n9639l3540K01192J4247
$$ -56849 -102508 4633 19474 -92069 15383 139771 154036 94397 60857 262049 276296
603B76296p4713l39716M8020r356L90J14366j31375N6780J10767J2906L9560n1421
$$ 276296 201583 -138133 -90113 -99469 -99079 15287 -116088 -59308 51459 64365 103925 52504
591E2504L087q3884m294j4335q1229K36923J50665j19102j94672J35237m5110
$$ 52504 55591 -28293 -32587 -46922 -128151 108772 259437 140335 -54337 80900 35790
580C5790j40743o7049J98517J27690k40817k0144K2714N029J02602J9361L8159
$$ 35790 -104953 -172002 26515 154205 -86612 -106756 -84042 -79013 23589 42950 81109
569H1109l1643l3637l4950L0365j5353N077n378N2463o3404j30900O1211L0072
$$ 81109 49466 15829 -19121 11244 -4109 968 -4410 48053 -15351 -146251 -85040 -54968
557e4968L3110l1430R2665L839j01465J14723m9420j22706O2634k3551j11842
$$ -54968 -21858 -53288 39377 43216 -58249 56474 7054 -115652 -53018 -76569 -188411
546a88411J22757m8800M6202P8405R8513q4365k99613k1739K30949K51134j2617
$$ -188411 -65654 -114454 -68252 10153 108666 24301 -275312 -297051 -66102 185032 172415
535A72415j08688M3881R0703K1009j0907j42993j30537j00952P6197j1324J05862
$$ 172415 63727 107608 198311 219320 208413 65420 -65117 -166069 -89872 -101196 4666
524D666K9370o8703M5510J63121M2511r7829q4453J1754j19304N388R6823l0982
$$ 4666 34036 -34667 10843 173964 216475 118646 34193 45947 -73357 -67969 28854 -2128
512b128O5138j0361p8435J24911M1668j19218p0318j46436Q6905R2903M5580n427
$$ -2128 63010 52649 -25786 99125 140793 21575 -48743 -195179 -108274 -15371 30209 24782
500B4782k6730Q1364L7594n2919K6825K0563j09217K7166j0854j11162m8765J53424
$$ 24782 -1948 79416 117010 64091 90916 111479 2262 29428 18574 -92588 -141353 12071
488A2071l2695m8913P0949J55301k6844j4424m8368M4073j28923j11758Q4233
$$ 12071 -20624 -69537 1412 156713 129869 115445 67077 111150 -17773 -129531 -45298
477d5298J7154j31279P003j16255n116J54004J31096P7382j12801L8138J00891
$$ -45298 -28144 -159423 -152420 -268675 -273791 -119787 11309 88691 -24110 14028 114919
466A14919m7367j39819n9321M9468Q2657j34597Q644j948o3973J50802K19743
$$ 114919 67552 -72267 -131588 -82120 537 -134060 -125416 -127364 -191337 -40535 179208
455A79208o7159J09641l5144j92568P4997k0863j77267J40693P5331n0272J49025
$$ 179208 112049 221690 186546 -6022 68975 48112 -129155 11538 86869 36597 185622
444A85622q3932j31388J3542j48498k36966J32013K77943N4029P0765j84905J23213
$$ 185622 101690 -29698 -16156 -164654 -401620 -269607 8336 62365 133130 -51775 71438
433G1438N9666j04050j10941j2956j30963L6322O8040k3457L0852o9956N9700
$$ 71438 131104 27054 -83887 -96843 -227806 -191484 -123444 -146901 -116049 -186005 -126305
422a26305K6100J05674K0380L0466N9209j17432m9536P5722n9757j40591J02408
$$ -126305 -100205 5469 25849 56315 115524 -1908 -51444 24278 -35479 -176070 -73662
411g3662j4148j6266m5758O7459J40677J0587k8565j89671J8522R1873j5489O6486
$$ -73662 -87810 -104076 -149834 -82375 58302 68889 40324 -149347 -130825 -38952 -54441 12045
399A2045k00135o468J57270O9139P8048L5p8534j05785J8409p9641R4325M9999
$$ 12045 -188090 -194558 -37288 31851 109899 109934 31400 -74385 -55976 -135617 -41292 8707
387H707q1784j66589O0797J54704r9317j06692J02594J48395q144m1483M9775
$$ 8707 -73077 -239666 -178869 -24165 -123482 -230174 -127580 20815 12671 -28812 20963
376B0963L7324q5782l8315k9886k4730K0316L2983l987P1408R5729J1437j20687
$$ 20963 58287 -27495 -65810 -95696 -120426 -100110 -67127 -71114 294 96023 107460 -13227
$$ [...]
##END NTUPLES=NMR SPECTRUM
##END=
