##TITLE=1H_EC-3275(II-1)
 CDCl3
 8 sc, 
 8.06.2022
##JCAMPDX= 6.0         $$ Bruker NMR JCAMP-DX V2.0
##DATA TYPE= NMR SPECTRUM
##DATA CLASS= NTUPLES
##ORIGIN= UXNMR, Bruker Analytische Messtechnik GmbH
##OWNER= root
$$ XWIN-NMR		Version 3.5
$$ Wed Jun  8 12:21:15 2022 Russian Standard Time (UT+4h)  she@DPX200
##.OBSERVE FREQUENCY= 200.131
##.OBSERVE NUCLEUS= ^1H
##.ACQUISITION MODE= SIMULTANEOUS
##.ACQUISITION SCHEME= undefined
##.AVERAGES= 8
##.DIGITISER RES= 18
##SPECTROMETER/DATA SYSTEM= spect
##.PULSE SEQUENCE= zg30
##.SOLVENT NAME= DMSO
##.SHIFT REFERENCE= (INTERNAL, DMSO, 0, 16.1788)
##AUDIT TRAIL= $$ (NUMBER, WHEN, WHO, WHERE, WHAT)
$$ ##TITLE= Audit trail, XWIN-NMR		Version 3.5
$$ ##JCAMPDX= 5.01
$$ ##ORIGIN= Bruker BioSpin GmbH
$$ ##OWNER= she
$$ F:/spectra/data/she/nmr/H-F/1/pdata/1/auditp.txt
$$ ##AUDIT TRAIL=  $$ (NUMBER, WHEN, WHO, WHERE, WHAT)
(   1,<2022-06-08 12:19:08.92 +0400>,<she>,<DPX200>,
      <created by zg, POWCHK disabled, PULCHK disabled
       configuration hash MD5:
       00 E9 B6 7A A2 85 ED C7 34 08 36 98 17 FE 4E 26
       data hash MD5: 16K
       D2 A3 26 54 45 31 42 F3 76 8B FE F6 EB 6C 7E 15>)
(   2,<2022-06-08 12:19:11.28 +0400>,<she>,<DPX200>,
      <Start of raw data processing
       efp BC_mod = 2 LB = 0.24 FT_mod = 6 PKNL = 1 PHC0 = -18027.82 PHC1 = 6.400741 SI = 16K 
       data hash MD5: 16K
       30 84 3C 5D 32 2C B1 4D 38 31 75 35 2E C8 44 CA>)
(   3,<2022-06-08 12:19:35.12 +0400>,<she>,<DPX200>,
      <pk PHC0 = -0.1042891 PHC1 = 7 
       data hash MD5: 16K
       ED 3F E2 3D 9A E1 59 E7 1B F5 E4 AF AD DE DE 78>)
(   4,<2022-06-08 12:19:38.45 +0400>,<she>,<DPX200>,
      <abs ABSG = 5 
       data hash MD5: 16K
       B9 EA C0 C5 8D 04 FF 88 94 F8 72 07 A2 B0 0D 34>)
$$ ##END=
$$ 
$$ hash MD5
$$ 4A 6D D2 DE 3E D1 44 5A 7E B2 58 12 98 D0 2B 5C
##$RELAX= 
##$RELAX= 
##$RELAX= 
##$RELAX= 
##$RELAX= 
##$RELAX= 
$$ Bruker specific parameters
$$ --------------------------
##$DU= <F:/spectra>
##$EXPNO= 1
##$NAME= <H-F>
##$PROCNO= 1
##$TYPE= <nmr>
##$USER= <she>
##$AMP= (0..31)
100 100 100 100 100 100 100 100 100 100 100 100 100 100 100 100 100 100 
100 100 100 100 100 100 100 100 100 100 100 100 100 100 
##$AQSEQ= 0
##$AQ_mod= 1
##$AUNM= <au_zg>
##$AUTOPOS= <>
##$BF1= 200.13
##$BF2= 200.13
##$BF3= 200.13
##$BF4= 200.13
##$BF5= 200.13
##$BF6= 200.13
##$BF7= 200.13
##$BF8= 200.13
##$BYTORDA= 1
##$CFDGTYP= 0
##$CFRGTYP= 5
##$CHEMSTR= <none>
##$CNST= (0..31)
1 1 145 1 1 1 1 1 1 1 1 1 1 1 1 1 1 1 1 1 1 1 1 1 1 1 1 1 1 1 1 1 
##$CPDPRG= <>
##$CPDPRG1= <>
##$CPDPRG2= <>
##$CPDPRG3= <>
##$CPDPRG4= <mlev>
##$CPDPRG5= <mlev>
##$CPDPRG6= <mlev>
##$CPDPRG7= <mlev>
##$CPDPRG8= <mlev>
##$CPDPRGB= <>
##$CPDPRGT= <>
##$D= (0..31)
0 1.2 0 0 0 0 0 0 0 0.06 0 0.03 0 0 0 0 0.0002 0 0 0 0 0 0 0 0 0 0 0 0 
0 0 0 
##$DATE= 1654676348
##$DBL= (0..7)
120 120 120 120 120 120 120 120 
##$DBP= (0..7)
150 150 150 150 150 150 150 150 
##$DBP07= 0
##$DBPNAM0= <>
##$DBPNAM1= <>
##$DBPNAM2= <>
##$DBPNAM3= <>
##$DBPNAM4= <>
$$ [...]
##$SUBNAM2= <"">
##$SUBNAM3= <"">
##$SUBNAM4= <"">
##$SUBNAM5= <"">
##$SUBNAM6= <"">
##$SUBNAM7= <"">
##$SUBNAM8= <"">
##$SUBNAM9= <"">
##$SW= 18.0517599122864
##$SWIBOX= (0..15)
0 0 2 0 0 0 0 0 0 0 0 0 0 0 0 0 
##$SW_h= 3612.71676300578
##$TD= 16384
##$TD0= 1
##$TE= 0
##$TE2= 300
##$TE3= 300
##$TEG= 300
##$TL= (0..7)
0 120 120 120 120 120 120 120 
##$TP= (0..7)
150 150 150 150 150 150 150 150 
##$TP07= 0
##$TPNAME0= <>
##$TPNAME1= <>
##$TPNAME2= <>
##$TPNAME3= <>
##$TPNAME4= <>
##$TPNAME5= <>
##$TPNAME6= <>
##$TPNAME7= <>
##$TPOAL= (0..7)
0.5 0.5 0.5 0.5 0.5 0.5 0.5 0.5 
##$TPOFFS= (0..7)
0 0 0 0 0 0 0 0 
##$TUNHIN= 0
##$TUNHOUT= 0
##$TUNXOUT= 0
##$USERA1= <user>
##$USERA2= <user>
##$USERA3= <user>
##$USERA4= <user>
##$USERA5= <user>
##$V9= 5
##$VALIST= <valist>
##$VCLIST= <CCCCCCCCCCCCCCC>
##$VD= 0
##$VDLIST= <DDDDDDDDDDDDDDD>
##$VPLIST= <PPPPPPPPPPPPPPP>
##$VTLIST= <TTTTTTTTTTTTTTT>
##$WBST= 1024
##$WBSW= 4
##$XGAIN= (0..3)
0 0 0 0 
##$XL= 0
##$YL= 0
##$YMAX_a= 242249
##$YMIN_a= -178390
##$ZGOPTNS= <>
##$ZL1= 120
##$ZL2= 120
##$ZL3= 120
##$ZL4= 120
##$ABSF1= 16.17883
##$ABSF2= -1.87306
##$ABSG= 5
##$ABSL= 3
##$ALPHA= 0
##$AQORDER= 0
##$ASSFAC= 0
##$ASSFACI= 0
##$ASSFACX= 0
##$ASSWID= 0
##$AUNMP= <proc_1d>
##$AZFE= 0.1
##$AZFW= 0.1
##$BCFW= 0
##$BC_mod= 2
##$BYTORDP= 0
##$COROFFS= 0
##$CY= -3
##$DATMOD= 1
##$DC= 0
##$DFILT= <>
##$DTYPP= 0
##$F1P= 0
##$F2P= 0
##$FCOR= 1
##$FTSIZE= 16384
##$FT_mod= 6
##$GAMMA= 0
##$GB= 0
##$INTBC= 1
##$INTSCL= 0
##$ISEN= 128
##$LB= 0.24
##$LEV0= 0
##$LPBIN= 0
##$MAXI= 10000
##$MC2= 0
##$MEAN= 0
##$ME_mod= 0
##$MI= 1.114404
##$NCOEF= 0
##$NC_proc= -6
##$NLEV= 6
##$NOISF1= 3.799351
##$NOISF2= 2.8
##$NSP= 0
##$NTH_PI= 0
##$NZP= 0
##$OFFSET= 16.17883
##$PC= 1
##$PHC0= -18027.92
##$PHC1= 13.40074
##$PH_mod= 1
##$PKNL= yes
##$PPARMOD= 0
##$PSCAL= 0
##$PSIGN= 0
##$REVERSE= no
##$SF= 200.129568495393
##$SI= 16384
##$SIGF1= 3
##$SIGF2= 2
##$SINO= 5.538805
##$SIOLD= 16384
##$SREGLST= <1H.CDCl3>
##$SSB= 0
##$STSI= 16384
##$STSR= 0
##$SW_p= 3612.71676300579
##$SYMM= 0
##$S_DEV= 0
##$TDeff= 16384
##$TDoff= 0
##$TI= <>
##$TILT= no
##$TM1= 0
##$TM2= 0
##$TOPLEV= 0
##$USERP1= <user>
##$USERP2= <user>
##$USERP3= <user>
##$USERP4= <user>
##$USERP5= <user>
##$WDW= 1
##$XDIM= 16384
##$YMAX_p= 363447221
##$YMIN_p= -1287780
$$ End of Bruker specific parameters
$$ ---------------------------------
##NTUPLES= NMR SPECTRUM
##VAR_NAME=  FREQUENCY,     SPECTRUM/REAL,   SPECTRUM/IMAG
##SYMBOL=    X,             R,               I
##VAR_TYPE=  INDEPENDENT,   DEPENDENT,       DEPENDENT
##VAR_FORM=  AFFN,          ASDF,            ASDF
##VAR_DIM=   16384,         16384,           16384
##UNITS=     HZ,            ARBITRARY UNITS, ARBITRARY UNITS
##FACTOR=    0.220516191357248, 1,           1
##FIRST=     3237.86210517882, 0,            0
##LAST=      -374.854657826971, 0,           0
##MIN=       -374.854657826971, -1287780,    0
##MAX=       3237.86210517882, 363447221,    0
$$ Real data points
##PAGE= N=1
##DATA TABLE= (X++(R..R)), XYDATA
$$ [...]
12701 -53163 14052 4088 -127491 -197906 -219941 -141314 -36164 -31987 38380 -2634 2263 5941
12689 5941 42289 36648 -38885 -80615 -20769 32856 26216 -60328 -81389 11081 -23491 -25144
12677 -25144 -49880 -85659 -133967 -95131 -142098 -132008 -127966 -167269 -31869 -20163 -68822 -60020
12665 -60020 -57495 -84238 -129579 4500 74167 -14621 -17671 -93853 -132783 11050 13578 78772
12653 78772 75498 -12105 12689 5451 -139877 -30867 -64896 -90102 -44162 -133584 -132326 -4925
12641 -4925 -53485 -26201 65999 1994 -28224 -74896 -98522 -58285 -54439 -8334 80417 107554
12629 107554 25709 -68644 14160 102351 -85145 -77979 28344 106372 50618 37841 110233
12618 110233 114286 23300 39125 3369 -12187 104192 152101 -25865 -99697 -56945 40044
12607 40044 107647 29589 67619 117457 56321 -23447 58571 34868 15752 -15169 -71569 54677
12595 54677 92852 -75134 75858 37504 -43253 24686 -371 17125 61866 -35459 35910
12584 35910 -48066 61041 -14770 -17294 867 -71160 17907 -12948 -56326 -65727 -26407 -71266
12572 -71266 -18750 38156 48158 63788 18011 -42439 68979 110617 51789 5657 -45457
12561 -45457 -158023 -86141 -3444 -62012 -44927 -47551 -39498 -26131 -49550 -73204 -3305 -21466
12549 -21466 -22630 26836 13431 -1666 28403 -29219 -1582 -17368 18801 132254 555
12538 555 -17450 53653 4285 -134158 -56756 74756 -60214 -28220 -30463 -160997 -164988 -213310
12526 -213310 -101952 -129033 -89792 -93161 -147891 -131169 -21931 70684 -79740 -97412 -57785
12515 -57785 22397 -10655 98289 5786 -61006 -27015 -134390 -85580 33853 19056 -64751
12504 -64751 -169732 -216479 -184192 -127176 -113964 -24243 150299 111456 -34366 -83211 -76999
12493 -76999 -39709 -9784 5474 -31436 -104061 -88634 26779 64136 -56681 -124361 -28948
12482 -28948 84227 24462 21949 -68844 -67146 -63994 -84128 -93524 -35264 72247 -104527 -216351
12470 -216351 -186121 -84522 -56322 19049 44945 26597 71834 -877 -74905 -51622 -4233
12459 -4233 -7041 45266 68390 -1422 47703 -1593 -65479 -120811 -182352 -149350 -127295 -95426
12447 -95426 -18622 -69420 -24308 52170 -25374 5926 -20278 19626 -2964 -40536 -57892 -49105
12435 -49105 -5452 8200 44916 -6475 -72608 -7577 -78272 -53266 127955 103976 82756
12424 82756 98806 -24338 -50255 -63221 25937 7315 -61815 -93687 -85409 4081 46622 -46925
12412 -46925 -47260 34234 41335 -51788 32125 -26578 -56427 -68048 -62225 -67835 -70265 -96377 -119559
12399 -119559 -160817 -59868 -20444 21318 50557 76029 4139 16140 -21071 -104377 -128516
12388 -128516 -162566 -110546 -7192 49789 81527 79574 -4041 -13117 23884 86321 -27812
12377 -27812 -6874 19805 20166 -28568 -71759 -28924 -39828 11419 133823 92830 56823 -83085
12365 -83085 -61820 -83450 14898 -16012 -86398 -32089 -29726 -57248 -57705 -154262 -66206 -34361
12353 -34361 -31769 39887 87407 59283 78111 148573 77548 -93326 -11948 -10946 4499 -26359
12341 -26359 -18443 15138 -1525 -50869 -360 106433 115094 57853 46214 -29579 -118728 -47665
12329 -47665 -52297 -57034 -47132 -93345 -40590 -47117 6138 49767 27424 -14273 -52187 -38918
12317 -38918 -21635 29293 59009 -20022 -69403 -16549 84059 136686 69046 12154 14487 -10817
12305 -10817 -10692 9059 32581 27511 -35378 8837 3029 67710 27794 17001 -47110 -84564
12293 -84564 8501 -62628 -82524 -39172 -159849 -144448 -136830 -153635 -58869 38167 49049 78894
12281 78894 82813 170359 76826 -23826 -63693 -51705 22195 23921 48005 -7160 34639 48512
12269 48512 8236 -50255 -154339 -104436 -148384 -124030 -152976 -166077 -138856 -82286 -118182
12258 -118182 -87973 -33891 48580 -107449 -101215 -29955 -4095 38427 -48274 -119215 -47332
12247 -47332 10406 32007 11885 -42408 36622 -39803 -53516 98774 96634 62361 -88066
12236 -88066 -85399 -19973 -51195 -61227 -126313 -92624 -49191 22205 8567 11798 -17989 -51387
12224 -51387 -42486 -53107 -126639 -116824 -48098 2972 82 -6074 -17166 1024 889 -53010 -92577
12211 -92577 -31052 -115470 -86567 -11387 -7982 -4921 -38104 15835 7279 -23775 -12892 -4379
12199 -4379 73701 96734 64052 25708 -27576 -55953 -126699 -104221 84586 64944 -10383 -86592
12187 -86592 -97200 -209767 -150888 -18775 20744 3537 -72423 -161454 -77800 -19781 20493
12176 20493 36747 -53469 -73546 -24706 9969 16059 52773 741 -76621 -102082 -115410 -162429
12164 -162429 -92017 54812 64191 90335 5661 23692 53191 -15063 -52409 -97499 -95376 -27989
12152 -27989 -16038 -47065 -57320 -43549 -26435 1816 34342 -33007 -48423 -120602 -128407 -94607
12140 -94607 -20614 -86839 81628 53275 16584 68495 98637 114843 -10642 22420 84885
12129 84885 149605 108720 57246 -27669 -66442 -104584 -29502 -40230 -102991 1916 -33744
12118 -33744 7279 -9883 41727 -38539 -26608 -80630 -58850 -8047 6492 -22706 -45868 -28081
12106 -28081 -47715 -49301 -36662 25091 3055 -11838 5753 34449 -30744 -40574 -48997 -75670
12094 -75670 -8681 1505 -76790 -32869 40468 -29456 41963 52778 -41346 -56631 -33017 1659
12082 1659 -27601 -61213 -58171 -140043 -79802 -62482 -26709 10590 14411 39741 -83968 -35641
12070 -35641 -40516 -81619 -117313 -43998 -11217 -16649 -33899 43435 44282 21771 -11408 67553
12058 67553 -20797 -20760 -58987 -5790 -33396 7717 114171 18552 -64294 -88127 -89633 -32006
12046 -32006 -27808 9611 -4587 50344 25141 -14457 -29355 -95177 -131163 -47479 44405 -121536
12034 -121536 -134590 -115994 -95804 -105004 -37617 153421 80468 -26064 -15089 -75308 -31301
12023 -31301 -76374 -23169 -19570 -60732 -28026 -26425 19023 66220 14 29789 71750 83116
12011 83116 -55906 -62748 -72066 -65869 -100949 -122786 -15057 70045 19597 29757 19971 -23710
11999 -23710 -47507 -121157 -99271 64288 53478 -12370 -63756 -37825 -85194 -117395 25439
11988 25439 -135703 -142672 -50984 -50751 53468 22462 -35196 3800 17837 77713 44934 8591
11976 8591 -4756 -32875 -30056 -36216 -51810 -81294 -75566 -64359 -106127 -14109 -90644 -189503
11964 -189503 -113422 -26920 -52716 -15293 -23540 -76128 -32041 11512 -30902 1371 34012 -14346
11952 -14346 12501 9098 7073 -56316 -71251 -113090 -88646 -124599 -72647 29705 12461 -80883
11940 -80883 -55394 25804 100141 104466 16697 56236 3633 9232 91806 -3867 -46955 56974
11928 56974 24983 -6052 45749 110538 51808 36386 65496 15125 18211 -44191 -55682 -60907
11916 -60907 -110286 -202331 -115227 -58926 7433 -16524 60413 5216 -54858 1930 -28415 -1983
11904 -1983 4626 -143414 -158215 -59320 52393 80164 10733 18395 1683 34891 -15360 -115198
11892 -115198 -124545 -25178 -116294 -115742 -34998 -79040 -150107 -50056 -64533 -87683 -97165 -96240
11880 -96240 -74449 27395 85593 34210 -57156 27859 -27667 -63663 -62018 11664 67495 -20659
11868 -20659 -43043 -117029 -115310 -97507 -10176 28429 30710 10078 -29776 -102030 -81149 -145836
11856 -145836 -41525 124013 29601 -54080 -148353 -182018 -109617 -53292 -59137 -50114 -28525
11845 -28525 69791 54325 -12270 -37406 -5515 -13895 81389 13035 -125516 -109322 -73433 12547
11833 12547 42914 -62124 -49151 -75276 -27741 -67402 -66418 -15148 78360 30680 -88356 -69436
11821 -69436 -62946 49586 62592 34114 8297 23974 -341 -148898 -113737 -56492 -79061
11810 -79061 17102 -18369 31203 -44540 -119161 17366 -28959 -67389 -45203 42112 56798
11799 56798 19925 18871 56502 38708 -60988 -4906 -127287 -56420 58693 82762 -239
11788 -239 22065 -81188 -34457 13896 -70965 -69374 -22800 21417 -30943 -28946 12311 -21120
11776 -21120 -91312 -17150 -37768 -75031 9398 22126 49889 -19069 -173788 -136512 -66382
11765 -66382 23994 -14367 -84056 -93859 -74967 -65361 -185260 -94164 -60168 -23256 -39590 11413
11753 11413 29395 -22293 1063 14763 -47851 -46300 10850 60539 15366 -13984 -33921 92629
11741 92629 27746 -46272 -38010 -43624 57867 114158 -11945 -155071 -85580 -21370 16765
11730 16765 11798 66974 -42149 -32312 60549 20848 -108344 -145139 -63913 19222 422 16663
11718 16663 -34547 -48654 -16384 94563 155608 42633 -8505 -26601 -94940 -88413 -80972 -125508
11706 -125508 -49285 -30967 -81594 10588 75153 37883 -46174 -120751 -45572 30035 -13309
11695 -13309 37529 -24513 19980 -8576 1304 68764 5748 -80489 -10932 17171 38697 -13705
11683 -13705 -18730 -60033 -100425 -152203 -112225 -46882 -31382 44430 54763 47069 -184 36394
11671 36394 -13486 6041 32146 107740 76433 -6239 -18005 -70000 -12622 55494 82094 48963
11659 48963 66803 67790 -17538 30593 6552 4627 43477 71077 86789 49075 -32774 -98124
11647 -98124 -23662 -73131 -20833 -41807 -16155 5483 -92308 -15356 40198 -57493 -47878 40556
11635 40556 11917 84431 5630 -22475 -40516 80317 85510 -47861 -128754 -19970 -42466
11624 -42466 -100038 -7422 31037 -56563 -35168 52832 30951 -35193 -5737 108917 6045
11613 6045 -98747 -72124 -100878 -38507 44454 9351 -22971 -46168 -12260 79382 81768 120525
11601 120525 77612 -9561 -45111 -75893 8929 -68526 -14814 -70409 15426 24319 -26200 -23078
11589 -23078 46114 57415 77401 76861 32079 -20863 -54743 59773 -8484 -5591 -2064 89309
11577 89309 58591 -27129 -16229 -82100 -107457 -113153 -121991 -18946 92285 -4950 -41955 -46316
11565 -46316 -33702 15873 -84354 -100313 -109964 -23754 154365 93162 52137 76252 -29299
11554 -29299 -1932 48671 -58719 -29104 49043 78810 138012 40979 -38185 -35415 19930 116663
11542 116663 32087 38210 26447 4763 3291 31910 32151 409 13330 -558 44514 -569
11530 -569 10974 74020 34939 -42563 -67414 -52873 10780 41383 53137 -1922 -28139 -68193
11518 -68193 -91818 -116814 -71515 -64344 -62991 -53377 48960 33643 -38827 7767 34215 103823
11506 103823 -8406 -43386 89252 32247 -98710 -103706 -41894 3203 -38666 -175318 -70386
11495 -70386 -12742 -43606 -34946 -57243 50715 57435 -12360 -26768 40729 24120 51955 74742
11483 74742 88518 59378 67374 104121 15522 104508 66706 1233 -8163 -14181 -64341 -8536
11471 -8536 33905 39011 -17091 -18899 4085 -116483 -103407 -35276 -281 69452 50918 1787
11459 1787 -76098 -54226 17178 -103298 -50672 22800 35551 61464 38271 -56665 -89113 13605
11447 13605 -43660 -26486 15946 -44547 -51478 -165846 -85798 -11018 62710 64665 42086 -62484
11435 -62484 -57473 -116229 -112613 -142986 -49420 -3863 -116900 -127369 -65598 2032 -93625 -92666
11423 -92666 8274 12577 9744 -4502 -48963 46413 56857 58145 102954 152292 147255 123284
11411 123284 103319 20280 41536 -6067 -61129 -5439 23177 20150 73485 20839 -13648 -24380
11399 -24380 -38889 -48937 53165 2016 5002 7357 -3254 -77908 -79312 -16126 73094 89878
11387 89878 19120 23875 -83148 -44142 -66042 -71279 -6424 29090 110129 137173 47914 -36827
11375 -36827 -65940 -27738 -37054 -36816 -73285 -49716 -101626 -83483 9899 87247 95205 47588
11363 47588 61319 69521 -18097 -27733 -86943 -28913 -97156 -24524 9214 -63522 -109542 -87831
11351 -87831 -55636 11199 22078 -33432 -34906 -91176 63705 127264 64459 32820 24238 480
11339 480 -69744 12963 11863 57341 10982 -14253 -10952 1080 15054 -13450 -43521 58473
11327 58473 36881 28421 31982 40067 26310 37692 53545 -39247 37790 -48228 32275 -5651
11315 -5651 -8198 -4578 -15951 -108577 -133952 -111707 -128501 -103018 -23642 8689 19198 39950
11303 39950 61471 92357 37510 -24782 -152940 -112562 -34154 51938 24347 5785 -49110
11292 -49110 -121047 9088 -34859 30230 44962 43449 106793 156842 91180 -30263 3278
11281 3278 -24031 9611 245 86865 80940 43247 151746 143295 133951 65406 24232 30988 -11368
11268 -11368 -21990 43363 17462 -54239 -67581 -1091 83055 -25018 -36571 111351 132113
11257 132113 47602 86198 -17446 35698 62895 -9177 -10785 66453 109961 133586 195777
11246 195777 178388 112076 65923 43066 -64494 -14195 -35572 6355 -81950 -15981 -11005
11235 -11005 -49267 57601 94342 -44084 70860 87724 80246 53417 25002 -13375 -50539
11224 -50539 -76568 -125704 -150982 -64801 58397 85030 81084 108222 119500 145128 56294 -31581
11212 -31581 29920 -105426 -71769 -72361 66027 104642 12831 -22782 -50382 -58259 -13711 11526
11200 11526 -622 -126342 -90090 -19204 -72543 28167 102220 97692 63914 18006 54322
11189 54322 156780 157645 57969 7050 29194 -109947 -93263 -31652 -64852 -80996 -90720 -57665
11177 -57665 -115871 -30684 35817 -37226 11211 74733 -29322 -32250 27590 -60141 -86956 -51177
11165 -51177 -12980 39135 -38370 -77385 -114208 -56250 -71868 -10252 -15704 -36675 53527 22408
11153 22408 -6825 24175 85145 72848 -46809 -113448 14887 90998 58176 90466 39218
11142 39218 74863 57257 -10123 -21835 -22135 13468 -2148 64372 141018 170416 162612 109193
11130 109193 149276 115996 77816 21026 -23633 -4540 -31999 -37648 -86169 -96016 -31325 -25699
11118 -25699 14569 23108 -8224 -65569 -101480 63967 -16578 56525 97696 -43302 35820
11107 35820 85950 32733 15797 71895 107379 166933 94794 14143 101838 103335 213921 113532
11095 113532 -4896 14214 6854 -47214 -112982 20720 -13253 -78775 -72382 -32818 -7579
11084 -7579 84116 -6446 -21781 -35677 -57629 -35213 46407 102363 27719 98795 143620 158622
11072 158622 7788 26588 50050 27071 97022 -9975 26123 51119 110246 111251 50963
11061 50963 53338 59452 66782 68103 77596 11323 28553 -26633 19107 -9775 -43008 -58483 -69485
11048 -69485 37610 139536 154121 69655 43066 105249 159881 80927 85222 93553 78430 79816
11036 79816 120598 154307 119552 61561 45230 50829 43448 90147 60711 188551 169934 146513
11024 146513 93857 11666 163511 262949 132483 19154 -138078 -71556 -75018 -146670 6475
11013 6475 53462 -7113 -43148 -37639 54286 -39002 -118142 -8749 114194 83258 44230 5917
11001 5917 1636 50394 48188 65196 48821 -20623 49034 67200 90469 104159 26535 4825
10989 4825 36978 140371 143239 151616 174021 256775 174071 72497 52412 57070 41853 87537
10977 87537 117360 79935 141025 164735 120561 134268 46741 52401 124394 113637 233527 309206
10965 309206 227734 248235 144441 229113 222067 197673 202926 164050 248814 134353 164523
10954 164523 197834 116553 167550 232702 159233 57380 214742 199585 129247 148717 178775
10943 178775 262992 280046 274929 327002 279834 315213 340329 307550 259805 284119 377221 427169
10931 427169 399123 385986 315769 330752 419715 397220 405892 448682 417461 509594 462627 423732
10919 423732 364177 340630 316318 297592 325035 257617 201783 193609 264809 333361 311720 191087
10907 191087 128113 218090 164991 145234 157740 175408 253517 236740 385404 359733 395711
10896 395711 352915 317476 351101 425368 366758 344062 457051 435091 386581 360076 362045
10885 362045 508134 459221 474333 443406 375017 411006 457223 314747 322411 347928 350977
10874 350977 213103 254550 351787 306783 336201 388978 390858 312877 230562 221325 277176 263802
10862 263802 272201 162296 223476 220780 253457 202666 176641 111728 88015 252549 223137
10851 223137 184015 214122 230928 162577 170612 205387 185780 157728 226048 249743 162243 156032
10839 156032 143999 133516 76303 256719 383532 281972 219425 112779 71863 125141 233311
10828 233311 265830 260834 250398 253431 182883 293935 224935 241706 264049 303444 399600 439402
10816 439402 408060 433462 401066 436282 363835 396035 489545 365587 307992 285442 346742
10805 346742 348750 404194 364553 357677 342932 377453 374890 346265 356614 256173 255700 403449
10793 403449 370674 382328 354685 429494 419655 357203 272750 399731 487219 522196 496714
10782 496714 490483 426802 438513 529757 483244 502528 591184 547440 639720 654763 738415 805662
10770 805662 843188 763509 780922 777173 837888 769599 773283 823397 790000 877576 880093 886111
10758 886111 893312 770663 716988 808464 763294 718216 804132 776481 601932 585065 568142
10747 568142 653719 684826 684010 620896 588879 578331 676117 706227 715324 762682 716131 763594
10735 763594 839197 780429 808261 856223 781948 705775 853192 830179 823501 957396 1029531
10724 1029531 927944 851975 794034 797356 790023 843718 902395 889136 872996 937486 921640
10713 921640 908526 910453 798658 815962 892445 920017 992166 944793 918494 807175 830592
10702 830592 954373 958045 882605 980041 944882 956953 953122 872948 894087 929071 912875 1026224
10690 1026224 1005969 931638 962570 993857 1067294 1087474 1077940 1089982 1087317 1097190 1020356 1075494
10678 1075494 1145898 1185098 1199115 1135126 1192080 1160044 1198111 1107281 1168745 1241345 1288099
10667 1288099 1293739 1298511 1251936 1280207 1386278 1418849 1499089 1567589 1577284 1655737 1663434 1673285
10655 1673285 1652640 1802588 1905108 2050792 2041584 1886349 1904113 1957505 1835580 1923603
10645 1923603 2080251 2098383 2189370 2307390 2332832 2383003 2322429 2304574 2399896 2455814 2476867
10634 2476867 2604667 2663280 2779256 2798671 2885677 2939858 3100213 3182374 3272846 3295865 3415437
10623 3415437 3512364 3558399 3720892 3881899 3942507 3998804 4109166 4113411 4298711 4441179
10613 4441179 4560471 4584759 4738060 4816675 4932238 4887958 5015693 4999782 5116658 5432594
10603 5432594 5675752 5890478 6116827 6310220 6512039 6815051 7035497 7182950 7381148
10594 7381148 7630039 8054552 8448763 8762632 9084981 9421409 9913842 10437896 10956673
10585 10956673 11417159 12021538 12738101 13392834 14202276 15111111 15959280 16880745 17960016
10576 17960016 19188214 20920823 22632487 23769986 24388803 25107028 26057791 27397175
10568 27397175 29354119 31972553 35244496 39131294 43719970 49385577 56266003 65295265
10560 65295265 76410076 86535648 90865958 85911047 75481140 65039758 56505570
10553 56505570 51103386 47986444 46551921 46345862 46647330 46210258 43645893 39376953
10545 39376953 35343467 32527787 30612605 29485820 28750645 28360357 28205240 28391065 28735671
10536 28735671 29233518 30230380 31550110 33442156 35711975 38511291 42084110 46520431
10528 46520431 51111217 54285940 55080890 54965600 55979872 58700127 63181954 69537808
10520 69537808 78007420 87955475 97277923 100672756 94911233 80289542 64138400 52458877
10512 52458877 44465410 38941515 34797221 31512582 29003727 26995757 25492570 24356307
10504 24356307 23771260 23662351 23172165 22083915 20215338 18104640 16433375 15167971
10496 15167971 14308400 13468782 12587532 11810776 11210166 10653932 10143763 9692024 9225124
10487 9225124 8755381 8404166 8120243 7965958 7748840 7471727 7218467 6985096 6633189
10478 6633189 6304874 6167682 5903515 5741736 5597345 5440073 5400095 5192620 5046011 4974640
10468 4974640 4879620 4670243 4512786 4331749 4204538 4122758 3946222 3824751 3736051 3651927
10458 3651927 3618319 3666326 3566745 3499367 3406337 3332523 3276866 3093900 2908303 2829555 2912469
10447 2912469 2975366 2877149 2746685 2626076 2616824 2645605 2648796 2498585 2457227 2484655 2348070
10436 2348070 2301172 2227177 2204191 2238902 2320263 2276363 2134361 2033358 2065949 2110810 2126118
10425 2126118 2036570 1940644 1947212 1871482 1964669 1923112 2055969 1949369 1843530 1773644 1702978
10414 1702978 1740369 1720042 1762006 1818609 1837623 1846959 1766743 1790113 1768097 1803481 1718952
10403 1718952 1704709 1735502 1742781 1704172 1655129 1730591 1760430 1772898 1808319 1851529 1817289
10392 1817289 1690095 1654209 1688036 1773143 1689462 1722199 1676527 1734316 1834652 1792256 1726018
10381 1726018 1761241 1680227 1752136 1753837 1747343 1849738 1791434 1947159 1959138 1977480 2038033
10370 2038033 2093359 2017977 1995401 2092335 2188158 2210635 2211581 2200375 2151004 2255200 2241315
10359 2241315 2194743 2361244 2469428 2492919 2496554 2480520 2544797 2533277 2283801 2389527 2466562
10348 2466562 2526040 2434619 2448852 2522606 2598233 2619495 2602246 2544264 2565879 2508324 2485079
10337 2485079 2555991 2615463 2670235 2722751 2702375 2664968 2728947 2940494 3017988 3117225 3149277
10326 3149277 3166556 3233463 3307878 3495116 3640120 3743977 3876457 4084462 4163389 4348085
10316 4348085 4483563 4587633 4842755 4933372 5166284 5423111 5545529 5742144 6003257 6155642
10306 6155642 6529184 6889402 7346686 7819182 8387734 9094964 9916544 10848736 11997276
10297 11997276 13273263 14877255 16616568 18874065 21659152 24954866 28966289 33892573
10289 33892573 40315177 50010394 59032561 62326419 54637910 40382627 30480457 24177340
10281 24177340 20123526 17099933 14887961 13075681 11628701 10352856 9399561 8532305
10273 8532305 7820190 7268945 6905363 6525414 6217949 5822501 5566964 5179604 4941546
10264 4941546 4736993 4533809 4320463 4138329 3966330 3901002 3670379 3489252 3345554 3284766
10254 3284766 3219206 3140592 3130192 2979506 2856736 2748067 2616205 2528327 2589212 2414301
10244 2414301 2215210 2178634 2123778 2076039 2065466 2019911 2014029 2097315 2012413 1909138 1970847
10233 1970847 1917584 1813898 1762213 1759813 1692662 1635631 1623415 1640970 1534323 1546636 1494306
10222 1494306 1562529 1511266 1573542 1531491 1501411 1456393 1496065 1433827 1444096 1399875 1346790
10211 1346790 1293961 1247492 1271043 1208228 1280883 1319438 1243350 1296592 1399081 1367585 1401678
10200 1401678 1433269 1315574 1271296 1280570 1277347 1288549 1266552 1265930 1276982 1346116 1348668 1390571
10188 1390571 1420755 1526403 1492228 1392226 1279923 1356960 1443164 1418455 1325746 1304645 1378507
10177 1378507 1341216 1317534 1343938 1348851 1332491 1347750 1277735 1306811 1332519 1366494 1478727
10166 1478727 1531281 1520383 1419611 1347902 1402333 1430766 1484646 1638166 1797933 1799736 1739218
10155 1739218 1715747 1767032 1812622 1814349 1953328 1976139 2037197 2068175 2024803 2061204 2125707
10144 2125707 2055171 2065819 2111388 2139698 2207977 2163170 2018240 2006908 1984711 1869265 1824933
10133 1824933 1715967 1755276 1656061 1630957 1485487 1441827 1452177 1461670 1431260 1504694 1512483
10122 1512483 1432302 1505372 1403365 1412965 1507267 1522657 1525899 1519583 1435486 1454417 1576296
10111 1576296 1525626 1550075 1663353 1545537 1557972 1587741 1639454 1637426 1694593 1761245 1730953
10100 1730953 1769122 1842313 1832350 1987792 2002771 1955379 2010401 1980111 2125900 2096340 2173267
10089 2173267 2208608 2215183 2274952 2257335 2301158 2340018 2417118 2490473 2595539 2582706 2692840
10078 2692840 2735343 2851596 2950970 2903619 2993368 3163147 3287838 3266433 3306372 3450484
10068 3450484 3487549 3585532 3696571 3695772 3914256 3928925 3991223 4139488 4288472 4243986 4421416
10057 4421416 4700005 4628762 4668466 4861045 5006710 5200733 5283475 5323355 5536054 5698252
10047 5698252 5829269 5917687 6133505 6483785 6769159 6867552 7040365 7364649 7505690 7778856
10037 7778856 8099763 8337526 8643771 9025542 9450619 9854791 10333961 10821619 11407713
10028 11407713 11929452 12544209 13172788 13854868 14588344 15393618 16511390 17607215 18713224
10019 18713224 19941515 21294981 23010291 25023922 26915320 28335493 29143050 29818817
10011 29818817 30828410 32398427 34549548 37462834 41300034 45777853 51227803 57757672
10003 57757672 65760874 76208969 88870523 100096543 104682579 98940930 86715142
9996 86715142 74239471 64386887 57600267 53546616 51584133 51012204 51093829 50582529 48077437
9987 48077437 43601955 38956456 35480358 33177590 31495992 30339846 29721167 29440485
9979 29440485 29384035 29486722 29682174 30450356 31476382 32978684 34887930 37351713 40496140
9970 40496140 44382640 48289617 51089388 52068305 51881937 52380704 54421897 58132856 63512766
9961 63512766 70512498 78732912 86108307 88777645 83954676 72268182 58504351 47965066
9953 47965066 40665807 35584706 31916553 29017011 26715828 24843562 23331288 22048763
9945 22048763 21340283 20981913 20587443 19675785 18318291 16595820 15132504 13963134 13004699
9936 13004699 12236772 11494549 10904933 10258410 9681529 9245650 8735022 8391255 8058188
9927 8058188 7669922 7414920 7187844 7018790 6733916 6456099 6326264 6104222 5908611 5662237
9917 5662237 5475584 5386317 5200367 5023555 4936119 4817727 4668362 4475522 4398890 4337698
9907 4337698 4088658 3999319 3894709 3796278 3684514 3573070 3452229 3363086 3345539 3176865
9897 3176865 3061268 3000539 2993549 2857407 2719669 2679116 2633980 2603005 2583193 2459679 2469869
9886 2469869 2520129 2418684 2472143 2284698 2179194 2169554 2184967 2163183 2110213 2111290 2155620
9875 2155620 1958701 1898770 1993891 1940479 1865211 1938448 1847146 1754211 1698239 1648463 1504552
9864 1504552 1483795 1529888 1477340 1465981 1342864 1359919 1381406 1401238 1244490 1283861 1380017
9853 1380017 1380925 1358260 1299287 1279176 1270932 1311855 1347277 1284880 1264599 1302102 1244233 1263895
9841 1263895 1231877 1124797 1049528 1030897 1155789 1062135 1090053 1017017 1064413 1021632 963522
9830 963522 895583 846102 915057 934172 998710 976929 852745 942470 1033554 1029325 1042775 896137
9818 896137 801295 828724 907449 849677 878590 893063 1007976 976869 983044 989336 1008659 925631
9806 925631 917491 907324 840852 713061 724440 682807 630029 613267 598977 682256 696352 660577
9794 660577 593867 601424 531862 575840 535011 524857 474816 524583 471253 515846 514133 490046
9782 490046 461810 407304 460425 502062 433686 400952 366363 472614 466996 386507 509023
9771 509023 447887 370753 412872 378891 433344 406768 455531 423597 405177 347993 279291 394514
9759 394514 386897 391163 418268 367922 262807 272946 293092 292559 325989 425848 409793 461543
9747 461543 467720 369342 275472 239521 280613 245761 285653 308673 331742 343289 330448 333545
9735 333545 210630 206023 147176 111100 63326 264662 297816 255433 364177 358845 227825
9724 227825 257152 305521 235102 247248 177923 200683 235235 183529 165403 152797 172417 96182
9712 96182 166348 187276 239578 234830 167563 233738 272253 212038 103034 155511 128228 148000
9700 148000 176240 142971 175830 226010 143404 95542 119660 61300 14420 126630 183163
9689 183163 139246 94196 172357 227217 250163 104416 113294 211689 225219 184341 140296 154912
9677 154912 133322 214882 209058 284646 296599 246261 86470 31809 143112 176285 181448 135270
9665 135270 117553 176823 177047 272191 160503 166254 255307 234855 199648 113523 113441 90212 188228
9652 188228 163763 161282 231706 302105 259191 294582 357457 366395 381314 391912 437952 481013
9640 481013 540881 461832 370420 440152 520670 557762 488339 475635 532855 458659 456954 444278
9628 444278 405647 361718 351146 407361 314385 301221 280354 271416 312799 307658 163520 153218
9616 153218 198971 173237 228787 250763 234758 267756 138480 108252 36981 199489 421579
9605 421579 429339 362736 241308 302810 293019 370758 280483 301626 345307 414980 438944 316775
9593 316775 251361 215182 134906 182020 181741 221385 252902 276136 188131 128856 183007 179355
9581 179355 174352 128897 39267 1239 90276 41893 122421 110953 65304 76120 83883 36336
9569 36336 81023 53014 54045 113039 65064 -9798 -34986 75420 56274 83236 46618 7530
9557 7530 83572 87061 65766 102952 90723 122619 176407 114399 97623 105361 13313 132488
9545 132488 107011 10076 62455 80134 142422 39836 43750 28688 -29158 26604 149750
9534 149750 156413 127789 70797 89176 55821 -11775 34267 -19552 -22688 -54166 -16326 35401
9522 35401 -3537 26790 70368 -3026 144627 170506 72957 31640 9537 -9124 32111 111427
9510 111427 57396 -76940 -77067 37960 -3161 -16447 16291 70988 24106 101474 159351 192388
9498 192388 112462 90741 23742 -13512 64596 -121029 -172093 -68225 34580 99156 -10397
9487 -10397 -59309 48140 63278 18058 42150 -5165 64928 10120 -116285 2106 -17741
9476 -17741 -15164 -53338 14615 7797 14106 19022 -6701 -176 -16156 67333 13697 -25966 76159
9463 76159 55473 -48269 -97152 -72113 -6544 -49132 -86714 -32369 88759 80355 102635 67394
9451 67394 65588 69773 14993 -26274 28487 -11024 2437 106814 80484 -71971 -67959 47152
9439 47152 98470 11766 -59470 -29564 -48901 18658 58611 -4827 -66451 -9852 18322 121005
9427 121005 42784 37051 12233 -39462 15018 -62240 -59197 -4244 23358 131146 40245 35898
9415 35898 34434 -18618 2450 -60277 63271 63178 25302 14056 5779 39426 43363 49245 -60053
9402 -60053 -58987 10700 -38412 -47184 29049 -17595 -69609 -58636 38920 20322 -16943 38406
9390 38406 56831 -66058 -162368 -169333 -130826 -117971 -127520 -29295 55080 -37776 -10913 57079
9378 57079 -22953 24055 45644 -21458 69400 11348 51335 33383 -75843 -50804 -21938 61762
9366 61762 34115 71150 49312 56929 -17770 61635 66561 -22593 43980 23033 -14093 -46622
9354 -46622 -42215 -36229 -4664 -92433 -164782 -72108 17744 -17288 -94492 -221900 -142247 -97010
9342 -97010 -94824 -9511 34976 -104462 -126753 9903 -3927 29504 -34221 -26634 -13546 -45271
9330 -45271 -162359 -72914 59378 22116 25055 -42609 -48481 30431 41819 -45391 -116395 -172818
9318 -172818 -98096 1421 19014 -39647 -48791 6523 -68309 -148458 -142788 -87927 -58406 -21182
9306 -21182 -45883 -14438 -110314 -121462 -97729 -46121 -70088 -93837 -91204 -21697 -103927 -35052
9294 -35052 -63483 -31889 -26414 -46998 -56357 -63077 -147966 -99340 -47465 -96610 -103208 -121996 -116343
9281 -116343 -169688 -107447 -135883 -22289 48937 -10689 -7426 -47563 2695 -60560 -146042 -106534
9269 -106534 -64919 -15051 -85077 -103779 -153143 -19899 4039 -96801 -22684 -44683 -131441
9258 -131441 -121827 -103606 -91402 -115026 -52671 -88497 -64471 -82433 -115822 -88728 -89475 -169384
9246 -169384 -158492 -109309 -99171 -111285 -75175 -82773 -108849 -48993 -9951 -64911 -61887 -132483
9234 -132483 -160144 -86604 -18325 -21898 21419 1349 34621 13872 -24453 -69325 -15260 -12028
9222 -12028 -127809 -39785 55215 18308 -18195 -17471 -29669 19634 -68251 -118224 -80749 8281
9210 8281 35827 11270 44097 49275 33282 -23338 -55373 -100417 -57026 39107 -40180 -33121
9198 -33121 -18399 45489 113173 -53808 -159831 -52285 43159 48043 -15943 -202753 -60457
9187 -60457 291 -34098 -21128 8595 -92967 -41508 -20731 9026 -830 -50040 -58719 -26655
9175 -26655 -23991 -20398 25912 40696 -39404 -107019 -67841 -95175 -77905 -118320 -471 64564
9163 64564 27744 -13195 -40936 -126325 -115636 -131751 -126573 -78725 66105 86306 87177 9340
9151 9340 94987 29512 -3468 -45125 -35823 76180 71411 45192 -62460 -40460 32523 -31776
9139 -31776 80195 142835 -27764 -119150 -42820 61694 69601 11602 -87994 -68491 -111902
9128 -111902 -64967 -26932 -102834 -112426 37508 138592 82725 64104 4320 80798 -2159
9117 -2159 32301 83616 91717 125932 18864 -30844 20149 -38422 39920 76597 108419 192590
9105 192590 254126 285247 342283 343182 308195 239145 302362 294662 374177 297240 230605 294831
9093 294831 229764 254458 267535 356631 376526 398845 340702 435498 433363 499211 516013 579228
9081 579228 558264 527939 563990 548070 420366 409674 222029 151402 111265 24328 48085
9070 48085 8242 101494 114109 88760 146933 126427 100117 142856 13540 81221 149262 102700
9058 102700 91218 129961 221673 213139 126518 138680 199991 165292 182216 97320 47276 77246
9046 77246 110918 -21978 -26606 -59347 -49504 29393 70924 88271 64766 55003 -7125 88250
9034 88250 139985 132716 197502 106851 158204 199617 171594 158680 109674 43552 -2100 137662
9022 137662 47405 -20641 9697 52274 113810 96704 152276 175358 95967 107048 147124 150673
9010 150673 195898 107635 37647 -529 164783 126936 103878 143812 48952 29765 78550
8999 78550 107279 136160 200295 102727 182105 73761 19865 102919 74857 16962 -44837 -34306
8987 -34306 7560 51294 -21472 41132 115079 77557 9632 -95290 -148426 -77901 -73546 -66954
8975 -66954 56070 42594 -8584 -10787 45996 39149 15634 -49819 -44454 15060 -14174 -78640
8963 -78640 -12860 2990 -41017 57828 159511 45816 -44367 -66899 44979 -16856 -90010
8952 -90010 20738 135497 122655 129096 114231 50495 32621 16831 -10717 -162300 -71826
8941 -71826 69108 127572 171405 125486 142435 184263 88326 38480 -2800 -57712 69451
8930 69451 29766 -62533 62369 76152 104157 158206 110908 95277 15213 -62517 23546 18759
8918 18759 -23482 -13175 15346 -12934 -85773 -2222 23457 103026 152986 72363 78314 78550
8906 78550 48845 34226 2107 40127 183508 156995 147153 98162 112237 240693 178887 125413
8894 125413 162374 121731 60069 73366 39029 75594 30332 84292 57590 -1617 13351 -15154
8882 -15154 44574 87617 57293 9015 -19636 115285 209858 188621 117282 127707 74636 73079
8870 73079 104465 129807 60487 28736 8222 92332 152858 119872 212585 140657 153068 220424
8858 220424 166438 148245 240586 94502 156233 112366 124308 210252 278273 277877 223880 274675
8846 274675 298755 238179 189240 148863 118170 159972 263636 106251 41550 135556 201832
8835 201832 183931 210533 180340 150973 206761 335346 238875 189381 330790 248432 199528
8824 199528 247844 257510 218608 188107 237702 294794 240932 283742 350450 401736 432195 463672
8812 463672 520886 432549 384948 438456 328673 273959 324932 386186 454652 491775 361119
8801 361119 363393 450898 429781 429021 512201 503920 493109 529504 607312 683580 673629 664256 675042
8788 675042 751118 760309 704553 708572 782329 880043 793310 899559 980965 924802 954292 958367
8776 958367 982705 1042744 929818 917574 1052351 1147913 1152634 1214505 1250860 1258492 1333446 1385727
8764 1385727 1536625 1657602 1670319 1650503 1695459 1808015 1745964 1812329 1937850 2034374 2030311
8753 2030311 2095367 2231203 2358793 2449024 2554834 2543066 2627534 2652114 2660707 2624472 2706581
8742 2706581 2863728 2772176 2867609 2961306 3087404 3055430 3075050 3121340 3160230 3394593 3577483
8731 3577483 3598282 3610294 3838481 4012659 4112434 4288329 4364710 4475319 4571580 4853555
8721 4853555 5118288 5255602 5502399 5883754 6227364 6459250 6742465 7077029 7380432 7773098
8711 7773098 8213952 8509423 8847501 9433592 9933890 10521496 11025142 11706501 12612259 13515268
8701 13515268 14383621 15605694 17070716 18721545 20455937 22694873 25255131 27980209
8693 27980209 31266257 35290944 40019731 45983011 52972443 61724161 72480125 84892932
8685 84892932 96603661 104692299 105109203 97227785 83873617 68306189 55019118 44927724
8677 44927724 37659710 32375670 28364906 25134770 22530118 20264079 18521152 16919670
8669 16919670 15668742 14486491 13405225 12398908 11498417 10740518 10102286 9482797 9046354
8660 9046354 8520291 8170407 7809476 7410158 7076239 6830658 6610266 6350229 6060600 5861424
8650 5861424 5628592 5522381 5374831 5159189 4946953 4710322 4650853 4520273 4308510 4203365
8640 4203365 4098834 3961906 3862045 3655234 3593346 3498433 3348830 3255970 3079476 2946316
8630 2946316 2861604 2800209 2607432 2499122 2433291 2338638 2320126 2316764 2307714 2242349 2190385
8619 2190385 2144048 2064933 2043670 1969717 2008804 1892273 1852582 1852491 1697729 1649309 1579941 1517224
8607 1517224 1467085 1463831 1414076 1310323 1284428 1349953 1328026 1225737 1153410 1199298 1253592
8596 1253592 1283454 1279350 1260477 1107962 1070036 996212 1044244 984677 971510 998150 965938
8585 965938 994183 965231 988377 1050859 942595 899999 844484 855600 844892 993270 1158088
8574 1158088 991306 934264 859014 898724 940836 936549 914873 899747 801176 758307 721095
8563 721095 663331 698537 703700 710814 627622 759932 714808 594977 608427 681394 651912 666001
8551 666001 623753 642952 670586 630482 707859 678883 507152 476707 484978 538783 515080 579168
8539 579168 595643 593245 535011 488994 502806 449707 527938 439312 457664 495311 527186 496587
8527 496587 455974 374480 372298 462800 382790 336640 301270 335457 418198 289941 352793 438833
8515 438833 340144 205558 264430 419380 397778 230689 253862 311064 311270 355064 328052
8504 328052 309979 279741 323306 193128 209118 216085 190684 108493 93105 166336 180936 252289
8492 252289 191893 292504 248113 202686 200636 284031 233165 199912 228029 134454 268282
8481 268282 319090 281951 294060 309141 418581 331547 272139 301531 311360 256730 330820 305583
8469 305583 243561 230481 210206 131522 144903 163055 218128 227744 196392 219825 98786 107251
8457 107251 216835 268270 309936 231494 115067 63922 161065 272134 291586 239292 242243
8446 242243 191665 190392 138367 104772 224806 271146 255588 229312 230317 138504 171565 84981
8434 84981 72643 235905 328767 218660 153337 125286 136572 187887 100320 89551 85413 -8713
8422 -8713 98608 129877 172544 75330 50062 181516 201023 152488 214123 199535 222427 156066
8410 156066 135444 164417 124912 143889 -85 36758 165896 109377 155989 181426 166486
8399 166486 199797 216273 147934 42437 100101 112322 28261 186789 149418 195503 219500
8388 219500 65110 148583 193993 184400 223080 295032 237067 256907 177312 107708 60401 90150
8376 90150 94047 106761 46260 130629 103923 57050 12518 106047 162917 241596 228704 315872
8364 315872 349932 165293 153554 115130 165636 168512 128571 44698 121063 18955 100808
8353 100808 185602 128918 51861 53465 76139 10525 29024 46152 84851 46731 3196 -12440
8341 -12440 1679 69542 93101 10155 -2837 40484 91839 83790 -11760 44994 142759 102940
8329 102940 73646 20892 89712 119664 11130 41438 117478 3666 35654 117349 46492
8318 46492 32495 142166 122781 6842 65715 73885 79494 -30015 -1755 10746 77719 -40797
8306 -40797 -30140 31741 15128 43792 93533 229032 213230 116975 133765 84260 106387 153122
8294 153122 199442 285713 282731 260749 309027 334049 354210 402067 430428 520630 525602 516264
8282 516264 423472 366811 293030 255142 258716 235517 201241 265712 182798 103086 63407 60790
8270 60790 30030 71381 112691 67584 60681 27676 138024 131359 117938 178045 185086 153697
8258 153697 59173 146993 135263 143142 40770 74414 145962 144268 52555 1271 -52390 -102773
8246 -102773 -7412 1179 24887 -8884 60187 34123 32053 -24845 -152343 -69589 65343 84827
8234 84827 7259 13387 -35484 94367 22645 -88520 -66380 -76546 -46376 -68228 -108125 -93441
8222 -93441 -63596 -37243 5009 -82781 -39558 -72519 -71965 41642 40917 29611 117576 15407
8210 15407 -21198 -160007 -90881 -185454 -183211 -153068 -69634 -74259 -9176 -116286 -39018 -99544
8198 -99544 -65726 -202160 -192040 -313433 -342689 -1010676 -1287780 141473 205552 295253 172335
8187 172335 165474 182579 88559 115958 158577 179260 193858 152793 201829 111254 43112 120766
8175 120766 127663 41142 41916 29401 118756 80682 135262 137038 107866 89534 75760 -38137
8163 -38137 -41917 -4734 17021 71935 -47454 -43332 -63437 -23394 12750 65860 69829 -40945
8151 -40945 -12668 -69681 -2545 39573 3356 108776 -10149 -69558 -104318 -50594 -35315
8140 -35315 -4764 -23902 34904 25249 59131 52188 140456 133583 44666 -11493 -31213 5010
8128 5010 39737 61116 -44830 -90868 25562 -32320 -13059 -81521 -181624 -182437 -98027 -94727
8116 -94727 44424 45817 -51602 -14504 -78841 -75619 -47207 41303 2467 47403 43158 25897
8104 25897 -1754 103717 100144 -23691 -56957 -64378 -22937 -41382 -55039 -87049 -145737 -156587
8092 -156587 -43157 -97245 -77237 -9135 -76074 -51728 56368 -4045 -2638 -7251 24203 7043
8080 7043 -45509 -114553 -108627 -146548 -188020 -104291 -110340 -30426 -112421 -118898 -51548 -77812 -91208
8067 -91208 3179 52455 28517 -124359 -182436 -43870 -50226 -83244 -58642 -78219 -41847 -111157
8055 -111157 -163683 -173013 -178553 -195920 -160011 -61092 -93654 -61307 -156594 -144081 -71901 21125
8043 21125 39091 -43227 -75570 -174602 -77415 13470 -7717 -33710 -50917 -37849 87425 31606
8031 31606 26196 57991 -44280 22485 48551 77787 48404 124026 80287 40337 38375 9382
8019 9382 -32982 -157719 -134144 -54862 -79986 -92869 -34507 -99881 -149642 -114785 31461 4371
8007 4371 -30718 47000 55723 5460 66839 44734 55534 50092 23925 -8719 -88923 -84153 -132513
7994 -132513 -112672 -131424 -79359 -36452 16484 -8174 -131909 -110166 -88375 -87957 -93416 12383
7982 12383 13948 99944 180014 271921 216919 139035 57413 -1828 -22791 127415 199824 117105
7970 117105 25915 -13237 114500 197262 39461 24906 156858 118098 107890 24569 -8268
7959 -8268 89491 136142 69354 42481 -85519 -61119 -8269 13351 111544 156620 59605 -59812
7947 -59812 -18837 -9551 61435 95997 29019 41635 112819 136009 17489 -54691 -62178 -7410
7935 -7410 11689 96149 206238 140174 208913 132650 81845 141664 244153 298358 332429 267848
7923 267848 239832 226964 128618 127416 169287 155038 136582 220470 266921 219581 209462 274305
7911 274305 205866 175993 133387 168881 99803 154268 238993 253260 178579 139144 110205 122813
7899 122813 87014 64233 214778 11984 -23046 55418 -51396 -37130 50650 36462 -1669
7888 -1669 86976 38802 32783 1759 38376 67050 176666 86724 169944 210502 254226 115320
7876 115320 69172 121897 96543 100461 93943 99445 141469 161159 59524 2943 93687 78742
7864 78742 172010 169361 125424 96993 109494 115282 78377 74045 51727 194375 235093 151665
7852 151665 96660 178653 159673 209650 88914 36239 97357 218312 171471 216015 204268
7841 204268 107377 130846 111731 117735 148305 122344 125072 130661 215453 126749 175253 195004
7829 195004 227842 291784 323243 325294 386127 424808 384815 325752 242556 129783 69268 143679
7817 143679 150474 81607 103718 15349 204148 139716 151455 18304 194090 385528 358591
7806 358591 373147 222767 147823 96639 172217 139412 204200 165576 181193 85577 122398
7795 122398 204171 247887 161179 224637 250440 225089 268214 239289 107275 133790 285199
7784 285199 299368 247521 167772 191708 226746 185343 202791 253454 273808 264046 186219 285087
7772 285087 372368 284853 273866 147413 111820 259591 352849 287097 368734 357551 224152
7761 224152 289139 272388 303671 436571 321047 350272 395137 377774 440745 477935 405349
7750 405349 468852 407332 474377 507242 397181 354396 455359 535194 560765 521452 542145
7739 542145 685550 558953 604690 625163 654805 613747 636925 677893 777966 819674 815317
7728 815317 858265 903602 879020 961535 906616 995809 1025306 938768 928291 954906 1018658 1050028
7716 1050028 1025791 1161129 1304585 1270771 1195545 1225362 1245537 1285985 1412469 1446942 1473232
7705 1473232 1560342 1557024 1551206 1542583 1634936 1697497 1716236 1824729 1839270 1915340 2009688 2040342
7693 2040342 2097699 2197132 2214538 2267968 2213989 2283508 2406869 2543698 2604766 2713882 2762401
7682 2762401 2937764 3060128 3167734 3249567 3391291 3534919 3631345 3801312 4003833 4257547
7672 4257547 4424728 4714973 4911395 5143734 5435748 5722432 6075909 6356795 6827688 7411045
7662 7411045 8081974 8712697 9469493 10359358 11393381 12541389 14002510 15613332 17653049
7653 17653049 20089266 23247924 26841804 29955789 30983578 29424953 26288961 23340733
7645 23340733 21736352 21040824 21156298 21832019 23004241 24785038 27371501 30105836 31477580
7636 31477580 30140563 26409735 21959125 18502168 16168834 14521464 13205567 12254783
7628 12254783 11459550 10924491 10467978 10018644 9739625 9609933 9507249 9448074 9372171 9318117
7618 9318117 9339104 9576159 9763439 9932532 10312042 10803532 11188930 11807604 12622023 13386416
7608 13386416 14253748 15482799 16979213 18490862 20438649 22996975 25813585 29545450
7600 29545450 34063132 38674403 41690216 41429502 38059703 33509988 30119687 28402747
7592 28402747 27909620 28058859 29108889 30922425 33763914 37302948 40137755 40303428 36715084
7583 36715084 31044769 25539260 21340100 18201374 15857687 14185978 12705480 11470941
7575 11470941 10477556 9671396 8993409 8362610 7861046 7379203 6990576 6615014 6198040
7566 6198040 6016503 5728423 5469570 5360393 5145747 4968063 4778702 4474342 4298972 4184873
7556 4184873 4106093 4087779 3934906 3764656 3647914 3548627 3444760 3348014 3433542 3360486 3243498
7545 3243498 3222653 3182884 3012382 2913686 2873042 2748974 2768148 2679243 2557520 2503700 2531347
7534 2531347 2463503 2381890 2355028 2305894 2265912 2259082 2267828 2237733 2230761 2248731 2188920 2182167
7522 2182167 2268318 2212607 2165512 2181930 2248959 2142668 1930983 1974200 1870165 1739242 1703893
7511 1703893 1874479 1949929 1897894 1861554 1831335 1812609 1764920 1854751 1833828 1909494 1871161
7500 1871161 1785985 1848520 1837934 1785958 1739011 1802420 1868366 1926670 1989408 2022843 2098909
7489 2098909 2266946 2319184 2300419 2345373 2505259 2649883 2757934 2921071 3136576 3369508
7479 3369508 3292587 2990957 2667734 2431734 2251146 2106954 1974550 1898857 1791282 1748480
7469 1748480 1744698 1614735 1566708 1493301 1459761 1447512 1424441 1401123 1409284 1466216 1338227
7458 1338227 1459456 1474809 1471974 1576886 1495342 1409720 1374009 1423611 1417665 1355396 1368898
7447 1368898 1423426 1462263 1510518 1467254 1431500 1471716 1467411 1480696 1620837 1555695 1494455
7436 1494455 1583684 1544733 1583732 1584426 1515190 1584970 1524699 1398683 1469460 1594678 1483273
7425 1483273 1444307 1403342 1433897 1447905 1422746 1421724 1398367 1521387 1536587 1571892 1623391
7414 1623391 1633343 1672941 1693030 1802483 1914571 1871423 1899077 1920923 1970527 1884532 2013196
7403 2013196 1996535 2123383 2213233 2214689 2161159 2105702 2161090 2129847 2263564 2284166 2291897
7392 2291897 2389387 2455158 2497878 2493176 2412046 2450557 2659261 2680180 2756092 2821568 2908422
7381 2908422 2915910 2983432 2996226 3015332 3209527 3259843 3355625 3464137 3574656 3525171 3594740
7370 3594740 3687141 3774736 3834215 3986998 4073293 4244689 4413979 4537447 4541988 4675032 4985238
7359 4985238 5080937 5150709 5400631 5602571 5786475 6053815 6282984 6585999 6981322 7323329
7349 7323329 7784171 8205804 8781590 9366789 10190493 11053468 12063639 13213057 14562516
7340 14562516 16369059 18365185 20793170 23643448 27160283 31491581 35490096 37174966
7332 37174966 35121854 30250780 25323692 21719100 19220739 17567250 16409797 15462872
7324 15462872 14887647 14481257 14250385 14230204 14333922 14653334 15240839 16103316 16957570 17787462
7314 17787462 19155681 20864560 23009434 25614356 28751841 33018731 37515231 40572414
7306 40572414 40125149 36027471 30326159 25399065 21930797 19522019 17935146 16678680
7298 16678680 15741502 15077993 14669224 14349805 14128144 14179681 14439365 14837028 15410928 16147974
7288 16147974 17224142 18444924 19954952 22106190 24822850 27780995 29979465 29912223
7280 29912223 27253642 23425523 19985351 17661777 16027436 14859066 14147122 13507128
7272 13507128 13078127 12731738 12487871 12525803 12690268 12891989 13266455 13911915 14728971 15548881
7262 15548881 16615807 17933526 19604910 21670873 24182584 27497617 30689413 31997862
7254 31997862 30239137 26333258 22088437 18668760 16385431 14766176 13572212 12639425
7246 12639425 11812778 11133279 10621033 10299503 10054887 9880367 9729188 9707284 9640051 9318410
7236 9318410 9311202 9337547 9340650 9248305 9232328 9236382 9319588 9301476 9326182 9469142 9596110 9684378
7224 9684378 9801983 10014200 10165200 10269194 10351232 10414893 10556524 10695918 10886344 11073354
7214 11073354 11188688 11174872 11315507 11362341 11479686 11690169 11863273 11987489 12138365 12395268
7204 12395268 12622550 13045290 13241997 13643053 14145444 14497748 14986460 15605914 16005262
7195 16005262 16434175 17115245 17712070 18276098 19022570 19827890 20578751 21560829 22659359
7186 22659359 23677788 24908204 26136224 27322703 28668198 30083455 31617318 33311599
7178 33311599 35151056 37073820 39107590 41310808 43931906 47009270 50598470 55026429
7170 55026429 60297358 66401802 73262796 81162713 90158871 100697886 113361350 128629497
7162 128629497 146567999 167802496 193309668 224577087 266368678 317836881 358951311
7155 358951311 363447221 318466038 251201663 196784553 159591111 133937719 115071249
7148 115071249 100521335 88894378 79277743 71234444 64372093 58677428 54079175 50032366
7140 50032366 46590687 43447573 40615553 38031163 35781397 33834877 32060175 30408854
7132 30408854 29013612 27802353 26564247 25363231 24212636 23153215 22307336 21516458
7124 21516458 20831774 20155937 19639453 18974542 18382176 17799976 17134314 16459421 15820392
7115 15820392 15366231 14835385 14405785 14005920 13584568 13355958 12986960 12536732 12270053
7106 12270053 11982321 11583134 11354181 10975920 10510431 10218517 9958464 9777891 9506889
7097 9506889 9226359 9046234 8814686 8599716 8489306 8179249 7879789 7676233 7523061 7401242
7087 7401242 7275432 7096052 6975117 6859891 6619305 6523235 6410483 6182493 6042574 5978555
7077 5978555 5855517 5677672 5484028 5420533 5228548 5112871 5040175 4993098 4886986 4822720
7067 4822720 4793036 4710084 4582163 4526690 4379617 4277402 4062819 3902337 4008338 3970056
7057 3970056 3895470 3828403 3849986 3835503 3700883 3575470 3431802 3396997 3470130 3506389 3579290
7046 3579290 3529285 3428448 3332855 3194388 3153598 3179901 3201659 3269293 3270212 3290975 3157239
7035 3157239 2998416 2932002 2942126 3041531 3098982 2893161 2823204 2823031 2761776 2693382 2686709 2675065
7023 2675065 2648031 2525679 2558693 2439577 2401484 2435890 2424620 2403525 2468104 2546573 2565972
7012 2565972 2519424 2499934 2498410 2426285 2413709 2503576 2439776 2392087 2453155 2459684 2447889 2355211
7000 2355211 2367719 2415826 2351495 2298622 2093826 2012815 2023248 1904721 2030723 1944076 1902226
6989 1902226 1868084 1951144 1842035 1857548 1809069 1859157 1965472 1814764 1866516 1862444 1899213
6978 1899213 1951587 1816612 1840189 1854603 1850180 1909317 1872608 1818533 1665463 1702960 1658354
6967 1658354 1647013 1660457 1603670 1661255 1658309 1579720 1640092 1681832 1719098 1682176 1607407 1524874
6955 1524874 1514795 1572514 1587841 1628642 1563287 1575622 1573688 1654334 1612648 1562102 1558773 1457468
6943 1457468 1467355 1458024 1412693 1448027 1385110 1406821 1414865 1431822 1399883 1365624 1329881 1414880
6931 1414880 1484377 1508610 1438371 1537817 1460762 1458124 1448233 1411623 1490847 1439882 1509490 1471628
6919 1471628 1484169 1450490 1417539 1466111 1315326 1152918 1167089 1212257 1257347 1262183 1272818
6908 1272818 1234332 1183023 1192186 1159783 1187885 1238774 1093288 1124991 1112958 1113949 1152387 1137206
6896 1137206 1273567 1228530 1201879 1366032 1301345 1225816 1225651 1232075 1242667 1195927 1129728 1220886
6884 1220886 1193922 1229404 1253816 1234575 1256787 1227601 1301296 1299736 1316258 1325454 1304519 1229211
6872 1229211 1241969 1257294 1274874 1184012 1199825 1264462 1197727 1191327 1199388 1330166 1355475 1375904
6860 1375904 1271860 1338418 1308022 1326292 1289474 1279990 1360827 1272496 1312247 1348967 1344705 1333965
6848 1333965 1296880 1306721 1301601 1401499 1370190 1322291 1419428 1513728 1519335 1536687 1717504 1802926
6836 1802926 1844471 2012381 2079407 2220078 2291960 2481111 2693954 2909545 3135700 3196688
6826 3196688 3067277 2884330 2622981 2350271 2296238 2125311 1960086 1935960 2020975 2044389
6816 2044389 2031764 1988514 1988809 1898939 1885748 1843775 1846197 1859783 1818113 1769167 1913601 1920273
6804 1920273 1829708 1847434 1947958 1975867 1934595 1999254 2002957 2035166 2158493 2162099 2086638
6793 2086638 2174287 2185281 2255217 2373894 2347831 2423145 2446885 2490662 2586794 2604617 2669461
6782 2669461 2657276 2722748 2682697 2662347 2769340 2854892 2927694 3003167 2982940 2995663 3047208
6771 3047208 3185997 3256561 3374473 3453800 3529259 3575318 3603352 3771386 3861182 4036220 4174600
6760 4174600 4231845 4287896 4539199 4838537 4950100 5136772 5452362 5646782 5969493 6275934
6750 6275934 6538053 6833952 7313167 7870866 8366625 8963917 9761949 10640476 11781405
6741 11781405 13107592 14379730 15024034 14928913 14417716 14195660 14299436 14870821 15667664
6732 15667664 16698151 18117344 19962449 22284771 24518424 25912327 25727392 24372976
6724 24372976 23565371 23659332 24523711 25608448 26292616 26394430 26407558 27201977 28683003
6715 28683003 30355006 31493673 31895483 31848124 31952177 32619651 33454091 33667853 32366438
6706 32366438 30357727 28993371 28738184 29494069 30905629 32025814 32247314 31310414 30548753
6697 30548753 30518866 30693774 30526086 29483684 27846631 25964249 24727924 24250273 24180704
6688 24180704 23954117 23361347 22689907 22627458 23284034 24404285 24818275 23799785 21180297
6679 21180297 18508503 16576779 15339120 14402525 13742043 13313912 13330428 13530524 13910883
6670 13910883 14023194 13537875 12249490 10690768 9454017 8588385 7983785 7446502 6965338
6661 6965338 6590197 6182232 5851273 5577802 5311176 5125522 4927374 4820464 4673891 4419393
6651 4419393 4205143 4157155 4126524 4078028 3960534 3791469 3658186 3579624 3496399 3507144 3428818
6640 3428818 3329950 3319695 3227556 3095654 3054746 3023477 3045194 3074812 2944663 2853861 2795932
6629 2795932 2786533 2752327 2596327 2437749 2406344 2575696 2617003 2505441 2417375 2321586 2249596
6618 2249596 2212429 2191325 2181487 2098907 2024719 2041697 1877742 1768427 1796160 1867893 1841277
6607 1841277 1823899 1754881 1666437 1656560 1646943 1682491 1692152 1685026 1632124 1628495 1578352 1532896
6595 1532896 1555443 1606134 1443730 1446404 1445852 1416800 1400321 1361519 1356059 1332411 1394283 1347252
6583 1347252 1387106 1338896 1288563 1243595 1277203 1391202 1283829 1296040 1232313 1262529 1289717
6572 1289717 1212736 1244815 1235681 1108397 1214074 1272995 1322926 1201325 1100964 1196099 1224175
6561 1224175 1287009 1226903 1253634 1322982 1374619 1387079 1331069 1401004 1396220 1428958 1379675 1338875
6549 1338875 1400416 1449464 1339417 1301926 1235036 1248431 1254358 1318441 1425373 1421763 1389468
6538 1389468 1466522 1385210 1356385 1314350 1350903 1327660 1261909 1365013 1464744 1377567 1411252
6527 1411252 1298282 1253587 1270959 1260250 1267800 1146400 1226871 1305546 1341233 1286130 1242142
6516 1242142 1178067 1178024 1192323 1182811 1176446 1179770 1184614 1182327 1204085 1181559 1152567 1086622 1062744
6503 1062744 1092755 1165973 1190595 1136657 1124776 1117163 1119328 1141648 1233690 1303076 1271182 1324006
6491 1324006 1364072 1286576 1511550 1526797 1418105 1226388 1190893 1108450 1105214 1024246 1068911
6480 1068911 1026906 1031798 1038462 1083686 1048326 973890 960864 1059023 1058134 976726 1103827 1237780
6468 1237780 1156914 1128344 1202976 1351042 1435616 1491315 1428582 1279965 1297342 1166971 1074804
6457 1074804 1034995 1018931 1046382 1047375 873668 884612 965437 887058 897700 854957 893485 927972
6445 927972 937797 756800 781523 858564 803806 877157 941629 979517 933517 856824 861401 920096
6433 920096 879202 861589 844600 913770 911489 848619 871355 941377 859617 834653 870670 841944
6421 841944 830411 888500 780734 806135 890123 898176 961572 1012757 1102795 1133504 1129442 1139269
6409 1139269 1159319 1208736 1388271 1433672 1401051 1287297 1314357 1376288 1391083 1362906 1463068
6398 1463068 1516004 1445851 1483174 1524989 1529847 1521874 1578570 1639304 1647140 1687917 1771559 1903823
6386 1903823 1983424 2013552 2096870 2106305 2220300 2155546 2189343 2301624 2345280 2392836 2454909
6375 2454909 2519904 2575299 2539277 2522378 2610555 2715345 2623950 2719846 2814606 2999395 3121830
6364 3121830 3197661 3215426 3376277 3525446 3651372 3764473 3768870 3837892 3870926 3893419 3951686
6353 3951686 4040004 4148694 4339783 4462806 4539006 4702147 4871139 5046767 5225807 5450226
6343 5450226 5844298 6111156 6279500 6685782 6975975 7264885 7710982 8232445 8670434 9277501
6333 9277501 10033875 10839725 11856948 12969325 14429137 15946659 17694905 19971864 22639436
6324 22639436 25984390 30221319 33966541 35270390 32867775 28320179 24719672 22508121
6316 22508121 21183699 20463386 20321427 20665453 21362849 22427075 23804331 25826258 28344079
6307 28344079 31374015 35185757 40074565 45941172 51796860 56122197 58013983 57890567
6299 57890567 55423588 49378404 41521382 35037253 30543948 27324690 25158328 23745490
6291 23745490 22739318 22211534 22181391 22453225 23216920 24395438 26136674 28431747 31714371
6282 31714371 35932321 39388249 39554361 35234972 28884713 23680638 20038966 17476290
6274 17476290 15591691 14063203 12757447 11618972 10752270 10050622 9498088 8960455 8520381
6265 8520381 8097415 7723622 7248799 6950314 6798863 6475734 6226320 6069655 5886696 5628662
6255 5628662 5503752 5464009 5317798 5189013 5048979 4938922 4734402 4712634 4709823 4564465
6245 4564465 4492411 4385073 4404863 4406325 4360581 4346673 4284896 4321734 4226276 4099853 4119271
6234 4119271 4053543 4066903 3956460 3939874 4011656 3923659 3921096 3983369 4124649 4121492 4032929
6223 4032929 4109054 4111245 4050144 4146760 4283086 4237845 4351295 4334342 4399063 4475001 4385925
6212 4385925 4364588 4303922 4143484 4195642 4274266 4278761 4340099 4339579 4397546 4633144 4756064
6201 4756064 4834800 4804636 4889823 4943478 5100029 5160362 5177927 5254949 5428257 5625849 5648280
6190 5648280 5660305 5832404 5871732 6070677 6317185 6497093 6681013 6820932 7113424 7333492
6180 7333492 7459823 7577168 7870908 8268461 8676681 9099630 9487864 9970934 10564233 11232147
6170 11232147 12010327 12801323 13804682 15041662 16423981 17956429 19812047 21914293
6162 21914293 24455853 27393442 31065220 35653655 40852436 44821252 45679379 42935096
6154 42935096 38708607 35254083 33361998 32831326 33458865 35064505 37585505 41224078
6146 41224078 45159400 47979213 47993289 44604979 40225790 36744932 34885007 34405083 35194736
6137 35194736 37106990 39607984 41415358 41060777 38048232 33992551 30664291 28599001
6129 28599001 27644482 27421584 27868838 29001650 30878064 33216068 34660747 33565987 30036398
6120 30036398 25281579 21236295 18348574 16134106 14590217 13260460 12305874 11434119
6112 11434119 10705278 10120651 9627948 9098129 8659022 8274135 7840168 7494810 7131982
6103 7131982 6943453 6699672 6486959 6210239 6087003 5919575 5698682 5638293 5401211 5229213
6093 5229213 5089624 4899807 4905727 4756445 4682076 4600848 4509423 4426931 4363650 4273452 4263275
6082 4263275 4228830 3996597 3838755 3821701 3706667 3652010 3600738 3488356 3448612 3432362 3318956
6071 3318956 3242226 3195473 3131602 3174614 3141871 3028845 3117067 3099777 2985425 2803572 2738761
6060 2738761 2735575 2731483 2731041 2811971 2808329 2718838 2687362 2657967 2666855 2664381 2655371 2623378 2593259
6047 2593259 2524954 2484721 2495454 2561128 2570404 2582689 2478789 2412600 2482642 2589315 2570013
6036 2570013 2566538 2731544 2888912 2866108 3073897 3317744 3500792 3660770 3734992 3899047
6026 3899047 3767579 3397167 3116515 2911686 2712820 2685047 2711000 2723561 2612304 2445990
6016 2445990 2428001 2396332 2350659 2276825 2225137 2242189 2347233 2377585 2384305 2419901 2429254 2394715
6004 2394715 2257705 2225049 2346272 2289218 2333906 2466132 2486539 2677676 2730402 2689528 2598401
5993 2598401 2430934 2451574 2437067 2389700 2406192 2236898 2232735 2096670 2029867 2050610 1948091
5982 1948091 1879940 1875446 1776989 1804412 1722991 1836069 1951971 1897825 1867382 1865400 1889192
5971 1889192 1950669 1987866 1980876 1926447 1779555 1611500 1552983 1674098 1603624 1556106 1640046
5960 1640046 1639463 1638231 1563756 1548086 1528792 1577662 1714547 1681627 1649882 1594068 1599691 1613957
5948 1613957 1714036 1679017 1686551 1633237 1660358 1602880 1595251 1683728 1638098 1633586 1634051 1592146
5936 1592146 1613606 1605273 1648220 1630638 1651433 1722880 1758762 1839146 1862890 1910702 1835563 1741707
5924 1741707 1690499 1689364 1683473 1674629 1650859 1662730 1717420 1779375 1821737 1816151 1775607 1796834
5912 1796834 1814686 1763688 1737817 1718506 1820362 1833286 1874429 1867725 1792161 1796975 1939144
5901 1939144 1991751 1967985 1941275 1932206 2026265 2020570 2072116 2244956 2215480 2077118 2080686 2006898
5889 2006898 1969088 2024787 1972363 1952315 1923471 1878269 1911880 1932786 1923385 1943382 2051032
5878 2051032 2158837 2193674 2228865 2171308 2089625 2167298 2167276 2192509 2237324 2223757 2291248 2177368
5866 2177368 2173384 2257680 2232458 2312469 2407749 2382069 2417450 2413929 2425705 2344593 2397694 2525791
5854 2525791 2586135 2595742 2658523 2684464 2757388 2752999 2840638 2928288 3058848 3104481 3119267 3242198
5842 3242198 3275904 3334023 3512986 3592330 3626186 3681140 3822786 3953581 4053100 4079371 4187585
5831 4187585 4348529 4404090 4451616 4538147 4603703 4842790 5087252 5166340 5349530 5443974 5607512
5820 5607512 5874294 6042909 6208218 6407769 6579283 6806911 6936596 7192294 7502482 7841127
5810 7841127 8108099 8201626 8205982 8303078 8317237 8611730 8813480 8989627 9025498 9197977 9432080
5799 9432080 9645337 9760237 9913439 10022499 10113160 10374572 10447974 10511436 10758885 11164035
5789 11164035 11512548 11785511 12054795 12473215 12948974 13379386 13783659 14363781 14957910
5780 14957910 15354155 15978149 16452379 17119686 17784823 18609997 19382652 20264219 21224865
5771 21224865 22248493 23293796 24526713 25659622 26876799 28353063 29845891 31344387
5763 31344387 33058621 34913023 37001749 39313866 41947153 44877678 48367836 52434305
5755 52434305 57214280 62478517 68561815 75595925 83848484 93480384 105224713 119273837
5747 119273837 136026850 155865933 179766358 208974703 246925776 290277283 328471718
5740 328471718 342659613 321240965 274878584 220748570 177569082 147275678 125852824
5733 125852824 109542230 96340576 85306917 76102011 68410854 62233506 57213036 53150208
5725 53150208 49562382 46280115 43264143 40219370 37556385 35258601 33340207 31628476
5717 31628476 30036289 28652579 27352292 26193994 25069143 23892157 22782452 21832206
5709 21832206 21038821 20252925 19551457 18940699 18265805 17513122 16938996 16377665 15884758
5700 15884758 15258334 14683620 14299921 13824908 13533812 13268557 12984947 12646363 12344677
5691 12344677 12020161 11737169 11320980 10865127 10651416 10321105 9932654 9653889 9410142
5682 9410142 9139441 8854695 8733338 8508949 8223208 8015898 7718765 7542208 7416493 7258422
5672 7258422 7155404 7069550 6846469 6597494 6318967 6318906 6186491 5934466 5860397 5708608 5554820
5661 5554820 5506293 5469404 5323938 5178479 5065907 4914746 4861684 4760654 4740144 4611484
5651 4611484 4551831 4450032 4335189 4194393 4151926 4148557 4064912 3973589 3886876 3778468 3763627
5640 3763627 3670892 3556789 3526825 3514265 3445508 3435174 3388610 3344692 3282579 3422631 3348842
5629 3348842 3300879 3290578 3305448 3383692 3327282 3235614 3191407 3142302 2997845 2936547 2825415
5618 2825415 2793721 2850174 2854712 2807648 2809991 2716223 2657672 2699738 2641676 2615405 2650727 2649146
5606 2649146 2461110 2400108 2456135 2479514 2473513 2472804 2346818 2310650 2389681 2364313 2336199 2329775
5594 2329775 2405845 2451051 2439234 2335722 2272659 2266223 2195241 2188913 2264027 2157340 2113446
5583 2113446 2019053 2023120 2062676 1953977 2003770 1963427 1923125 1981480 2018255 2039222 1850928
5572 1850928 1766284 1773683 1878943 1936606 2006146 2082426 2182888 2142264 2037337 2012714 1868669
5561 1868669 1870071 1799207 1719999 1711170 1663992 1623503 1656637 1659344 1654292 1690506 1621013 1701458
5549 1701458 1711965 1773751 1823193 1665831 1660680 1718211 1705753 1730867 1774064 1743021 1760781
5538 1760781 1814993 1753334 1671245 1545187 1573935 1612068 1540975 1615331 1669454 1574965 1477387
5527 1477387 1508302 1612722 1558393 1567038 1607058 1614126 1554802 1504965 1516993 1409591 1365184
5516 1365184 1416431 1435655 1391516 1502187 1513596 1429631 1350731 1525440 1629996 1571648 1600807
5505 1600807 1592553 1554461 1510576 1562413 1563066 1548820 1515675 1530524 1645255 1594697 1524255 1544361
5493 1544361 1507744 1500690 1494108 1475425 1595030 1614146 1616942 1568013 1636492 1635914 1640596 1655516
5481 1655516 1662676 1616978 1686015 1746984 1738998 1753195 1726606 1748521 1743558 1651302 1706582 1791395
5469 1791395 1787234 1930246 1886068 1979129 2073463 2113786 2130425 2210946 2249802 2317639 2472222
5458 2472222 2541064 2669706 2795805 2881220 3036566 3156456 3417042 3666390 3903989 3926484
5448 3926484 3855964 3599291 3394907 3206185 3220546 3251548 3240522 3217655 3221279 3244060 3322559
5437 3322559 3470905 3481228 3667479 3962625 4224524 4475178 4780365 5258689 5677229 6337579
5427 6337579 6980144 7822860 8835648 9931175 11357936 13033295 14885872 16202338 16523029
5418 16523029 15134555 12415821 9992230 8422723 7258574 6450735 5704145 5079253 4641508
5409 4641508 4320980 4014389 3727554 3506952 3338560 3218565 3156574 2960499 2954647 2884408
5399 2884408 2627028 2579529 2606878 2423480 2391942 2313352 2214842 2125892 2068913 2151767 2128355
5388 2128355 2102943 2017715 1901263 1901413 1832029 1777837 1758873 1783775 1651837 1697594 1766691
5377 1766691 1806197 1806980 1694318 1684715 1665324 1631119 1623118 1680291 1658529 1661703 1576097 1642445
5365 1642445 1534160 1500789 1453217 1290229 1344559 1391043 1407371 1406939 1411605 1353010 1312292 1402730
5353 1402730 1458287 1510011 1478584 1381533 1478524 1411586 1385324 1333437 1267367 1402485 1403926
5342 1403926 1317349 1272447 1411520 1453241 1331557 1299523 1215604 1251928 1375985 1383982 1352755
5331 1352755 1379794 1260522 1303482 1371348 1391425 1328723 1350823 1298250 1302086 1293521 1249580 1274801
5319 1274801 1241542 1292341 1333762 1275011 1309105 1378447 1333828 1328142 1312932 1323585 1389091 1361730
5307 1361730 1336230 1266935 1329114 1288750 1213760 1331475 1365561 1319891 1287144 1323803 1338531
5296 1338531 1360905 1303479 1414688 1397899 1353390 1313011 1355637 1418283 1469598 1417458 1426112
5285 1426112 1420442 1381374 1437326 1518731 1491187 1453075 1401758 1448456 1500923 1421378 1474271 1436471
5273 1436471 1459076 1419682 1410185 1464903 1452207 1491271 1484812 1410484 1467401 1591099 1480345
5262 1480345 1438640 1500721 1444527 1487160 1529926 1518903 1616975 1708133 1624660 1549493 1577597
5251 1577597 1496261 1554996 1484151 1540624 1483112 1524308 1549196 1533806 1599209 1578129 1588458
5240 1588458 1588132 1638180 1586514 1549640 1503806 1468885 1500949 1537472 1480065 1442944 1525629 1616879
5228 1616879 1678496 1664117 1618247 1606914 1644244 1589175 1570596 1646310 1621947 1663171 1687522
5217 1687522 1733662 1698588 1596700 1516843 1526177 1664029 1654949 1660619 1732982 1744685 1681234 1721818
5205 1721818 1758598 1736237 1707978 1694845 1700968 1706818 1718064 1655919 1567456 1687818 1641697 1561126
5193 1561126 1561969 1585151 1657557 1602545 1597702 1644661 1674445 1670840 1705104 1706497 1691025 1693355 1713924
5180 1713924 1755441 1727955 1617724 1639553 1673422 1721996 1612260 1644354 1780721 1733248 1791461
5169 1791461 1661526 1611096 1620080 1556591 1633461 1582027 1645991 1615860 1619424 1672610 1807887
5158 1807887 1722857 1563256 1565778 1670727 1739975 1720828 1654614 1728747 1674711 1766570 1793970
5147 1793970 1680569 1690998 1637600 1674599 1672119 1765592 1783572 1654465 1686313 1779554 1811906
5136 1811906 1855333 1892960 1933943 1870724 1822931 1876161 1809676 1860353 1843905 1773355 1834329
5125 1834329 1819836 1820205 1789105 1778114 1904676 1877108 1904355 1944608 1948196 1985738 1900201 1801211
5113 1801211 1795963 1806585 1813792 1871318 1901360 1917805 1800570 1802293 1821086 1904827 1815571 1808428
5101 1808428 1758105 1763706 1753192 1758359 1706414 1700102 1762414 1786580 1771520 1775158 1882312 1874644
5089 1874644 1916478 1913205 1925406 1888747 1944477 1911593 1910929 1946115 1933542 1907454 1870870 1865130
5077 1865130 1877944 1930659 1901204 1895806 1966635 1947931 1950784 1909537 1970405 1920216 2008571 2095153
5065 2095153 1952483 1968154 1915347 1875661 1864291 1867646 1953116 1932218 1928698 1918014 1844986 1956828
5053 1956828 2039567 2021186 1881424 1899987 1956703 1853123 1830988 1923231 1936146 1934201 1921099
5042 1921099 1984636 2035022 2114398 2220409 2220305 2097115 2090616 1995509 1950030 2003731 1938554 1923529
5030 1923529 1964587 2105410 2104126 2040773 2151927 2186568 2061141 2092463 2128539 2106792 1996035
5019 1996035 2004407 1983910 1990015 2069157 2089719 2144825 2115674 2159125 2231569 2291880 2200393 2214359
5007 2214359 2247481 2175567 2143615 2162553 2184907 2312310 2363176 2376042 2500096 2414545 2277158
4996 2277158 2275625 2294994 2344816 2427232 2383216 2480551 2464573 2512550 2658537 2545033 2525631
4985 2525631 2624116 2682143 2673681 2635419 2676780 2730082 2800556 2738362 2637705 2607286 2690721
4974 2690721 2747718 2762565 2894415 2934910 2995702 3045539 3131447 3154890 3021540 3037942 3095922
4963 3095922 3066969 3143314 3055375 2991601 3007785 3038096 3155341 3139012 3180223 3130731 3127310
4952 3127310 3177596 3131732 3192775 3235897 3340791 3326794 3502535 3533782 3483597 3577720 3624897
4941 3624897 3645383 3762560 3887212 3924424 4069581 4168715 4153693 4047294 3911940 3914554 3802936
4930 3802936 3911391 3863010 3778657 3845844 3925373 3954400 3922515 4043473 4076876 4066097 4010846
4919 4010846 4114131 4242155 4399979 4462557 4523768 4457588 4585935 4642691 4663504 4644900 4671226
4908 4671226 4712563 4779314 4902864 5002087 5017939 5058976 5200319 5223358 5151168 5103328 5135991
4897 5135991 5303140 5298210 5405347 5507438 5632469 5701228 5732420 5815403 5824045 5981221 6132933
4886 6132933 6403585 6601891 6742090 6835215 6790870 6687962 6719175 6864223 6994372 6921894
4876 6921894 6977412 7088516 7108476 7257841 7336018 7405920 7531703 7614207 7689998 7930710 8022059
4865 8022059 8144544 8378221 8577157 8732874 8949925 9204225 9361747 9658213 10001570 10273623
4855 10273623 10602879 10921006 11061543 11167138 11438382 11640175 11803790 11981205 12294982
4846 12294982 12505908 12832579 13231991 13645775 14146012 14863251 15508937 16048646 16695053
4837 16695053 17360142 18105068 18965302 19897392 20672654 21491025 22215709 22730802 23036698
4828 23036698 23064921 22699048 22027908 21017824 19911741 18698732 17421833 16333294 15572044
4819 15572044 14711302 13891962 13197449 12666980 12269451 11802003 11386138 11010886 10655923
4810 10655923 10302618 10072189 9808641 9468987 9266216 9039999 8925993 8725612 8534058
4801 8534058 8401972 8206442 7975911 7934730 7732265 7610500 7541210 7433628 7310950 7163933
4791 7163933 7066030 7027658 6827359 6705331 6559184 6391014 6332985 6309290 6226159 6159018 5928975
4780 5928975 5925046 5878574 5621903 5560465 5523629 5601741 5578711 5355301 5224796 5313514 5256403
4769 5256403 5166557 5083217 4910953 4903671 4910167 4846228 4730719 4668967 4736878 4692461 4578636
4758 4578636 4482989 4483584 4352761 4301130 4342759 4440844 4383121 4331570 4268117 4172328 4209145 4168647
4746 4168647 4027958 4167973 4108614 4072581 4052508 3952576 3910304 3863354 3838839 3746143 3806018
4735 3806018 3681639 3698678 3664166 3573594 3602481 3600999 3571563 3529769 3531177 3374468 3431966
4724 3431966 3429451 3511048 3459450 3386854 3300664 3315500 3240745 3231173 3279761 3245142 3181061 3051853
4712 3051853 3224264 3206980 3159544 3041837 2987297 3078716 3016760 3097322 3067695 3045130 2914270
4701 2914270 2901792 2919289 2919313 2986772 3019888 2915173 2809439 2848472 2849072 2824951 2697152 2791145
4689 2791145 2868336 2874323 2874893 2825502 2738401 2733089 2772544 2758540 2712210 2646263 2628399 2661616
4677 2661616 2658329 2724770 2565289 2590914 2615757 2587772 2729632 2612728 2538404 2627048 2604085
4666 2604085 2562162 2506224 2519534 2536691 2498960 2587552 2577202 2464715 2405301 2393958 2392564
4655 2392564 2479647 2498436 2590127 2540607 2501881 2453563 2416608 2319885 2406319 2442377 2375284
4644 2375284 2405369 2364845 2385896 2370956 2388809 2435280 2368692 2282322 2260346 2309200 2308221 2220205
4632 2220205 2326614 2359968 2352948 2325555 2391673 2391245 2418688 2399604 2419804 2335041 2330575 2403614
4620 2403614 2351848 2409449 2396055 2389793 2464042 2427914 2391493 2392851 2482593 2536421 2416647 2485606
4608 2485606 2507056 2362550 2498432 2520564 2525607 2421483 2412133 2568583 2633810 2673926 2817735
4597 2817735 2779169 2801608 2939516 2976095 3028251 2989755 3057533 3153677 3154867 3153292 3172967 3221319
4585 3221319 3267382 3266088 3292557 3254883 3166439 3205640 3256042 3236365 3339154 3385050 3425380
4574 3425380 3485813 3393376 3351711 3498530 3466626 3376058 3403223 3547765 3765736 3804910 3757095
4563 3757095 3890031 3944016 4050370 4122609 4300881 4403442 4431034 4516267 4624533 4676421
4553 4676421 4869797 4897689 4951187 4914431 4777331 4712396 4751057 4767519 4758955 4791464 4782209
4542 4782209 4756639 4788083 4711777 4591866 4550499 4611523 4704208 4627681 4674067 4795929 4927600
4531 4927600 4983507 5101125 5119177 5190904 5162825 5380450 5528666 5533890 5634529 5845705 6032289
4520 6032289 6113961 6191658 6432947 6503443 6555389 6675950 6687850 6589940 6609203 6675334 6636959
4509 6636959 6686608 6687118 6725548 6735124 6731838 6824435 6834319 6914450 6902013 7057456 7272297 7460071
4497 7460071 7629743 7759158 8023830 8205955 8393861 8661187 9014097 9286130 9447734 9559351
4487 9559351 9588096 9453580 9284275 9096150 8807083 8533670 8251613 8046724 7917785 7907442
4477 7907442 7840372 7890065 7841876 7802926 7826937 7936615 8017004 8058600 8254107 8317336 8370162
4466 8370162 8399837 8454727 8493405 8567338 8719010 8867897 8797116 8700503 8564759 8429949 8227342
4455 8227342 8057108 7773390 7510612 7319930 7176645 6899862 6682939 6499454 6460935 6492573
4445 6492573 6483276 6354976 6304561 6275016 6303221 6270614 6147534 5902521 5754252 5645004 5491689
4434 5491689 5426851 5351754 5251312 5113674 4986610 4755775 4579525 4489465 4404708 4359884
4424 4359884 4265490 4152435 3961141 3902298 3900019 3787467 3739895 3689802 3606276 3519204 3460940
4413 3460940 3379876 3387569 3350723 3316860 3298110 3224334 3129015 3059669 3022008 2884725 2807646
4402 2807646 2921608 2965711 2866460 2747205 2732599 2711140 2670442 2569524 2440183 2512676 2523339
4391 2523339 2476171 2365010 2337247 2315793 2241279 2209237 2180253 2215542 2095829 2059167 2033414
4380 2033414 2109980 2002394 2003905 1941323 1881382 1904418 2003400 1983220 1889892 1896754 1861151 1835483
4368 1835483 1780528 1673839 1618915 1713094 1666143 1566025 1655770 1691130 1605808 1563636 1617387
4357 1617387 1504669 1294246 1262110 1270502 1268015 1272465 1251069 1283217 1271798 1321631 1390032 1288623
4345 1288623 1317797 1351085 1323974 1250840 1234035 1097781 1097370 1158492 1131363 1099958 1016147 1014691
4333 1014691 1039899 1083121 1108169 973494 1078447 1056228 1029424 967303 910446 1052913 1007479
4322 1007479 1013149 1058792 1007703 905619 936739 772664 828754 813942 778255 848481 909359
4311 909359 940272 844681 813176 795650 768304 822528 670698 691995 705436 710289 708849 729785
4299 729785 688262 604746 622087 709928 721314 623477 636535 586048 622759 506047 537924
4288 537924 587276 644689 665860 508190 525410 562803 556948 640120 708790 583620 577720 604722
4276 604722 584106 672821 745575 704690 550612 555889 663673 684475 615751 552689 511678
4265 511678 617637 630761 603942 514575 532484 539069 530173 569703 579135 586619 606961 630952
4253 630952 625336 595054 552527 536923 536384 551868 554969 506442 563841 620997 657339 705952
4241 705952 748175 696201 586414 583116 639305 755642 799655 805435 793916 727838 769032 729846
4229 729846 758223 739025 777853 756011 664958 657730 645156 673311 610135 586603 610593 565503
4217 565503 630500 632983 661484 710800 832936 967859 962286 864966 759424 819200 830834
4206 830834 807505 897015 966820 913643 874770 897170 774104 745588 882248 775827 840966
4195 840966 950289 857408 803521 886987 851994 912512 839283 812697 896691 959759 925955
4184 925955 865329 860184 859673 866321 920484 954973 987205 1025501 970726 938346 1033029 1072964
4172 1072964 960535 937100 905331 878635 877192 815949 769670 867792 882039 810555 780340
4161 780340 831301 756517 769042 792828 925459 772303 828222 823770 755520 836385 868761
4150 868761 800203 662552 713116 650763 751231 775772 712869 759615 792252 793985 771881
4139 771881 740483 738259 683586 704868 587134 493402 562803 594798 588499 622753 643969 606433
4127 606433 613762 584170 455537 444879 550161 546097 434133 371296 425904 444933 409269
4116 409269 406517 406016 496289 447036 423151 477133 446741 295212 280601 362050 374084 374620
4104 374620 453285 394975 440299 493973 449081 252137 298087 261271 249040 257801 218821 262841
4092 262841 218207 181037 181179 118137 146687 166514 219213 172884 277455 338009 320452 315330
4080 315330 191544 230134 249917 194299 247773 265070 90805 197139 211946 145233 234951
4069 234951 286390 197365 151676 122135 91814 187661 153856 36788 -13628 52790 210447
4058 210447 117145 214592 49768 139692 163921 21183 73965 158152 116562 86076 224712
4047 224712 238283 165749 58995 31144 62695 42195 84403 205319 143236 117065 189429
4036 189429 178241 127168 88181 29049 -11271 7631 -58821 47558 152588 164299 133971
4025 133971 156036 175726 204667 210548 188616 198839 193240 115155 44571 105978 100821 92786
4013 92786 82416 75427 104567 165014 159059 59975 114684 140734 79558 101106 72040 144081
4001 144081 163991 67128 102768 180193 80967 100181 175293 88809 79311 61915 8115 38579
3989 38579 71912 30125 5781 -81130 1216 26328 76406 120331 25135 53433 32150 61027
3977 61027 29152 52093 85591 61530 156000 176362 216675 176356 109565 119878 152067 147886
3965 147886 251719 199416 169897 147244 104240 227429 297630 376680 313489 380612 508120
3954 508120 418027 305683 246241 220555 224771 141546 82440 37185 116235 191759 92758 137693
3942 137693 74121 87872 96492 67742 127867 80640 113113 83258 61022 21553 69540 100611
3930 100611 59523 102817 98185 67164 76025 42617 29573 20770 21932 19340 107473 93694 4290
3917 4290 46236 67131 8972 53285 86585 130190 149151 169716 99422 56568 29851 94966
3905 94966 88336 98369 28101 119182 81117 47751 87933 149744 107121 77992 42275 51569
3893 51569 -7508 -44120 50354 171419 157771 88142 89232 -49383 15156 -17195 45610 32531
3881 32531 27604 53525 93154 94250 173935 136720 3758 -49297 104189 136593 79193 30294
3869 30294 66524 57249 -7264 48391 66717 54901 66805 133805 91413 233657 225149 176821
3857 176821 97984 66368 169254 155062 155351 208167 255379 217901 114934 88012 65395 101917
3845 101917 92909 59720 114815 135219 176299 80203 152470 227707 220862 118785 126668 67409
3833 67409 75091 198510 209154 170263 154548 101402 96816 91644 93965 117543 138727 95862
3821 95862 149213 165279 202071 228852 159308 157882 166020 190447 254420 287958 298778 250084
3809 250084 171245 216308 278505 271881 283214 302480 240206 272810 273379 131594 176774 375676
3797 375676 337735 294761 291532 213724 341756 382860 353807 342005 266810 312704 378699 416430
3785 416430 410841 411957 415366 429068 496307 480844 510676 406529 430203 521749 606291 665978
3773 665978 699469 685282 638868 622023 659819 679806 753771 935765 936730 881421 826738 813132
3761 813132 901394 989644 860887 856637 925981 967620 979079 1107358 1154788 1204664 1238959
3750 1238959 1202641 1227203 1191693 1205470 1196439 1301916 1318530 1257156 1268545 1206835 1340347
3739 1340347 1238260 1296489 1395544 1495479 1580830 1671388 1728952 1770795 1812339 1902149 2022345
3728 2022345 2156790 2224650 2211804 2332743 2386321 2570618 2639107 2728458 2788074 3002238 3257940
3717 3257940 3454830 3569112 3634260 3868477 4094046 4389817 4709816 4933394 5180712 5711140
3707 5711140 6136712 6622783 7137193 7944070 8667618 9353765 9917964 10721322 11698006 12832989
3697 12832989 14371873 16559617 18994450 21934633 25485276 29735179 35068079 43496870
3689 43496870 52068624 56120847 50979007 38647840 29330271 23543933 19861258 16981183
3681 16981183 14793734 12987609 11592219 10441604 9603089 8844499 8460391 8173300 7749511
3672 7749511 7288746 6540250 5978006 5539402 5100220 4759802 4471055 4329631 4153609 4043268
3662 4043268 3821439 3585728 3357585 3220305 3125980 2961651 2905300 2912171 2800892 2604837
3652 2604837 2519404 2468190 2319448 2235582 2110780 2070304 1963763 1829598 1802030 1806639 1884469
3641 1884469 1757817 1596163 1470285 1552182 1498215 1597774 1583109 1438490 1361752 1314431 1198716
3630 1198716 1234104 1298587 1242902 1171536 1123591 1061804 1077015 1126053 1154465 995709 915067
3619 915067 936332 1032837 1003777 914395 869150 785792 755315 742531 650130 681388 675264 711174
3607 711174 709146 687637 750033 684545 612271 582215 630501 632770 627081 641801 638600 636808 675758
3594 675758 636089 551444 524992 639241 612919 502439 453820 456652 408686 395456 489186
3583 489186 458893 366078 330094 439714 510376 545640 513441 436874 419787 405762 391841
3572 391841 339236 422626 365824 353872 364010 305999 326902 434241 499883 394936 382823
3561 382823 309036 309054 319355 374373 319960 297516 415891 345699 247674 364783 303262 348384
3549 348384 330158 299944 325931 236497 271462 198573 258679 288020 315403 388353 310544 248015
3537 248015 284874 276203 208112 177335 277201 268144 296938 318437 203712 172771 246783 359756
3525 359756 357778 248707 232896 300310 270897 309014 161949 188669 223880 135060 179948
3514 179948 113325 214095 257304 207943 153427 133384 166896 233441 322683 266616 203649
3503 203649 235731 198261 196403 168161 230568 252727 179633 150633 185936 117269 94704 60890
3491 60890 83353 56137 30670 111004 79520 107049 148206 145577 147914 229751 237429 202418
3479 202418 124673 66795 147374 198826 206812 120018 84650 4130 13083 60250 30224 23354
3467 23354 159243 233910 252345 177646 219525 78489 86489 106991 185071 193913 85923 148324
3455 148324 143444 64397 96834 159978 206022 112512 70206 208928 125950 126865 37536 76446
3443 76446 25024 67452 103262 116194 79169 44623 89605 94144 69176 95206 192732 225017
3431 225017 101551 72381 117671 251343 330054 307062 309720 380062 307362 236092 284196
3420 284196 263604 399506 373192 220590 186777 146814 232029 200189 165292 164842 238139 196011
3408 196011 163729 64612 68629 167691 114609 169157 262738 160220 49698 35518 96109
3397 96109 71349 87393 59929 45357 -3585 -39 55687 70238 113865 40354 24078 50597
3385 50597 107414 247259 210725 113982 120946 44518 6259 110169 98796 114297 105674 -32743
3373 -32743 -124493 -75649 -40643 -36017 28139 72398 112467 27365 67241 54982 125171 105189
3361 105189 147078 16961 16318 99775 81009 94933 -16406 -52136 8495 25100 20406 35989
3349 35989 7892 105550 141466 89266 97735 61067 72797 -12745 -13360 28531 25323 21523 -32927
3336 -32927 17208 45684 8204 34663 22168 52729 14535 31993 57193 57231 24804 -68495
3324 -68495 41365 -32648 30689 60309 -37183 25576 69770 156371 134047 74596 25354 31958
3312 31958 -11997 -8979 24446 97947 148070 133219 127586 25162 4713 -13036 7007 69244
3300 69244 180984 53803 54877 97298 165611 151836 -9150 100268 112524 36082 47795
3289 47795 74937 52537 44826 -932 -1662 -123795 -53115 39528 79421 36847 5964 114087
3277 114087 78146 105398 20332 -42755 -11048 80113 50770 -62238 1926 -20970 36053
3266 36053 22083 52562 39383 39849 -18478 -105814 -68553 14441 25220 -2555 85272 106146
3254 106146 101781 26354 -14812 -13236 7127 14480 -5513 -1098 -132114 -46420 9898 -86729
3242 -86729 -183286 -22848 32967 -40259 -73949 -62243 28091 -10862 44972 -15681 -47133 17213
3230 17213 43035 87453 126466 76400 79395 -6122 10661 -53329 -47101 -35448 100611 159435
3218 159435 111916 26313 35778 101243 27959 -76584 -81009 -68518 67861 103912 61770 110947
3206 110947 87636 57599 -12909 84246 80071 83611 185683 119437 137895 20920 28816 67495
3194 67495 -45608 -12269 7536 92545 152651 132535 82002 18043 -72085 57008 112806
3183 112806 93763 -9432 -96208 58508 94943 43903 175406 96103 29400 43167 135
3172 135 71760 -27101 -102259 -70756 -26304 -49409 -44845 47634 93634 96053 125481 139555 186700
3159 186700 119917 59528 40493 -23549 -133761 -1764 49945 134639 174082 -16284 -295
3148 -295 2509 105292 85247 49396 9923 68219 155740 65027 81904 108017 166006 72641
3136 72641 -3217 71064 -5405 -78537 -70343 -34378 53015 106332 72438 -63294 -535 -18487
3124 -18487 -15505 -69199 -14 70293 141107 35206 81414 150195 -3540 57399 -35445 6706
3112 6706 -63985 15613 151637 146689 115704 53115 67013 154151 192964 138704 16797 -36909
3100 -36909 -59359 380 45551 64452 39403 69285 -23739 -87427 -90375 -25880 7230 -21124
3088 -21124 18524 35630 70938 87425 21121 -27986 -92981 -73671 -106777 -35372 -16650 -19977
3076 -19977 32387 53909 101803 93903 108152 157548 15988 -75610 -20922 86462 120420 68131
3064 68131 19440 36770 -33973 -117872 -59687 31481 57 35189 30930 -11931 35907 111386
3052 111386 15029 -61889 54706 -32100 -56446 -53341 -20914 20169 39390 65854 133483 192552
3040 192552 122566 102339 41362 -51848 -63109 30109 114958 92423 71437 45719 -86162
3029 -86162 6810 46997 10862 73255 -16669 -2145 -57051 -42887 -1312 42697 25822 138336
3017 138336 68137 97814 154239 119338 150101 47474 31637 80973 44132 34095 7356
3006 7356 12409 83945 72039 13431 81761 85351 119487 134038 78714 -34655 17227 17346 -41617
2993 -41617 -36519 1695 51754 104838 24221 47030 -26330 -152097 -81863 25981 122034 141149
2981 141149 -3164 -47544 34138 -98350 -40785 -47457 -59635 -86918 -38399 5560 11426 59185
2969 59185 26164 -16625 40874 59080 19388 11171 12191 -15728 -111739 -60742 -140779 -127070
2957 -127070 -50478 -22602 -32282 -73873 -56893 -85255 -17229 41983 90301 98340 26071 62786
2945 62786 77410 35687 65360 50562 108303 93479 69061 135494 107780 149069 130817 3113
2933 3113 -45966 -36503 -48609 13388 76709 11733 12682 75702 87651 -7861 -39226 8227 -74318
2920 -74318 22001 -57204 -88598 -8911 -78842 -124973 -101700 30929 33303 51463 91492 86050
2908 86050 16857 -2855 77012 86032 -11178 35950 60294 184081 122316 81776 102624 5489
2896 5489 -97988 7512 56549 23694 -10741 28544 81463 53165 -11143 -61155 -45461 8675
2884 8675 19902 25657 -15803 6939 40890 -12335 21069 33206 24207 154767 25921 -41344
2872 -41344 95759 56193 26970 28554 20583 64431 -9704 -16010 57884 8455 66840 121039
2860 121039 94458 -22323 -29024 -27989 -61391 4327 31754 44204 75859 93217 21567 -57137
2848 -57137 -22679 -28507 -72693 -68558 10623 -19942 -1848 -63684 -56463 25272 -53389 -77173
2836 -77173 -99233 -93003 -91772 -62598 -25580 -34512 28275 57592 53474 -44119 14606 -16126 -39214
2823 -39214 -12170 33385 4491 59935 88917 48038 -104905 -54702 55922 62997 -3924 -56189
2811 -56189 -81016 -61881 81650 113895 84585 40694 120589 -23127 -81359 -70113 -10874
2800 -10874 -61449 -81163 -163365 3330 76785 -45005 -99493 -127773 -80572 31024 102872
2789 102872 42808 27839 16123 9043 -48605 63452 -25997 12221 86721 -73422 -2131
2778 -2131 4825 -27635 -24397 17741 19391 -20437 -38869 29574 -12727 -181798 -139174 -9056
2766 -9056 34625 -23348 -79425 -122803 39132 58727 -33233 26727 16255 -37433 -2917 20674
2754 20674 24920 -27869 81648 102747 65091 38095 -72155 -63494 -7242 29255 113541 58436
2742 58436 50000 3704 -23010 -17671 -38295 -23623 38875 55341 54477 9746 19013 110917 27878
2729 27878 36166 -30372 -65263 -33311 -24452 -2377 -27852 -90717 -115456 -36166 13117 52513
2717 52513 93530 37317 47475 -115493 -253286 -129781 -55555 -138023 -98713 -66945 -84215
2706 -84215 10222 44694 -29144 -31954 -37216 58363 23729 32543 80013 -13607 -94527 -133427
2694 -133427 -111443 -56127 27853 38003 -30830 -28359 16312 -5349 15743 -33142 -76633 -83918
2682 -83918 -31054 -80351 -57800 -37221 -16217 162 32083 -37480 -15840 21337 66529 -484
2670 -484 90841 183024 -42990 -25644 -998 55380 88353 6448 -9849 41867 -43766 -124018
2658 -124018 -150140 -89828 33354 126284 114561 49480 -59806 -31629 -132467 -149501 -31759
2647 -31759 -54535 -41478 -55142 -90429 -22442 -14318 1490 -70101 -27098 20134 83009 85599
2635 85599 73048 34279 -35022 -64931 -63366 -8166 -29227 -130205 9643 124879 -19733
2624 -19733 9067 -21447 -51916 -106779 -124436 -26691 -27849 43034 7567 -70005 -6795 -10280
2612 -10280 25726 -59507 -7945 125924 130834 57185 20842 32191 -38039 -64357 -126964 -202336
2600 -202336 -175580 -70693 -135978 -110237 -106057 -13534 58546 28430 94312 -26378 -39485
2589 -39485 44405 101645 91612 37829 12143 20923 -33294 4966 25517 27406 61909 -20154
2577 -20154 -38659 36376 -46293 -68215 -138377 -8943 16280 -60708 24561 -13134 29638 4900
2565 4900 -12127 17358 -125993 -3925 5928 16397 63 51287 6890 -7039 55833 52798
2553 52798 47513 124645 80076 -49338 10852 -60170 34786 -66918 -20404 -80698 -33335 -30571
2541 -30571 -54307 -27463 -97156 -57991 -38240 74957 169788 20865 -43773 29485 -7949
2530 -7949 -62570 -46144 -22252 -27804 18341 17619 15279 -19681 109681 151844 67536 -49756
2518 -49756 -111125 -50279 63537 -13333 -81967 -64276 38294 111296 56838 -50785 -52794
2507 -52794 -49142 -68636 -69274 -4950 22294 79872 149230 70011 39825 46439 12312 -1406 358
2494 358 -24622 6676 -11400 52224 18242 35935 -10008 9196 -24492 -45241 35206 -9150
2482 -9150 57034 -157649 -304690 -142607 -92434 -68683 435 4769 7510 14458 -104185 -76211
2470 -76211 23205 34228 -71701 -109629 -73442 -10044 11676 -16965 -4162 -71850 -41203 130089
2458 130089 130119 61045 58374 -17600 -25703 27007 -5390 -20330 -31442 33624 59419 76012 19570
2445 19570 67129 -49598 -88747 11781 -7979 -76477 -165434 -126718 -29236 -51997 -122118
2434 -122118 -117782 -107773 -128608 -187068 -33617 31553 45986 60689 108406 91490 31353 -29226
2422 -29226 -104769 -30546 54961 54358 25289 39220 -33088 -32866 69334 97049 -22251 6837
2410 6837 111560 57255 -38013 -49843 -50532 67953 32107 49463 51878 25461 -21670 -31702
2398 -31702 -37083 -42388 23123 28923 15796 -41146 62856 1686 5342 25651 9841 -84759
2386 -84759 2317 20146 -77611 -106314 30978 -3964 -161806 -136179 -63721 -64670 -14591 52224
2374 52224 -41498 -68075 -39803 -56891 -42522 -77508 -145788 -111283 -54578 -43611 -68757 -23493
2362 -23493 98386 31415 -28776 -41380 -4430 45928 -15362 -41206 -37478 -55175 -43829 4397
2350 4397 56385 31469 -12220 12729 -34551 -94502 -83359 -23521 3766 15600 34181 -24968
2338 -24968 27241 64669 45355 45503 -109066 -59266 -18522 -14540 49364 -50823 -62159 -146880
2326 -146880 -157007 3187 11927 16151 368 90513 81364 42646 10816 -15613 -104460 -35062
2314 -35062 54922 9578 -54147 -54909 22508 11133 4053 -102509 -4498 65283 39231 46659
2302 46659 44250 -9925 15990 79358 119142 102316 -2943 -6633 4211 -72309 -80515 -25776
2290 -25776 40170 1152 -9672 -111 -23089 -44500 -24854 11039 41811 -35473 -99450 -10179
2278 -10179 -63984 6213 7268 -38381 9840 -96291 -49519 60011 71901 -26062 -16163 -87782
2266 -87782 -106511 -105979 -172243 -40557 -127916 -46763 30108 -126014 -118390 -42652 53057 118897
2254 118897 107117 93646 100456 154045 96131 2928 -41123 -78021 -24271 16978 22444 13025
2242 13025 29042 70549 48661 -20164 -110966 -36592 4235 119823 116577 112442 75033 -103
2230 -103 -53518 48101 -106759 -49148 -16801 -44501 50564 -49378 -33763 -53055 -822 2963
2218 2963 -94327 -122477 17608 -49254 -144427 -79947 -17889 -11180 -42025 -41182 -43145 -35157 -75527
2205 -75527 -88565 35945 26678 -46953 -59250 -38388 15528 13709 -65359 -83589 -42725 -59043
2193 -59043 14053 68207 -10048 -4145 -58362 -70789 -103564 -5757 -12430 -92957 -85421 -4999
2181 -4999 -63433 -79029 22417 -9992 -30707 -31411 41047 35877 -67401 -149901 -179228 -150097
2169 -150097 -110347 -28817 13433 -49265 -94383 -42843 -86259 -86212 -63253 -1598 -39015 -57476
2157 -57476 -13849 -14614 16385 45218 -13020 -24502 80969 5671 -17845 -10581 -3627 -51212
2145 -51212 33659 56919 -9729 -54004 -142547 -65401 16856 125584 90774 16746 35 57661
2133 57661 89529 84184 19739 -96393 -106832 -80503 -143380 -106347 -61413 -24559 89688 95543
2121 95543 20559 30999 70978 54201 90860 51465 86650 104109 84019 34139 78700 45457
2109 45457 22208 -40987 -66874 -59692 32668 309 -82083 -37283 10515 -30666 -30429 -89579
2097 -89579 -70426 -112659 -121689 -32038 -146854 -966 77902 9888 -64980 -16108 -14353 -102333
2085 -102333 -26899 11121 15051 -19802 -56221 -17406 -108346 -59358 -29931 -31883 -120183 -90662
2073 -90662 -74436 -50648 -9620 -90285 3142 59281 68117 23382 -12661 4244 -109001 -164408
2061 -164408 -170041 -63725 -62699 -34743 -38477 -58621 12511 85006 159078 54893 24816 -35200
2049 -35200 -110784 -79516 -103577 -167389 -93585 -28600 -82589 -51518 -67943 -53488 -6659 15902
2037 15902 -10137 -21864 -25903 -65678 47935 113874 -1194 -1050 27526 -18604 -1852 -76363
2025 -76363 -59955 -63366 -35210 -92728 -65094 -9696 35619 -167091 -85205 -24181 -6513 27077
2013 27077 -80432 -102805 -6708 928 70786 46542 13090 13040 3216 7227 -52247 -29086 -21918
2000 -21918 -21675 18938 31423 -110346 -53011 17198 55592 -49746 -87544 -89789 -30517 -79595
1988 -79595 -70789 3274 346 22169 11085 -40756 36175 4331 -37829 79094 -635 17428
1976 17428 -34099 -97090 -58005 -111439 -105018 -93288 -96156 -123299 -172672 -183282 -11080 -44399
1964 -44399 31853 94390 76582 -26998 -65019 -21842 -22113 9897 27885 -57838 -88645 -51816
1952 -51816 39467 10623 -186 -24651 -79645 49748 -11567 -2703 -2652 -46259 -63568 93166
1940 93166 145976 -8562 -72311 -34389 30214 -22547 5162 66555 84566 46977 10 -17668
1928 -17668 12678 -47212 -103815 -85196 -38189 68962 26602 -8759 -24202 -45452 -73357 -76992
1916 -76992 -31674 -22729 5845 4561 27821 126991 77376 61280 83860 48447 55170 52201 44575
1903 44575 62894 -18944 -28613 113640 51888 -41303 -652 45355 -9296 -81980 -125157 -103637
1891 -103637 -57007 -31102 27067 -49953 -55495 -24101 21677 26418 6841 -90843 -24719 33910
1879 33910 -37975 54901 -6073 -74067 -26858 14466 74313 14657 -14849 -54608 -14259 -66593
1867 -66593 -108243 -57608 -102661 -149591 -104313 -99922 -16646 5036 -38725 28003 75622 -79345
1855 -79345 -125153 -57468 -39514 3134 53338 27302 -74111 -74345 -78056 -92772 -86022 -65372
1843 -65372 -83233 -16302 13534 -16495 -48126 -234 27434 82139 77882 26076 -87829 36264
1831 36264 76615 8952 5617 -4686 22461 80770 85765 13815 -48414 -90011 -74775 -118491
1819 -118491 -55051 3778 13559 48000 84344 89416 85909 30745 51285 92388 58395 -1560
1807 -1560 -38966 -56201 -49256 -73942 -70396 -135544 -112411 -163823 -88947 -36313 10966 9324 -37281
1794 -37281 5349 -41705 -21266 -24939 -66153 -65309 -50618 -69952 36878 -129771 -90065 38732
1782 38732 48724 44082 -1491 -22352 -40452 8884 11748 12591 30231 -46953 58295 91473 106779
1769 106779 79871 -100615 -72957 28778 -58546 -25988 -29180 17631 43128 7183 6980 -3858
1757 -3858 -142753 -158569 -126128 -84198 18917 -59739 -54413 7126 -82556 -74256 7178 -54115
1745 -54115 -38833 -99675 -103759 -97455 -54781 -15471 11480 27934 7477 -81516 -59263 10764
1733 10764 -40945 -140160 -110993 -48477 -38531 -38758 39116 -2178 1304 44987 63234 103530 58862
1720 58862 49067 -7698 12501 -2710 -34322 -48520 61013 85176 -694 6132 -29547 -39210
1708 -39210 -56562 -1752 -33242 -11033 -5809 83887 25086 -32545 -98232 -30007 66304 96567
1696 96567 107600 -49654 -38203 60808 -3743 -2964 9218 -126413 -97405 -55295 -16339 -102790
1684 -102790 -57557 -24713 -51460 -71715 -96102 -35556 -22160 -89227 -67023 -103323 -89150 -130930
1672 -130930 -150539 -128901 -95578 -117174 13108 47866 4613 -45791 -78049 -135443 -60085
1661 -60085 -32056 -113308 -59911 -53191 -78030 -57544 53358 -103614 -92516 -90342 -57186 -37983
1649 -37983 -27956 50921 56527 1082 -99387 -182810 -132682 -159447 -157508 -74473 -41125 -40315
1637 -40315 -22612 -32137 40590 -36443 -59502 -8800 -79912 -117186 -72273 -135016 -58015 -8249
1625 -8249 -47148 -15803 10850 75898 75771 6779 -64746 48114 116367 143953 76233 27393
1613 27393 53710 31711 53760 8597 33447 -51076 5156 13961 3523 -17307 -94998 -25011
1601 -25011 -60430 -100480 -79482 -114180 -77241 -38953 -84776 -15940 -46789 -921 -86303 -96335
1589 -96335 -70276 -3413 32033 7295 -25594 18906 51111 55342 -84541 -5972 47736 26507
1577 26507 -56886 -21868 21699 -48351 12276 -19417 -43026 -19366 -90135 65167 91877 123298
1565 123298 163803 63107 61517 -40291 -44073 13593 -2938 -1430 -4048 -77348 -31516 -96207
$$ [...]
##END NTUPLES=NMR SPECTRUM
##END=
