##TITLE=1H_EC-3275(2)
 CDCl3
 8 sc, 
 3.06.2022
##JCAMPDX= 6.0         $$ Bruker NMR JCAMP-DX V2.0
##DATA TYPE= NMR SPECTRUM
##DATA CLASS= NTUPLES
##ORIGIN= UXNMR, Bruker Analytische Messtechnik GmbH
##OWNER= root
$$ XWIN-NMR		Version 3.5
$$ Fri Jun  3 14:06:14 2022 Russian Standard Time (UT+4h)  she@DPX200
##.OBSERVE FREQUENCY= 200.13135
##.OBSERVE NUCLEUS= ^1H
##.ACQUISITION MODE= SIMULTANEOUS
##.ACQUISITION SCHEME= undefined
##.AVERAGES= 8
##.DIGITISER RES= 18
##SPECTROMETER/DATA SYSTEM= spect
##.PULSE SEQUENCE= zg30
##.SOLVENT NAME= CDCl3
##.SHIFT REFERENCE= (INTERNAL, CDCl3, 0, 15.7403)
##AUDIT TRAIL= $$ (NUMBER, WHEN, WHO, WHERE, WHAT)
$$ ##TITLE= Audit trail, XWIN-NMR		Version 3.5
$$ ##JCAMPDX= 5.01
$$ ##ORIGIN= Bruker BioSpin GmbH
$$ ##OWNER= she
$$ F:/spectra/data/she/nmr/H-F/1/pdata/1/auditp.txt
$$ ##AUDIT TRAIL=  $$ (NUMBER, WHEN, WHO, WHERE, WHAT)
(   1,<2022-06-03 14:04:21.48 +0400>,<she>,<DPX200>,
      <created by zg, POWCHK disabled, PULCHK disabled
       configuration hash MD5:
       00 E9 B6 7A A2 85 ED C7 34 08 36 98 17 FE 4E 26
       data hash MD5: 16K
       2B 9F F8 DE B2 7B 86 A3 CC 6F BD F6 A1 C7 85 A9>)
(   2,<2022-06-03 14:04:54.21 +0400>,<she>,<DPX200>,
      <Start of raw data processing
       efp BC_mod = 2 LB = 0.24 FT_mod = 6 PKNL = 1 PHC0 = -18053.42 PHC1 = 14.80074 SI = 16K 
       data hash MD5: 16K
       85 F7 C8 7D 4D A3 FD 6C B5 14 40 37 6E 64 76 22>)
(   3,<2022-06-03 14:05:13.25 +0400>,<she>,<DPX200>,
      <pk PHC0 = 1.439706 PHC1 = -3.2 
       data hash MD5: 16K
       69 A8 E4 97 70 50 75 BA F2 10 49 02 B6 BE C6 41>)
(   4,<2022-06-03 14:05:16.56 +0400>,<she>,<DPX200>,
      <abs ABSG = 5 
       data hash MD5: 16K
       35 B4 91 D0 C5 25 C7 63 30 DA EF 19 3C 4F DF 3D>)
$$ ##END=
$$ 
$$ hash MD5
$$ 16 BF D7 63 29 0D AE 07 27 29 3F 32 AF 1A 51 06
##$RELAX= 
##$RELAX= 
##$RELAX= 
##$RELAX= 
##$RELAX= 
##$RELAX= 
$$ Bruker specific parameters
$$ --------------------------
##$DU= <F:/spectra>
##$EXPNO= 1
##$NAME= <H-F>
##$PROCNO= 1
##$TYPE= <nmr>
##$USER= <she>
##$AMP= (0..31)
100 100 100 100 100 100 100 100 100 100 100 100 100 100 100 100 100 100 
100 100 100 100 100 100 100 100 100 100 100 100 100 100 
##$AQSEQ= 0
##$AQ_mod= 1
##$AUNM= <au_zg>
##$AUTOPOS= <>
##$BF1= 200.13
##$BF2= 200.13
##$BF3= 200.13
##$BF4= 200.13
##$BF5= 200.13
##$BF6= 200.13
##$BF7= 200.13
##$BF8= 200.13
##$BYTORDA= 1
##$CFDGTYP= 0
##$CFRGTYP= 5
##$CHEMSTR= <none>
##$CNST= (0..31)
1 1 145 1 1 1 1 1 1 1 1 1 1 1 1 1 1 1 1 1 1 1 1 1 1 1 1 1 1 1 1 1 
##$CPDPRG= <>
##$CPDPRG1= <>
##$CPDPRG2= <>
##$CPDPRG3= <>
##$CPDPRG4= <mlev>
##$CPDPRG5= <mlev>
##$CPDPRG6= <mlev>
##$CPDPRG7= <mlev>
##$CPDPRG8= <mlev>
##$CPDPRGB= <>
##$CPDPRGT= <>
##$D= (0..31)
0 1.2 0 0 0 0 0 0 0 0.06 0 0.03 0 0 0 0 0.0002 0 0 0 0 0 0 0 0 0 0 0 0 
0 0 0 
##$DATE= 1654250660
##$DBL= (0..7)
120 120 120 120 120 120 120 120 
##$DBP= (0..7)
150 150 150 150 150 150 150 150 
##$DBP07= 0
##$DBPNAM0= <>
##$DBPNAM1= <>
##$DBPNAM2= <>
##$DBPNAM3= <>
##$DBPNAM4= <>
$$ [...]
##$SUBNAM2= <"">
##$SUBNAM3= <"">
##$SUBNAM4= <"">
##$SUBNAM5= <"">
##$SUBNAM6= <"">
##$SUBNAM7= <"">
##$SUBNAM8= <"">
##$SUBNAM9= <"">
##$SW= 18.05172834244
##$SWIBOX= (0..15)
0 0 2 0 0 0 0 0 0 0 0 0 0 0 0 0 
##$SW_h= 3612.71676300578
##$TD= 16384
##$TD0= 1
##$TE= 0
##$TE2= 300
##$TE3= 300
##$TEG= 300
##$TL= (0..7)
0 120 120 120 120 120 120 120 
##$TP= (0..7)
150 150 150 150 150 150 150 150 
##$TP07= 0
##$TPNAME0= <>
##$TPNAME1= <>
##$TPNAME2= <>
##$TPNAME3= <>
##$TPNAME4= <>
##$TPNAME5= <>
##$TPNAME6= <>
##$TPNAME7= <>
##$TPOAL= (0..7)
0.5 0.5 0.5 0.5 0.5 0.5 0.5 0.5 
##$TPOFFS= (0..7)
0 0 0 0 0 0 0 0 
##$TUNHIN= 0
##$TUNHOUT= 0
##$TUNXOUT= 0
##$USERA1= <user>
##$USERA2= <user>
##$USERA3= <user>
##$USERA4= <user>
##$USERA5= <user>
##$V9= 5
##$VALIST= <valist>
##$VCLIST= <CCCCCCCCCCCCCCC>
##$VD= 0
##$VDLIST= <DDDDDDDDDDDDDDD>
##$VPLIST= <PPPPPPPPPPPPPPP>
##$VTLIST= <TTTTTTTTTTTTTTT>
##$WBST= 1024
##$WBSW= 4
##$XGAIN= (0..3)
0 0 0 0 
##$XL= 0
##$YL= 0
##$YMAX_a= 96447
##$YMIN_a= -184317
##$ZGOPTNS= <>
##$ZL1= 120
##$ZL2= 120
##$ZL3= 120
##$ZL4= 120
##$ABSF1= 15.72816
##$ABSF2= -2.323689
##$ABSG= 5
##$ABSL= 3
##$ALPHA= 0
##$AQORDER= 0
##$ASSFAC= 0
##$ASSFACI= 0
##$ASSFACX= 0
##$ASSWID= 0
##$AUNMP= <proc_1d>
##$AZFE= 0.1
##$AZFW= 0.1
##$BCFW= 0
##$BC_mod= 2
##$BYTORDP= 0
##$COROFFS= 0
##$CY= -3
##$DATMOD= 1
##$DC= 0
##$DFILT= <>
##$DTYPP= 0
##$F1P= 0
##$F2P= 0
##$FCOR= 1
##$FTSIZE= 16384
##$FT_mod= 6
##$GAMMA= 0
##$GB= 0
##$INTBC= 1
##$INTSCL= 0
##$ISEN= 128
##$LB= 0.24
##$LEV0= 0
##$LPBIN= 0
##$MAXI= 10000
##$MC2= 0
##$MEAN= 0
##$ME_mod= 0
##$MI= 1.114404
##$NCOEF= 0
##$NC_proc= -7
##$NLEV= 6
##$NOISF1= 3.799351
##$NOISF2= 2.8
##$NSP= 0
##$NTH_PI= 0
##$NZP= 0
##$OFFSET= 15.74028
##$PC= 1
##$PHC0= -18051.98
##$PHC1= 11.60074
##$PH_mod= 1
##$PKNL= yes
##$PPARMOD= 0
##$PSCAL= 0
##$PSIGN= 0
##$REVERSE= no
##$SF= 200.130006256653
##$SI= 16384
##$SIGF1= 3
##$SIGF2= 2
##$SINO= 5.538805
##$SIOLD= 16384
##$SREGLST= <1H.CDCl3>
##$SSB= 0
##$STSI= 16384
##$STSR= 0
##$SW_p= 3612.71676300578
##$SYMM= 0
##$S_DEV= 0
##$TDeff= 16384
##$TDoff= 0
##$TI= <>
##$TILT= no
##$TM1= 0
##$TM2= 0
##$TOPLEV= 0
##$USERP1= <user>
##$USERP2= <user>
##$USERP3= <user>
##$USERP4= <user>
##$USERP5= <user>
##$WDW= 1
##$XDIM= 16384
##$YMAX_p= 465791663
##$YMIN_p= -830936
$$ End of Bruker specific parameters
$$ ---------------------------------
##NTUPLES= NMR SPECTRUM
##VAR_NAME=  FREQUENCY,     SPECTRUM/REAL,   SPECTRUM/IMAG
##SYMBOL=    X,             R,               I
##VAR_TYPE=  INDEPENDENT,   DEPENDENT,       DEPENDENT
##VAR_FORM=  AFFN,          ASDF,            ASDF
##VAR_DIM=   16384,         16384,           16384
##UNITS=     HZ,            ARBITRARY UNITS, ARBITRARY UNITS
##FACTOR=    0.220516191357247, 1,           1
##FIRST=     3150.10236517459, 0,            0
##LAST=      -462.614397831194, 0,           0
##MIN=       -462.614397831194, -830936,     0
##MAX=       3150.10236517459, 465791663,    0
$$ Real data points
##PAGE= N=1
##DATA TABLE= (X++(R..R)), XYDATA
$$ [...]
7035A568972J07243K786J67932K66292R3704M5720K75616J99419K83172N02918
7025C513774L20183L18734N97281N51689P06057L76610j6238k47510o99281q49135
7015D572164n70042j66294n47325l33771l76411l52168j86171j72253k19101j91750
7005A456878k14210j24166p7969N1397j32080o3228J81422j81243j8084o8488
6995H10229j21214L9749P7652n1857n0308j25906K8902K0271q8881J46524m938
6984F80223O3928j08215j81834j38130P1529j0472P5381m1671J6088j8210J76692
6973E85309j52123j37949J90769m7988k5745m3657q0391K90508M5735j08916j12211
6962D03341J7813N3960j43790J11350l9560J8927Q8831M6796L0177J14193j30355
$$ y = [1568972, 1676215, 1679001, 1846933, 2113225, 2206929, 2252649, 2528265, 2727684, 3010856, 3513774, 3833957, 4152691, 4749972, 5301661, 6007718, 6384328, 6368090, 6120580, 5421299, 4572164, 4002122, 3835828, 3288503, 2954732, 2578321, 2226153, 2039982, 1867729, 1648628, 1456878, 1242668, 1118502, 1040533, 1091930, 959850, 896622, 1078044, 896801, 878717, 810229, 689015, 728764, 806416, 754559, 704251, 578345, 607247, 627518, 538637, 685161, 680223, 744151, 635936, 454102, 315972, 387501, 377029, 452410, 410739, 426827, 408617, 585309, 433186, 295237, 486006, 438018, 412273, 368616, 288225, 578733, 624468, 515552, 403341, 421154, 475114, 331324, 442674, 403114, 422041, 510872, 557668, 587845, 702038, 571683]
6951E71683q5049j5407r2942l4938O0759q4107J47730r8533J3293p4943q4213
6940B23333N4772L3412m2092n2949J06413n8714j27365m1355J70524O8589j1894
6929C22674P6469J5386j80481M5006P5143j25198N7233J11752J96241J33796m1564
6918F86457k34393J88218r2386k15604R6471m333P5346n5880K1817J5785j93561
6907B87937J55345J08569j6546L2628K98032J57133K4283M2533R2881k45959l2568
6896I04268J33968O2204j2012j56765j27026m5139m2936R0682J30441l555r733
6885I24397j67481j11078L3807l7939j6006L2524L6421j54236j72434K23644n7250
6874E34369o0839N172K10280J8078m4571r7613k36560j50323J87872J60375o2202
$$ y = [571683, 486634, 471227, 378285, 343347, 404106, 319999, 467729, 369196, 382489, 307546, 223333, 278105, 311517, 269425, 216476, 322889, 264175, 136810, 95455, 265979, 334568, 322674, 399143, 414529, 234048, 279054, 354197, 228999, 286232, 397984, 594225, 728021, 686457, 452064, 640282, 547896, 332292, 428763, 424430, 499776, 443896, 465713, 481498, 287937, 443282, 551851, 535305, 567933, 865965, 1023098, 1047381, 1089914, 1182795, 936836, 904268, 1038236, 1100440, 1088428, 931663, 804637, 759498, 716562, 807244, 937685, 934130, 924397, 756916, 645838, 679645, 641706, 625700, 658224, 694645, 540409, 367975, 591619, 534369, 473530, 478702, 688982, 707060, 662489, 564876, 328316, 177993, 365865, 526240, 464038]
6863D64038o7382r0474J3047L2228r2655j01863N5917J2334n3714P246o7791N0403
6851A61334j076n1355J73379q1611P118J64055K653O3116j2744k75738j8185J05480
6839B36426L2576j4143L5946o9647j26986P2602o1408J72056q3375q4264M1073
6828A50856J03876j34936n5829j76046O5766J03110J1861J05481j75402P3642
6818G2379l7434m3683J84293R101j8902j34112J6683J10591l3250N8307R0394
6807B74367k0842K2356K4751j38954o112N4221J26632j10362j84639L0402j1524
6796F0296O4586J74416n1041j91936n3505O1010M2468q9130J48020k16612L877
6785d7551K50850K33501n4875j65993J9085j2611Q5811r4810j45706m02J75757
$$ y = [464038, 396656, 306182, 319229, 351457, 258802, 156939, 212856, 225190, 171476, 178722, 110931, 161334, 160258, 108903, 282282, 200671, 207789, 371844, 374497, 437613, 424869, 149131, 130946, 236426, 269002, 254859, 290805, 221158, 94172, 166774, 105366, 277422, 194047, 109783, 150856, 254732, 119796, 63967, -112079, -46313, 56797, 68658, 174139, -1263, 72379, 34945, -8738, 175555, 184656, 165754, 31642, 48325, 158916, 125666, 183973, 274367, 253525, 275881, 300632, 161678, 155566, 209787, 336419, 226057, 41418, 71820, 60296, 124882, 299298, 248257, 56321, 2816, 63826, 106294, 17164, 165184, -51428, -47551, 203299, 436800, 381925, 215932, 235017, 222406, 308217, 213407, 67701, 67299, 243056]
6774B43056K7557q0251J8890j03513N5030N3348j29729J74295o2058m5807q9601
6763F1217N5728j2609k11400N0198J45989R2007M34j28682q490j2048J5988n1413
6751c081R1288J63888j52039k01914K03070J00312n5729r701M7130k1298j54422
6740G504m543n8420l088J41566R8653r3043O3245J50956j29097L7080R3178j09693
6728A94298m0047p9222j74754M5046J84547R1059p6262J99669l9814j5850o9974
6717B18696n7690j9875J00375l1186j31386n6027p8163J6089J04196l86K8759
6706I3402m203p4909J90083R1032j76623o3750O5885P3695j10548J21830j0508
6695A95386k26891J71332j73569J16076k3395l411J3006j37740m0823J01340Q122
$$ y = [243056, 270613, 190362, 209252, 105739, 160769, 214117, 84388, 258683, 196625, 150818, 61217, 116945, 104336, -107064, -56866, 89123, 181130, 181564, 52882, 44392, 32344, 48332, -3081, 88207, 252095, 100056, -101858, 101212, 201524, 145795, 136094, 183224, 161926, 7504, 2961, -55459, -58547, 83019, 181672, 88629, 151874, 302830, 173733, 210813, 303991, 194298, 154251, 75029, -99725, -54679, 129868, 220927, 144665, 344334, 304520, 288670, 218696, 161006, 141131, 241506, 210320, 78934, 22907, -55256, -39167, 65029, 64643, 93402, 89199, 14290, 204373, 295405, 118782, 55032, 120917, 194612, 84064, 205894, 195386, -31505, 139827, -33742, 82334, 58939, 55528, 68534, -69206, -110029, -8689, -567]
6684e67P9787J37222J67779q8875j12931j72212J26330P476O2259J17244j89337
6673A34175M713j55007J8172L0814m7827P9446R124j00877j17752Q5434K80079
6662B20494N1480n7877m1327J8545j41379q18J42522J7572m9243J50403j26673
6651A83699j60373K23605K2998j11587M2494J67170Q1504j0361j02949j3312n4651
6640B68237r6015j0625q5368J41114M8925m4383J3969P3144j22667K5228J02430
6629C13989O7609o1998l0822Q254j10327n1288j04441J27066j5696N2604N2516
6618B47466q6038O8742J88294j67974q2380j9472l3160m403R1914q9767Q9583
6607B02805J14144k9940j20327P002J50643m4024J4898o1250o1609K1040M6566
$$ y = [-567, 79220, 216442, 384221, 295346, 182415, 10203, 136533, 144009, 206268, 323512, 134175, 138888, -16119, 2053, 32867, -14960, 64486, 73610, -27267, -145019, -59585, 220494, 271974, 214097, 172770, 191315, 49936, 49118, 191640, 209212, 159969, 310372, 183699, 23326, 246931, 269929, 158342, 200836, 368006, 449510, 439149, 336200, 322888, 268237, 172222, 161597, 76229, 217343, 266268, 221885, 235854, 308998, 186331, 211559, 313989, 381598, 319600, 288778, 297032, 186705, 135417, 30976, 158042, 142346, 194950, 247466, 161428, 230170, 418464, 250490, 168110, 148638, 115478, 111075, 202989, 113222, 202805, 316949, 287009, 166682, 173684, 324327, 280303, 295201, 233951, 172342, 193382, 239948]
6596B39948r7937j30758j3624P1715K5195P1258j70812j63761Q3951Q5961L61436
6585C62572O8550k31860r5602k4298P1284L3497N3955l7890n294q9952m8160K5860
6573H2662J02744N6559k5516L5138p4405p6218l7973J48932r8625l465O1374O5472
6561B36679q3145L5242K1327n7247o608M0251l1611k28487O5264P0121R2564R6609
6549B50959J03270j08554q3108j78388J36826J46332M8408N2998k33075j47596
6539a1928R7293n2238l9345K3155O2546K30749r7299n4598J22107j24524N1706
6528B07624R9217m8844j26974q4697r2488n4213J4983O8175j9883J54208K2007
6517A39115k2174m6950J25376J76172j65149R3366m1451m9210J5809p5052O264
$$ y = [239948, 142011, 11253, -2371, 69344, 94539, 165797, -5015, -168776, -84825, 1136, 362572, 431122, 199262, 103660, 79362, 150646, 184143, 238098, 200208, 194914, 104962, 56802, 82662, 185406, 241965, 216449, 251587, 177182, 100964, 62991, 211923, 113298, 109833, 171207, 236679, 153534, 188776, 210103, 152856, 146248, 186499, 154888, -73599, -8335, 61786, 154350, 250959, 354229, 245675, 162567, -15821, 121005, 267337, 315745, 368743, 135668, -11928, 85365, 33127, -6218, 16937, 79483, 310232, 212933, 158335, 280442, 155918, 207624, 306841, 257997, 131023, 46326, -46162, -100375, -85392, -17217, -37100, 117108, 139115, 116941, 69991, 195367, 371539, 206390, 299756, 258305, 209095, 224904, 149852, 156116]
6506A56116n7442m7196R9033j17953P3595M4152j69350N3919M5820j60534j3096
6495i2936J57139P6610j6799J06837j1349K2625p3722r4126O9675L4178j33783
6484D4349M3870K30077j26631k8427J25098R2451j79466k28836q8261J76981m3018
6473A8187R1200Q6165l2151J95322k1273J2015n6491Q4679j45562l6772R4851
6462B90170j09126k1586k30795K47840k3211j37673o4346m7703J3486K48563J86019
6451C51638j78602Q6904p9286k07294m682J00538j03952j24195K33934N8111j18346
6440A4768J72599J2802O906Q3362P0887q1208l6013J52399P5908j30142l05116
6429C7152o8337K29568o8287L1176m4532J49961O9100j08229R8954O2932j07121
$$ y = [156116, 98674, 51478, 150511, 32558, 106153, 150305, -19045, 34874, 80694, -79840, -92936, 64203, 140813, 124014, 230851, 219502, 242127, 168405, 74279, 143954, 178132, 44349, 88219, 318296, 191665, 163238, 288336, 380787, 201321, -27515, -115776, 61205, 18187, 109387, 195552, 163401, 358723, 337450, 349465, 292974, 377653, 232091, 195319, 290170, 181044, 159458, -71337, 176503, 153292, 15619, -48727, -96430, -82944, 165619, 351638, 173036, 259940, 180654, -26640, -31322, 69216, -34736, -158931, 75003, 133114, 14768, 187367, 200169, 207075, 290437, 361324, 280116, 244103, 396502, 472410, 342268, 37152, -31185, 198383, 130096, 161272, 116740, 266701, 335801, 227572, 326526, 389458, 282337]
6418B82337k73429K51583l1020l61350J03565J10875L1020N2415R2810o2565o1437
6407A34804L6219K2157L5891o7511l6123J12154j33780J0095q25M2053N2253k09651
6395b264Q8788M1594Q0491P7690k16447l881K01965o0990J1985l4430m2311J61354
6383C03544N3246p6778N8708L3320k9894q2669n2450J93150r0781L1377j13130
6372B27643r0987m6899j1354J06117J4971j58104k057J29771r8202j44039K13312
6361A40172q1619R8049Q6065m2218L5768q0041m6285P1783P3288M735K0515j43045
6349A37167P4550L9052p7483N1821J30319L3398L0154k70338Q7322J32226k1880
6338C46308l6836j70400O4085J88501j28421j40390j9775K2517P9101K33937m2593
$$ y = [282337, 8908, 260491, 229471, -131879, -28314, 82561, 113581, 165996, 258806, 196241, 134804, 171023, 193180, 229071, 161560, 125437, 237591, 103811, 113906, 113081, 155134, 207387, -2264, 86524, 128118, 208609, 286299, 69852, 65971, 267936, 206946, 218931, 184501, 142190, 303544, 356790, 280012, 338720, 372040, 342146, 259477, 207027, 400177, 309396, 340773, 227643, 136656, 89757, 78403, 184520, 199491, 41387, 39330, 169101, 70899, -73140, 140172, 58553, 156602, 242667, 200449, 236217, 156176, 109891, 181674, 254962, 259697, 280212, 137167, 211717, 250769, 173286, 225107, 355426, 388824, 418978, 148640, 235962, 368188, 346308, 309472, 139072, 203157, 391658, 263237, 122847, 103072, 125589, 204690, 438627, 396034]
6327C96034o1668M0243j3958k64574J77785L8491r6177m6788J363o5032j5626
6316I0093J78480k3782N835P9818o7424J10782m957j26694N6037j07442J77731
6305C68477L3533n975N7305o5063J4472p4316M4202J6337o6795N7985N3138j26396
6293C06904K8870N1427o1998q5903J27167j0888j40189L3714J8415J16270n7199
6282C26590j36331j39892n42K8095p6401J57156N3281P985N2038J15930J3611
6271D01520j9359J16838j7659n3282O3562P7268l6071M0156o2555p38K1044p3040
6259D57684k22208L0897Q0544L6767k12240n8026J37828K18185J61305j17090
6249E13646j65759J75106m7034Q8460P362j12625M2980j8394m9768l2821m8049
$$ y = [396034, 334366, 374609, 360651, 96077, 273862, 312353, 216176, 169388, 170751, 105719, 90093, 268573, 244791, 250626, 330444, 263020, 373802, 368845, 242151, 298188, 190746, 368477, 402010, 396035, 453340, 388277, 402749, 328433, 372635, 388972, 322177, 380162, 433300, 306904, 335774, 387201, 325203, 239300, 366467, 355579, 215390, 249104, 267519, 383789, 326590, 190259, 50367, 49825, 77920, 1519, 158675, 211956, 219941, 271979, 387909, 401520, 382161, 498999, 481340, 428058, 491620, 568888, 532817, 572973, 510418, 509680, 530724, 457684, 235476, 266373, 346917, 383684, 171444, 113418, 251246, 469431, 630736, 513646, 347887, 522993, 475959, 564419, 571781, 459156, 502136, 483742, 433974, 401153, 353104]
6238C53104o7002N642o7079J45084J77375k36341O6071L03665j57260O4815J219
6227E89293K952P0708M9444L1822p4778J07862r9547O6042m5065J54577M6514
6216H99824j98535j61724J73712j7630p527o5593Q3204O4558j23516P0371j46984
6205E70160Q3397k2687J14228o9787n0684J48699Q515j16327R9001q4690M3480
6194G23305J44722l3212j74519K224l14004K05224K9884Q329Q7075J22698N0322
6183H52048P4404m23r0349R6225K6837L0269k12351J19395J04515m1018k32667
6172G26885m7782J00665J735j2802j6449M3587R4403P9459n9184j22538O0436
6161H48415N2072J15460p7243p1364J15245n3945j30325J84207O8290P8575P2289
$$ y = [353104, 286102, 291744, 224665, 369749, 547124, 310783, 376854, 680519, 523259, 588074, 589293, 592245, 662953, 712397, 744219, 669441, 777303, 677756, 743798, 698733, 853310, 899824, 701289, 539565, 713277, 695647, 688120, 622527, 705731, 770289, 646773, 717144, 570160, 653557, 630870, 745098, 675311, 624627, 773326, 781841, 665514, 764515, 679825, 723305, 868027, 834815, 660296, 662520, 348516, 553740, 583624, 591953, 679028, 801726, 852048, 926452, 926029, 835680, 931905, 958742, 989011, 776660, 896055, 1000570, 959552, 726885, 679103, 779768, 781503, 768701, 752252, 795839, 890242, 969701, 910517, 787979, 848415, 900487, 1015947, 938704, 867340, 982585, 928640, 798315, 982522, 1050812, 1129387, 1201676]
6150A201676q4555p5945M2291j21363N1208J27670j19017j08811N8724N4711J28448
6139A155037k82681N616j5233j22446J45923o1054O7985J10392l8063k6460N8260
6128I97276j09257P1856L5141J05650o3986j87246N5919q728n8468J05606O5123
6117A008886l1362O8654N6722j90575J12079N6929N9296n2639Q0824O8670j04722
6106A132762j9527q4985M0393R9020L32085P1785o9991j98683q841N3978p3196
6095A274800j04624O663J07842k23819r907N2437R0733N4604N1069M295J7468
6084A321561j1382j35837j16920L8119j16806O0865J56467J4961J61512J21488
6074A494028k541j5584o4835J26780j66311j64124L9356L2247P0730j10609J94491
$$ y = [1201676, 1117121, 1041176, 1083467, 962104, 1013312, 1140982, 1021965, 913154, 971878, 1026589, 1155037, 872356, 877972, 862739, 740293, 886216, 825162, 893147, 1003539, 965476, 939016, 997276, 888019, 959875, 995016, 1100666, 1036680, 849434, 905353, 896625, 838157, 943763, 1008886, 977524, 1046178, 1102900, 912325, 1024404, 1081333, 1140629, 1087990, 1168814, 1237484, 1132762, 1113235, 1028250, 1068643, 1167663, 1499748, 1571533, 1501542, 1302859, 1294018, 1347996, 1274800, 1170176, 1176839, 1284681, 1060862, 1050955, 1103392, 1194125, 1248729, 1299798, 1304093, 1321561, 1310179, 1174342, 1057422, 1095541, 978735, 1039600, 1196067, 1211028, 1372540, 1494028, 1491487, 1475903, 1411068, 1537848, 1371537, 1207413, 1246769, 1279016, 1349746, 1239137, 1433628]
6063A433628m6393k21117P4159K75044J33107j06929J02867P306k16790j6827
6053A418055j30941Q7873N8328J52403J90494j02470q6252k3990K17329o8822
6043A712007o4471J07788j30042M2660J55839j32869k432q8274r6058l3849K01079
6032A671378J09626n5640J74958J17459K7601J17881r8330j34737J76350M2513
6022B149059j05434j00236M3473m9304j8476K0457R1431K54884n5323O1905K19516
6011B511952J57856o8238J34181L887k6428K72080N1984k6889J42231K51161L9341
6000C443118P06J07859J35335n6362l1934j48343K26718K26323J75146P9394J23671
5989D281631N3331K36708J31861J93734J5963K58171J70345n3128K12281O4513
$$ y = [1433628, 1387235, 1166118, 1240277, 1515321, 1648428, 1541499, 1644366, 1651672, 1434882, 1418055, 1287114, 1374987, 1433315, 1585718, 1776212, 1673742, 1587490, 1563500, 1780829, 1712007, 1647536, 1755324, 1625282, 1667942, 1823781, 1690912, 1688480, 1600206, 1504148, 1470299, 1671378, 1781004, 1725364, 1900322, 2017781, 2045382, 2163263, 2064933, 1930196, 2106546, 2149059, 2043625, 1943389, 1986862, 1937558, 1919082, 1939539, 2030970, 2285854, 2230531, 2292436, 2511952, 2669808, 2601570, 2735751, 2739638, 2713210, 2985290, 3037274, 3010385, 3152616, 3403777, 3443118, 3443824, 3551683, 3687018, 3630656, 3598722, 3450379, 3677097, 3903420, 4078566, 4157960, 4281631, 4334962, 4571670, 4703531, 4897265, 4913228, 5171399, 5341744, 5288616, 5500897, 5565410]
5979E565410K20849K00508J89170L43335J52732J76830L95044L29356L58178L27845
5969H259257L27873N89131O18026N83949M08382K97241K51169L28985R8408J26831
5959A1889252M5819K5563o2509n996L00224K0662J99494K59065L94262J21798
5949A3187634Q1438J77546L534k65493o9076o0131j77480l94028m14155k21616
5939A1848173q6400k51763j00809J55459R3669L66255L84262N40813N06140O44648
5929A4100447P81871Q72499Q30617Q96683O34762O94809L83521k39238k12470
5920A8743501l77519k07467j83067n7689k45647m69918l88719n21956n54716j77852
5910A5558951j23383k57887j51236K6427L01789M57770K95807K99233N03124N13376
$$ y = [5565410, 5786259, 5986767, 6175937, 6519272, 6672004, 6848834, 7243878, 7573234, 7931412, 8259257, 8587130, 9176261, 9794287, 10378236, 10786618, 11083859, 11335028, 11664013, 11762421, 11889252, 11935071, 11960634, 11898125, 11892129, 12192353, 12213015, 12412509, 12671574, 13065836, 13187634, 13269072, 13446618, 13450152, 13184659, 13115583, 13055452, 12877972, 12483944, 12069789, 11848173, 11761773, 11510010, 11409201, 11564660, 11658329, 12024584, 12408846, 12949659, 13455799, 14100447, 14882318, 15754817, 16585434, 17482117, 18116879, 18811688, 19195209, 18955971, 18743501, 18365982, 18158515, 17975448, 17917759, 17672112, 17202194, 16813475, 16291519, 15736803, 15558951, 15435568, 15177681, 15026445, 15052872, 15354661, 15812431, 16108238, 16407471, 16910595, 17423971]
5900A7423971K46800J22265J32772K60250J60629K58366O6486K44327j21132l16621
5890A8478113k09864m05690n00449m26968n44002j12190k06487j31037Q5550L44725
5880A6371701M06900L97196M79395M48026K83848K63714L88957k3820j59687m65752
5870A8390478o48657n04123n98954m60120k98731j90445p0232m4598L8373L35244
5860A5948235K37952K72233L78016J76811K28807L48005N07887K77941J7214M78887
5850A8871988N34700M21744N43744O66750P34863M57628K56283M8022Q6802K61796
5840B2884320M77552M93118K24039N223R7697l07297m39019o30034p01860j139724
5830B0964015q00589p50542m62335k55885p1139P7089J83764M32737N60117N61034
$$ y = [17423971, 17670771, 17793036, 17925808, 18186058, 18346687, 18605053, 18671539, 18915866, 18794734, 18478113, 18268249, 17862559, 17362110, 16935142, 16391140, 16278950, 16072463, 15941426, 16026976, 16371701, 16778601, 17175797, 17655192, 18103218, 18387066, 18650780, 19039737, 19015917, 18856230, 18390478, 17741821, 17237698, 16638744, 16178624, 15879893, 15689448, 15619216, 15574618, 15612991, 15948235, 16186187, 16458420, 16836436, 17013247, 17242054, 17590059, 18097946, 18375887, 18393101, 18871988, 19406688, 19828432, 20372176, 21038926, 21773789, 22231417, 22487700, 22535722, 22622524, 22884320, 23361872, 23854990, 24079029, 24084252, 24181949, 23874652, 23435633, 22805599, 22103739, 20964015, 20163426, 19412884, 18950549, 18694664, 18623525, 18700614, 18884378, 19317115, 19877232, 20438266]
5820B0438266O29318O23548L75208L06790j25329k99789m40030p35796o80149
5811B0092037o51711m52450m01563m58649j43256p2761l23349k91284j74459k18172
5801A6904383m04652j59165j97791K29548K99683J93703R6159N7677j15768n8086
5791A6845691R2869m1867l07579m34046n29284n57190l08731k50065l09714j2954
5781A4187130o7326m73820o48928n62996l04862j83575l42029k18300k17116k9850
5771A1138328k15512j67309j10574j29239L0839j87287m8077q6078j01373j71819
5761I951899o0061p4426L2026o7552K88256k31895k74658J565k5554J10344k61552
5750I388392n8004J99842l39760M0407n6548j46024j77143o3978p8957l0120j18755
$$ y = [20438266, 21067584, 21691132, 22066340, 22373130, 22247801, 21948012, 21507982, 20772186, 20092037, 19440326, 18987876, 18586313, 18127664, 17984408, 17911647, 17588298, 17297014, 17122555, 16904383, 16499731, 16340566, 16142775, 16372323, 16672006, 16865709, 16961868, 17019545, 16903777, 16845691, 16938560, 16896693, 16589114, 16155068, 15625784, 15068594, 14759863, 14509798, 14200084, 14187130, 14119804, 13645984, 12997056, 12434060, 12129198, 11945623, 11603594, 11385294, 11168178, 11138328, 10922816, 10755507, 10644933, 10515694, 10546533, 10359246, 10311169, 10225091, 10123718, 9951899, 9891838, 9817412, 9849438, 9781886, 10070142, 9838247, 9563589, 9565154, 9539600, 9649944, 9388392, 9330388, 9530230, 9190470, 9230877, 9174329, 9028305, 8851162, 8787184, 8708227, 8678107, 8559352]
5739H559352r0630K8060o17j38499q4810O3307J57794k48598j44692J32264n7971
5728H174960j65843j63139j48917P3263j42104J8745J30108j80437N2213N4936
5718G703785q2601k22743J2040J04576j61561k95585K2937l68j54121L1628q2792
5707F875195j65427r2294l9730K80654Q2611j00645M9108j30180P3128j00393
5697F732027n9295r4324R134l9559r7529l0767l5510J67676n4404N2934J06496
5686F656879N2784k90772r9287K62202J75370j2261Q8621P928j46847p5865J19044
5675F737796J60017m0013k0417J99952o446L1255J15044M887M0921L6763J49477
5664G409236K40632L6672J81755N9981J62548K11748M9233J95585n5625J6101
$$ y = [8559352, 8468722, 8496782, 8496165, 8357666, 8272856, 8336163, 8493957, 8245359, 8100667, 8232931, 8174960, 8009117, 7845978, 7697061, 7770324, 7628220, 7646965, 7777073, 7596636, 7648849, 7703785, 7621184, 7398441, 7410481, 7515057, 7353496, 7057911, 7080848, 7080480, 6926359, 6957987, 6875195, 6709768, 6617474, 6577744, 6858398, 6941009, 6840364, 6889472, 6759292, 6832420, 6732027, 6672732, 6578408, 6587542, 6547983, 6450454, 6419687, 6384177, 6551853, 6497449, 6550383, 6656879, 6709663, 6418891, 6319604, 6581806, 6757176, 6744915, 6833536, 6841464, 6694617, 6618752, 6737796, 6897813, 6857800, 6837383, 7037335, 7030889, 7062144, 7177188, 7182075, 7222996, 7259759, 7409236, 7649868, 7686540, 7868295, 7928276, 8090824, 8302572, 8351805, 8547390, 8491765, 8507866]
5654H507866N1385L7342p6942j6197J62030K25637J83181M4514J56418l2430K61742
5643I504546P6862O3676K85719J55803K09335L87330K73094l8626L13230k6994
5633A1203975j2960L4872J93584J82544K4055J13974Q9797P5727N3444K55135
5623A2214147J57428L21803O5402K12278L27402J94152J60735K66503K34540K52539
5613A4406929L46027K78905J58448M82836M17533N09981J57664K32718M26995
5604A7418036N65271M41877M76223M93475M44181N82215O15155P78184J032098
5595B2846715R01739J028097J093576J239374J331597J533780J901609J503690
5587C3380177J850409J998334K198288K191641K747580L131288L357185M111986
$$ y = [8507866, 8559251, 8596593, 8519651, 8503454, 8665484, 8891121, 9074302, 9118816, 9275234, 9242804, 9504546, 9581408, 9645084, 9930803, 10086606, 10295941, 10683271, 10956365, 10917739, 11230969, 11203975, 11191015, 11225887, 11419471, 11602015, 11626070, 11740044, 11829841, 11905568, 11959012, 12214147, 12371575, 12693378, 12758780, 12971058, 13298460, 13492612, 13653347, 13919850, 14154390, 14406929, 14752956, 15031861, 15190309, 15673145, 16090678, 16600659, 16758323, 16991041, 17418036, 17983307, 18425184, 18901407, 19394882, 19839063, 20421278, 21036433, 21814617, 22846715, 23748454, 24776551, 25870127, 27109501, 28441098, 29974878, 31876487, 33380177, 35230586, 37228920, 39427208, 41618849, 44366429, 47497717, 50854902, 54966888]
5579E4966888M869356N308494O358852P496678Q389023R077488P588838L809179
5571A07864796j32088j732875j11112K453085M706536O601718Q286142R963338
5563A37899540J1621182J3196553J2260439P173217Q92968m6515N326575J0588242
5555A98912201R133429j181154j4123579k2044463k3110697j9518609j5054659
5548A13012469j1951696r629328p793828o145147n152566m345347l282349k879841
5540F1832367k738535k786295k686422k492150k260547j793513j578645j429263
5532D4066997j472728j144942j223950j102838r97054j097059r08104n79331n17875
5523C5023116l14921l65832n53921n43225p09704o92434q16135q80372n75721
$$ y = [54966888, 59836244, 65144738, 71503590, 79000268, 87389291, 96466779, 104055617, 107864796, 107732708, 105999833, 105888721, 108341806, 113048342, 119650060, 127936202, 137899540, 149520722, 162717275, 174977714, 182150931, 183043899, 182997384, 188323959, 198912201, 208045630, 206864476, 192740897, 170696434, 147585737, 128067128, 113012469, 101060773, 91431445, 83637617, 77492470, 72339904, 67994557, 64712208, 61832367, 59093832, 56307537, 53621115, 51128965, 48868418, 47074905, 45496260, 44066997, 42594269, 41449327, 40225377, 39122539, 38125485, 37028426, 36120322, 35540991, 35023116, 34708195, 34342363, 33788442, 33245217, 32535513, 31843079, 31026944, 30146572, 29570851]
5514B9570851l03898k56523m25394k82091m43886m87088n41801j05366k13223
5505B6511581m1354J68095J66210r47k63381n92004o51747n32227n86847l88869
5495B3788510m02776m47203o55591n65756l36970m97725o63161n53760n56862
5486A9108706j38516k07725k14978N1456j25804J49911K60002K18806P22966O42843
5476B0467667R64249J008361J234948J692955J831107J656161P30989q79769k096395
5467B6610273k404263k122455j742887j292924j049441r36908p14451m92113k40719
5458A5614112m52344j47193j35956l08283j39974r140J41991K57957K13330J91811
5448A5226311N73720K19343M38633R41137J132153J158839J527071J716610J923749
$$ y = [29570851, 29266953, 29010430, 28585036, 28302945, 27859059, 27371971, 26830170, 26724804, 26511581, 26470227, 26638322, 26804532, 26803585, 26540204, 25948200, 25296453, 24764226, 24177379, 23788510, 23385734, 22938531, 22282940, 21717184, 21380214, 20882489, 20219328, 19665568, 19108706, 18970190, 18762465, 18547487, 18598943, 18473139, 18623050, 18883052, 19101858, 19824824, 20467667, 21431916, 22440277, 23675225, 25368180, 27199287, 28855448, 29586437, 28706668, 26610273, 24206010, 22083555, 20340668, 19047744, 17998303, 17061395, 16346944, 15854831, 15614112, 15161768, 15014575, 14878619, 14570336, 14430362, 14421222, 14563213, 14821170, 15034500, 15226311, 15800031, 16019374, 16458007, 17399144, 18531297, 19690136, 21217207, 22933817, 24857566]
5439B4857566J552257O07859p99766k072139k401826k104845j781954j477842
5431A6379310j202514q64155q52391n11062m57604l17267k37669l82606q1982
5422A1472060l7416p0961J00662J0781m7817q3531J66352K99813M44329M30844
5412A2685116M10169O36079M45768O02503N01465L47764j14623o30895q40173
5403A4043173j112359j091479o33033o90436m39298n20409o54985l14134j33573
5394H453467j09770l29617k39853j19645m0522j01518n7605N9821k00519j93013
5384G121226N2991p2293j49743j12024n2792j29749M3871L59251n7151P9637M8475
5373G131699j30458K69424K97051k4077K41088J16284O600r5536k07666j41568
$$ y = [24857566, 26409823, 27017682, 26217916, 24145777, 21743951, 19639106, 17857152, 16379310, 15176796, 14312641, 13460250, 12949188, 12491584, 12174317, 11936648, 11554042, 11472060, 11434644, 11363683, 11464345, 11475126, 11427309, 11343778, 11510130, 11809943, 12254272, 12685116, 13095285, 13731364, 14177132, 14779635, 15281100, 15628864, 15514241, 14883346, 14043173, 12930814, 11839335, 11206302, 10515866, 10076568, 9556159, 8901174, 8587040, 8453467, 8343697, 8014080, 7774227, 7654582, 7614060, 7512542, 7454937, 7514758, 7314239, 7121226, 7174217, 7101924, 6952181, 6840157, 6787365, 6657616, 6701487, 7060738, 7003587, 7083224, 7131699, 7001241, 7270665, 7567716, 7543639, 7784727, 7901011, 7907611, 7812075, 7604409, 7462841]
5363G462841l03066j38118k2507l6331k10302j29345J13779O218Q4421L804j0590
5352F820804p6150j62361k27652j78098j90105j40962P8788k03813l64720n2247
5342E303484o978Q6894J4675k09207L5616o2980m7998R5324j89139J683J42440
5331E163814N2007l13451j16643M6039j30863J36258j6910K6438j04244J45457
5321D887902J36071L9593L95510J22639J46261R969Q7276K19134K21420p7382
5311F188393o2834k20815k4948j42270k01784k19467k90999j17526q8886k06034
5301D612830j31644K4587M3513j83523m02421L13J64183J7650O9645k9078j07766
5290D078289N7392j622M0510P4389O9674o5809j0940p1751r7344r2K6976k13587
$$ y = [7462841, 7159775, 7021657, 6999150, 6962819, 6752517, 6623172, 6736951, 6743169, 6827590, 6831394, 6820804, 6744654, 6582293, 6354641, 6176543, 5986438, 5845476, 5924264, 5720451, 5355731, 5303484, 5296506, 5383400, 5398075, 5188868, 5224484, 5161504, 5113506, 5208830, 5019691, 5021374, 5163814, 5215821, 4902370, 4785727, 4831766, 4700903, 4837161, 4820251, 4846689, 4742445, 4887902, 5023973, 5063566, 5459076, 5581715, 5727976, 5737945, 5825221, 6044355, 6265775, 6188393, 6125559, 5904744, 5879796, 5737526, 5535742, 5316275, 5025276, 4907750, 4818864, 4612830, 4481186, 4505773, 4549286, 4365763, 3963342, 3963655, 4127838, 4145488, 4215133, 4186055, 4078289, 4135681, 4134059, 4174569, 4248958, 4318632, 4252823, 4241883, 4170132, 4072788, 4072696, 4099672, 3886085]
5278C886085O4357j10007R8641j24482j81776K0007j16206j27745j82445O4998
5268C291427L7224J60711R6241k49560k52136j260o9978j15597J43122p408P8186
5257C110972k1047j74203j18599J03223l7754M0287k2957q2918O3262L56057N6001
5246C272324J374J53808p0901n9747r8418M6268l3930K5433J14751M8016J8634
5235C417612k449N4598k3823m1701J41228O4098J5902Q503J71205j04046p7570
5224C623557J0555j37171j74856k32201m5635q6809j19558J89581m2190k25244
5214B760029n8333O3682J42468o4899n5336r526J83741N1673k45426k1322L0418
5203B777169Q0601n348l7239j08596o1648o8367M276j32359j04p5081o0189J88458
$$ y = [3886085, 3950442, 3840435, 3939076, 3814594, 3632818, 3652825, 3536619, 3408874, 3226429, 3291427, 3328651, 3489362, 3585603, 3336043, 3083907, 3082647, 3012669, 2897072, 3040194, 3032786, 3110972, 3089925, 2915722, 2797123, 2900346, 2862592, 2902879, 2879922, 2797004, 2860266, 3216323, 3272324, 3273698, 3427506, 3356605, 3296858, 3198440, 3244708, 3210778, 3236211, 3350962, 3398978, 3417612, 3415163, 3469761, 3445938, 3404237, 3545465, 3609563, 3625465, 3633968, 3805173, 3701127, 3623557, 3634112, 3496941, 3322085, 3089884, 3044249, 2957440, 2837882, 3027463, 2985273, 2760029, 2701696, 2765378, 2907846, 2842947, 2787611, 2778085, 2961826, 3013499, 2768073, 2746751, 2777169, 2857770, 2852422, 2815183, 2706587, 2644939, 2576572, 2580848, 2448489, 2448385, 2373304, 2313115, 2501573]
5191B501573q2607J923N2164J11367j03855J38639o8529N2986n6307K7003j6604
5180B557753j3960J29633r3009j07752M0304q176J26906R8389l9455Q5218m8802
5169B727049o4787j31644P2266n8142M377R0751J71364m5831O3295J22767j69591
5158B781874j55551o4057N4705J02573M247k5366j213j2400j74069k061J50155
5147B658837K7324P2902k0572l8947O1436r449M0226P6308P4556N0554J5091j18742
5135B889524l3972k1926L9039J17156j52849Q0252J19987k7879r270n0627J74777
5124C124212O7448j73086m4798J08688J48902M17776J87302K15439O1508P6415
5114D189806J82803J871j15771j48323l37161j34171l13177j5969J01148K2076
$$ y = [2501573, 2418966, 2420889, 2473053, 2584420, 2480565, 2619204, 2550675, 2603661, 2547354, 2574357, 2557753, 2543793, 2673426, 2580417, 2472665, 2512969, 2504793, 2631699, 2730088, 2690633, 2775851, 2727049, 2662262, 2530618, 2602884, 2544742, 2549119, 2639870, 2811234, 2765403, 2828698, 2951465, 2781874, 2626323, 2562266, 2616971, 2719544, 2723791, 2698425, 2697212, 2684812, 2510743, 2508682, 2658837, 2686161, 2759063, 2738491, 2699544, 2760980, 2751531, 2791757, 2868065, 2942621, 2993175, 3008266, 2889524, 2855552, 2833626, 2872665, 2989821, 2836972, 2917224, 3037211, 3009332, 3000062, 2949435, 3124212, 3191660, 3018574, 2973776, 3082464, 3231366, 3649142, 3836444, 4051883, 4113391, 4189806, 4372609, 4374480, 4258709, 4110386, 3773225, 3639054, 3325877, 3309908, 3411056, 3433132]
5104C433132J29937j22050r7430K13695J15170R2673K27960K34469J25665J23411
5094D476632L47621L95736L62556J90869J46153n7705n49493n64549l25127k47142
5084D175551k45911j21227o4210J42711N8518k18679j20171j95564o5873J6338
5074C361483J63669j21753J14969J59290P7470k1236Q8140K76944L22111j1520
5064D409567r7168J4061k10662n19662N2996k0922p5750k66000k1938n4134j01583
5053C108805K52831N7419k86416j51002J24933N7056J4063n598J43360k0007l7725
5042C257719j5491K2816n5698J08675M2880q0797J03121j7452R4995J1417j81577
5031C290608o2600n5234N0543J3452N9130k12988k2520R8409P4494k621j07386
$$ y = [3433132, 3563069, 3441019, 3343589, 3557284, 3672454, 3765127, 3993087, 4227556, 4353221, 4476632, 4824253, 5219989, 5582545, 5773414, 5919567, 5861862, 5312369, 4747820, 4422693, 4175551, 3929640, 3808413, 3744203, 3886914, 3945432, 3726753, 3606582, 3411018, 3345145, 3361483, 3525152, 3403399, 3518368, 3677658, 3755128, 3733892, 3822032, 4098976, 4421087, 4409567, 4312399, 4326460, 4115798, 3596136, 3649132, 3628210, 3552460, 3286460, 3264522, 3210388, 3108805, 3361636, 3419055, 3132639, 2981637, 3106570, 3163626, 3177689, 3172091, 3315451, 3295444, 3257719, 3242228, 3265044, 3209346, 3318021, 3360901, 3280104, 3383225, 3365773, 3460768, 3472185, 3290608, 3228008, 3172774, 3223317, 3236769, 3295899, 3082911, 3060391, 3158800, 3233294, 3230673, 3123287]
5020C123287J63836k9983m4315J11637K283P8086J09914j43007m0453N8780J2353
5009C402418J60222K7687k02406k8653M1939R7910K1427J29692J2628o872R3264
4998C749256j9590N928J3521J45335J67543L0336K1514K5623q8331L9909j3741
4987D077303J6788K56151L58119K23346k9946P6112K75285R1767J37305J66016
4977E648246J07955m4039k7262J3366j6300J4595N0622J64129J994J67010J80426
4966F260742K36447R7434J04356K96822J57581j07258k68012N0358r6477J5322
4956F747315K35475l1745n1580R3734k8551L49133K79753k8864J12073K37752
4946G914495j35448R8871o7497k45086N0400J69694o0049j33633O9168M6497N5738
$$ y = [3123287, 3287123, 3257140, 3212825, 3324462, 3326745, 3404831, 3514745, 3371738, 3331285, 3390065, 3402418, 3562640, 3590327, 3387921, 3359268, 3401207, 3499117, 3520544, 3650236, 3662864, 3655992, 3749256, 3729666, 3735594, 3749115, 3894450, 4061993, 4092329, 4113843, 4139466, 4051135, 4091044, 4077303, 4094091, 4350242, 4708361, 4931707, 4901761, 4977873, 5253158, 5344925, 5482230, 5648246, 5756201, 5712162, 5684900, 5698266, 5681966, 5696561, 5747183, 5911312, 5913306, 6080316, 6260742, 6497189, 6594623, 6698979, 6995801, 7153382, 7046124, 6778112, 6828470, 6731993, 6747315, 6982790, 6951045, 6899465, 6993199, 6964648, 7313781, 7593534, 7564670, 7676743, 7914495, 7779047, 7877918, 7810421, 7565335, 7615735, 7785429, 7725380, 7591747, 7660915, 7707412, 7763150]
4935G763150Q839Q7376K91k3903j78794j36794j31318k04244k59080J16m909j55878
4923F764852j49861K35678R1819j07084J20488j02072p9939k43840k28616j30258
4913F171167q3219j44854n8937K570j16088J6484p9736l23699K6255j39121l1926
4902E238896N623j07796l9220j70403m7597j00253j28236j70812R3863j02489
4892D471576j40450q5104j83222k6700J1529j2l6393K336j21511o6580j97697
4881C627772n8505N372k63067n5182j0208m0970o6687N0776M9835j59775j59494
4870B919867R567k4033K8263j43476j50814K69350o393N801j04200r9191J37066
4859B841807o0275K2446p5650J1564k5403R4493j11917O728N0541k4724k7276
$$ y = [7763150, 7771989, 7859365, 7859656, 7835753, 7656959, 7520165, 7388847, 7184603, 6925523, 6925639, 6920730, 6764852, 6614991, 6850669, 6942488, 6835404, 6955892, 6853820, 6773881, 6530041, 6301425, 6171167, 6087948, 5943094, 5884157, 5886727, 5770639, 5787123, 5707387, 5383688, 5409943, 5270822, 5238896, 5244519, 5136723, 5097503, 4927100, 4879503, 4779250, 4651014, 4480202, 4574065, 4471576, 4331126, 4246022, 4062800, 4036100, 4047629, 4047617, 4011224, 4013560, 3892049, 3825469, 3627772, 3569267, 3574639, 3311572, 3256390, 3246182, 3205212, 3138525, 3189301, 3239136, 3079361, 2919867, 2929434, 2905401, 2933664, 2790188, 2639374, 2908724, 2902331, 2908132, 2803932, 2704741, 2841807, 2781532, 2803978, 2728328, 2739892, 2714489, 2808982, 2697065, 2703793, 2754334, 2729610, 2702334]
4848B702334R7730n3687k4390J38599l4534N7250J43923r7595j39678J8786J47105
4837B955843K19275p3373j32538O9848O3605l10557N5234K22762J88093P6655
4827C334847r6906j59085J8118M0096O8038J64657M5498j17151k9548P4839O9889
4816C413292p660J98293Q7702k10479l2126J79233k5238J63646j610P6256J84331
4805D025640J07266J29333J53415K35360M1862J28016J01519K26485l7435j1682
4795E099779R4052J85515L0679J56924K71882L16333J05129J1492K13011L03322
4785F788118M86803L75593L02725N16823N51667N24262N71834P78763Q51760J372604
4775A3120952J477320J681270K237096K948499L588191L582257J981504n39502
$$ y = [2702334, 2800064, 2746377, 2721987, 2860586, 2826052, 2883302, 3027225, 2929630, 2789952, 2808738, 2955843, 3175118, 3101745, 2969207, 3039055, 3102660, 2792103, 2847337, 3070099, 3258192, 3334847, 3237941, 3078856, 3096974, 3137070, 3205108, 3369765, 3415263, 3298112, 3268564, 3343403, 3413292, 3405632, 3603925, 3691627, 3481148, 3449022, 3628255, 3603017, 3766663, 3765053, 3841309, 4025640, 4132906, 4262239, 4415654, 4651014, 4692876, 4820892, 4922411, 5148896, 5111461, 5099779, 5193831, 5379346, 5410025, 5566949, 5838831, 6155164, 6260293, 6271785, 6484796, 6788118, 7274921, 7650514, 7953239, 8470062, 9021729, 9545991, 10117825, 10896588, 11748348, 13120952, 14598272, 16279542, 18516638, 21465137, 25053328, 28635585, 30617089, 30077587]
4767C0077587k624799l960150l931171l138409k251522j516843j013922j110518
4759A0530253p47958m88857p36068l73275l83464j46953k08133k49739j08510
4750G087296J9877p1886j68827j07005k4915Q390j86413O556m4936J61248M5261
4739F724646l471J03513J23737J94118j49453q0955O4990N6071J18814k2213O9397
4728G199194J79567J62506J26915K34756l7334J56909J35692K02874J70109L26049
4718H857237K34667K60114M48484O53657N34960M67962M11008J003662J244880
4709A4116631J422927J616083J784228K684388L193031L170217K176867M05466
4701C0569838q97235k076080l447148l670552k924726j994824j141323q31074
$$ y = [30077587, 27452788, 23492638, 19561467, 16423058, 14171536, 12654693, 11640771, 10530253, 9782295, 9293438, 8557370, 8184095, 7800631, 7653678, 7445545, 7195806, 7087296, 7107173, 7035287, 6866460, 6759455, 6734540, 6742930, 6556517, 6563073, 6518137, 6679385, 6724646, 6721175, 6824688, 6948425, 7142543, 6993090, 6912135, 6977125, 7033196, 7152010, 7129797, 7199194, 7378761, 7541267, 7668182, 7902938, 7865604, 8022513, 8158205, 8361079, 8531188, 8857237, 9091904, 9352018, 9800502, 10454159, 10989119, 11457081, 11868089, 12871751, 14116631, 15539558, 17155641, 18939869, 21624257, 24817288, 27987505, 30164372, 30569838, 29672603, 27596523, 24149375, 20478823, 17554097, 15559273, 14417950, 13586876]
4693A3586876q06029m45548l30088l41001o3751j53513k2560K48520J26554L05982
4683A2105442K09524N8940L4822n4135j20421k50852r0779j00788k43736k68319
4673A1279698j9013m9497o5081K40787j19184K66964L12587K78973K89867P4374
4663A2490475K64325K23467R8453J51625j28220l66174j50026L8641j00512k25544
4653A2296510j23069N0656J38005K86653J71486j55373j24691l6770m04340j44895
4643A1954172j70232l719P6237m7283r2342J52692J17014K37015M08899L28576
4633A2961029M44319N17958O48515J47901J81936O07029N50440N76464K64637
4624A6900228p7190m07663o89308m88101j96411J42399K59632L96809O13894M57555
$$ y = [13586876, 12780847, 12335299, 12005211, 11664210, 11600459, 11446946, 11424386, 11672906, 11799460, 12105442, 12314966, 12373906, 12408728, 12354593, 12234172, 11983320, 11892541, 11791753, 11548017, 11279698, 11260685, 11211188, 11146107, 11386894, 11267710, 11534674, 11847261, 12126234, 12416101, 12490475, 12754800, 12978267, 13076720, 13228345, 13100125, 12733951, 12583925, 12622566, 12522054, 12296510, 12173441, 12224097, 12362102, 12648755, 12820241, 12664868, 12540177, 12503407, 12099067, 11954172, 11783940, 11780221, 11856458, 11809175, 11716833, 11869525, 11986539, 12223554, 12632453, 12961029, 13405348, 13923306, 14571821, 14719722, 14901658, 15508687, 16059127, 16635591, 16900228, 16823038, 16415375, 15726067, 15237966, 15041555, 15183954, 15443586, 15840395, 16454289, 16911844]
4614A6911844L42261M00894M71478N20274J91654M48026K48008P0365j5197j10061
4604A9479546k44701m34329n13527p86050p25646m35102j44928k43109K2316K68270
4594A6242740K81234K34261n5100q2j98084k66966p1950o2011k04149o57P7200
4583A5976436j18701o65359p51539o10231l45722k66649J4298K67524L38697K49170
4573A4087924M25644K20115Q8461J36043J26263n3075m49016J1814J93306O8543
4563A4856022p4370J05220P6074K05459j14185l00812n22993o28661m66913O5218
4553A3200059Q1611J39673J75011p4378L7988j97051l71035n73085l48601l76472
4543A1693720l28246j40327l1984K98829L56103K51235N03324M55447j16964k78692
$$ y = [16911844, 17254105, 17654999, 18126477, 18646751, 18838405, 19286431, 19534439, 19604804, 19589607, 19479546, 19234845, 18800516, 18286989, 17500939, 16775293, 16340191, 16195263, 15952154, 15974470, 16242740, 16523974, 16758235, 16703135, 16703053, 16504969, 16238003, 16166053, 16104042, 15899893, 15899236, 15976436, 15857735, 15192376, 14440837, 13830606, 13484884, 13218235, 13232533, 13500057, 13838754, 14087924, 14513568, 14733683, 14822144, 14958187, 15084450, 15031375, 14582359, 14594173, 14787479, 14856022, 14781652, 14886872, 14962946, 15168405, 15054220, 14753408, 14230415, 13601754, 13134841, 13200059, 13281670, 13421343, 13596354, 13521976, 13559964, 13362913, 12991878, 12418793, 12070192, 11693720, 11365474, 11225147, 11193163, 11491992, 11848095, 12099330, 12602654, 13058101, 12941137, 12662445]
4533A2662445l17073n12695o07530m01404q59778l14001k98580j52059j63741
4524I035584j28291M8945k99837j64359M4384L5083P5479n0856J7888P1716j0975
4513H674761N3022k7364r8128J27120m5026m38514j09714j27178k4411j65748
4503G818820O8959o1332L6532K20561J34961J2490j32022m9144M1435j08577J0496
4492G993179l8371p8003j02952k49087k09772j54557n1270j77870j17658Q7142
4482F900781k36583M9697J22102K3801j1410j55289N9651J75784J47551j49158
4472F926927l4355N351K47760j8098j4482K22782Q5734j64891J4540P156k25639
4461G052785N2064n2489J17477J14947L28009K31403J95394K59804J47022n3566
$$ y = [12662445, 12345372, 11832677, 11225147, 10823743, 9963965, 9649964, 9351384, 9199325, 9035584, 8907293, 8956238, 8656401, 8492042, 8536426, 8571509, 8646988, 8596132, 8614020, 8685736, 8674761, 8727783, 8700419, 8602291, 8729411, 8684385, 8245871, 8136157, 8008979, 7984568, 7818820, 7887779, 7826447, 7862979, 8083540, 8218501, 8230991, 8098969, 8049825, 8091260, 7982683, 7993179, 7954808, 7876805, 7773853, 7524766, 7314994, 7160437, 7109167, 6931297, 6813639, 6900781, 6664198, 6713895, 6835997, 6859798, 6848388, 6693099, 6752750, 6928534, 7076085, 6926927, 6892572, 6897923, 7145683, 7127585, 7113103, 7335885, 7421619, 7256728, 7271268, 7278424, 7052785, 7104849, 7052360, 7169837, 7284784, 7612793, 7844196, 8039590, 8299394, 8446416, 8392850]
4451H392850K36779K61239L92832M41574L65572L67948K03905M12176P17337Q26381
4441A2618593R46822P68693P14030N21702L21672j06317l03209k08304P7597J70490
4431A5521769O005J25704J93065K48197J31030J95103L7654J76646K2740P774
4421A6665687J17107K21025M84569O02414N04628L99956R267p52771j023763q24814
4411A6403305q32877p04808m97988m95769j41092J90498K77904K66705j08817
4402A4357061n07113q20781p76782o46754m64379l01j33588n6076K91192K5303
4392A1267782m26757o00808j94067j73082k49879k04143L3574L02853J58310K06912
4382A0120695K39129m572l55474m96758j52589j82965m8143Q474J22517K92866
$$ y = [8392850, 8629629, 8890868, 9283700, 9725274, 10090846, 10458794, 10662699, 11074875, 11792212, 12618593, 13565415, 14334108, 15048138, 15569840, 15891512, 15785195, 15481986, 15273682, 15351279, 15521769, 15527774, 15653478, 15846543, 16094740, 16225770, 16420873, 16458527, 16635173, 16657913, 16665687, 16782794, 17003819, 17488388, 18090802, 18595430, 18995386, 19004653, 18251882, 17228119, 16403305, 15570428, 14865620, 14367632, 13871863, 13730771, 13921269, 14199173, 14465878, 14357061, 13849948, 13029167, 12252385, 11605631, 11141252, 11140951, 11007363, 10951287, 11242479, 11267782, 10841025, 10240217, 10046150, 9873068, 9623189, 9419046, 9452620, 9755473, 9913783, 10120695, 10359824, 10355252, 9999778, 9503020, 9350431, 9167466, 9119323, 9127797, 9250314, 9543180]
4372I543180J67767R9651J73329k7398P4366K46880j0299j64221j2150J79178
4362A0270283k5541j57606N5018j6462K75529J10376K17336J74814J10241K65512
4352A1279500L11826K91793k80853j19078m48219m13882k76431k67509l48090
4343I729057l36692q3032j65055j92673r3761k51541l02282j29509k85456k72803
4333G616253o4216j04722R453K236j1459K37441r5490j55913j64699q0077k17627
4322F971180j78841J73565k5203l0581J10695J92121J50248l6535K9621j81911
4312G174359j01554j81062l17691n538L7283J79152J47527j36430o4977K23818
4302F954887L01753p9265j75649k09081j28905Q3282m1743R017N025j54836O7982
$$ y = [9543180, 9710947, 9810598, 9983927, 9956529, 10030895, 10277775, 10267476, 10103255, 10091105, 10270283, 10244742, 10087136, 10142154, 10125692, 10401221, 10511597, 10728933, 10903747, 11013988, 11279500, 11591326, 11883119, 11602266, 11483188, 11034969, 10621087, 10344656, 10077147, 9729057, 9392365, 9309333, 9144278, 8951605, 8857844, 8606303, 8304021, 8174512, 7889056, 7616253, 7552037, 7447315, 7456768, 7459004, 7447545, 7684986, 7589496, 7433583, 7268884, 7188807, 6971180, 6792339, 6965904, 6940701, 6910120, 7020815, 7212936, 7363184, 7326649, 7356270, 7174359, 7072805, 6891743, 6574052, 6568514, 6605797, 6784949, 6932476, 6796046, 6731069, 6954887, 7256640, 7177375, 7001726, 6792645, 6663740, 6747022, 6705279, 6714296, 6719321, 6564485, 6632467]
4291F632467K1950j41964R0783P8376l8063J54106J52716k20298K07514L16607
4281G254194n1354Q8491K06107j2665R6357K19309K1552K3887J48736J34230O4980
4270H193824N6995O7541m0538J57440L44482L80946j6319K53180N48033K5827
4260I971411m209m5137j20481J26052J45728o729j77320j468J20054L2513K08138
4249A0248552j8689K13187L94275K53137K16913J14608J37159J74876K46090l1438
4239A1948670L39960N34287J23137J27801J78811K07624K85940p9569q434j936
4229A3656291j12147Q6035L16089J60534J04337Q7858K10723K82090O1088o5009
4219A4787889o1423j78900k13253k31331n961L16526R0796J299K81048R7142M1373
$$ y = [6632467, 6654417, 6512453, 6603236, 6681612, 6643549, 6797655, 6950371, 6730073, 6937587, 7254194, 7202840, 7291331, 7497438, 7484773, 7581130, 7800439, 7821991, 7845878, 7994614, 8128844, 8193824, 8250819, 8318360, 8277822, 8435262, 8779744, 9160690, 9144371, 9397551, 9945584, 9971411, 9967202, 9922065, 9801584, 9927636, 10073364, 10066635, 9889315, 9887847, 10007901, 10040414, 10248552, 10229863, 10443050, 10837325, 11090462, 11307375, 11421983, 11559142, 11734018, 11980108, 11948670, 12288630, 12822917, 12946054, 13073855, 13252666, 13460290, 13746230, 13666661, 13658227, 13656291, 13544144, 13630179, 13946268, 14106802, 14211139, 14298997, 14509720, 14791810, 14852898, 14787889, 14726466, 14547566, 14334313, 14102982, 14097021, 14413547, 14504343, 14505642, 14786690, 14883832, 14925205]
4208A4925205j4243Q4744K54072L05441J66924K07802M21633O99330L91158M41828
4198A7883894N48108J92114j25947j90265j18306k31115Q8752K082o888k85346
4188A7757083l31878j90760j32834j9317K17338K41737R2531L08895K25384L07783
4178A8475962M36286P83585Q82654J113897J110222J540569J625867J928305J662208
4169B9559555J308807R98122k59796j126565r19329q49084q02332L664M38371
4160B8351413R00332P82265R78268Q69592J101088J402732K118021K275057K786162
4151D1564930K964668K842282K234243K282897K585015L078188L160020K762967
4143F3475210J960690J001263J001253K038043L895933N715128N425198K246815
$$ y = [14925205, 14910962, 14995706, 15249778, 15555219, 15722143, 15929945, 16351578, 17050908, 17442066, 17883894, 18432002, 18624116, 18498169, 18307904, 18189598, 17958483, 18047235, 18049317, 18042429, 17757083, 17425205, 17234445, 17101611, 17082294, 17299632, 17541369, 17633900, 17942795, 18168179, 18475962, 18912248, 19695833, 20578487, 21692384, 22802606, 24343175, 25969042, 27897347, 29559555, 30868362, 31866484, 31606688, 30480123, 29560794, 28711710, 27909378, 27913042, 28351413, 29251745, 30034010, 31012278, 31881870, 32982958, 34385690, 36503711, 38778768, 41564930, 44529598, 47371880, 49606123, 51889020, 54474035, 57552223, 60712243, 63475210, 65435900, 66437163, 67438416, 69476459, 73372392, 79087520, 84512718, 86759533]
4135H6759533k800605o649027o898219n418732m641164l679905l024564k643421
4127E1003896k079365j938234j477586j420101j194287p17539m02625k42074M6385
4118D1578470J93073J87256M62760O34941J249913J068719Q95289o6846r93414
4109D5210161j200406q99063m14083k891K06535N61726R64308O86053L66932M72218
4099D5951490O23674P18106Q18828J319483J340211J437282J211558J637355K043574
4090E7101561K655888L037512K719638K395749K293238K312316L363444M368353
4082H0247699N563363P000704Q827104J0020542J1029469J2110056J4091476J6836548
4074A65726961J9702106J9813959J8379550J3577473J2495245K1157248L8383186
$$ y = [86759533, 83958928, 77309901, 70411682, 64992950, 60351786, 56671881, 53647317, 51003896, 48924531, 46986297, 45508711, 44088610, 42894323, 42176784, 41774159, 41532085, 41578470, 41771543, 41958799, 42421559, 43056500, 44306413, 45375132, 46270421, 46203575, 45210161, 44009755, 43110692, 42696609, 42693718, 42900253, 43461979, 44426287, 45112340, 45479272, 45951490, 46575164, 47293270, 48112098, 49431581, 50771792, 52209074, 53420632, 55057987, 57101561, 59757449, 62794961, 65514599, 67910348, 70203586, 72515902, 75879346, 80247699, 85811062, 92811766, 101638870, 111659412, 122688881, 134798937, 148890413, 165726961, 185429067, 205243026, 223622576, 237200049, 249695294, 270852542, 309235728]
4067C09235728O3249703O6989527K6316705n0151939r0831142p5294920m8647522
4060B00866140l3653414k3886042j7769032j3746732j1807219j0118484q519919
4053H1365298o734557n259806m580848l856819l485210k807955k361629k122973
4045E0155501j997954k296798k244610j623279j457832r42420n75363n66334j135149
4036C7315762j115307j202130j144406p80583o28308n42703m17080j75332l14442
4027C0995471k10436K1763K9534k43247j62121K34042J98495L26792L19074R25737
4017C2435104J441700J860966J816406K452155L304019M317802L406442O23683
4009E1658277l052980n461435n494944m220967l131554k345452j905191j531616
$$ y = [309235728, 372485431, 439474958, 465791663, 415639724, 324808582, 249513662, 200866140, 167212726, 143326684, 125557652, 111810920, 100003701, 89885217, 81365298, 74630741, 69370935, 64790087, 60933268, 57448058, 54640103, 52278474, 50155501, 48157547, 45860749, 43616139, 41992860, 40535028, 39592608, 39017245, 38450911, 37315762, 36200455, 34998325, 33853919, 33073336, 32445028, 31902325, 31485245, 31309913, 30995471, 30785035, 30806798, 30836332, 30593085, 30430964, 30665006, 30863501, 31190293, 31509367, 32435104, 33876804, 35737770, 37554176, 40006331, 43310350, 47628152, 51034594, 51658277, 48605297, 43143862, 37648918, 33427951, 30296397, 27950945, 26045754, 24514138]
4001B4514138j533981r88330p07719r23405p52624m95633o27145m62272o62065
3992A7360964l45101k64441l06965k77308j33587j98949j23371r2341j33592o6653
3982A5418656J05093l73906n85716n63377m03985k16521k06622k03113j02151
3973A2868358k48679j86541p8444j17276J49282L79317J65848J88342J55045J19108
3963A3394360L64655M43322K41028N5420M1444j20938l95265k54457p8465M8509
3953A3739613k3072j09089k2681l33507j13405k10631k19329m0328q9014K0737
3943A2599294M2955j4274j8415j3869J22199J61902K78917P379K03508N5455j14466
3932A3310585J90806M0877j9455j57806j42734j47829j14658j87401k6585O7023
$$ y = [24514138, 22980157, 21991827, 21284108, 20360703, 19608079, 19112446, 18485301, 18023029, 17360964, 17015863, 16751422, 16444457, 16167149, 16033562, 15834613, 15711242, 15618901, 15485309, 15418656, 15523749, 15149843, 14564127, 14000750, 13596765, 13380244, 13173622, 12970509, 12868358, 12619679, 12433138, 12354694, 12237418, 12386700, 12766017, 12931865, 13120207, 13275252, 13394360, 13759015, 14202337, 14443365, 14498785, 14540229, 14419291, 14024026, 13769569, 13691104, 13739613, 13716541, 13607452, 13584771, 13251264, 13137859, 12927228, 12707899, 12667571, 12578557, 12599294, 12642249, 12627975, 12609560, 12595691, 12717890, 12879792, 13158709, 13166088, 13369596, 13425051, 13310585, 13501391, 13542268, 13522813, 13365007, 13222273, 13074444, 12959786, 12772385, 12745800, 12812823]
3922A2812823n7561N3218k82553j20444k0688j09588l9694q4100j32662M8842
3912A2067593J456j64240J53717P0540n8545l5805L34200J67388K6491O5210K49663
3901A2877668L86296L42610M24570K19279J53363J70036L62440J50352O0699M9057
3891A5196370K49898K08978J42423K04227K54885L09896M36512N69893M51410
3882A8024492M17330N20459L80951M77110O42504P29176P51246Q43971J023081
3873B3810320J042967J268563J637740J968705K431917L205685L538572L761002
3865D2665471N018630O735833Q569491P045010R49261o284740r702518q677866
3857D6318572n793404m051243l101209k215370j499095p28661n47500n70441l96399
$$ y = [12812823, 12755262, 12808480, 12525927, 12405483, 12384795, 12275207, 12235513, 12151413, 12018751, 12067593, 12069049, 11904809, 12058526, 12129066, 12070521, 12034716, 12368916, 12536304, 12562795, 12628005, 12877668, 13263964, 13606574, 14031144, 14250423, 14403786, 14573822, 14936262, 15086614, 15147313, 15196370, 15446268, 15655246, 15797669, 16001896, 16256781, 16566677, 17003189, 17573082, 18024492, 18441822, 18962281, 19343232, 19820342, 20462846, 21192022, 21943268, 22787239, 23810320, 24853287, 26121850, 27759590, 29728295, 32160212, 35365897, 38904469, 42665471, 47684101, 54419934, 62989425, 70034435, 70983696, 64698956, 54996438, 46318572, 40525168, 36473925, 33372716, 31157346, 29658251, 28929590, 28382090, 27811649, 27415250]
3848B7415250o49522j200149j242878q64794q10957m64481n83865m16416l50944
3839B0831244k79976j08533j38133J72557M63699L08766K26047K56509K06420
3830B1938600N7052o48589j031868p79618p80006o05108l23464l03098k94422
3821A7229479n6218P754j52944l4463L78931M90851L87568K62067K42682O0977
3811A8816684J64639P0410k10336k64472r58027q32880p28835m42643k94646k85770
3801A5034124l11171j37682l1063l8921N3304L15259K47092L50352M31428M35677
3791A6348399K22280n2058n82169o24997o60943n61415n21897k52975n0756l6375
3781A3227094j2441J05782r862l1670K26418R1167K29456P7688m21630n52996
$$ y = [27415250, 26765728, 25565579, 24322701, 23457907, 22646950, 22182469, 21598604, 21182188, 20831244, 20551268, 20442735, 20304602, 20477159, 20940858, 21249624, 21475671, 21732180, 21938600, 21995652, 21347063, 20315195, 19535577, 18755571, 18150463, 17826999, 17523901, 17229479, 17173261, 17181015, 17028071, 16993608, 17372539, 17863390, 18250958, 18513025, 18755707, 18816684, 18981323, 19051733, 18841397, 18576925, 17618898, 16786018, 16057183, 15614540, 15319894, 15034124, 14722953, 14585271, 14554208, 14515287, 14568591, 14883850, 15130942, 15481294, 15912722, 16348399, 16570679, 16518621, 15936452, 15311455, 14650512, 14089097, 13567200, 13314225, 13263469, 13227094, 13214653, 13320435, 13310573, 13278903, 13505321, 13596488, 13825944, 13903632, 13482002, 12929006]
3771A2929006o78484n94052o39189l56965p7848l95365k07361k89035k81913k04321
3761I204473l40812j51916l9131q5899j86470k0540j84892k32783n5195j6589
3751G890246n1438j41266n7312j2571l52416l19032L371Q8526j44263j819J48415
3740G050441j00256j8905j63079J05159Q5278j06292j83069j26434k27J3547j44625
3729F411538J04170l6984j21175j13515p4950M6493j63622n9011J5347K09483
3719F217774n6668j83486j57972q1857J57750L3661n5398j31839j11201J9804
3709E650568k6198O0313j27025j02241J60599j72222Q0554J18565q2631j16779
3699E443503m6542n0245M6511P0210n8290j16520n466J76113L084J39957K69173
$$ y = [12929006, 12250522, 11656470, 11017281, 10660316, 10582468, 10187103, 9979742, 9690707, 9408794, 9204473, 8863661, 8711745, 8672614, 8586715, 8400245, 8379705, 8194813, 7962030, 7906835, 7890246, 7838808, 7697542, 7640230, 7627659, 7275243, 6956211, 6959582, 7048108, 6903845, 6902026, 7050441, 6950185, 6931280, 6768201, 6873360, 6958638, 6852346, 6669277, 6542843, 6542616, 6556163, 6411538, 6515708, 6478724, 6357549, 6244034, 6169084, 6215577, 6051955, 5992944, 6008291, 6217774, 6161106, 5977620, 5819648, 5737791, 5895541, 5929202, 5873804, 5741965, 5630764, 5650568, 5624370, 5684683, 5557658, 5455417, 5616016, 5443794, 5524348, 5642913, 5560282, 5443503, 5396961, 5346716, 5393227, 5463437, 5405147, 5288627, 5283161, 5459274, 5462358, 5602315, 5871488]
3688E871488K37252J11767K50062J30934M49206M35485L35138L9086o1757n03654
3678G295007l42505k54210j67759j17670j45318j66129j83134O4571N0839j26781
3668E906911j57908J00469J41896L00919K70552K63178R1273o3443j50339k88100
3658F415408k89561k28619l5018j31219r3992K195o1884K21523m4394L7075L52766
3647F144280L72446L23653R4995j86084k66670m64344r6452m75470r3003j76825
3637E176526j63007j73249m696j52017p9277M3996J41391J93072j2532K24318
3627E194525K93067p136P5089j03338k76505k98033l28414o0551j82539k89848
3617D016317j43415p3748j11809j99006k21527L1179M7970p3716J03143m2263
$$ y = [5871488, 6108740, 6220507, 6470569, 6601503, 7050709, 7486194, 7821332, 7860418, 7798661, 7295007, 6952502, 6698292, 6530533, 6412863, 6267545, 6101416, 5918282, 5982853, 6033692, 5906911, 5749003, 5849472, 5991368, 6292287, 6562839, 6826017, 6917290, 6853847, 6703508, 6415408, 6125847, 5897228, 5862210, 5730991, 5636999, 5639194, 5577310, 5798833, 5754439, 5791514, 6144280, 6516726, 6840379, 6935374, 6749290, 6482620, 6018276, 5921824, 5446354, 5353351, 5176526, 5013519, 4840270, 4835574, 4683557, 4604280, 4648276, 4789667, 4982739, 4970207, 5194525, 5487592, 5480456, 5555545, 5452207, 5175702, 4877669, 4549255, 4488704, 4306165, 4016317, 3872902, 3799154, 3687345, 3488339, 3266812, 3297991, 3345961, 3272245, 3375388, 3333125]
3607C333125l2694J1333L3526j01792j45424r784J01575k8173q5747j70627M5066
3596B950384j472j80852k297O5007m9382J29907K170j02702L2608j75053J41239
3585B809557J49312k763k71623l2477J6327M6689o8026l1841j50389q5990J15776
3574B494552O5226j44727L3089K12184l7340Q016l5183j41901O208J6324k9742
3563B446706k06463n0108o3239J14922m028L4932l2482q0696j90270J03199q713
3552B063760R1097m5975j33361M4019k6466o5769J29627M6900k56342j54285J22055
3541A815260J3376R681M588l7842L3746K76742j11966l0773p2260k98863K17440
3530A819129R3314k25764L8685K536j33150J62793o1352p6191j03513J42759j64330
$$ y = [3333125, 3300431, 3311764, 3345290, 3243498, 3098074, 3088290, 3189865, 3161692, 3075945, 2905318, 2950384, 2948912, 2768060, 2765763, 2830770, 2781388, 2911295, 2913465, 2810763, 2843371, 2668318, 2809557, 2958869, 2956106, 2684483, 2652006, 2668333, 2715022, 2646996, 2615155, 2464766, 2378776, 2494552, 2559778, 2415051, 2448140, 2660324, 2622984, 2631000, 2595817, 2453916, 2460124, 2476448, 2446706, 2240243, 2190135, 2126896, 2241818, 2237790, 2272722, 2240240, 2159544, 1969274, 2072473, 2063760, 2154857, 2108882, 1975521, 2019540, 1993074, 1927305, 2056932, 2103832, 1847490, 1693205, 1815260, 1828636, 1838317, 1842905, 1805063, 1838809, 2115551, 2003585, 1972812, 1900552, 1601689, 1819129, 1912443, 1686679, 1725364, 1727900, 1594750, 1757543, 1696191, 1620000, 1516487, 1659246, 1494916]
3519A494916j87696L25928k6494n2438j17257o9173M4949q5595J34962P4077o2360
3508A473819k68028q8259N1486n4138P0931J10658N3056j21882K3673O4407Q5944
3497A401667l4644M6810r7948K0655K07744o264j40502j08475l5276k2960R2738
3486A323545O7337r7110j37466O4258Q4120n7232M2477r9432m9557q3704j52461
3475I04775J08891J00970R5463n9062J07491j89005P0085j40744R32j48561M7306
3464H98541O3421j64724K00956l9463j32224L10717L6489k22694K9549l5591l7042
3453I07935M7786P8936K9762n5646J3840j11702J9915k3125P9024o6128j24360
3442G96237l0409P0414Q4559J07933j84174J0949J60222o6731k80253M6683M7913
$$ y = [1494916, 1307220, 1633148, 1606654, 1554216, 1436959, 1367786, 1412735, 1327140, 1462102, 1536179, 1473819, 1205791, 1117532, 1169018, 1114880, 1185811, 1296469, 1349525, 1227643, 1251316, 1315723, 1401667, 1367023, 1413833, 1315885, 1336540, 1544284, 1538020, 1397518, 1289043, 1253767, 1230807, 1323545, 1390882, 1293772, 1156306, 1220564, 1304684, 1247452, 1289929, 1190497, 1140940, 1057236, 904775, 1013666, 1114636, 1210099, 1151037, 1258528, 1069523, 1139608, 998864, 999796, 851235, 898541, 961962, 797238, 998194, 958731, 826507, 1137224, 1173713, 951019, 980568, 944977, 907935, 955721, 1034657, 1064419, 1008773, 1022613, 910911, 930826, 907701, 986725, 920597, 796237, 765828, 836242, 920801, 1028734, 844560, 855509, 1015731, 949000, 668747, 715430, 763343]
3431G63343J1073r4673K28081J27094r5466r7546R2377N123j76622Q1044J0638
3420H54466K13962k4349j60919L5403o7560j28768K2764J49969m5016j7392j2395
3409H20165j52826K0489J6970K1302j813J27942K8592m532k4203l0496L0516J16861
3397I68967k9698J4046j04978o5588j62123r5600p9236Q2024N4269M5807n9175
3386E68715J47850P7757o7800l7061M5425p0456k5202J28188P622n4420q7477
3375F33141N6588n4851q4439J10161o541J94138q1254j42310q9484J96319J3461
3364G44929J39487k5942j64617q8749n6337J77595m3263P1156J64197q3438j22134
3353G12884J05067q4247k3358j234m3733N6538l6811j0421j06298J01213J0317
$$ y = [763343, 774416, 679743, 907824, 1034918, 939452, 841906, 934283, 939406, 762784, 843828, 854466, 1068428, 1044079, 883160, 918563, 851003, 722235, 744999, 894968, 849952, 832560, 820165, 667339, 687828, 704798, 726100, 724287, 852229, 880821, 876289, 852086, 821590, 852106, 968967, 939269, 953315, 848337, 782749, 620626, 525026, 445790, 527814, 582083, 627890, 568715, 716565, 794322, 726522, 689461, 734886, 664430, 639228, 767416, 775038, 720618, 633141, 689729, 634878, 550439, 660600, 654059, 848197, 766943, 624633, 535149, 731468, 744929, 884416, 858474, 693857, 605108, 548771, 726366, 683103, 754259, 918456, 835018, 712884, 817951, 733704, 710346, 709112, 665379, 721917, 685106, 674685, 568387, 669600, 679917]
3342F79917n2575M3453J53959j3835P7319L9075k97336k62587K79712J41289l1123
3331G57268r1019R0324J79401R9155j15956m3154N0618Q668l9576j41417J31325
3320H85637R1210K18328J23131j07167k33128N4641R4623J74264j07775l0022
3310A163742R806J2535J29925K03541j91355n7600J62242K40155O3050o2931n7652
3299A615458p0990N1321J21129r364J81292k775n5239l2826j06970k5367L36929
3288B002598l3400R2602M1796P9790J65749J5024j69362L04989K04626j74864
3278B529548K39279J23501K03936J69998R9911L873p1559J78976K66581J11824
3268C855868L0382R6785K77864J56179J36074k9064J66845J49701K19194K33675
$$ y = [679917, 627342, 670795, 824754, 810919, 888238, 927313, 629977, 367390, 647102, 788391, 757268, 666249, 756573, 935974, 1035129, 919173, 876019, 926637, 935305, 895729, 754312, 885637, 976847, 1195175, 1318306, 1211139, 978011, 1032652, 1127275, 1301539, 1193764, 1163742, 1173548, 1186083, 1316008, 1519549, 1328194, 1270594, 1432836, 1672991, 1736041, 1673110, 1615458, 1544468, 1595789, 1716918, 1707554, 1888846, 1886071, 1830832, 1798006, 1691036, 1665669, 2002598, 1969198, 2061800, 2103596, 2183386, 2349135, 2364159, 2194797, 2499786, 2704412, 2529548, 2768827, 2892328, 3096264, 3266262, 3366173, 3370046, 3298487, 3477463, 3744044, 3855868, 3886250, 3983035, 4260899, 4417078, 4553152, 4524088, 4690933, 4840634, 5059828, 5293503]
3258E293503N8018L66683M09669L68236N12157N57854O75973N08695O29691Q38864
3248A0219343J142786J623894J461351J774273K461229L398123M100072K520185
3240B8701256n98184l684379m182695k829511j852301j390019r60020n18192m92371
3231A2193584n44684n35981k89933k70818l78234J66125L07936L78979N52252
3222A1579226O42827M58418O41020Q41854J073530J476820K076542K412372K542522
3213B3745131L323585M901346O836589P267359L510119l362849q192051q127344
3205B9901885n721746l701804k747918k013931j665263j215551j069415q22573
3197A0943684n04761o66934k96362q5653r8477k9871N4302n1550J10486L18014
$$ y = [5293503, 5351521, 5718204, 6127873, 6496109, 7008266, 7566120, 8242093, 8750788, 9380479, 10219343, 11362129, 12986023, 14447374, 16221647, 18682876, 22080999, 26181071, 28701256, 28103072, 24418693, 20235998, 17406487, 15554186, 14164167, 13204147, 12685955, 12193584, 11648900, 11112919, 10822986, 10552168, 10173934, 10340059, 10647995, 11026974, 11579226, 12222053, 12680471, 13321491, 14163345, 15236875, 16713695, 18790237, 21202609, 23745131, 27068716, 31970062, 38806651, 46074010, 49584129, 46221280, 38029229, 29901885, 24180139, 20478335, 17730417, 15716486, 14051223, 12835672, 11766257, 10943684, 10438923, 9771989, 9475627, 9389974, 9291497, 9261626, 9315928, 9264378, 9374864, 9692878]
3187I692878L86819L67237N65856Q40493J180002J096386J621385K325120L271118
3178B1347294L035696J260230k055312m292387l941589k673641j825011j359898
3170I495382j173048o12204n13613o97860n09786l94081m46315l06448j91449
3161D650578k38397j37173j51380l75033j97422L2666p5525P6604q5003m8058
3151C451857o9097j52234j31737J50740j36945r8481k71947j60383j47863M6543
3141B480453j49447j50317K3617j33361l100j53494j15674o6072R0230J8647j89597
3130A651885k132r1889J9067p6835j25576n8370p4792K6941q3994J84094r4548
3119A273851j8200n3939n3280L3011J31356l0575j51956r6182m6703M7430l7607
$$ y = [9692878, 10079697, 10446934, 11012790, 11853283, 13033285, 14129671, 15751056, 18076176, 21347294, 24382990, 25643220, 23587908, 19295521, 15353932, 12680291, 10855280, 9495382, 8322334, 7710130, 7196517, 6498657, 5988871, 5594790, 5148475, 4842027, 4650578, 4412181, 4275008, 4123628, 3748595, 3551173, 3583839, 3508314, 3584918, 3499915, 3451857, 3382760, 3230526, 3098789, 3249529, 3112584, 3014103, 2742156, 2581773, 2433910, 2480453, 2331006, 2180689, 2204306, 2070945, 2067845, 1914351, 1798677, 1732605, 1822835, 1841482, 1651885, 1649753, 1557864, 1576931, 1500096, 1374520, 1316150, 1241358, 1268299, 1184305, 1368399, 1273851, 1255651, 1201712, 1148432, 1181443, 1312799, 1282224, 1130268, 1034086, 987383, 1034813, 997206]
3108I97206l1468m8895J26363O0944l4365j6547N6975n9425P5231j18837j70597
3097H36585o0040j12394N4630K26234j26907P5158j55561K1652j143J3440K5568
3086G97222k40139L0656q868m2218P3864r5128r0698M5464o413Q3829j63346K6947
3074D11172R1045q1538n6351K1512J43447J2967M6130K38289j10530o6709K0178
3063F69612L5141j30790k0322J7467p2716l3471O674J1430p2129j2035m5871J44642
3051D97632J66492j42111j49803q3206M4608j39960J02535R8543j01486R0230
3041C83474m420l7703l3933N1992n1290p4793J00940l1874J7453J3215k5235j04071
3029B03755R2910n3201O5338m0856J8955Q189j8485j36883L6610J73893J6014
$$ y = [997206, 965738, 916843, 1043206, 1104150, 1069785, 1053238, 1110213, 1050788, 1126019, 1007182, 836585, 776545, 664151, 718781, 945015, 818108, 893266, 737705, 759357, 758214, 771654, 797222, 557083, 587739, 578871, 536653, 610517, 515389, 424691, 470155, 463742, 547571, 384225, 411172, 502217, 420679, 364328, 385840, 529287, 542254, 588384, 826673, 716143, 649434, 669612, 704753, 573963, 553641, 571108, 498392, 464921, 471595, 483025, 410896, 398861, 352990, 497632, 664124, 522013, 372210, 289004, 333612, 193652, 296187, 394730, 293244, 383474, 379054, 341351, 307418, 359410, 308120, 233327, 334267, 302393, 319846, 333061, 307826, 203755, 296665, 243464, 308802, 267946, 286901, 295090, 276605, 139722, 176332, 350225, 366239]
3018C66239j13648k05570L1276K469J12606j40299J35645J2036K6435j0220j02958
3007A14011K9321K09699m7818k43173o7236O2794J27420n5598j06977k8336O5130
2996E9237o0383n7308L277J07719J63428l8181n3413N3412j99067J5140j9226
2985b5365J08373R3073j2801j7388m2579K94950p37j23634L3520j90036p0168
2974D7208n7555K4570r4902J36811R5395k25782J80565O8231J36707k2072o658
2963B82518r6670o9651j5035J22221O0713j40975O8953J40603Q718Q286j22608
2952B47073k5355j1835m1747Q8564K7863L1362r8182J0340p4547J11900k0575
2941B44861j01684j16707J2312J51903K7199l3462j91019Q9402k21008N3269M2426
$$ y = [366239, 252591, 47021, 78297, 80766, 193372, 53073, 188718, 200754, 227189, 216969, 114011, 143332, 353031, 305213, 62040, -5196, 57598, 185018, 129420, 22443, -5893, 59237, -1146, -58454, -55177, 52542, 215970, 177789, 124376, 177788, -21279, -6139, -25365, 83008, 176081, 163280, 145892, 103313, 398263, 397526, 273892, 307412, 117376, 47208, -10347, 14223, -80679, 56132, 151527, -74255, 106310, 174541, 311248, 289176, 282518, 185848, 116197, 101162, 223383, 284096, 143121, 212074, 352677, 361395, 369681, 247073, 221718, 209883, 168136, 256700, 284563, 315925, 217743, 228083, 153536, 265436, 244861, 143177, 26470, 38782, 190685, 217884, 184422, -6597, 82805, -138203, -84934, -42508]
2930d2508O4608K47938P6109p1226O7537J16281q8585M1144P9448j41088j60703
2919A88955N29M147R9431p776m8422p4181L6779l1005M1393J33947k3086M4283
2907C64994r3047O0640M6582J01719j25792l15883J99733L30513p2592j56099
2897C40768j80399k8015K06210j08022k8874j9282J31348J55191j57213l373l1625
2886B76714L669q4174J05387l9037p8557p2677k5718K00382k9300l308Q7262l2214
2874C08429k1352j6894J9534P4391j45534Q1459p8682p623K2007k6453j12918
2863I6364K04051l1334j5749J39768l5756k30259j8926J59247M8190l10775j96864
2852a92043J89750N1520Q5113o3636J01695k1785o7923l3608j28655N5545R9209
$$ y = [-42508, 22100, 270038, 346147, 274921, 342458, 458739, 370154, 411298, 490746, 349658, 188955, 189484, 193631, 293062, 285286, 236864, 162683, 199462, 168457, 209850, 343797, 320711, 364994, 271947, 332587, 379169, 480888, 355096, 39213, 238946, 569459, 496867, 340768, 160369, 132354, 338564, 230542, 201668, 182386, 313734, 468925, 311712, 308339, 276714, 280383, 196209, 301596, 262559, 184002, 111325, 85607, 285989, 256689, 253381, 340643, 308429, 287077, 270183, 289717, 364108, 218574, 300033, 221351, 213728, 235735, 209282, 96364, 300415, 269081, 253332, 393100, 357344, 127085, 108159, 267406, 315596, 4821, -192043, -2293, 49227, 134340, 70704, 172399, 150614, 82691, 49083, -79572, -24027, 75182]
2841G5182J6008j50308j82625J73269J08805J3666m0241m1795J55431j0415p958
2830A09019k9323L0023J9062q4782m0233N0921J500m2404j13062K9819M4547o7352
2818i2265q7018M3639P1632L9366M909Q6614m3289j3510n4072j14404l2026K09504
2806A9080K43260p9960L0429j93363O0600n1561P0452k2202j25340K6143j9883
2795d2345p9318M097j51634Q1917J91117J46618j24206r2654L4108J03134j18584
2784d7750N7828P4104o3017j01169j18490R8882Q6770M3634p5270J27357j60563
2773g7684j59332J92871J37925l4944q164k25023J49735Q9603o3311L9134J18716
2762A59526k03819j08655J67788J69749j25630p8542j60622J9049J9794m6997
$$ y = [75182, 91190, -59118, -241743, -68474, 40331, 53997, 13756, -28039, 127392, 116977, 109019, 79696, 109719, 128781, 43999, 3766, 54687, 56187, 13783, -99279, -69460, -24913, -92265, -179283, -135644, -64012, -24646, -19737, 66877, 23588, 10078, -43994, -158398, -190424, 19080, 262340, 182380, 212809, 19446, 80046, 28485, 98937, 76735, -48605, -22462, -42345, -121663, -117566, -269200, -187283, 3834, 150452, 26246, -66408, -32300, 70834, -47750, 10078, 84182, 21165, -80004, -198494, -99612, -12842, 30792, -44478, 82879, -77684, -237016, -44145, 93780, 58836, 50672, -174351, -24616, 64987, 1676, 40810, 159526, -44293, -152948, 14840, 184589, 58959, -19583, -180205, -161156, -141362, -188359]
2752a88359J34463k5481J51663j36420P2743K3093o6350l0774J14874O6993j40014
2741b3569p5328J46250M7288j45227K19366N9253j53541k1953l8413q2972P165
2730f1681o2503K3911P7366l9725Q64r2641N8036K33296j09968j16486M3932r7340
2718a42939j2671L1714j047O8219k6131J71255Q4109r7177j16935q122j5186j16523
2706a81434J24987J41570J8399q6453r4934L1641O8675O6584l9692q6812n6915
2695i4384o0752K7637J75590l8790j62432n2086M4090R2319J45248L297R7709
2684A77446P4557j27088l8018q3723R7892K36995p9968k69079j5900r2447J6745
2673a02588Q305K1036J01261R1958k2787l486m8335l5444o8355m6202j49754K69765
$$ y = [-188359, -53896, -79377, 72286, -64134, 8609, 31702, -34648, -65422, 49452, 116445, -23569, -98897, 47353, 94641, -50586, 168780, 228033, 74492, 52539, 14126, -68846, -61681, -124184, -100273, -22907, -62632, -61768, -154409, -96373, 136923, 26955, -89531, -45599, -142939, -155610, -123896, -124943, -56724, -82855, 88400, 172509, 75332, -41603, -49725, -64911, -181434, -56447, 85123, 103522, 17069, -77865, -46224, 22451, 89035, 49343, -37469, -94384, -155136, -127499, 48091, 9301, -153131, -205217, -161127, -68808, 76440, 79737, 177446, 252003, 124915, 86897, 3174, 101066, 338061, 258093, -10986, -26886, -119333, -102588, -94283, -73247, 28014, 119972, 97185, 93699, 45364, 9920, -58435, -104637, -254391, 15374]
2661A5374L5419R3302J13516k16628N3163q1033m0977j8535J05187O2682L5640
2650A57110P5278n1662j62419n4712N3532P1697n10j45013L6774Q2561O9711j18782
2638A3565m2670l2011j49044p0298q5681J23745K27473J17449j16260q0484N7802
2627c6414R233J8988l8541j99258K0392J41765M291q8421L3130q5065O7828J48431
2615c641r5018j6355k6213k5815J61288o2838Q095k5352J17873R4928K7075j6995
2603A37032j92316n0930p9199J99887J50158q3043k56290n0722j1610J00302P4431
2592f2300j1047k798l3592N9060j40944J36101J04072K1980j15591j09025J74469
2581B0385j21803N3318k0542J40372K5642j26641N6790j5678J07617j14693P9964
$$ y = [15374, 50793, 144095, 257611, 40983, 94146, 13113, -27864, -46399, 58788, 121470, 157110, 232388, 180726, 18307, -36405, 17127, 88824, 88314, -56699, -19925, 62636, 132347, 13565, -29105, -61116, -210160, -280458, -366139, -242394, -14921, 102528, -13732, -94216, -36414, -27181, -8193, -46734, -245992, -225600, -83835, -79544, -167965, -134835, -219900, -152072, -3641, -98659, -115014, -141227, -167042, -5754, -68592, -60497, -85849, 32024, 126952, 154027, 137032, -55284, -106214, -185413, 14474, 164632, 81589, -174701, -225423, -237033, -136731, -62300, -73347, -76145, -109737, -50677, -191621, -55520, 48552, 70532, -45059, -154084, 20385, -101418, -48100, -68642, 71730, 97372, -29269, 27521, 11843, 119460, 4767, 84731]
2570H4731j52404j17486J41154K15315j2759k61841q6671J3384O416K8855N0008
2559i1298P2432j39425L9091j7608K1258J45051o5065L6779O2706N0769k27772
2548a13082Q4263n7035o4734j3092J12781o0063r841N2337j44378J90924n9499
2537h1419J22976p110r8384o9785M3215p0965R3618P1795m3827l4237j50247j90178
2525d14548J30016J17609P504J9843r291M4817q44j67629p6490J66866Q8493o1950
2513a55604J73180q388j56649O2473n5886rJ22202r0528L1794p4387O0883J07136
2501A6217m3829j26674J9787l1823j44229K7882K5890P3187J2907J62597j18385
2490a26473J20130p2201R0355N1900Q913m8255R5604p2559j24743J944P7776l5116
$$ y = [84731, -67673, -185159, -44005, 171310, 158551, -103290, -189961, -176577, -170161, -141306, -91298, -18866, -158291, -119200, -136808, -115550, 29501, -35564, 1215, 63921, 114690, -113082, -28819, -85854, -150588, -163680, -50899, -110962, -120803, -68466, -212844, -21920, -81419, 41557, 34447, -63937, -133722, -90507, -161472, -67854, 3941, -39886, -74123, -224370, -414548, -284532, -166923, -159419, -139576, -148867, -104050, -104894, -272523, -349013, -182147, -93654, -155604, 17576, 9188, -147461, -84988, -140874, -140883, -18681, -109209, -77415, -151802, -90919, 16217, -27612, -154286, -134499, -166322, -310551, -282669, -256779, -183592, -170685, -8088, -126473, -6343, -78544, 11811, 63711, 72624, 24369, 119973, 47414, -77329, -75385, 2391, -32725]
2478c2725J8972N0413q0057j27083K63818P7181l44208J14583j66883P5378K56192
2467A05581J4474k4770j73018p0079O7989J08320K8045o2817k0643r254j65398
2456b01570O1087Q2350L8099J3864P9114k13454M3032n7121M2900j6917J23103
2445e513r9776j26256J95531j003n7485Q040R8006j59962n3337O9925R3964l9246
2433g7112M3727K1661N7963J35862R6194M6009k14495l4100M7141j92250J87826
2422A18426l5244j53125K7725Q8296Q336l3937R0641j6914j98041N9517j0247
2411e4567J70597J27764n1807k08437m7170J41302o4902J18787K070m0715J528
2400I4450j96413j49867K42503N4741j02180r0455K2869J43888M1659m4287m2639
$$ y = [-32725, -13753, 36660, -43397, -170480, 93338, 170519, -173689, -59106, -225989, -150611, 105581, 120055, 95285, -77733, -147812, -79823, 28497, 56542, -6275, -26918, -36172, -201570, -140483, -58133, -20034, -6170, 72944, -140510, -97478, -154599, -111699, -128616, -5513, -105289, -231545, -36014, -37017, -94502, -86462, 11544, -148418, -201755, -131830, -37866, -77112, -33385, -11724, 46239, 182101, 278295, 324304, 109809, 75709, 122850, -69400, 118426, 83182, -69943, -42218, 46078, 54414, 20477, 111118, 94204, -103837, -44320, -54567, 116030, 243794, 191987, -16450, -63620, 77682, 12780, 131567, 133637, 92922, 94450, -101963, -251830, -9327, 45414, -56766, -147221, -124352, 19536, 61195, 16908, -25731]
2389b5731J31140P6502P5197j57553L67P0191n8025k7756J8898m9878J07208n6164
2377A04396n263J35905O2132j9441q528n4067n2610o7596J05528J72142N6900
2366D29498R0904J25828j06936k1202j85830L0647n0517P4916R0634J4648l03000
2355A89590m4010j58719l8668J78726j50677J45231L7049N9440n3501J01826J6551
2344B82838j57533L8270J24118q8275k44478J19504O7605m0480p9277j53891K1722
2333a09877q6091J43271N3234K6433J6334P3470q4768K5887p1958o2623K04303
2322A27615P426j7740n423J21222l9805j50836J2744R571k72085J81702J65887
2311A40278j86815J14588J35551J6829j31332R7379k1288J53915j07035j85968
$$ y = [-25731, 105409, 181911, 257108, 99555, 99922, 170113, 112088, 84332, 103230, 53352, 160560, 104396, 99133, 235038, 297170, 277729, 269201, 215134, 162524, 94928, 200456, 372598, 429498, 520402, 646230, 539294, 518092, 332262, 362909, 312392, 387308, 477942, 492590, 189590, 145580, -13139, -51807, 126919, -23758, 121473, 158522, 217962, 164461, 266287, 282838, 125305, 163575, 287693, 199418, -45060, 74444, 142049, 101569, 22292, -131599, -109877, -195968, -52697, 537, 26970, 43304, 116774, 32006, 57893, -14065, -76688, 127615, 135041, 117301, 111878, 233100, 193295, 42459, 55203, 64774, -207311, -25609, 140278, -46537, 68051, 203602, 220431, 89099, 186478, 165190, 319105, 212070, 26102]
2301B6102r3549N9927j11116J60824J75167p3374j01697l2843r340o0656N5940
2290d615K7593K08526O3520k8231P2228k1451j26652m6167j04739n230K68735
2279C03517j4878J50817j47665j52903q8426k0585K8272p416J42940j46349l00136
2268b52812K30130K11642k14066N6618M9906k982J87187n6914p3166r6216L6277
2257G5604K16308P7294m0768k6132p8555m4163j26256n402M8844m245K7373j07362
2245A2540p748L0823K22721M7045j27892p7503o3186N7342j7164J24159k21562
2234b0425j52334K00582J97786K2380j06440o9761j10840J1256L0196K88340J63495
2223D54235L1336o9861q1022q0354r9613j82014J12098n8624J13544K34092Q4991
$$ y = [26102, -67447, -7520, -118636, 42188, 217355, 143981, 42284, 9441, 101, -60555, -4615, 22978, 231504, 295024, 266793, 339021, 317570, 190918, 144751, 40012, 34782, 303517, 288639, 439456, 291791, 138888, 50462, 29877, 58149, 50733, 193673, 47324, -252812, -22682, 188960, -25106, 31512, 81418, 78436, 265623, 208709, 135543, 39327, 75604, 291912, 369206, 328438, 302306, 223751, 179588, 53332, 47930, 96774, 92529, 119902, 12540, 4792, 35615, 258336, 305381, 177489, 99986, 36800, 94142, 76978, 201137, -20425, -172759, 27823, 225609, 247989, 141549, 71788, -39052, -27796, 2400, 290740, 454235, 485571, 415710, 334688, 254334, 154721, -27293, 84805, 26181, 139725, 373817, 458808]
2212D58808j27276m639p1751o2009K40752o4386l5263R1727j59078j0117K86387
2201E43155j21988j58962K57509P8859J96467n5226j02267j2402P8078j6736J87543
2190H74030K90224j47089j74208k4420L7628K37422Q1454p350o6124n4917J72514
2179A219164Q2313O5154j07589l5505J75616j51636K7003K07701k2924Q3369o853
2168A535813L7727J19559m395J20740j84754j06765K05687K66374N249j62220
2158A833015K262L18668P6943r1649q9477J54680k8349J0460J88776P0752Q2484
2147B528565j67787k5001K58023J16338L5077L7619Q41K82160N8961J45321R5948
2136C366065O5785K03794L99294K50193J49312K88988K39520K13755L61935L66985
$$ y = [458808, 331532, 326893, 255142, 193133, 433885, 369499, 334236, 425963, 266885, 256768, 543155, 421167, 262205, 519714, 598573, 795040, 739814, 637547, 625145, 703223, 686487, 874030, 1164254, 1017165, 842957, 818537, 856165, 1093587, 1175041, 1167691, 1101567, 1046650, 1219164, 1301477, 1366631, 1259042, 1223537, 1399153, 1247517, 1274520, 1482221, 1459297, 1542666, 1535813, 1573540, 1693099, 1688704, 1809444, 1624690, 1517925, 1723612, 1989986, 1995235, 1833015, 1835277, 2153945, 2230888, 2139239, 2049762, 2204442, 2176093, 2186553, 2375329, 2446081, 2528565, 2360778, 2335777, 2593800, 2710138, 2745215, 2782834, 2783675, 3065835, 3124796, 3270117, 3366065, 3431850, 3635644, 4034938, 4285131, 4434443, 4723431, 4962951, 5176706, 5538641, 5905626]
2126E905626K58393J89532M26327K23674M76065N32026N96962M63618M91804L53030
2116I917057R37296J171065J270823J297174J192759J145364J091400J139510
2108A9162448J588208J775146K420601L596446M863016N342379N891966P340346
2100E1980556J0766567J5805276J5788399M819328j3078387k0067137j5474580
2093E0540022r730928p087153n077462l601589l110171k596175k030018j682968
2085A5623558j299023p52945n91470n79933o82362j139951p12218m90395r10375
2076H464886p96331o72845k89868l42938l37551l78082j40109j16802k09433k37049
2066D943878k28560l78247j65897j44169J41663j00601k38538l0821j69895k39400
$$ y = [5905626, 6164019, 6353551, 6779878, 7003552, 7479617, 8011643, 8608605, 9072223, 9564027, 9917057, 10854353, 12025418, 13296241, 14593415, 15786174, 16931538, 18022938, 19162448, 20750656, 22525802, 24946403, 28542849, 33405865, 38748244, 44640210, 51980556, 62747123, 78552399, 94340798, 99160126, 86081739, 66014602, 50540022, 40809094, 33721941, 28644479, 25042890, 21932719, 19336544, 17306526, 15623558, 14324535, 13571590, 12980120, 12400187, 11717825, 10577874, 9865656, 9375261, 8464886, 7668555, 6995710, 6705842, 6362904, 6025353, 5647271, 5507162, 5390360, 5180927, 4943878, 4715318, 4337071, 4171174, 4027005, 4168668, 4068067, 3829529, 3798708, 3628813, 3389413]
2056C389413l69240j30170P0644N1849j9524M6977l03962k10168m6562q0186k24108
2045B174963J6320O7466q3686p3511O1499j06914M9411p3618l52069L2038J29487
2034A841386n3640l05314j06557p5039J4539J59274p7788j38057o1077J9109k36683
2023I80153j64761N0559N4850P1259k5136O5938o4789o6577K7152J1429n9194
2012H80883r8255j4474r0680k21434J30318M4038K232j41644K10613K5300j43734
2001E83163J53135m0175k591O9857r0835J36237l2294r1032j60623m1774K74552
1990G57620k28816K4351j4475N132Q1333k6818j35496J18809j4151O1845J04719
1979G34053j68778k17918P4239J09235r520J6120r4313R9600J11064q402j01327
$$ y = [3389413, 3020173, 2890003, 2960647, 3012496, 2992972, 3039949, 2735987, 2525819, 2479257, 2399071, 2174963, 2191283, 2258749, 2175063, 2101552, 2163051, 2056137, 2105548, 2031930, 1679861, 1711899, 1841386, 1787746, 1482432, 1375875, 1300836, 1315375, 1474649, 1396861, 1258804, 1197727, 1216836, 980153, 815392, 865951, 920801, 992060, 966924, 1032862, 968073, 901496, 928648, 940077, 880883, 782628, 768154, 677474, 456040, 586358, 630396, 632628, 490984, 701597, 726897, 583163, 736298, 696123, 693532, 763389, 672554, 808791, 776497, 685465, 524842, 483068, 757620, 528804, 553155, 538680, 543812, 625145, 598327, 462831, 581640, 567489, 629334, 734053, 565275, 347357, 421596, 530831, 521311, 537431, 443118, 542718, 653782, 645380, 544053]
1968E44053J26717M177k7402j66756j1581J62519P545l5859n6378p4141j59465
1957C13429R3939J13105O8035m7404p9265q5278R9659k0804o2249J82752j73265
1946D02654j10109J37553j97379p9294l395l6804j21489J15433l6155L565Q6869
1935A61449N8874p2191L0515j653p2061l0997K10282M4016P9667o7052r2159o8517
1923A80173j16955N75J8660K15156o0472m6274O9987j09932l3457L2485Q6513
1912B36459j3534p3481j05618P6270J13651l55595J14194L1294J43143p4382J20803
1901B13204m0634o5760J21970K9874p0606k08736O8846Q251j9713M772J08663
1890A50131J66750k5105j91952r0719J00588j19163o5013Q3968J00722J82589
$$ y = [544053, 670770, 674947, 647545, 480789, 469208, 631727, 639272, 603413, 547035, 472894, 313429, 407368, 520473, 588508, 541104, 461839, 376561, 476220, 455416, 393167, 575919, 402654, 292545, 430098, 232719, 153425, 150030, 113226, -8263, 107170, 71015, 74580, 161449, 220323, 148132, 178647, 176994, 104933, 73936, 284218, 328234, 407901, 340849, 248690, 180173, 63218, 63793, 82453, 297609, 237137, 190863, 260850, 150918, 117461, 149946, 236459, 222925, 149444, 43826, 120096, 233747, -121848, -7654, 23640, 166783, 92401, 213204, 172570, 106810, 228780, 258654, 188048, -20688, 48158, 56409, 36696, 41468, 150131, 316881, 291776, 99824, 9105, 109693, -9470, -74483, 9485, 110207, 292796]
1880B92796o123p3951k28758L6680l3574j5494K02780j14784l1040j36419J99481
1869I1594P885K2772k0363r9479o5571J07698l5017J7528j8677o6349K4183K70787
1857B36991O253n6343J02155k41953j78143l2193k1744K04664k798j59468l2849
1846a75428J82300N6585J1121J67423j64241J6156l1071J01739j22415J64333
1836B06502J38338j2902p4480P1780K30992j08479j0111Q6522j43522J5720n4401
1825C45959j99499o099P2128j98487J39558r3829K3998Q6499j0731r9446j29920
1814f9869J01886J08976l8415m343j88p4466n3985L3093O588p5733R4053r4867
1802f7270J13255j7288j2596j46805j8477P5501o5434j04243J53064J06637M2747
$$ y = [292796, 286673, 212722, -16036, 20644, -12930, -28424, 174356, 59572, 28532, -107887, 91594, 99479, 122251, 101888, 2409, -63162, 44536, 9519, 27047, 8370, -57979, -33796, 236991, 243244, 186901, 289056, 47103, -131040, -163233, -184977, 19687, 16889, -142579, -175428, 6872, 63457, 74578, 242001, 77760, 93916, 62845, 164584, 42169, 206502, 344840, 331938, 257458, 329238, 560230, 451751, 441640, 528162, 384640, 400360, 345959, 146460, 140361, 212489, 14002, 153560, 59731, 83729, 170228, 159497, 60051, -69869, 32017, 140993, 102578, 98235, 98047, 23581, -30404, 2689, 9277, -66456, 27597, -67270, 45985, 28697, 16101, -130704, -149181, -73680, -139114, -243357, -90293, 16344, 59091]
1791E9091m2295P4880m7106k05103j01293J56256J05073j85040J51513l884j39086
1780a76994N3297K05235J7037P2014j78302j27798J1097J54963n6824j05043K15762
1769H4444n3599o0612J44691j9805L5982j61992m1125K1063K2402O6062j16135
1758g8624O332J39425N9853k39201J18774R1452r0470j03487p6350P0308K3468
1747g8520M0351J32810n3013N7892l1639j66610l2304Q4710m0119m6419K41137
1736A08276j96710J60414P0166l47023J4753J23301L6775m2806J5153k15578l0414
1725c03693L25871O9476l4029R7207j25214k0667j53690l4448J28062K1669q4362
1714a13818K7979R9569O9901j5642j80088J55940j3110j31645j56034K00252l4511
$$ y = [59091, 16796, 91676, 44570, -160533, -261826, -105570, -497, -185537, -34024, -37908, -176994, -123697, 81538, 98575, 170589, -7713, -135511, -124414, 30549, -26275, -131318, 84444, 30845, -29767, 114924, 95119, 131101, -30891, -72016, -50953, -28551, 37511, -78624, -72292, 67133, 126986, -112215, 6559, 98011, 7541, -95946, -172296, -101988, -78520, -38169, 94641, 41628, 99520, 67881, -98729, -131033, -46323, -86442, -132861, 108276, -88434, 71980, 142146, -204877, -190124, -66823, -30048, -72854, -57701, -273279, -303693, 22178, 91654, 57625, 154832, 29618, 8951, -144739, -179187, -51125, -29456, -113818, -85839, 13730, 83631, 67989, -112099, 43841, 30731, -100914, -256948, -56696, -91207]
1703i1207j64950M2420N6444J15850P8808q4667q8773J44224j8065l786n1389
1692f5091L1805M071L7113M9765j44814j9871J25530o1403J329O9512J03546R9392
1680B30884j69326j17467J0983j4830P7059J97382o3538k04756J8879j39123R9395
1669g4458R3445q7507P7316J49446n8103J00394j38117j41719r527N3389J52216
1658A16775j26607j32934M1305L545K2551Q4105j87588q407Q1059M8455J63347
1647A05606l9796n5808k8104n7853Q1705L8273M988j67378R7534r3498j01806
1636b16137J66635R7622l1583j29022q9381n92J73128M8016l7828j11208l1689
1625a62039K691K16710M8437j72856J59273k0789n7471L1474l8237Q840j4023
$$ y = [-91207, -256157, -213737, -157293, -41443, 37365, -47302, -136075, 8149, -9916, -13702, -65091, -33286, -29215, 7898, 57663, -87151, -107022, 18508, -42895, -41566, 27946, 131492, 230884, 61558, -55909, -44926, -59756, 17303, 214685, 151147, -53609, -34730, -173853, -74458, 18987, -68520, 8796, 158242, 100139, 200533, 62416, -79303, -88830, -35441, 116775, -9832, -142766, -101461, -97916, -75365, 8740, -178848, -187255, -106196, -57741, 105606, 65810, 10002, -18102, -75955, 5750, 44023, 49011, -118367, -20833, -114331, -216137, -49502, 48120, 16537, -112485, -201866, -202458, -29330, 18686, -19142, -130350, -162039, -159348, 57362, 105799, -67057, 92216, 71427, 13956, 45430, 7193, 16033, 2010]
1614B010m3555M5241j19727L5150J7743K8434j8543J1922j59363N7542Q969M7089
1602h7088K03414L097J28j39589m1700Q5861m6462K192Q0947j34979J17851J6334
1590F0006r2731l1948p4240n0527j3663J17164o6749L9082N0922j2089J02540
1579B7767r2566p2958K3552J17044J7431N6499j6423k01937J54732J95939j47329
1568F1751Q6739n6202l075n5929j47157L2695K14136q653r8173j82836j16336
1557b73040J46395k6353P6306m355R1777J44831k51661j22122J33173k6559J45120
1546C3512Q5534k10883K2641J48501j35385J04255m5290k41201J63205M568j53977
1535b24520m4954J52811l3583l8896j4429P7560l28Q832l6009M1594K1390o4139
$$ y = [2010, -41545, 3696, -116031, -80881, -63138, -34704, -53247, -41325, -200688, -143146, -134177, -87088, 116326, 119423, 119551, -20038, -61738, 24123, -22339, -20147, 60800, -74179, 43672, 60006, -32725, -64673, -138913, -189440, -203103, -85939, -152688, -113606, -62684, -74773, 27767, -64799, -137757, -114205, 2839, 20270, 76769, 60346, -141591, 13141, 209080, 61751, 148490, 92288, 89213, 33284, -113873, -81178, 132958, 124305, 26132, -156704, -273040, -126645, -152998, -76692, -81047, 10730, 155561, -96100, -218222, -85049, -111608, 33512, 119046, -91837, -69196, 79305, -56080, 48175, 2885, -238316, -75111, -70543, -224520, -269474, -116663, -150246, -189142, -203571, -126011, -126339, -117507, -153516, -111922, -90532, -154671]
1523a54671J433K27996n3934k64887J81346J45558j95861r5876J89555M0885K8934
1512E0478N6410J07201j22782n9577M9535k8249o0573j43894j2712J27871J50323
1501A14031J16401j58910j08778J66753K1021l5450j17396j49053J15152N3499
1491A7270q4704j30560J5780J04995O4658j08014J09121J38387j64182m6565N8382
1480b5432j4417J26413j4422K4708l24902r647K24553N2753M2552R3892m7471
1469A28580p0683L978k8565j43396m782J1067p0424K14647Q5918j99882j839J40380
1457F4999j32702P7472j56606O8279o0587J67161P568n8586N4368j67898k1019
1446a57551M8312j04573j00380J38780O0702J85163R994m3846L508m5551M6343
$$ y = [-154671, -153238, 74758, 20824, -244063, -62717, 82841, -113020, -208896, -19341, 21544, 50478, 106888, 214089, 91307, 31730, 81265, 53016, -7557, -151451, -164163, -36292, 114031, 230432, 71522, -37256, 129497, 150518, 115068, -2328, -151381, -36229, 17270, -67434, -197994, -182214, -77219, -12561, -120575, -11454, 126933, -37249, -83814, -25432, -39849, 86564, 72142, 96850, -228052, -237699, -13146, 39607, 82159, 176051, 128580, 57897, 61875, 33310, -110086, -114868, -103801, -174225, 40422, 126340, -73542, -75381, 64999, -67703, 9769, -146837, -78558, -139145, 28016, 35584, -23002, 31366, -136532, -157551, -109239, -213812, -314192, -175412, -114710, 70453, 80447, 36601, 40109, -5442, 40901]
1435D0901k2492m5759R4907Q5550p0856L04r7256j64037J75220M4182j60788N3484
1423f6640M6613k22089J42832Q8323l8713M9309l336k8931l3930q8663N5331L091
1411i6803j03090M5322N3891N537R7528J3957J59823m7066j34627O3989j6263
1400D2198j30572q9817K4043J33220m0555k0745L9774l4060J34250m304n4347
1389i15n6435L2726Q5131j24961j7731K56903j02926R6234j20377k8398q1640
1378f2389K519k1417j69180J63341J58304J1738l4680k23844n1234M2501k1888
1367b06229o7207N7162P3183n8061J4379J52263k7979j05816K4020J38724K2621
1356A7060j01983O7619N6876j942j82611R490L5932Q4951k9083L51J05188M0973
$$ y = [40901, 18409, -27350, 67557, 153107, 82251, 82555, -14701, -178738, -3518, 40664, -120124, -66640, -20027, -242116, -99284, -10961, -49674, -365, -3701, -32632, -66562, -155225, -99894, -96803, -199893, -154571, -100680, -95143, 2385, 16342, 176165, 129099, -5528, 58461, 42198, -88374, -178191, -154148, -20928, -61483, -82228, -42454, -76514, 57736, 53432, -915, -57350, -24624, 60507, -64454, -82185, 174718, 71792, 168026, 47649, 19251, -62389, -59870, -81287, -250467, -87126, 71178, 82916, 48236, -175608, -226842, -184341, -206229, -273436, -216274, -143091, -201152, -186773, -34510, -62489, -168305, -144285, -5561, 17060, -84923, -17304, 39572, 37630, -144981, -135491, -99559, -14608, -43691, -43340, 61848, 102821]
1344A02821N6640j3409j13583m5983Q367K2421j20309J05909k3414L0620K3345
1333C3425l7278O359p0037k0321M3110J22827j06062J18364J8338J01392j96660
1322A3457r6150P1234L958K9314J2147n9023r5059J6416M2559J15867o0321m3597
1310d9198O6549j84258k11186J76648K55869n4162p5931J19844j42515j11197
1300b09537M8422m082J18724P0200J15400o1268p5915k1185j55889L1743P4985
1289f8402j9570J5174J52492j24452L3019Q8711m9426j710n4194n901J40065l2293
1277G3513j72032o0139P4262N7806r3029r1631K32813J20158l6145O1372j01915
1266F5033j30357J89087j1813j34424J49147j69590m4155O2917J58018K5446j42551
$$ y = [102821, 159461, 146052, 32469, -13514, -5147, 17274, -103035, 2874, -20540, 10080, 33425, -3853, 2506, -67531, -87852, -44742, 78085, -27977, 90387, 108725, 210117, 13457, -82693, -11459, -7501, 21813, 33960, -25063, -120122, -103706, -61147, 54720, -5601, -49198, 17351, -166907, -378093, -201445, 54424, 262, -75669, 44175, -98340, -209537, -161115, -165197, -46473, 23727, 139127, 77859, 1944, -19241, -175130, -143387, -68402, -87972, -72798, 79694, -44758, -11739, 76972, 27546, 25836, -28358, -34259, 105806, 73513, -98519, -158658, -84396, -26590, -119619, -211250, 21563, 141721, 105576, 166948, 65033, -65324, 123763, 111950, -22474, 126673, -42917, -87072, -24155, 133863, 159309, 16758]
1255A6758J10563p1347r6627J38952k1037n4050j7674k00706J65865L4833O6943
1244G2473N3531J03270j5836m17775j69171L18092J70046M5216k40360j5646M7870
1233d8290L5353R7763q0725M7634K1085J29574j78806J0589p3871O0929j55809
1222a34574N0057J19316n8429J00072q6572k6498p1304l4201Q7274M4174J63926
1211A53241j08780j32138J70726p16N4482p0466K8681J65328J07599k25672p526
1200A34759M3708o5365j40326Q4966R4637j69115M9563k9164L5602J05514Q368
1189A53147P591k29689q5950J41620J21364n2812j57250j9135Q0906K8033n9648
1178g1823P8474N5526J27720j08735J52785p9030j03676j33566r4853Q2206p0603
$$ y = [16758, 127321, 55974, -40653, 98299, 77262, 23212, 5538, -195168, -29303, 5530, 72473, 126004, 229274, 213438, -204337, -373508, -55416, 114630, 159846, -80514, -96160, -48290, -12937, 84826, 4101, 51735, 72820, 202394, 23588, 34177, -39694, 21235, -134574, -84517, 34799, -23630, 76442, -10130, -36628, -107932, -142133, -54859, -10685, 153241, 44461, -87677, 83049, 82333, 136815, 66349, 95030, 260358, 367957, 142285, 134759, 178467, 113102, -27224, 57742, 152379, -16736, 32827, 3663, 39265, 144779, 153147, 160738, -68951, -154901, -13281, 108083, 55271, -101979, -121114, -40208, -12175, -71823, 6651, 62177, 189897, 81162, 233947, 154917, 51241, -82325, -177178, -94972, -165575]
1167a65575K22189j17462O674l5039j5950J89393R1777k77381J68370r294j13938
1156e6236K0242N7396K30201k05731l5945n6751J4656P6418q7995P1018R3518
1145A20791q5774j57781k62066K34195P8481P500m1796P3092p2347K15187l7909
1134G1573j72192J07614K8707k13807N7488J64649j00693j13141j39963J97274
1124a12491J87593n4021m7840N4137j2794K3256k00701J7005L4563J23432P3502
1113H5641j9596p1511j84282N9785j7677j41451J66300K36802j11788r9070L6637
1102f0210m3637K9302L7552O5969P616r0476K3145j04608R8242L5116Q8482N6849
1090A43342j41459r2303P9721j4467K3157O8126j0185j62823M0540J41993m3147
$$ y = [-165575, 56614, -60848, -54174, -89213, -105163, 84230, 176007, -101374, 66996, 57702, -56236, -35994, 21402, 251603, 45872, 9927, -46824, -32168, 44250, -43745, 27273, 120791, 35017, -122764, -384830, -150635, -72154, -64654, -106450, -33358, -105705, 109482, 71573, -100619, 6995, 35702, -178105, -120617, 44032, -56661, -169802, -309765, -112491, 75102, 21081, -26759, 27378, 14584, 37840, -162861, -145856, -111293, 12139, 85641, 66045, -5466, -189748, -129963, -147640, -289091, -122791, 114011, 2223, -96847, -60210, -103847, -74545, -36993, 28976, 36592, -53884, -30739, -135347, -37105, -1989, 86493, 143342, 1883, -90420, -10699, -25166, -2009, 66117, 55932, -106891, -66351, 75642, 32495]
1079C2495J4568p9690J67672r6872L3079o4209O4274j16783R0496J58502p1638
1068A31894K888P0595N4411k27383j9910n887j01844j91623K04539R1242M8537
1057E7459j8347l0325j04562M6721N2597J31487j40147L9368j2932j0396J09589
1046A20512j50060J70079N6460n7268p7185j88336J3354K38895j56583K9916P4727
1035G4511L1331l8733j0275J39835P994k70546Q2605J6112j29535K2919J48812
1024G5030p3400N2279r4611k0051K0324l1160J5914J49956j17526O2003j9287
1013A9471q6914j5926R8820l2196q3190Q8478j42592O1857K19455j39351j34389
1002a46477Q659o3370l5039O673M0945K32327J18832K9876o8744q9616j30025
$$ y = [32495, 47063, -32627, 135045, 38173, 71252, 7043, 71317, -45466, 45030, 203532, 131894, 134782, 205377, 259788, 32405, 12495, 6608, -95236, -286859, -82320, 8922, 57459, 39112, 8787, -95775, -49054, 3543, 135030, -5117, 34251, 21319, 10923, 120512, -29548, 140531, 196991, 139723, 62538, -125798, -112444, 126451, -30132, -216, 74511, 105842, 67109, 56834, 196669, 204663, -65883, 16722, 32834, -96701, -73782, 75030, 1630, 53909, -40702, -60753, -40429, -71589, -55675, 94281, -23245, 38758, 19471, -67443, -83369, 15451, -16745, -99935, -11457, -154049, -92192, 127263, -12088, -146477, -137818, -201188, -236227, -229554, -188609, 43718, 162550, 192426, 123682, 34066, -95959]
991i5959j12025R9994O4216K25432j61362j30701L0031Q8609J9672J89253p3429
980A43731J5321K768q6212k05485n399Q8041J03188M3170k05771Q2096M1797K7146
$$ y = [-95959, -207984, -107990, -43774, 181658, 20296, -110405, -80374, 8235, 27907, 217160, 143731, 159052, 161820, 75608, -129877, -135276, -47235, 55953, 99123, -106648, -24552, 17245, 44391]
$$ [...]
##END NTUPLES=NMR SPECTRUM
##END=
