##TITLE=1H_EC-3275(11)
 CDCl3
 8 sc, 
 6.06.2022
##JCAMPDX= 6.0         $$ Bruker NMR JCAMP-DX V2.0
##DATA TYPE= NMR SPECTRUM
##DATA CLASS= NTUPLES
##ORIGIN= UXNMR, Bruker Analytische Messtechnik GmbH
##OWNER= root
$$ XWIN-NMR		Version 3.5
$$ Mon Jun  6 14:15:41 2022 Russian Standard Time (UT+4h)  she@DPX200
##.OBSERVE FREQUENCY= 200.13135
##.OBSERVE NUCLEUS= ^1H
##.ACQUISITION MODE= SIMULTANEOUS
##.ACQUISITION SCHEME= undefined
##.AVERAGES= 8
##.DIGITISER RES= 18
##SPECTROMETER/DATA SYSTEM= spect
##.PULSE SEQUENCE= zg30
##.SOLVENT NAME= CDCl3
##.SHIFT REFERENCE= (INTERNAL, CDCl3, 0, 15.7337)
##AUDIT TRAIL= $$ (NUMBER, WHEN, WHO, WHERE, WHAT)
$$ ##TITLE= Audit trail, XWIN-NMR		Version 3.5
$$ ##JCAMPDX= 5.01
$$ ##ORIGIN= Bruker BioSpin GmbH
$$ ##OWNER= she
$$ F:/spectra/data/she/nmr/H-F/1/pdata/1/auditp.txt
$$ ##AUDIT TRAIL=  $$ (NUMBER, WHEN, WHO, WHERE, WHAT)
(   1,<2022-06-06 14:13:27.46 +0400>,<she>,<DPX200>,
      <created by zg, POWCHK disabled, PULCHK disabled
       configuration hash MD5:
       00 E9 B6 7A A2 85 ED C7 34 08 36 98 17 FE 4E 26
       data hash MD5: 16K
       EB 31 3E 5F 5B A4 AF A9 3A 98 9F A1 47 08 58 A0>)
(   2,<2022-06-06 14:13:29.90 +0400>,<she>,<DPX200>,
      <Start of raw data processing
       efp BC_mod = 2 LB = 0.24 FT_mod = 6 PKNL = 1 PHC0 = -18035.51 PHC1 = 12.40074 SI = 16K 
       data hash MD5: 16K
       DB 3A 1D F8 A9 6E 92 39 F5 9B EA 0D AD 3D C2 2E>)
(   3,<2022-06-06 14:14:17.81 +0400>,<she>,<DPX200>,
      <pk PHC0 = 1.624815 PHC1 = -2.600002 
       data hash MD5: 16K
       BE D3 84 BB 7B 43 89 B6 80 53 F5 DB 86 BA 57 83>)
(   4,<2022-06-06 14:14:21.23 +0400>,<she>,<DPX200>,
      <abs ABSG = 5 
       data hash MD5: 16K
       16 22 A0 29 1C 63 42 83 7E 12 33 B2 F3 3D B3 36>)
$$ ##END=
$$ 
$$ hash MD5
$$ 1B 22 A9 86 D5 D0 AE 91 18 A7 DD 2C 3D C6 FB DA
##$RELAX= 
##$RELAX= 
##$RELAX= 
##$RELAX= 
##$RELAX= 
##$RELAX= 
$$ Bruker specific parameters
$$ --------------------------
##$DU= <F:/spectra>
##$EXPNO= 1
##$NAME= <H-F>
##$PROCNO= 1
##$TYPE= <nmr>
##$USER= <she>
##$AMP= (0..31)
100 100 100 100 100 100 100 100 100 100 100 100 100 100 100 100 100 100 
100 100 100 100 100 100 100 100 100 100 100 100 100 100 
##$AQSEQ= 0
##$AQ_mod= 1
##$AUNM= <au_zg>
##$AUTOPOS= <>
##$BF1= 200.13
##$BF2= 200.13
##$BF3= 200.13
##$BF4= 200.13
##$BF5= 200.13
##$BF6= 200.13
##$BF7= 200.13
##$BF8= 200.13
##$BYTORDA= 1
##$CFDGTYP= 0
##$CFRGTYP= 5
##$CHEMSTR= <none>
##$CNST= (0..31)
1 1 145 1 1 1 1 1 1 1 1 1 1 1 1 1 1 1 1 1 1 1 1 1 1 1 1 1 1 1 1 1 
##$CPDPRG= <>
##$CPDPRG1= <>
##$CPDPRG2= <>
##$CPDPRG3= <>
##$CPDPRG4= <mlev>
##$CPDPRG5= <mlev>
##$CPDPRG6= <mlev>
##$CPDPRG7= <mlev>
##$CPDPRG8= <mlev>
##$CPDPRGB= <>
##$CPDPRGT= <>
##$D= (0..31)
0 1.2 0 0 0 0 0 0 0 0.06 0 0.03 0 0 0 0 0.0002 0 0 0 0 0 0 0 0 0 0 0 0 
0 0 0 
##$DATE= 1654510406
##$DBL= (0..7)
120 120 120 120 120 120 120 120 
##$DBP= (0..7)
150 150 150 150 150 150 150 150 
##$DBP07= 0
##$DBPNAM0= <>
##$DBPNAM1= <>
##$DBPNAM2= <>
##$DBPNAM3= <>
##$DBPNAM4= <>
$$ [...]
##$SUBNAM2= <"">
##$SUBNAM3= <"">
##$SUBNAM4= <"">
##$SUBNAM5= <"">
##$SUBNAM6= <"">
##$SUBNAM7= <"">
##$SUBNAM8= <"">
##$SUBNAM9= <"">
##$SW= 18.05172834244
##$SWIBOX= (0..15)
0 0 2 0 0 0 0 0 0 0 0 0 0 0 0 0 
##$SW_h= 3612.71676300578
##$TD= 16384
##$TD0= 1
##$TE= 0
##$TE2= 300
##$TE3= 300
##$TEG= 300
##$TL= (0..7)
0 120 120 120 120 120 120 120 
##$TP= (0..7)
150 150 150 150 150 150 150 150 
##$TP07= 0
##$TPNAME0= <>
##$TPNAME1= <>
##$TPNAME2= <>
##$TPNAME3= <>
##$TPNAME4= <>
##$TPNAME5= <>
##$TPNAME6= <>
##$TPNAME7= <>
##$TPOAL= (0..7)
0.5 0.5 0.5 0.5 0.5 0.5 0.5 0.5 
##$TPOFFS= (0..7)
0 0 0 0 0 0 0 0 
##$TUNHIN= 0
##$TUNHOUT= 0
##$TUNXOUT= 0
##$USERA1= <user>
##$USERA2= <user>
##$USERA3= <user>
##$USERA4= <user>
##$USERA5= <user>
##$V9= 5
##$VALIST= <valist>
##$VCLIST= <CCCCCCCCCCCCCCC>
##$VD= 0
##$VDLIST= <DDDDDDDDDDDDDDD>
##$VPLIST= <PPPPPPPPPPPPPPP>
##$VTLIST= <TTTTTTTTTTTTTTT>
##$WBST= 1024
##$WBSW= 4
##$XGAIN= (0..3)
0 0 0 0 
##$XL= 0
##$YL= 0
##$YMAX_a= 79405
##$YMIN_a= -157369
##$ZGOPTNS= <>
##$ZL1= 120
##$ZL2= 120
##$ZL3= 120
##$ZL4= 120
##$ABSF1= 15.74688
##$ABSF2= -2.30497
##$ABSG= 5
##$ABSL= 3
##$ALPHA= 0
##$AQORDER= 0
##$ASSFAC= 0
##$ASSFACI= 0
##$ASSFACX= 0
##$ASSWID= 0
##$AUNMP= <proc_1d>
##$AZFE= 0.1
##$AZFW= 0.1
##$BCFW= 0
##$BC_mod= 2
##$BYTORDP= 0
##$COROFFS= 0
##$CY= -3
##$DATMOD= 1
##$DC= 0
##$DFILT= <>
##$DTYPP= 0
##$F1P= 0
##$F2P= 0
##$FCOR= 1
##$FTSIZE= 16384
##$FT_mod= 6
##$GAMMA= 0
##$GB= 0
##$INTBC= 1
##$INTSCL= 0
##$ISEN= 128
##$LB= 0.24
##$LEV0= 0
##$LPBIN= 0
##$MAXI= 10000
##$MC2= 0
##$MEAN= 0
##$ME_mod= 0
##$MI= 1.114404
##$NCOEF= 0
##$NC_proc= -7
##$NLEV= 6
##$NOISF1= 3.799351
##$NOISF2= 2.8
##$NSP= 0
##$NTH_PI= 0
##$NZP= 0
##$OFFSET= 15.73367
##$PC= 1
##$PHC0= -18033.88
##$PHC1= 9.800737
##$PH_mod= 1
##$PKNL= yes
##$PPARMOD= 0
##$PSCAL= 0
##$PSIGN= 0
##$REVERSE= no
##$SF= 200.13000757836
##$SI= 16384
##$SIGF1= 3
##$SIGF2= 2
##$SINO= 5.538805
##$SIOLD= 16384
##$SREGLST= <1H.CDCl3>
##$SSB= 0
##$STSI= 16384
##$STSR= 0
##$SW_p= 3612.71676300578
##$SYMM= 0
##$S_DEV= 0
##$TDeff= 16384
##$TDoff= 0
##$TI= <>
##$TILT= no
##$TM1= 0
##$TM2= 0
##$TOPLEV= 0
##$USERP1= <user>
##$USERP2= <user>
##$USERP3= <user>
##$USERP4= <user>
##$USERP5= <user>
##$WDW= 1
##$XDIM= 16384
##$YMAX_p= 385327834
##$YMIN_p= -527164
$$ End of Bruker specific parameters
$$ ---------------------------------
##NTUPLES= NMR SPECTRUM
##VAR_NAME=  FREQUENCY,     SPECTRUM/REAL,   SPECTRUM/IMAG
##SYMBOL=    X,             R,               I
##VAR_TYPE=  INDEPENDENT,   DEPENDENT,       DEPENDENT
##VAR_FORM=  AFFN,          ASDF,            ASDF
##VAR_DIM=   16384,         16384,           16384
##UNITS=     HZ,            ARBITRARY UNITS, ARBITRARY UNITS
##FACTOR=    0.220516191357247, 1,           1
##FIRST=     3148.77954330196, 0,            0
##LAST=      -463.93721970382, 0,            0
##MIN=       -463.93721970382, -527164,      0
##MAX=       3148.77954330196, 385327834,    0
$$ Real data points
##PAGE= N=1
##DATA TABLE= (X++(R..R)), XYDATA
$$ [...]
8584A464418L2243K4880J70572N1328J08936l3426O5012J33081m0447j38620j18651
8573A719326R3707J51204o0859j3502k1013Q892k6419p6584J8728P7365k57748
8562A613097M201J71008K66585N4432k23930l5233J20812j42847K85886p8229
8552B035782K4760O8686j06416q9139L4485L6429r2793j59065j72914J50339J60694
8541A890848m3920r9413J58013j39984j51746O1347M53166K36259k50398O6789
8531B180961K2667j15782O7791q4023k9906J87998R6032o4656m577n9564L0056
8520B226997p6900o4891K55908K840J37215K38648J19733m3925J43115O3876p3023
8509B929593j45822r5198j32203n7804Q7537j12484J46820r1910K08360L37880
$$ y = [1464418, 1496661, 1521541, 1692113, 1743441, 1852377, 1818951, 1883963, 2017044, 1976597, 1837977, 1719326, 1813033, 1964237, 1903378, 1889876, 1868863, 1877755, 1851336, 1774752, 1793480, 1870845, 1613097, 1617298, 1788306, 2054891, 2109323, 1885393, 1850160, 1970972, 1828125, 2114011, 2035782, 2060542, 2129228, 2022812, 1933673, 1968158, 2004587, 1911794, 1752729, 1579815, 1730154, 1890848, 1846928, 1747515, 1905528, 1765544, 1613798, 1675145, 2128311, 2364570, 2114172, 2180961, 2203628, 2087846, 2155637, 2071614, 2041708, 2229706, 2325738, 2261082, 2256505, 2196941, 2226997, 2150097, 2085206, 2341114, 2343954, 2481169, 2719817, 2839550, 2795625, 2938740, 3002616, 2929593, 2783771, 2688573, 2556370, 2498566, 2586103, 2473619, 2620439, 2528529, 2736889, 3074769]
8499C074769J29537K11429m0805L7456K8285j62705J77635k6093M5501J53535
8489C628544j08319J21850J35428j09709K26436J71043j2154N3681R5261J42003
8479D344064L3245K36105m3237K36031N43757r7950M6906M2084J83119K62208
8469E786332P9503J29132R0543J59841K22173J14676L670L48445K22437J72954
8459G329706M53217L43392K17971o6387L07536N32619L80770L57545N16924J94945
8449A0568238K82152M94589N49256P33159O15359P42355O64952P48705O67116
8440A6065881R84421J066726J092031J268106J434996J949240K170716K311920
8432B8344037K411605K575255J524234P71355P65574Q99937J422247K418616L201936
$$ y = [3074769, 3204306, 3415735, 3374930, 3412386, 3440671, 3277966, 3455601, 3429508, 3475009, 3628544, 3520225, 3642075, 3777503, 3667794, 3894230, 4065273, 4053119, 4106800, 4202061, 4344064, 4377309, 4613414, 4570177, 4806208, 5349965, 5252015, 5298921, 5341005, 5524124, 5786332, 5865835, 5994967, 6085510, 6245351, 6467524, 6582200, 6585870, 6934315, 7156752, 7329706, 7782923, 8126315, 8344286, 8277899, 8585435, 9118054, 9498824, 9856369, 10373293, 10568238, 10850390, 11344979, 11894235, 12627394, 13242753, 13985108, 14650060, 15398765, 16065881, 17050302, 18117028, 19209059, 20477165, 21912161, 23861401, 26032117, 28344037, 30755642, 33330897, 34855131, 35626486, 36392060, 37291997, 38714244, 41132860, 44334796]
8423D4334796M117902M795312O058318P700484J0347610J2978071J2889280P044994
8415A10266767n362423j3239072j3583195j1093994p322084m471150k272539n94404
8407E2327906L33211l5100j973798m716530m810735l609667k283058j495434r24290
8398C2812505l96579n1126k22791J10271M44621R49681J378670J705663K425952
8389C9156867K581207L576370L767365L690951K747676L77063j085945k84594
8381E4526960J338328L055241M853916O828508Q617343Q434848M143014l103996
8373H8694162j2468018j5268383j1323088p576758n376393l909256l199147k260904
8365B7312215j889440j638130j260813n61241n62522o3116p35887j408508j652301
$$ y = [44334796, 48452698, 53248010, 59306328, 67006812, 77354422, 90332493, 103221773, 110266767, 104904344, 91665272, 78082077, 66988083, 59665999, 55194849, 52922310, 52327906, 52661117, 52626017, 50652219, 45935689, 41124954, 37515287, 35232229, 33736795, 32812505, 32415926, 32364800, 32142009, 32252280, 32696901, 33646582, 35025252, 36730915, 39156867, 41738074, 45314444, 49081809, 52772760, 55520436, 55897499, 54811554, 54526960, 55865288, 58920529, 63774445, 70602953, 79220296, 87655144, 91798158, 88694162, 76226144, 60957761, 49634673, 42057915, 36681522, 32772266, 29573119, 27312215, 25422775, 23784645, 22523832, 21962591, 21400069, 21336953, 20601066, 19192558, 17540257]
8356A7540257j523593j156902j050709o89291p75482o20517m68162o17056q32635
8347I805910k88036m17154m48483l54127l69115k80630k25272j92758j43610k61156
8337F825569m20923k19479k38584k39715L1798j47048j30592l54319j62387j84337
8327D759983p2220n1580k80984k08602K9005p3291J2851j20806k89554n2165N993
8316C658630k21416j31942k37J8128l20317j49239O5271j19153o1025R3894J26160
8305B958754k08900k97782j22682J34995P2860j66742k1314r2204J59346k4178
8295B392153p4504N0660r1078j58425j77609j82577L149k8455j59526P3056Q616
8284A655460k15583j6933J69877N7648m6288k06165O9269k4150q7861l0414L6351
$$ y = [17540257, 16016664, 14859762, 13809053, 13119762, 12344280, 11723763, 11255601, 10638545, 9805910, 9517874, 9100720, 8652237, 8298110, 7928995, 7648365, 7423093, 7230335, 7086725, 6825569, 6404646, 6185167, 5946583, 5706868, 5738666, 5591618, 5461026, 5106707, 4944320, 4759983, 4687763, 4636183, 4355199, 4146597, 4175602, 4102311, 4115162, 3994356, 3704802, 3652637, 3658630, 3437214, 3305272, 3305035, 3323163, 3002846, 2853607, 2918878, 2799725, 2738700, 2832594, 2958754, 2749854, 2452072, 2329390, 2464385, 2537245, 2370503, 2349189, 2256985, 2416331, 2392153, 2317649, 2368309, 2277231, 2118806, 1941197, 1758620, 1761769, 1733314, 1573788, 1646844, 1655460, 1439877, 1422944, 1592821, 1650469, 1604181, 1398016, 1467285, 1443135, 1355274, 1324860, 1361211]
8273A361211L792j9434J2154N7010K1491k54003j16560J33341r3171J06280J8563
8262A230674j8527n1688n0011j96166k84008K84204J22513j07603j78021k057
8252G49310Q0972L4832J56746k640j73915L2319M4745J2174p6844L2895K7913
8241I18507k9069j34303P3040J19590N3948r3077k0626k7494o2520M923o2248
8230G40671N7428J46644n9630n2671M8589J89507J37564j02011J19420L761k3111
8219A206161p6312k08610n3582j55233p296J4780j46597j4939m9861L4759q1936
8208D61334R9588J49449r4839j11320J4849J33434j48489k11031K99523K62918
8198H55416r6593l0566k25048P6330J6278N3780P19448l79673j73686o8373j98237
$$ y = [1361211, 1365003, 1345569, 1357723, 1414733, 1436224, 1182221, 1065661, 1199002, 1105831, 1212111, 1230674, 1212147, 1160459, 1110448, 914282, 630274, 914478, 1036991, 929388, 751367, 749310, 830282, 865114, 1021860, 1019220, 845305, 877624, 922369, 934543, 857699, 890594, 918507, 889438, 755135, 828175, 947765, 1001713, 908636, 888010, 860516, 797996, 802919, 740671, 798099, 944743, 885113, 832442, 881031, 1070538, 1208102, 1106091, 1225511, 1229272, 1206161, 1129849, 921239, 867657, 712424, 705128, 719908, 573311, 558372, 508511, 543270, 461334, 560922, 710371, 615532, 504212, 519061, 652495, 504006, 292975, 592498, 855416, 758823, 728257, 503209, 579539, 595817, 649597, 1369045, 989372, 815686, 747313, 549076]
8187E49076m7152R4236j70416P0656N766k00647J85271N5987Q39j06042j36704
8176C00870j63312J12342P0519R5213k24170K6774J98024M6150k44073j23360
8166I4977J15148P4917j03871k16787J16142R6656j3646J3057K2799r3900K1962
8155A27454K9146j22365j22833N5088O399L63378n47l10499J04148n2817N3569
8144A30121n7185j0614m3290J8498j32287J17273n2887K75715r9176k65742P6733
8133d2841j17126L39430J6977j46718j51715K16058J50490j49789j7618P9968
8123A77116J8502j2934o3085R8166M0414L3366m9559j43118Q6653p8437j46204
8112c9120J81340Q1116p3770k8286k03000P391R8315J35532K23150j50620j38936
$$ y = [549076, 501924, 596160, 425744, 496400, 502166, 301519, 486790, 542777, 543616, 437574, 300870, 137558, 249900, 320419, 415632, 191462, 218236, 416260, 462410, 218337, 94977, 210125, 285042, 181171, -35616, 80526, 177182, 163536, 176593, 199392, 105492, 127454, 156600, 34235, -88598, -33510, -27111, 336267, 335720, 25221, 129369, 76552, 130121, 72936, 62322, 19032, 37530, -94757, 22516, -30371, 245344, 146168, -119574, -42841, -159967, 179463, 196440, 49722, -101993, 114065, 264555, 114766, 97148, 177116, 195618, 182684, 119599, 217765, 258179, 291545, 241986, 98868, 185521, 107084, -39120, 142220, 223336, 149566, 121280, -81720, -74329, 23986, 159518, 382668, 232048, 93112]
8101I3112N0006J41607o5184j04862k9954N9668m1490K31407j05005l40902K26868
8090A15271J4844K7855r6400J1195J49864K5959q930p3883L8455k1363O7434O1402
8078C11703p0903K3802j99939p9991R4261L11071n9274j41306p4858r5501J41195
8067A60260J90385P5393l14036o3638J21915J63688j09515j0624J11917P594n2776
8056B80563J02448O117k8772j31180n7079k6464o975K43137R0541M3172j7507
8045D98001j03732j20187r6751J41130P2761P6239L6481k69705O2633j57862Q6953
8034B25961N0463J03054J03449j42174j90391K03446O9087j06033q7687p8843
8024A50332Q1912L2065j25944Q4369J15571r2764Q7131r6238J37701Q9293j6288
$$ y = [93112, 143118, 284725, 219541, 114679, 84725, 144393, 102903, 334310, 229305, -111597, 115271, 130115, 157970, 61570, 72765, 222629, 248588, 239658, 165775, 204230, 182867, 250301, 311703, 240800, 264602, 64663, -15328, 78933, 390004, 330730, 189424, 114566, 19065, 160260, 350645, 426038, 112002, 48364, 170279, 333967, 224452, 213828, 325745, 333339, 280563, 383011, 389128, 360356, 229176, 172097, 145633, 138658, 381795, 472336, 515508, 498001, 394269, 274082, 177331, 318461, 391222, 467461, 503942, 234237, 296870, 139008, 225961, 276424, 379478, 482927, 340753, 150362, 353808, 422895, 316862, 229175, 150332, 232244, 264309, 138365, 222734, 338305, 245541, 332672, 236434, 374135, 463428, 447140]
8013D47140L0129l3512K0616j24721j81372k52346K21195K33163m7764l72992
8003f0464K2377K92415M0163J04641k30281j8352p5485p8993J04768L4406J19682
7992B54877j81492n6728N2366L3059J16971q6280k1966o7901J9907k97577J02348
7981a32416N7939L6823M2430M4208N070O0381N6602j9667L7190J12010l14349
7970a3779k3543K2162J6850J33862p7389o1783M1740P5336j15464O7655r173N0219
7958A06693J10037n9057j0182K1309r86j7369k09104j25585J21089J6184k09133
7947b56104Q1247J70239j07858o2367M25482n7937o2323j523M2638q7810j06866
7936b3182R2196K7012o9241Q0159q7732m7760m6888j78171K27996K3825J8449
$$ y = [447140, 477269, 443757, 464373, 339652, 158280, -94066, 127129, 360292, 312528, -60464, -38087, 254328, 294491, 399132, 168851, 150499, 75014, -3979, 100789, 135195, 254877, 73385, 16657, 69023, 102082, 219053, 132773, 110807, 42906, 62813, -234764, -132416, -74477, -37654, 4776, 48984, 54054, 114435, 171037, 151370, 188560, 300570, -13779, -37322, -15160, 1690, 135552, 58163, -3620, 38120, 113456, -2008, 65647, 56474, 106693, 216730, 157673, 147491, 168800, 167814, 150445, -58659, -184244, -63155, -46971, -256104, -174857, -4618, -112476, -174843, 250639, 192702, 130379, 128856, 171494, 83684, -23182, 69014, 96026, 26785, 106944, 19212, -28548, -75436, -253607, -25611, -1786, 16663]
7925A6663K6543m757m7360R2515J49323j83011L8809j59180j60013L0374J02429
7914i7665k0607j367L3696K13074M1840j62199o2227N7774P9273N9069j05950
7903C4711j86876n0507Q4867j24743J19130L008j08891J77776M6974M0988r2340
7892e5903k9925n5813m2148j42200k3076P1456n7221L0827L83348N0048j56756
7881b7363j47649Q134k3042J83451o3755L3931K3475j25310R1539K14506k49175
7870h1258j18885Q364j9604J30024j28729J0587Q604J90397j49050J05631J58121
7859A14202O4130n483j42077k05240j45283O5716N7293O0796K41440r9191j56016
7848a49713R6809O5203j85845L8269R1581Q177K5599O7610L0009r9713J03844
$$ y = [16663, 43206, 38449, -8911, 83604, 232927, 49916, 88725, -70455, -230468, -200094, -97665, -118272, -119639, -85943, 127131, 168971, 6772, -55455, 2319, 81592, 140661, 34711, -152165, -202672, -117805, -242548, -123418, -120410, -229301, -51525, -4551, 36437, -55903, -85828, -141641, -183789, -325989, -349065, -277609, -334830, -304003, 79345, 129393, -27363, -175012, -166878, -189920, -6469, -70224, -36293, -12818, -138128, -46589, 167917, -81258, -200143, -191779, -211383, -81359, -210088, -199501, -190897, -500, -149550, -43919, 114202, 178332, 172849, 30772, -174468, -319751, -254035, -196742, -135946, 105494, 6303, -149713, -52904, 12299, -173546, -135277, -43696, -35519, -9920, 57690, 87699, -12014, 91830]
7837I1830j62014n5002k74977Q3049J89703L9198O5712J74403l9665j10736k09396
7826b07895P0487J2903J34279L2539k21983O5066J94810m7094j12405M4569J30576
7815I5852j77046L8270n2717p7651J40784J26624n5905k50810N3835j37257K9293
7804b66728K86770j63571Q3972O5741O6156j85019J51166R9950N08716r0095r45183
7793c88125L17360j53184j61576R4812J78486J47868M9179l36363l6746O0472
7783b27817J49744L3334M8467j19737J03376n329k2909p2999O3993P8422n1396
7772b2851j46579M4271J57265j22993R9566j61373j92865K2672M9708n6647p8849
7761d08675J99682R4829J82353J05211n2709k50464n9970j6662K8200K25559j10738
$$ y = [91830, -70184, -125186, -400163, -317114, -127411, -88213, -22501, 151902, 112237, 1501, -207895, -137408, -124505, 9774, 42313, -179670, -114604, 80206, 33112, -79293, -34724, 95852, -81194, -42924, -95641, -173292, -32508, 94116, 38211, -212599, -158764, -296021, -266728, 20042, -143529, -59557, 6184, 72340, -112679, 38487, 138437, 647153, 557058, -388125, -70765, -223949, -385525, -290713, -112227, 35641, 84820, -251543, -288289, -227817, -78073, -44739, 3728, -116009, -12633, -17962, -40871, -113870, -49877, 28545, -22851, -169430, -125159, 32106, -90887, 8679, -152694, -345559, -322887, -273179, -329826, -408675, -208993, -114164, 68189, 173400, 120691, -129773, -189743, -206405, -178205, 47354, -63384]
7750f3384J19522K33474k41661k4714J16601L8576j29582m1963j35189l5839Q0103
7739h4056r0323J75962n1160N5088M6719j67506O9741K0249Q3803P2140Q08J3405
7727A44870j69062K9293P1475k7950K6792k9917j23367k46427J05678J2587J03738
7716a02290K1865q5654J25699P5155m6343K1908k01755J28970J62123j0432K08777
7705B98023k30580j27167n5032j03143j47881J69680K24727K7136j77416l8797
7695a60450J3112J71297p798p0006Q440J59188j53756q0348K0482j7510k38648
7684c55997J81182Q173q3869K16068k17000K8975L4154J11091P4436j28623k768
7673a34178j79620J04629k5582R2967j90771L6749K18969l6096R0246m1888K82549
$$ y = [-63384, 56138, 289612, 47951, 23237, 139838, 178414, 48832, 6869, -128320, -164159, -84056, -174379, 1583, -49577, 5511, 52230, -115276, -45535, -25286, 58517, 130657, 131465, 144870, -24192, 5101, 76576, 48626, 75418, 45501, -77866, -324293, -218615, -206028, -102290, -80425, -166079, -40380, 34775, -11568, 10340, -191415, -62445, 99678, 89246, 298023, 67443, -59724, -114756, -217899, -365780, -196100, 28627, 55763, -121653, -160450, -147338, 23959, 16161, -53845, -45405, 113783, -39973, -120321, -99839, -117349, -355997, -174815, -166642, -250511, -34443, -251443, -222468, -188314, -77223, -2787, -131410, -134178, -313798, -209169, -234751, -141784, -332555, -295806, -76837, -112933, -22687, -64575, 217974]
7662B17974m1287k85771j65827K5427K51887j60745L2424J31530m5677J19806
7652G9741m5422j02992O8472p4476j43526r0788J67204M0049j74521K3124J16204
7641a36931Q6301m4682j72064J24192P1239J14474J35660k26929Q7041J04002
7631A42303k42147l8091K2668P2840J91970J2907l0468j90576J12954J25207j68672
7620A0895k07187O7098J16872J25790J62111j93060j18855l7069p3504k9615n4647
7609b31171K67353n9048p5242P8559p0442J56591m6532N8874n1574j83350l5082
7598a91064j7106K92282k9663J35766k83895j03065J29619L0534k32506J46676
7588a22422J03613j741j15926q3714J59017r8591J16370j7174j40512M5963N1949
$$ y = [217974, 176687, -109084, -274911, -249484, 2403, -158342, -125918, 5612, -40065, 79741, 34319, -68673, -201, -74677, -218203, -308991, -141787, -101738, -276259, -253135, -136931, -50630, -95312, -267376, -143184, -71945, 42529, 178189, -48740, 38301, 142303, -99844, -137935, -115267, -42427, 149543, 162450, 131982, -58594, 54360, 179567, 10895, -196292, -129194, -12322, 113468, 275579, 82519, -36336, -73405, -146909, -176524, -231171, 36182, -22866, -98108, -19549, -89991, 66600, 20068, 78942, 27368, -155982, -191064, -208170, 84112, 54449, 190215, -93680, -196745, -67126, -36592, -269098, -122422, -18809, -20550, -136476, -220190, -61173, -159764, -43394, -60568, -201080, -155117, -103168]
7577a03168K2513m5170K46465k1435q7458K40549j15618j00349n8289L4731O7811
7566H0582K8662j83080j96735O2333M2364P1250K7339n952J46643M2734k7981
7555H8159l1844l6967K31160R8217j85854n862j92294m9888M4814l8147J66742
7544H8236j39823J27478O4823j50746K53991j53338k68135R9571J19090l727P0598
7533A08018N018M812k1803J18512j97277j7701R3825n1544J23117J38106j38858
7522A64225j35938J86851J03427O491j75377j16674J1922K45827q5335q1536J94351
7511C18234r1368p6714O4768J99297J08292j27784l1775J57246J40590l5874K41213
7500H66125J82796r7566j55173l30340j04241j23473k0692J6070k71444O6375
$$ y = [-103168, -80655, -125825, 120640, 99205, 11747, 252296, 136678, 36329, -21960, 12771, 80582, 109244, -73836, -270571, -208238, -165874, -94624, -67285, -73237, 73406, 116140, 88159, 56315, 19348, 250508, 348725, 162871, 157009, -35285, -85173, -40359, -78506, 88236, -51587, 75891, 140714, -10032, 243959, 90621, -177514, -77943, 41147, 37420, 108018, 113036, 117848, 96045, 214557, 17280, -421, 93404, 41860, 164977, 303083, 164225, 28287, 215138, 318565, 325056, 149679, 33005, 44927, 290754, 205419, 123883, 318234, 226866, 150152, 214920, 414217, 522509, 394725, 362950, 520196, 660786, 624912, 866125, 1048921, 951355, 796182, 465842, 361601, 238128, 217436, 233506, -37938, 28437]
7490B8437J37442n0820R0095o8052j82637N4995J9578J01460M3565j01396K7438
7479A00105q1399J25667J15558o7381J903l7080P8674j78867k15087J81323o6406
7468d2990M6403R8101O9879j43171M5858N7926j62002r8838J71301J48887j1076
7457A80278j76583L6941J6427O5985J2745N4250q8401j80763Q3706M5644J30009
7446A80238r868j47660j53909k4967O7916K74619m8983k48469Q8857Q4728o1475
7435A027O3348o4682n1208l2239J25046P8077J9767J58444j1998L647j10558j36207
7423D2464J13432N3734k53924q0698J17679r1660K3024J16683p1147n6312K31988
7412A45263K17348k94250j95985J23117k2616j61728L7796N9458J18865J94297
$$ y = [28437, 165879, 115059, 205154, 137102, -45535, 9460, 29038, 130498, 174063, 72667, 100105, 18706, 144373, 259931, 192550, 194453, 157373, 236047, 57180, -157907, 23416, -42990, 3413, 101514, 171393, 28222, 74080, 132006, -29996, -128834, 42467, 191354, 180278, 3695, 40636, 57063, 123048, 135793, 190043, 101642, -79121, 4585, 50229, 180238, 170370, 22710, -131199, -156166, -88250, 186369, 137386, -111083, -22226, 62502, 1027, 64375, -307, -51515, -83754, 41292, 119369, 139136, 297580, 285582, 289229, 178671, 42464, 155896, 209630, -44294, -124992, -7313, -98973, -75949, 40734, -30413, -86725, 145263, 362611, 68361, -127624, -4507, -27123, -188851, -151055, -91597, 27268, 221565]
7402B21565j1291N6237o4447j56636j09099R5480P7375p70j58425Q6637J57510
7391A94136J86407j11805p1072j28573m8763k5088r7630R8795m0122j00504J03545
7380d0674J74727p0842o6251O7568l9401K0832M5207l0291q2532J74230r8795
7369E3778N8921P5657k05346N2763l2851K48374j2532l4950l07348p415N7507
7358e3442o7354J06321P1507n1625L0896M6913j69649Q7367K07971q2355m723
7347A21827Q538r8648Q8084o4233J64814j7768r2358L0477j09730j49712K8883
7336h9826K48466j97791N7046R8228r0778N5634J72926K4016k25281R708R7483
7325A59831K2295L4536p266K5241K5342o6972j13161J17181j860j53683j22276
$$ y = [221565, 210274, 266511, 202064, 45428, -63671, 31809, 109184, 108414, -50011, 36626, 194136, 380543, 268738, 197666, 69093, 20330, -4758, -102388, -3593, -43715, -144219, -40674, 134053, 63211, -3040, 64528, 25127, 45959, 91166, 60875, -21657, 152573, 53778, 112699, 188356, -16990, 35773, 2922, 251296, 238764, 203814, -103534, -110949, -53442, -120796, -14475, 57032, 5407, 36303, 83216, -86433, 934, 208905, 126550, 121827, 130365, 31717, 119801, 55568, 220382, 202614, 110256, 140733, 31003, -118709, -89826, 158640, -39151, 17895, 116123, 25345, 80979, 253905, 277921, 52640, 62348, 159831, 182126, 216662, 209396, 234637, 259979, 193007, 79846, 197027, 195167, 41484, -80792]
7314h0792K7792M338N2677J68280n6593N3990o1485j20648j54664L4302M4534
7303h8269J21818j21100J82510P1491O5782j72118M6035M061q0340J60496L7080
7292B27446J10958r0737j62764N7074M7655P9744J82047j48199j94541n5557K9200
7281H2326o8511J02133Q5550K92723j37605k86012K46608K09054k62140j68989
7271I5137J57332O2895Q2739Q8848j10493j64124j52338J88475J23968L8490j20688
7260B90241O149j82951M5357J32487q9617P454k9989M6530J72094k5705l5429
7249C36621Q7956l1507J38868k16102k4789Q9546Q4350q6683j35842N5318m461
7238B93275o2720j2542J25334L9138p4210j09757J13150J04055O7432J04772O6338
$$ y = [-80792, -53000, -48662, 4015, 172295, 115702, 169692, 108207, -12441, -167105, -132803, -88269, 33549, -87551, 94959, 166450, 232232, 60114, 106149, 110210, 29870, 190366, 227446, 338404, 247667, 84903, 141977, 189632, 269376, 451423, 303224, 108683, 53126, 82326, 13815, 115948, 201498, 494221, 356616, 70604, 317212, 526266, 264126, 95137, 252469, 315364, 398103, 486951, 376458, 212334, 59996, 248471, 372439, 410929, 290241, 296390, 113439, 158796, 291283, 201666, 209120, 179131, 225661, 397755, 372050, 336621, 424577, 393070, 531938, 315836, 291047, 380593, 464943, 378260, 242418, 297736, 293275, 230555, 218013, 343347, 382485, 308275, 198518, 311668, 415723, 483155, 587927, 654265]
7227F54265j43087J77618j92046J38345M2442r4190R0619J79183r2882k8074L3103
7216G65296k16795n4546J45740Q9788n1484J95887n4036K6271Q6846q8444M9890
7205H94413o7757j27353P3094J84066J23445m0466J89372j42433L4973r2198J30673
7194A159829p5868J92685P2668j66956O4791O8064l5347p0448P0043J2165J93111
7183A484737j5838r651J08501J08175M8350m63M2904J10338K05101J73470m2681
7172B212943k7391o7356J31321K89485J43878q1843K07182P7332k01095J33420
7162B817876j5766j13314P6013L86239n8522J03879J07202j21603J6498Q1235
7152C279737n6455J32420J93407L00916R2204K34458R0420j07856J38209J75638
$$ y = [654265, 511178, 688796, 496750, 635095, 677537, 583347, 673966, 853149, 760267, 732193, 765296, 548501, 493955, 639695, 729483, 677999, 873886, 819850, 846121, 932967, 844523, 894413, 826656, 699303, 772397, 956463, 1079908, 1039442, 1228814, 1086381, 1121354, 1029156, 1159829, 1083961, 1276646, 1349314, 1182358, 1247149, 1315213, 1279866, 1209418, 1279461, 1291626, 1484737, 1468899, 1459248, 1567749, 1675924, 1724274, 1723811, 1766715, 1877053, 2082154, 2255624, 2212943, 2185552, 2118196, 2249517, 2539002, 2682880, 2601037, 2808219, 2885551, 2684456, 2817876, 2802110, 2688796, 2764809, 3151048, 3092526, 3196405, 3303607, 3182004, 3198502, 3279737, 3223282, 3355702, 3549109, 3850025, 3942229, 4176687, 4267107, 4159251, 4297460, 4473098]
7142D473098R7487M2164L05394L63164K53797M34002K05127J59135K01122K19938
7132F754428M10663J88554J60433M53587M88001L59755O35755L70252N63907O29014
7122A1014349P24484J124310J069437J037579J286985J549372J916319J956758
7114B1679593K269189K726625K770284L281968L938667M784097N819227P013768
7106E4283418Q685356J1154707J3097925J2429911P937110r76012q957519j5104282
7098H2550614j6290651j3336429r926520p039793n257602l811122k874121k318527
7090B1695849k196690j641051j314332j188909j094253j126241p02796n65108
7082A1866469o00456p37937p18895m10763m46159n01736k83871l27099l80674
$$ y = [4473098, 4570585, 4612749, 4918143, 5281307, 5535104, 5969106, 6174233, 6333368, 6534490, 6754428, 7165091, 7353645, 7514078, 7967665, 8455666, 8815421, 9451176, 9821428, 10385335, 11014349, 11738833, 12863143, 13932580, 14970159, 16257144, 17806516, 19722835, 21679593, 23948782, 26675407, 29445691, 32727659, 36666326, 41450423, 47269650, 54283418, 62968774, 74123481, 87221406, 99651317, 107588427, 106612415, 97654896, 82550614, 66259963, 52923534, 42997014, 35957221, 30699619, 26888497, 24014376, 21695849, 19499159, 17858108, 16543776, 15354867, 14260614, 13134373, 12431577, 11866469, 11266013, 10528076, 9809181, 9398418, 8952259, 8450523, 8166652, 7839553, 7458879]
7073G458879l70119j01087l82243m21902j54210l19250m34997k34406j53574k02034
7063D685057m17768k69120J46874m8822l84300j92264k6309l12632K91264O5069
7053C537049j04157P6422l04369k96218j23839m2994o6219m5272j32202j26163
7043B372038k2343q9915M366P571N1652j44426J10775J065j81116k02128j75808
7032A731731K8499J51867j0141j44482j1293m0508o1019J4928j61311j51429Q7826
7021A434668J46270q6575j46773j86891K1193j84550J02605j6901J05283J39230
7011A327559j97198j01150O7981L250j04098J35138j89615k7782J10025j4890
7001A009220k55245P4487J67492j90121j18653j02997n317R140L0353K24559j75597
$$ y = [7458879, 7088760, 6987673, 6605430, 6183528, 6029318, 5710068, 5275071, 5040665, 4887091, 4685057, 4267289, 3998169, 4145043, 4096221, 3711921, 3519657, 3493348, 3180716, 3471980, 3537049, 3432892, 3509314, 3204945, 2908727, 2784888, 2741894, 2675675, 2630403, 2498201, 2372038, 2349695, 2259780, 2264146, 2271717, 2323369, 2178943, 2289718, 2290783, 2109667, 1907539, 1731731, 1760230, 1912097, 1901956, 1757474, 1746181, 1705673, 1644654, 1659582, 1498271, 1346842, 1434668, 1580938, 1494363, 1347590, 1160699, 1181892, 997342, 1099947, 1083046, 1188329, 1327559, 1130361, 1029211, 1097192, 1100442, 996344, 1131482, 941867, 914085, 1024110, 1009220, 753975, 828462, 995954, 805833, 687180, 584183, 578866, 588006, 618359, 842918, 667321]
6990F67321j12196Q4128j45465K61686l0543j04410m5128J93362J30475j10965
6980G88265j96345j28315J14645j08321J96922j32298j56529K1504J49627q1399
6970D67756J81111p7876m9847L5639J31159k12559j90414K98817j42621P1466
6960E12631K9350Q1348N3231j69113k64946N4989J26969n4171R4594J57076j50222
6949D71736k76307M2915m2586r7761J38417n0400j24o080K7263j9260r7723L3460
6937A23550k5520j34493K27098L0816m6067K29095P7157L8519q3454q6903k28597
6926A21201j49498J55802j3901J38213L4541P160j67461N4381J24032k13209K25959
6915C17220J51232j09863o8635J10513K8488k31231j09589J70436P566J13680
$$ y = [667321, 555125, 639253, 493788, 755474, 724931, 620521, 575393, 768755, 899230, 788265, 591920, 463605, 578250, 469929, 666851, 534553, 378024, 399528, 549155, 467756, 648867, 570991, 521144, 556783, 687942, 475383, 284969, 583786, 441165, 512631, 541981, 623329, 676560, 507447, 242501, 297490, 424459, 370288, 464882, 621958, 471736, 195429, 238344, 195758, 97997, 236414, 186014, 185890, 179810, 207073, 187813, 90090, 123550, 98030, -36463, 190635, 221451, 175384, 404479, 481636, 520155, 436701, 349798, 121201, -28297, 127505, 113604, 251817, 286358, 293518, 126057, 180438, 304470, 91261, 317220, 468452, 358589, 289954, 400467, 428955, 197724, 88135, 258571, 266137, 379817]
6905C79817Q1222J47181n2938k52834l70406K42920L24027r1645j53338K3129
6895B77135J1104j18839m4382J92241O9022m223k26670O5662R6964J0421j04327
6884B24108n5572N4538j35864J50104N8315J15471k16349j5107J77396j4457R1060
6873D33643K4552m9855L6411n9064J8283j68232j41109N0857N3652m0959j41713
6862A6466N6297K10590J10815j47250j30261j77360J0460O9599N407J09493J5836
6851A50092j3332L5929o135m7797j38960J1629R7332o906O1274m6008j21460j9191
6839d3533l9325J3451J16705q0655J83326j88233L7145J72600j22171l4098J58274
6828A73486j22602k2715J33612J96711j27735k7962K8763P174O2310j29136m42
$$ y = [379817, 461039, 608220, 555282, 302448, -67958, 174962, 498989, 407344, 254006, 277135, 288239, 169400, 125018, 317259, 386281, 382058, 155388, 221050, 318014, 328435, 224108, 168536, 223074, 87210, 237314, 295629, 411100, 194751, 179644, 357040, 342583, 433643, 458195, 408340, 444751, 385687, 403970, 235738, 94629, 145486, 199138, 158179, 16466, 72763, 283353, 394168, 246918, 116657, -60703, -50243, 19356, 24763, 134256, 150092, 136760, 172689, 166554, 118757, -20203, -8574, 88758, 81852, 143126, 97118, -24342, -43533, -82858, -69407, 47298, -33357, 149969, -38264, -1119, 171481, 49310, 15212, 173486, 50884, 28169, 161781, 358492, 230757, 202795, 231558, 238732, 301042, 171906, 171464]
6817A71464k46764j12038K53059R5112k5790P0110r7623m2077l8461o0431M4272
6806A0833n6439J50756J05160L9784k5263m7365j77186l0444m748J47017j6972
6795I5133L1477J29434N3065p6450q2756J0462P2008k14815j32105L79563j18561
6784A46455J07145j35362q1104o2561n2660K66769l5554n6526o320O0530J56521
6773C07333k12544o983j37210J35683j46343r6926L42281l639j81976R1297J16960
6762B07933j25272k00307J48215J42516o528k38745j03793M5632Q0135K34722
6752A84508P7911j12823j89832Q9081J18160p5233j79391j60320J31092J05554
6742a1293Q0904m2800o8020Q8535j73033j40393L04109K12696j0363n4643k77794
$$ y = [171464, -75300, -187338, 65721, 160833, 135043, 205153, 107530, 65453, 26992, -33439, 10833, -45606, 105150, 210310, 250094, 224831, 177466, 280, -30164, -34912, 112105, 95133, 126610, 256044, 309109, 232659, 149903, 160365, 232373, 17558, -114547, 265016, 146455, 253600, 118238, 37134, -25427, -78087, 188682, 153128, 96602, 90282, 150812, 307333, 94789, 87806, -49404, 86279, -60064, -156990, 185291, 181652, -324, 90973, 207933, 82661, -117646, 30569, 173085, 166557, -72188, -175981, -130349, -50214, 184508, 262419, 149596, -40236, 48845, 167005, 91772, -87619, -247939, -116847, -11293, 69611, 26811, -41209, 47326, -125707, -266100, 38009, 250705, 240342, 185699, -92095]
6731i2095N8451N6951k7316j30002n3449L2522L987Q4752J01309K9931l9412J51157
6719A76786j30315q3477k5881N9753J46370R6512M2017q6627k23918M8540M8623
6708F8383r0620Q3293M7682R9072J63026J92024J22016j18278L0203p7892k14790
6697C04119j52093k72694J96627K8473r9454j71443M306K08943m4816Q8877N6507
6686A47352j15087L2229o7692P9489m2285m3411J70074j08424j92060Q1119l1265
6675h9961M0054J83992l7861J0884r8027L3913N4374k67180O478N3164J08918
6664a252k33643k5019J44611O0777k5288j77125p136K1127L623K68881K9933j65578
6652a06089O5991Q4448p8367j71783N0202J0625n0086j41408K05486K57008l6021
$$ y = [-92095, -33644, 23307, -4009, -134011, -187460, -154938, -150951, -66199, 35110, 65041, 25629, 176786, 46471, -37006, -62887, -3134, 143236, 239748, 281765, 195138, -28780, 19760, 68383, -22237, 61056, 108738, 207810, 370836, 562860, 684876, 566598, 596801, 518909, 304119, 152026, -120668, 75959, 104432, 4978, -166465, -162159, 46784, 1968, 90845, 147352, 32265, 64494, -3198, 76291, 34006, -9405, 160669, 52245, -139815, -58696, -89961, -49907, 134085, 96224, 107108, 9081, 42994, 97368, -169812, -163334, -110170, -1252, -234895, -259914, -115303, -54526, -79814, -256939, -264075, -242948, -239325, 29556, 59489, -106089, -40098, 44350, -34017, -205800, -155598, -144973, -195059, -336467, -130981, 126027, 90006]
6641I0006q238K6267l09762q5136K7078Q2425J59087M9032M9610k14688J6338
6630a17981O5313q4271j4843L3227J22216J48869J38141j13875P539n4775l19853
6619a90293n1506K00806Q4911K4743N1973J3520j34765k30916k0934K39667J3032
6608B38K7317O3496R7665P3687j96482N1000M3134o6146r1228j16820L34460j96364
6596B3957j53329l8329K13452p707q2705P1715o5256J15257J3584K2876p6067
6585C7448P0053j36351O7090o382p7031j54530j980L4742N7466j5145J87814o710
6573E6484j07442N3805J92009q6219m8459L5372m2510n3764R7133M1451o0829
6562G7031j54480q4066j13716O8696J66709L4076j7082R0538j40395O7120j03699
$$ y = [90006, 81768, 108035, -201727, -286863, -259785, -177360, -18273, 30759, 80369, -134319, -117981, -52668, -136939, -151782, -118555, 3661, 152530, 290671, 176796, 184335, 129560, -190293, -241799, -40993, 43918, 68661, 120634, 134154, -611, -231527, -252461, -12794, 238, 27555, 91051, 188716, 262403, 65921, 116921, 160055, 93909, 2681, -114139, 220321, 23957, -129372, -167701, 45751, 38044, -44661, 27054, -38202, 77055, 90639, 113515, 37448, 107501, -28850, 38240, 31858, -45173, -199703, -201683, -166941, -109475, -124620, 63194, 56484, -50958, 2847, 194856, 108637, 60178, 95550, 53040, -724, 96409, 137860, 77031, -77449, -161515, -275231, -206535, -39826, -5750, -22832, 67706, -72689, -5569, -109268]
6551a09268k29186M7164Q2678n6315N7503J67027j53249j8645J6284R1689P7558
6540b6760J24645K4728j72869r5149J94417k1268l7687K4780J53800j05844m9051
6529A3742p3202L24362r8289M2278k17319R7732k34024J226J06711k0543P3223
6518A5897r1162j28751L9838J78148m4713J04675J8854j27923j99629o720K22819
6507a8667k7840j29232O9804l0595Q5901J29730J15254j93965O9090j6025j44295
6496i0840L071k8412j723J1032P2376J7147M8050J09627l2971j4223m9452j41438
6484i7756Q10m3175J52153P7386j07730n2121M4399P1920q7357Q1860N0718N6262
6472A47369k75353j28155J32284J03773J59303j79208r8202m9107J14249p1890
$$ y = [-109268, -338454, -291290, -208612, -264927, -207424, -40397, -193646, -212291, -196007, -104318, -26760, 97885, 122613, -50256, -145405, 49012, 27744, -9943, 14837, 168637, 62793, 13742, -59460, 264902, 166613, 208891, -8428, 89304, -144720, -143494, -36783, -57326, 15897, -75265, -204016, -164178, 13970, -30743, 73932, 92786, -35137, -234766, -241486, -18667, -46507, -175739, -105935, -136530, -50629, 79101, 194355, 390, 69480, 53455, -90840, -87769, -116181, -117904, -106872, -34496, -17349, 30701, 140328, 107357, 93134, 43682, -97756, -96946, -140121, 12032, 89418, -18312, -70433, -26034, 45886, -41471, 40389, 91107, 147369, -127984, -256139, -123855, -20082, 139221, -39987, -138189, -187296, -73047, -144937]
6462a44937r2260J74913M660p1079q2352K02901r7949J55700k8155Q7414K75067
6451C83923j22262j71566m7614j04181K50805j5022j72102p7337M6491j17051
6441a45916J08508n7167j78703K38948J67403P5346j93175j24871j3487M5930
6431g7184J87680k12943l6425Q1965K0658Q5159n593J5291k68580J24798k4847
6420a10021j23582J26648J25243M6301l2366o6655o9228M2869J34739P1321k61509
6409a16240J22981q0461q0160J87150J82788O3722j02768j0490K20617j69929
6399B17210k03130J33968l2709M686j92306J31852L5521J31077k4942J17845j58595
6388A60477J5883J37385j22959K2251J1458O7359Q335o2740m6498N7207j53943
$$ y = [-144937, -237197, -62284, -57624, -128703, -211055, -8154, -106103, 49597, 21442, 108856, 383923, 261661, 90095, 42481, -61700, 189105, 174083, 1981, -75356, -28865, -145916, -37408, -94575, -273278, -34330, 133073, 208419, 15244, -109627, -123114, -77184, 110496, -102447, -138872, -56907, -36249, 48910, 43317, 58608, -209972, -85174, -110021, -233603, -106955, 18288, 64589, 32223, -34432, -103660, -60791, 73948, 145269, -116240, 6741, -73720, -153880, 33270, 216058, 279780, 177012, 166522, 387139, 217210, 14080, 148048, 115339, 120025, -72281, 59571, 95092, 226169, 201227, 319072, 160477, 176360, 313745, 190786, 213037, 224495, 291854, 300189, 237449, 190951, 248158, 94215]
6377I4215l1514l5155J80370J6014j1087j01087j07640k1738M7454K15035N3031
6366B97898O0953p0742p5125k04433N5458J31840r6979J21406k12366K49693K7097
6355B84700j04450K58533k57020j20473m393J45912j53603K04744j9668j71516
6345F2766M2606J62500p4217K57989J6110j53429k9601j14429K76843J9414k47600
6334B18952K3588P2202m9804m6570J16714m6583q5352l0783M7694N5410k83293
6323g825O1384J45273j28979P4935k11787o450L22173l514p0179J09731k752j13260
6311A68750K7509j86809P4108j25j40806R8750l6349j08505J1917J77482J70033
6300B55955Q8488j67424k7516K05286j0571N3628N9643j80774j01130p287j58551
$$ y = [94215, 62701, 27546, 207916, 223930, 212843, 111756, 4116, -17622, 29832, 244867, 297898, 358851, 288109, 212984, 8551, 64009, 195849, 98870, 220276, 7910, 257603, 284700, 180250, 438783, 181763, 61290, 56897, 202809, 49206, 253950, 234282, 62766, 105372, 267872, 193655, 451644, 467754, 314325, 284724, 170295, 447138, 466552, 218952, 242540, 314742, 264938, 218368, 335082, 288499, 203147, 172364, 220058, 275468, -7825, 53559, 198832, 69853, 144788, -66999, -73449, 248724, 245210, 175031, 284762, 282010, 168750, 196259, 9450, 83558, 83433, -57373, 41377, 5028, -103477, -91560, 85922, 255955, 344443, 177019, 149503, 354789, 344218, 397846, 457489, 276715, 175585, 168298, 9747]
6289I747N2612m2632L12871Q3119j48043k14875J50827Q9117J7503l0899j59681
6278A19666Q3173M6674l4975k22450p2109J17671m5012J7202N0713J40035J51985
6267C52573k07313j3164M3527q477j89261Q0943N1688j04683J35887Q9485O4388
6256B95593j42442K2097l3884m3805K1635j7565p6741K30465l5831j69909R290
6245E8903j31815k4736M3645L01653m4228q3702q8498L7083R0714K7753n8240
6234A28532l796r9103R0776M0998n4467J44961J26481O9703j7268j18450o9024
6223B39343J40544l69485O2868J89034L0033k23417J77077k1984l3619K12669
6213D03063J41106P939j49038j40136Q7283o7201k813m8218P4628j3134j044J64887
$$ y = [9747, 62359, 19727, 332598, 415717, 267674, 52799, 203626, 292743, 310246, 279347, 119666, 202839, 249513, 214538, -7912, -80021, 37650, -7362, 9840, 60553, 200588, 352573, 145260, 132096, 175623, 167146, -22115, 58828, 110516, 5833, 141720, 231205, 295593, 153151, 175248, 141364, 97559, 119194, 101629, 24888, 255353, 219522, 49613, 58903, -72912, -97648, -54003, 247650, 203422, 119720, 31222, 68305, 159019, 186772, 128532, 124736, 25633, 116409, 157407, 102940, 247901, 374382, 444085, 426817, 308367, 239343, 379887, 10402, 73270, 262304, 292337, 68920, 245997, 224013, 190394, 403063, 544169, 552108, 403070, 262934, 350217, 283016, 280203, 231985, 306613, 293479, 292435, 457322]
6201D57322j41403k40342J8334J67208j9452L2757L9389J93971J58960k09652
6191D57092m1443J3124j97725J22879O5150K6456j24072K6059q528J81703J16836
6180F37531r3662q3242J06904r3686K08203j55226j5707n4827L1326Q2799J60867
6169G31280l68330L0626K16056l0836j0569J9963K43110q4708o9937j40233R8589
6158F35011K22439J28648k4826l13663O0408K92147l1041o7312J3880J76189n851
6147A086029k1336j09275n7757R4503O4046j33281Q4024K87327k7470J1095n4570
6136A223335J8095K4248J52911j02502J6727J41552l1679o419P6149R8138j24739
6125A485816M37600Q8230o8277j26659n3092L3262P4470j36363K77705J17816
$$ y = [457322, 315919, 75577, 93911, 261119, 241667, 274424, 313813, 507784, 666744, 457092, 415649, 428773, 231048, 353927, 419077, 445533, 321461, 347520, 338992, 520695, 637531, 543869, 460627, 567531, 473845, 682048, 526822, 511115, 456288, 487614, 570413, 731280, 362950, 393576, 609632, 578796, 568227, 588190, 831300, 746592, 676655, 536422, 635011, 857450, 986098, 961272, 647609, 708017, 1000164, 969123, 901811, 915691, 1091880, 1086029, 1064693, 955418, 897661, 992164, 1056210, 922929, 1006953, 1294280, 1266810, 1277905, 1223335, 1241430, 1265678, 1418589, 1316087, 1332814, 1474366, 1442687, 1436268, 1512417, 1610555, 1485816, 1923416, 2011646, 1943369, 1816710, 1763618, 1796880, 1871350, 1734987, 2012692, 2130508]
6115B130508J71397r2389j06734J27175K07414N3108j8289O2304n4813J37011
6105B616692P3458N18812n5912o1810o9981J07220J84125j8153R4638L53732L6925
6094C779746J40427K69015q078M12572J50659J71874K05167J67800K41797K66708
6084E797687M88843M18493J21330L97604N51334M60812O79393R25125P66212J318319
6074A1925152J128836J132360J568334K292655K615512L253942L836967L178043
6066C0931801J026799j768261l426188l120016j579180q75530J30005N30600R07474
6057B2757504J786624K643178K840297K071280j043994l626797m618241l859048
6049A8950803k384006j640341j235865r94168r29082p62273m85574m16211m2756
$$ y = [2130508, 2301905, 2209516, 2102782, 2229957, 2437371, 2490479, 2472190, 2534494, 2479681, 2616692, 2690150, 3208962, 3153050, 3091240, 3021259, 3128479, 3312604, 3294451, 3389089, 3742821, 3779746, 3920173, 4189188, 4181110, 4593682, 4744341, 4916215, 5121382, 5289182, 5530979, 5797687, 6286530, 6705023, 6826353, 7223957, 7775291, 8236103, 8915496, 9840621, 10606833, 11925152, 13053988, 14186348, 15754682, 18047337, 20662849, 23916791, 27753758, 30931801, 31958600, 30190339, 26764151, 23644135, 22064955, 21189425, 21319430, 21850030, 22757504, 24544128, 27187306, 30027603, 32098883, 31054889, 27428092, 22809851, 18950803, 16566797, 14926456, 13690591, 12696423, 11767341, 11005068, 10519494, 10103283, 10060527]
6040A0060527k5133l70361j73025Q2525m9049J27785J37850J96921K48108J36540
6030A0372688O09506P74943N65482N56772P74127R66507J164554J269576J669366
6021A8723521K010543K348093L004987M010414M558956N009355L607763k44153
6013D3029479l743781n035814l473187k167548p47933L8921P07323J709611L162454
6004C3479525L821820L275503J115782l019664o261923o207239m536021l176953
5996A8490830k199656j805804j480155j057253j107580q43375o31213n72156p93246
5987H000392n24097j09711k44561l36107l03484j78676l15189j79062j26508k13678
5977E469319k02070k99171j72969p4189M0365p3463l26439m4162k9107k31403
$$ y = [10060527, 10035394, 9665033, 9492008, 9574533, 9525484, 9653269, 9791119, 9988040, 10236148, 10372688, 10982194, 11757137, 12322619, 12879391, 13653518, 14620025, 15784579, 17054155, 18723521, 20734064, 23082157, 26087144, 30097558, 34656514, 39665869, 43273632, 43029479, 39285698, 34249884, 30776697, 28609149, 27861216, 27900137, 28607460, 30317071, 33479525, 37301345, 40576848, 41692630, 38672966, 32411043, 26203804, 21667783, 18490830, 16291174, 14485370, 13005215, 11947962, 10840382, 9997007, 9365794, 8793638, 8000392, 7476295, 7366584, 7122023, 6785916, 6482432, 6303756, 5988567, 5809505, 5682997, 5469319, 5267249, 4968078, 4795109, 4720920, 4761285, 4687822, 4361383, 4317221, 4288114, 4056711]
5967D056711o3488j34683l16571Q7077k02713j34906L9282r9902j09976o9730
5957C051101j16734J50222j63975L4012N6421p3550k00060k7431O6041q8129k6221
5946B661697j42608J19159J06912k5931p9809K9804O8970j86358N1645P2409J1796
5935B687686k02362L6482j54622J9794j57542j3501j79058O6429J14225p1119
5925B146412K13651j5859N9577j68857J88394j6788p1095k5328K0875R1953j9353
5914B403582p6531J41433n3815M5569J04046J33784P3999J70031j36510j5220
5904B790368Q6976J26703J06084M55959L99101L4115m04467n53901j38346K6947
5894B929539j22954k47705k18130p1661n9857L2638J53609j91549j09779n457
$$ y = [4056711, 3993223, 3858540, 3541969, 3629046, 3426333, 3291427, 3330709, 3230807, 3120831, 3051101, 2934367, 3084589, 2920614, 2954626, 3011047, 2937497, 2737437, 2710006, 2776047, 2687918, 2661697, 2519089, 2638248, 2745160, 2719229, 2639420, 2669224, 2738194, 2551836, 2603481, 2675890, 2687686, 2485324, 2521806, 2367184, 2386978, 2229436, 2215935, 2036877, 2103306, 2217531, 2146412, 2360063, 2344204, 2403781, 2234924, 2423318, 2406530, 2335435, 2310107, 2330982, 2422935, 2403582, 2327051, 2468484, 2414669, 2460238, 2564284, 2698068, 2772067, 2942098, 2805588, 2790368, 2877344, 3004047, 3110131, 3566090, 3965191, 3999306, 3594839, 3040938, 2902592, 2929539, 2806585, 2558880, 2340750, 2269089, 2209232, 2241870, 2395479, 2203930, 2094151, 2088694]
5884B088694J30068N8672n0685M6844k51311m7710Q7140l3276K13597M4671j51665
5873B135039Q3009L42791r527N665j11484P5259R920j3150J15012J11980M41510
5862C186024n5973k74254k21528Q2700J6077L41960K28366n8616J23468j46242
5852C221982k26381p7888J93055K05802j41715j30443J68183q7683j18397J71956
5842C178471j25968J24561M1812m2516N7827j57323k02349j08337J65423j46931
5832B784670J19547O854l3038O9424M8977m935o1095j40584J36518L08783J82227
5821C417348J53369m8431K73487J72541J60839N6350J29499Q3731K43871J71423
5811D814027j65423j1887J01862R9705J30656K84045K07529J76817k11446j98015
$$ y = [2088694, 2218762, 2277434, 2226749, 2273593, 2022282, 1974572, 2061712, 2028436, 2242033, 2286704, 2135039, 2218048, 2560839, 2551312, 2556977, 2445493, 2520752, 2530672, 2517522, 2632534, 2744514, 3186024, 3130051, 2855797, 2634269, 2716969, 2733046, 3075006, 3303372, 3244756, 3368224, 3221982, 2995601, 2917713, 3110768, 3316570, 3174855, 3044412, 3212595, 3124912, 3006515, 3178471, 3052503, 3177064, 3218876, 3176360, 3234187, 3076864, 2874515, 2766178, 2931601, 2784670, 2904217, 2911071, 2878033, 2947457, 2996434, 2991499, 2930404, 2789820, 2926338, 3235121, 3417348, 3570717, 3522286, 3795773, 3968314, 4129153, 4185503, 4315002, 4398733, 4642604, 4814027, 4648604, 4636717, 4738579, 4838284, 4968940, 5252985, 5460514, 5637331, 5425885, 5227870]
5801E227870J33995K48883O5087J31737j38708p8829O6730L37999J15238Q8041
5791F198043K9582K33749j38273j04296k69618N7855Q435M0171L45856m5366J32536
5780F488674J20645M20825M9239J74465K88633M72595N32561O41101O65642O08966
5770A0463346Q28508R43977R31359J118837J455866J726555J675282K349134L061599
5761B4554463L982080M676646M113761J922296k474403n796000n392480l488394
5753B2097969k454967j567294j144426r32820m51240l67028p7047O7023M02823
5744A5572993L48341N33792Q54312P75814J293930J390179J805310J909631K584514
5735B7068816L733989M446316M793495K976995j385455n047582n984960m820089
$$ y = [5227870, 5361865, 5610748, 5675835, 5807572, 5668864, 5590035, 5656765, 5994764, 6110002, 6198043, 6227625, 6461374, 6323101, 6218805, 5949187, 6007042, 6015477, 6055648, 6401504, 6356138, 6488674, 6609319, 7030144, 7079383, 7253848, 7542481, 8015076, 8547637, 9188738, 9854380, 10463346, 11291854, 12235831, 13167190, 14286027, 15741893, 17468448, 19143730, 21492864, 24554463, 28536543, 33213189, 37326950, 39249246, 36774843, 30978843, 25586363, 22097969, 19643002, 18075708, 16931282, 15998462, 15547222, 15180194, 15103147, 15170170, 15572993, 15921334, 16455126, 17309438, 18085252, 19379182, 20769361, 22574671, 24484302, 27068816, 30802805, 35249121, 40042616, 43019611, 41634156, 36586574, 30601614, 25781525]
5727B5781525l313360k335072j691262j508903p49258n62262k70115k89201l9779
5718A5022313J32731K54125N28784P28483O74072Q54344J181924J637506K102933
5709B3117215K868258L032931K631393o2211l284214m350184l460060k445683
5701A8047445j587682j099852q62015n45348n24703k06791j52440J03341K42243
5692A3414198M64538M49560M42340P40654J072761R24093J407453J538291K381040
5683B2834928K842848L348904L336188R51588k649696m605653m386641l188352
5675A8484114k108951j386016j145379j087617o97589n08741m99075k36277l14646
5666A0499823k55487m20207k08300Q5365k05432q8263R058J0867J64065J06171
$$ y = [25781525, 22468165, 20133093, 18441831, 16932928, 16183670, 15621408, 15351293, 15062092, 15022313, 15155044, 15409169, 15937953, 16666436, 17340508, 18194852, 19376776, 21014282, 23117215, 25985473, 29018404, 31649797, 31587586, 28303372, 23953188, 20493128, 18047445, 16459763, 15359911, 14497896, 13952548, 13427845, 13221054, 13068614, 13171955, 13414198, 13878736, 14328296, 14770636, 15511290, 16584051, 17508144, 18915597, 20453888, 22834928, 25677776, 29026680, 32362868, 33314456, 30664760, 26059107, 21672466, 18484114, 16375163, 14989147, 13843768, 12756151, 12058562, 11549821, 11050746, 10814469, 10499823, 10244336, 9824129, 9615829, 9701194, 9495762, 9407499, 9416557, 9427424, 9591489, 9697660]
5656I697660n3557r2403K23772j16728K0501J00545J37972p7885O58K5928K44262
5645A0110725L17421k64323M04245K09910K47582M66599K07097N2723M38867m971
5635A2185875J647K77746K48055r652J29635K17931J62409J57637L58673O2844
5625A3792800J42M12860K86016M63632O50590L93003K04620N58197O31354N24575
5615A7917789P71221O05628P18287R65282O83063P31522P69640R61807J002422
5606B5126661J163175J225668J230991J232239J180656J330437J698635J747951
5598C5936413J970982K243916K647571L011087L428638M181029M945926N255489
5590F3621051O309313P310859P987034R049584J0511633J3149118J6038003J7518328
$$ y = [9697660, 9644103, 9551700, 9775472, 9658744, 9679245, 9779790, 9917762, 9839877, 9840535, 9866463, 10110725, 10428146, 10163823, 10568068, 10777978, 11025560, 11492159, 11699256, 11751979, 12190846, 12185875, 12187522, 12465268, 12713323, 12703671, 12833306, 13051237, 13213646, 13371283, 13729956, 13792800, 13792942, 14205802, 14491818, 14955450, 15606040, 15999043, 16203663, 16761860, 17393214, 17917789, 18689010, 19294638, 20012925, 20978207, 21661270, 22392792, 23162432, 24124239, 25126661, 26289836, 27515504, 28746495, 29978734, 31159390, 32489827, 34188462, 35936413, 37907395, 40151311, 42798882, 45809969, 49238607, 53419636, 58365562, 63621051, 69930364, 77241223, 85228257, 94277841, 104789474, 117938592, 133976595, 151494923]
5582A51494923J8591730J8906488K1469620K9656473M2487244N1579225M5400244
5575C79585947N741887n6913898p5571107n5243120l7499262k6182004j9384086
5568A14534357j4591900j1370193q979035p734448o702653n683546m494130l578252
5560E1400200k880799k684199k100693k247299j858967j794191j658003j873310
5552C4302739j883192j490526j529267j517457j320408j126269p99666q69317
5544B3766637p93981p08738p61856q24999j041558q37706n97856q22002l33778
5535A7044163o05896k92616j70185n72061l94195l54873m52535n26634k92241
5526A3382927m59253m39193m65980k24262k87729l98263m35568m90189k90182
$$ y = [151494923, 170086653, 188993141, 210462761, 240119234, 282606478, 334185703, 379585947, 385327834, 328413936, 252842829, 197599709, 160100447, 133918443, 114534357, 99942457, 88572264, 79593229, 71858781, 65156128, 59472582, 54978452, 51400200, 48519401, 45835202, 43734509, 41487210, 39628243, 37834052, 36176049, 34302739, 32419547, 30929021, 29399754, 27882297, 26561889, 25435620, 24635954, 23766637, 22972656, 22263918, 21502062, 20677063, 19635505, 18797799, 18199943, 17377941, 17044163, 16438267, 16145651, 15975466, 15403405, 15009210, 14654337, 14201802, 13675168, 13382927, 12923674, 12484481, 12018501, 11794239, 11506510, 11108247, 10672679, 10182490, 9892308]
5517I892308j84646j42318O2025j83849k84202r5154K13170j61003j629j27063
5507H987639j43965q1251K84646j45480l86905j83453k39194q6142l22994k27144
5497G455757j61036l97248m42445j16090j73094j99915j90865j96360K074n1508
5487E529270j75224k9666k74650p7414k27586j74774K8566o9986J29885k18990
5477D439431Q9342r5441j37535j16208p5552k63097Q4252j59229k42334K44979
5467C768608J07699j31059j81721j15814k8282P6003q0168n0679R7952L7308r8188
5456C401659m1297k51374L2439j75974o9217r8959K01022J35613n6493k15777
5446B861642N9921j64778n6967Q8988M5112P1667m2718N6397j71924l7280k3006
$$ y = [9892308, 9707662, 9565344, 9627369, 9443520, 9159318, 9064164, 9277334, 9116331, 9114702, 8987639, 8843674, 8762423, 9047069, 8901589, 8514684, 8331231, 8092037, 8005895, 7682901, 7455757, 7294721, 6897473, 6455028, 6338938, 6165844, 5965929, 5775064, 5578704, 5580778, 5529270, 5354046, 5324380, 5049730, 4972316, 4744730, 4569956, 4598522, 4528536, 4658421, 4439431, 4528773, 4433332, 4295797, 4179589, 4104037, 3840940, 3925192, 3765963, 3523629, 3768608, 3876307, 3745248, 3563527, 3447713, 3419431, 3495434, 3415266, 3364587, 3462539, 3499847, 3401659, 3360362, 3108988, 3141427, 2965453, 2896236, 2797277, 2998299, 3133912, 3077419, 2861642, 2921563, 2756785, 2699818, 2788806, 2833918, 2905585, 2862867, 2919264, 2747340, 2710060, 2687054]
5435B687054l8181n3364j05878J44458L965n9660J2397L9486k2479j03733l4560
5424B469505K5492K17445Q2389j24525p2251r8340P8883j1148j60623p2697J79863
5413B513993k19377M49Q8464k23143o653J27763K3346p881J7507o9721R0220J1389
5401B346356k3652j29194k31218L6309O4330Q6372J35927L1345R098j19811L4444
5390B240306j23117L699r6050l12649j3851J69048O2333o9094n5928J182O2262
5379A868141J73322n0525n5603P8808j32411n8077l3283O5358O0047J20036m0852
5368A994961j12499j2667o4369Q2896j9190j16495j39793j31615J39812J83180
5358A804221J29N1294k4232k68369R0614J8557j39780J51564j64130o7609J45823
$$ y = [2687054, 2648873, 2595509, 2489631, 2634089, 2638054, 2578394, 2590791, 2630277, 2607798, 2504065, 2469505, 2494997, 2712442, 2794831, 2670306, 2598055, 2499715, 2578598, 2567450, 2406827, 2334130, 2513993, 2294616, 2295065, 2383529, 2160386, 2153733, 2281496, 2304842, 2296961, 2314468, 2244747, 2334967, 2346356, 2322704, 2193510, 1962292, 1998601, 2062931, 2149303, 2285230, 2316575, 2325673, 2205862, 2240306, 2117189, 2120888, 2024838, 1712189, 1698338, 1867386, 1929719, 1860625, 1804697, 1805879, 1868141, 2041463, 1990938, 1935335, 2014143, 1881732, 1823655, 1790372, 1855730, 1915777, 2035813, 1994961, 1882462, 1869795, 1805426, 1888322, 1869132, 1752637, 1612844, 1481229, 1621041, 1804221, 1804350, 1855644, 1831412, 1563043, 1653657, 1672214, 1532434, 1683998, 1519868, 1452259, 1598082]
5347A598082J76148M3717n1714K5907N3102j18522N5562k73778J92652Q4517l4906
5336A750767j47648l2139J24313N8575J03291k21813k06853K83428j64449O8352
5326A615824L0487R4836j19002k68538p9891N2234K83628L4006n4473j38930R2893
5315A543074j23196J49925p747L6667K38575k19819J8829n5105N3453J32634Q7001
5304A854291n9024j28913n3200j51611J01694M5979N2760j07536R0743L9619j19061
5293A565741j29742R4014J23154J4089m8344K47256J2311j62107j14696k47208
5283A354468R1574J56694j24360J65450Q4584j15160J4878o407K6902M2903j0562
5272A680964J76798j08858k0351R7235m0360k5527J78255n3119o3017J23708m5751
$$ y = [1598082, 1774230, 1817947, 1766233, 1792140, 1845242, 1726720, 1782282, 1508504, 1701156, 1785673, 1750767, 1603119, 1570980, 1695293, 1753868, 1857159, 1635346, 1428493, 1711921, 1547472, 1615824, 1646311, 1741147, 1622145, 1353607, 1273716, 1325950, 1609578, 1643584, 1589111, 1450181, 1543074, 1419878, 1569803, 1562056, 1598723, 1837298, 1617479, 1636308, 1581203, 1634656, 1767290, 1854291, 1795267, 1666354, 1613154, 1461543, 1563237, 1609216, 1661976, 1554440, 1645183, 1684802, 1565741, 1435999, 1530013, 1653167, 1667256, 1618912, 1866168, 1878479, 1716372, 1601676, 1354468, 1446042, 1602736, 1478376, 1643826, 1728410, 1613250, 1628128, 1621721, 1648623, 1691526, 1680964, 1857762, 1748904, 1728553, 1825788, 1785428, 1759901, 1938156, 1885037, 1822020, 1945728, 1899977]
5261A899977J26011j7010J6420M3825m0835J65380J13790K24536K55661K36853
5251C024608n5682J59337L44663L12624P9721j02748m04163l29026k42921j03871
5241B682542k03106l71968r1455O0436P634L4391p1179J14175k8642n5002N9562
5230B137388K6109j19454J33713J11394P2666j2093j35097M1237j1742K0954Q5267
5219B350342J04518j75200m3567j3346J57718P9255J54853O377j1922N3609K2852
5208B685489K22222K5777p0986r7482P9353L5067P0333J09617J03364R027l4511
5197C137270J86221P0032N5406J0286J29060q375J12097j363n4028j19779J66214
5186C683041K49473J72841J6969m7768J30464J12635L72804L26287O2619R3287
$$ y = [1899977, 2025988, 2008978, 2025398, 2069223, 2028388, 2193768, 2307558, 2532094, 2787755, 3024608, 2968926, 3128263, 3472926, 3785550, 3865271, 3762523, 3358360, 3029334, 2786413, 2682542, 2479436, 2107468, 2016013, 2076449, 2084083, 2118474, 2047295, 2161470, 2132828, 2077826, 2137388, 2163497, 2044043, 2177756, 2289150, 2361816, 2349723, 2214626, 2255863, 2244121, 2265075, 2350342, 2454860, 2279660, 2236093, 2222747, 2380465, 2459720, 2614573, 2620950, 2609028, 2662637, 2685489, 2907711, 2933488, 2862502, 2765020, 2844373, 2879440, 2949773, 3059390, 3162754, 3171781, 3137270, 3323491, 3393523, 3448929, 3459215, 3588275, 3579900, 3691997, 3690634, 3636606, 3516827, 3683041, 3932514, 4105355, 4122324, 4074556, 4205020, 4317655, 4690459, 5016746, 5079365, 5172652]
5176E172652Q7163L20476J22552J41931R4491K11828K50142M54188M09425O02537
5166G867385N48180P55498P75913O30239J050469J300850J249533J339491K61082
5157A5778640m05159o00247R5564L19759N04557Q94145J117946J682545J835242
5148B1222992K736516K311040R24379r28382j290699q06369M03835R73250J054574
5139B6601136O56745k85479J36259J060755J958736J744547J108378P2559n35216
5130C2518420K13397Q12613R27173J12353j993342k297713j338144j02652J429808
5121C0281913J441290J204292o76116j338560l12719M47120M96317n03706j410500
5112B9629331k257665j758378p57738k95567J99052l02822j076329l83822J86606
$$ y = [5172652, 5259815, 5580291, 5702843, 5844774, 5939265, 6151093, 6401235, 6855423, 7264848, 7867385, 8415565, 9171063, 9946976, 10577215, 11627684, 12928534, 14178067, 15517558, 15778640, 15373481, 14773234, 14868798, 15188557, 15693114, 16587259, 17705205, 19387750, 21222992, 23959508, 26270548, 27194927, 26266545, 24975846, 24169477, 24573312, 25546562, 26601136, 27257881, 26972402, 27108661, 28169416, 30128152, 31872699, 32981077, 33053636, 32518420, 32731817, 33544430, 34471603, 34583956, 32590614, 30292901, 28954757, 28852105, 30281913, 31723203, 32927495, 32251379, 30912819, 30600100, 31047220, 31543537, 31039831, 29629331, 27371666, 25613288, 24855550, 24559983, 24759035, 24456213, 23379884, 22996062, 23182668]
5103B3182668Q84447J132450j13264j970277k838167k347366j763864j283415
5095A4883212p37085n64881m41807J65508L86847K07888J34318p35285j607267
5086A1691448j205359j179645q90829n56281m56338n31401l09390n72679j32689
5077E856837k59179l4970l02288k28339O3376l35535k43799j01230M8833j05050
5067D358656j71159r5649O7048j65278J3837N2852l18128j48530m1731L3005M8322
5056C633245j25462J09986j47936j4422k64564J04225j6199l24998j11058J00129
5046B942946p6989j68849m7368P7798P6038p3336j67129j04981J58630j43831
5036B472929l4286Q2530k7022m9900K0852k94436J63186J36178p9956j02729q3091
$$ y = [23182668, 24067115, 25199565, 25086301, 23116024, 20277857, 17930491, 16166627, 14883212, 14146127, 13581246, 13139439, 13304947, 13691794, 13899682, 14034000, 13298715, 11691448, 10486089, 9306444, 8415615, 7859334, 7402996, 6871595, 6562205, 5989526, 5856837, 5597658, 5562688, 5260400, 5032061, 5095437, 4759902, 4516103, 4414873, 4463706, 4358656, 4187497, 4091848, 4158896, 3993618, 4007455, 4060307, 3742179, 3593649, 3551918, 3584923, 3633245, 3507783, 3617769, 3469833, 3455411, 3190847, 3295072, 3278873, 2953875, 2842817, 2942946, 2865957, 2697108, 2649740, 2727538, 2803576, 2730240, 2563111, 2458130, 2616760, 2472929, 2438643, 2521173, 2494151, 2444251, 2465103, 2170667, 2333853, 2470031, 2390075, 2287346, 2204255]
5025B204255j56439J8875J05519j1698j75134m1091L0859r021k4559j25848J50649
5014A966367r2278N3528j54998r398K67048N6959j5263l9249L3825m3548K33233
5003B256226J05773k10741O887k30107J60208L40262k05344O6372J39754k0330
4993B408960j88621l6184J62583j59P3251J49608J84526n118j55155j50688K68111
4982B711114K70566J00960K5890j61084o6628o2688J33921M52955J37950j34886
4972C408070q0185k23207J51799j31153k08495K9089K51958M6665n5293L15863
4962C505111O785J07175J57955q2201J32754N5734k28172k02145J06864O8659
4952C628519j8769J77268j50836L54P3P8670j44496l1908j4040M07651r7372k67439
$$ y = [2204255, 2047816, 2066691, 2172210, 2160512, 1985378, 1944287, 1975146, 1966125, 1941566, 1815718, 1966367, 1874089, 1927617, 1772619, 1763221, 2030269, 2087228, 2071965, 2032716, 2066541, 2022993, 2256226, 2361999, 2151258, 2158145, 1928038, 2088246, 2428508, 2223164, 2289536, 2429290, 2408960, 2220339, 2184155, 2346738, 2346579, 2419830, 2569438, 2753964, 2748846, 2593691, 2443003, 2711114, 2981680, 3082640, 3108530, 2947446, 2880818, 2818130, 2952051, 3405006, 3542956, 3408070, 3327885, 3104678, 3256477, 3125324, 2916829, 2945918, 3197876, 3244541, 3189248, 3505111, 3511896, 3619071, 3777026, 3694825, 3827579, 3883313, 3655141, 3452996, 3559860, 3628519, 3609750, 3787018, 3636182, 3636536, 3636609, 3715279, 3570783, 3538875, 3524835, 3932486, 3835114, 3567675]
4940C567675j79611j54705K01151j62345l2083M0018J38937q4379p2618J45373
4930C407413p0528k745K77987k26961j40638O7120j75870L9568j28016q7269Q5424
4919C045485O0913j27728j07172j99556K00259R7719k8913J29390J08386N6569
4909C235352J61113j68006k58252M6533j15545k54962m8960o073j16756k94457
4899B179987k42656J3570K35877Q76k65263j6094P5766j63528L1232J07783J5834
4888A973384J35872L80J27306k78507K8790K7951l4929j01625k8982J27582L7931
4877B015153k08577j57296j13598j5872M2174M7801J08809m6496k66782q9531
4867A315785k7419r9987J09139L6041j79905J53l9121K6241K64784n6939j5770
$$ y = [3567675, 3388064, 3233359, 3434510, 3272165, 3240082, 3280100, 3419037, 3334658, 3262040, 3407413, 3336885, 3334140, 3612127, 3385166, 3244528, 3311648, 3135778, 3175346, 3047330, 2960061, 3045485, 3106398, 2978670, 2871498, 2671942, 2872201, 2969920, 2941007, 3070397, 3178783, 3235352, 3396465, 3228459, 2970207, 3016740, 2901195, 2646233, 2597273, 2591200, 2474444, 2179987, 1937331, 1950901, 2186778, 2187654, 1922391, 1906297, 1982063, 1818535, 1849767, 1957550, 1973384, 2109256, 2109636, 2236942, 1958435, 1987225, 2015176, 1980247, 1878622, 1849640, 1977222, 2015153, 1806576, 1649280, 1535682, 1519810, 1561984, 1609785, 1718594, 1672098, 1405316, 1315785, 1288366, 1188379, 1297518, 1333559, 1153654, 1153807, 1114686, 1140927, 1405711, 1348772, 1333002]
4856A333002J76622j08405j57493J02821L2897l01486K3377L57043P701p9629
4846A386450Q8195Q7347j24978J06603j36932k15079K35299j36104R5986l0450
4836A356337o6380Q5154R7568O0841Q3512n483j38820n0996J52310L05066r887
4825A869222k4802J87313o6599j05071p1856J60364K29253n5686j13183r5761
4815A913194j86918J55321J85950j47911R8784K4760J62236L5822j24303J29352
4805B246287j20776O3364J70609K75729l9883l0254J50743j32024j65527J69906
4795B588174N2796m0346m9594L9047M1528J53700L5020J81732K01012n2668L3479
4784C183880m3727K56964J61411J95469R2127J86859r3184K6798J31150J29950
$$ y = [1333002, 1509624, 1401219, 1243726, 1346547, 1379444, 1077958, 1101335, 1458378, 1466079, 1386450, 1474645, 1561992, 1437014, 1543617, 1406685, 1191606, 1426905, 1290801, 1386787, 1356337, 1289957, 1375111, 1472679, 1533520, 1617032, 1611549, 1472729, 1421733, 1574043, 1879109, 1869222, 1844420, 2031733, 1965134, 1860063, 1788207, 1948571, 2177824, 2122138, 2008955, 1913194, 1726276, 1881597, 2067547, 1919636, 2018420, 2043180, 2205416, 2241238, 2116935, 2246287, 2125511, 2188875, 2359484, 2635213, 2595330, 2565076, 2715819, 2583795, 2418268, 2588174, 2640970, 2600624, 2551030, 2590077, 2631605, 2785305, 2820325, 3002057, 3203069, 3150401, 3183880, 3140153, 3397117, 3558528, 3753997, 3846124, 4032983, 3939799, 3966597, 4097747, 4227697]
4774D227697Q980j4888K46597L09431m216J04103Q0357K31673L18647J69403M35724
4763F113508K51119K18132L15265L50899M64482L71082N11188N82977N99895O78827
4753A0457374P63163Q03341R12504J082466J354726J578951K102961K504208L062571
4744B4622265L947716M576035L610213n96837m507749m635131k984074j776467
4736B2255971p38396l69678J31007N35067P33316J195884J545708K151962K732734
4727C0173575L319415M131846N531033O127919N896901L381816M14361o91051
4719E8285815l730949q128570q130306n485640m010846k641821j605468j106653
4711B3445562p27003k87902J42237P33145Q79928J205772J880443K811700M215613
$$ y = [4227697, 4236677, 4221789, 4468386, 4777817, 4773601, 4877704, 4958061, 5189734, 5508381, 5677784, 6113508, 6364627, 6582759, 6898024, 7248923, 7713405, 8084487, 8595675, 9178652, 9778547, 10457374, 11220537, 12023878, 12936382, 14018848, 15373574, 16952525, 19055486, 21559694, 24622265, 28569981, 33146016, 36756229, 36159392, 31651643, 27016512, 24032438, 22255971, 21517575, 21147897, 21278904, 21813971, 22547287, 23743171, 25288879, 27440841, 30173575, 33492990, 37624836, 43155869, 49283788, 55180689, 58562505, 58976866, 58285815, 54554866, 46426296, 38295990, 32810350, 28799504, 26157683, 24552215, 23445562, 22718559, 22430657, 22572894, 23306039, 24185967, 25391739, 27272182, 30083882, 34299495]
4702C4299495M462684K983172k028798o504301o352778m611997l038107k379007
4694A6830363j715029j409198j306296q20961j005598p26320l57194k76172o01928
4685H611667m15251l13491k65173k86014k63205k19039j94029q8875k24060r5686
4675F246844J10195k68814p1929K1607j43181p1554O0272o7326k7469j30731j30294
4664E527620N3766N4360n2410N9460P7991M03332L36819p0875L27553n4897l51737
4653F310982j34453R1404k25453J38782P8186j91484n4236R0513K4118L12224
4643F440583K13484L06993L75514R9173K65400K77957K2295N8368M74785L73407
4633H907959j06304j85860n90162n71079j96930m9064m9774j59182N0374J95140
$$ y = [34299495, 38762179, 41745351, 39716553, 33212252, 26859474, 22247477, 19209370, 16830363, 15115334, 13706136, 12399840, 11578879, 10573281, 9846961, 9489767, 9213595, 8611667, 8196416, 7882925, 7617752, 7331738, 7068533, 6849494, 6655465, 6566590, 6342530, 6246844, 6357039, 6088225, 6016296, 6037903, 5894722, 5823168, 5883440, 5816114, 5788645, 5657914, 5527620, 5581386, 5635746, 5583336, 5642796, 5720787, 6124119, 6460938, 6390063, 6717616, 6662719, 6310982, 6176529, 6267933, 6042480, 6181262, 6259448, 6067964, 6013728, 6104241, 6128359, 6440583, 6654067, 6961060, 7336574, 7435747, 7701147, 7979104, 8001399, 8059767, 8534552, 8907959, 8801655, 8615795, 8025633, 7454554, 7257624, 7208560, 7158786, 6999604, 7049978, 7245118]
4623G245118N1813K77979K65906K43779K14196L96218L27149L93440K31839L45646
4613I993083K09788j22866r8827j996m10000l38306j82870r7412R7239r968q6424
4602H951441K18618Q5357N17648M52027L20171L13833N01744N31474P06448Q98425
4592A3497186Q26878Q18203O95714O73134Q46193J111588J524127J755239K065036
4583B3813298K467467K748761L164811L940539M777406N243793M104978N65225
4575E0826278l089643m600945l563796j887028n78245M65676J234955K334329
4567D1141581L751503M022609L166568O2130l656472m587370l503630k036495
4559C8360424k78577O90311J894120K516409J983981m08608l288253m460121l467470
$$ y = [7245118, 7296931, 7574910, 7840816, 8084595, 8298791, 8695009, 9022158, 9415598, 9647437, 9993083, 10202871, 10080005, 9981178, 9979182, 9569182, 9230876, 9048006, 8950594, 9047833, 9037865, 8951441, 9170059, 9255416, 9773064, 10225091, 10545262, 10859095, 11360839, 11892313, 12598761, 13497186, 14324064, 15142267, 15837981, 16511115, 17357308, 18468896, 19993023, 21748262, 23813298, 26280765, 29029526, 32194337, 36134876, 40912282, 46156075, 50261053, 50826278, 47736635, 43135690, 39571894, 37684866, 37106621, 37572297, 38807252, 41141581, 44893084, 48915693, 52082261, 52144391, 48487919, 43900549, 40396919, 38360424, 38081847, 38772158, 40666278, 43182687, 45166668, 44758060, 41469807, 37009686, 33542216]
4550C3542216j960416r05720l09438M24470J072388J792526J929066J447565j018960
4541C6013697m193023n139157m295727k970947j964536j824696j131799j262133
4533A3231679p86874r03509p11436m62323m76483m65555m38018j62582k18845
4524H606054j53884k65800k30221m01296m26381j05617m88003q5586L9581k48517
4514F240330k70554k55106Q3220j09001m14551j08418r9639k7058R3137L0839
4504E163199j42394j96425R0839K7455k6237k57558j90124j16347L4069k8986
4494D357491l9822l6793K7950o0084j84833k41436m734J08947J87831J3880k71303
4483C857094j58268J2313k51107k3475M4092Q6759j3271k78505J64354Q7465j53424
$$ y = [33542216, 31581800, 30676080, 30366642, 30791112, 31863500, 33656026, 35585092, 37032657, 36013697, 31820674, 26681517, 22385790, 19414843, 17450307, 15625611, 14493812, 13231679, 12444805, 11541296, 10829860, 10367537, 9891054, 9425499, 8987481, 8824899, 8606054, 8452170, 8186370, 7956149, 7554853, 7128472, 7022855, 6534852, 6449266, 6488847, 6240330, 5969776, 5714670, 5797890, 5688889, 5274338, 5165920, 5066281, 5039223, 5132360, 5163199, 5020805, 4824380, 4915219, 4942674, 4916437, 4658879, 4468755, 4352408, 4386477, 4357491, 4317669, 4280876, 4308826, 4248742, 4063909, 3822473, 3817739, 3926686, 4114517, 4128397, 3857094, 3698826, 3711139, 3460032, 3436557, 3480649, 3567408, 3554137, 3275632, 3439986, 3527451, 3374027]
4472C374027l0593j53938J0495k3833N8974O3830k4664n4234J31074o4406M276
4461C291008k71p928k08753J27306K81967O8141K84315J90100r955P8585K57798
4450D352313K51650M47047M08695K97727L28625J70648j16027l22725l33628l31320
4440E153005k57570J49754J95135K05462O5164r2356q506k04143j06940p562k7745
4429E063698J90288L30649K51303L06255K90061K58979j29868o73023k97221l48491
4419E242630j48979j0209J85407K96921J79771L37112M39555J73289l31123m10157
4409E954217m18710l68891l50917n1649M6294l3642K30686j3529l14625k90598
4399D388636l12477j99718j26611K7173j35998J49432q4476R4563M3908N5666
$$ y = [3374027, 3343434, 3189496, 3199991, 3176158, 3235132, 3298962, 3274298, 3220064, 3351138, 3286732, 3291008, 3290737, 3282809, 3074056, 3201362, 3483329, 3551470, 3835785, 4025885, 4015930, 4094515, 4352313, 4603963, 5051010, 5459705, 5757432, 6086057, 6256705, 6140678, 5817953, 5484325, 5153005, 4895435, 5045189, 5240324, 5445786, 5510950, 5418594, 5410088, 5205945, 5099005, 5091443, 5063698, 5253986, 5584635, 5835938, 6142193, 6432254, 6691233, 6561365, 5888342, 5591121, 5242630, 5093651, 5083442, 5268849, 5565770, 5745541, 6082653, 6522208, 6695497, 6364374, 5954217, 5535507, 5166616, 4815699, 4764050, 4810344, 4776702, 5007388, 4993859, 4679234, 4388636, 4076159, 3876441, 3749830, 3777003, 3641005, 3790437, 3705961, 3800524, 3844432, 3900098]
4389C900098j95618j77186n08572j28601l87862O4429j66729k02406J15836R3769
4379B407158o3045k8471j00125j92972O0741J60652M3567j70969N9640p3182K36670
4368B339664j95203r0251Q7271J3110j15982j52293m2506O9679j67978K47542
4358A993053j25954P4400J49668J55771o8060q1993o344r0998P4392K57569o4063
4347B267441J28173o4342j73501o5309K75025j36609j13308l8261r4555J22107
4337B106861o6723K24811J27249o548R0022n955n7097O2499J05202J20412l18450
4326B382283j80372N0932J38196J35225K5820O2333j51533J85849j60176J08938
4316B597495R3248j90302J5430q2515J50244l3283l9660l5498l8888j66295P6550
$$ y = [3900098, 3704480, 3527294, 3018722, 2890121, 2502259, 2566688, 2399959, 2197553, 2313389, 2407158, 2344113, 2315642, 2215517, 2022545, 2083286, 2243938, 2287505, 2116536, 2176176, 2102994, 2339664, 2144461, 2054210, 2141481, 2154591, 2038609, 1886316, 1843810, 1913489, 1745511, 1993053, 1867099, 1941499, 2091167, 2246938, 2178878, 2096885, 2090541, 1999543, 2073935, 2331504, 2267441, 2395614, 2331272, 2157771, 2092462, 2367487, 2230878, 2117570, 2079309, 1984754, 2106861, 2040138, 2264949, 2392198, 2385650, 2475672, 2469717, 2412620, 2475119, 2580321, 2700733, 2382283, 2201911, 2252843, 2391039, 2526264, 2552084, 2614417, 2462884, 2648733, 2488557, 2597495, 2690743, 2500441, 2515871, 2433356, 2583600, 2550317, 2510657, 2475159, 2436271, 2269976, 2346526]
4305B346526L83105r7754j30690j11815j02999P3090M4779J05255R4444k10401
4295B393540J50311P7378L0097o4593j38182J4602N977p6085M2588K75573Q3065
4284B794271m2079O0927J16943k07175Q9873Q1167J55248J5323N331J06977k7811
4273C148995K5592J808l1231L2303K23997P3872j27541N6306L5868J81391j9156
4262C602204l9429J15135j3339M08478k2754n4293J92156j5010K69447J23548
4252D566143n541J03315N4185N4555P7004k899J26451J56988L9308J34020L23336
4241E626865K21492L12234N8151J72024K07416J82611Q9458K31535r2246M6839
4231G056379N82895L64309J08895J70302M85983K40644L42957P8452k9939K39652
$$ y = [2346526, 2729631, 2631877, 2501187, 2389372, 2286373, 2359463, 2404242, 2509497, 2603941, 2393540, 2543851, 2621229, 2651326, 2586733, 2448551, 2463153, 2469130, 2393045, 2435633, 2711206, 2794271, 2752192, 2813119, 2930062, 2722887, 2812760, 2893927, 3049175, 3064498, 3069829, 3176806, 3148995, 3174587, 3176395, 3145164, 3177467, 3401464, 3475336, 3347795, 3404101, 3439969, 3621360, 3602204, 3562775, 3677910, 3664571, 4073049, 4050295, 3996002, 4188158, 4173148, 4442595, 4566143, 4560602, 4663917, 4718102, 4772657, 4849661, 4846762, 4973213, 5130201, 5169509, 5303529, 5626865, 5848357, 6160591, 6218742, 6390766, 6598182, 6780793, 6870251, 7101786, 7009540, 7056379, 7639274, 8003583, 8112478, 8282780, 8768763, 9009407, 9352364, 9430816, 9400877, 9640529]
4221I640529K71029J66781J63685J38974J13783L13661J65499J04270L4171J08881
4211A1221263J50711o1607L32147N09892K99134K21631M99546L93126J69116N32828
4201A4267787O00134L87079M42417K75475N72570O94549P24442R40320P66490
4192A9671263O06077P07611R53431Q98972J077807J111507J019178J141207J233149
4183B8420202J274464J309574J659266J818215J725972K302869K399455L056213
4175D3966230L201496L997265M806671N270940N527749O463875P216894Q320901
4167H8772021R988596J2013834J4021252J6231740J8432190K2932059K9513194
4160B11904886L9241445M5933660M4227065J7364717k0807014m9224935n8535519
$$ y = [9640529, 9911558, 10078339, 10242024, 10380998, 10494781, 10808442, 10973941, 11078211, 11112382, 11221263, 11371974, 11310367, 11642514, 12152406, 12451540, 12673171, 13172717, 13565843, 13734959, 14267787, 14867921, 15255000, 15697417, 15972892, 16545462, 17240011, 17964453, 18904773, 19671263, 20277340, 20984951, 21938382, 22837354, 23915161, 25026668, 26045846, 27187053, 28420202, 29694666, 31004240, 32663506, 34481721, 36207693, 38510562, 40910017, 43966230, 47167726, 51164991, 55971662, 61242602, 66770351, 73234226, 80451120, 88772021, 98760617, 110774451, 124795703, 141027443, 159459633, 182391692, 211904886, 251146331, 297079991, 341307056, 358671773, 337864759, 288639824, 230104305]
4153B30104305m3615540k9253725j9799037j4949398j2778032j3308483j2018144
4146H4381946r712607p703839o023990m810781l855511l226364l349612k902456
4138D2796786k645076k252931j977247j851221j907829j648825j415884j520650
4130B7577123j242019j175326j148740p18093j148555j071977p62681r93037q23910
4121A8492785o72710p12861m62757o63070n57163k98349l26083m85995o79890
4112A3633907m35422m43208l27935k99788k49079l36264k55980l84090k97317
4103A0604824k26200o20110l22303k03591k81903k98020j79337n0953j19349l4664
4093H268394l07735o5030k04496j79237k41265p7099j40274p2239k52989k01442
$$ y = [230104305, 186488765, 157235040, 137436003, 122486605, 109708573, 96400090, 84381946, 74669339, 66965500, 60941510, 56130729, 52275218, 49048854, 45699242, 42796786, 40151710, 37898779, 35921532, 34070311, 32162482, 30513657, 29097773, 27577123, 26335104, 25159778, 24011038, 23292945, 22144390, 21072413, 20309732, 19316695, 18492785, 17820075, 17107214, 16644457, 15981387, 15424224, 15125875, 14799792, 14313797, 13633907, 13198485, 12755277, 12427342, 12127554, 11878475, 11542211, 11286231, 10902141, 10604824, 10378624, 9758514, 9436211, 9232620, 8950717, 8652697, 8473360, 8422407, 8303058, 8268394, 7960659, 7895629, 7691133, 7511896, 7270631, 7193532, 7053258, 6981019, 6728030, 6526588]
4083F526588k93394j39673j39922o6522M7223j16163j54119k46920j28508j94473
4073E094117q7339j12983j31439k9154j91229j08975L9789j35001j76342l20228
4063C841216k59004Q9138j84646J3915o9572J65979L486k21345J78472k59035
4053C298604K3550k96806q9856p4542k60860P0912L20885N822q8697j7420r195
4042B882397J046m0222L555j34199K9928j11452l2589M4665J5105q7258j12015
4031B458961Q6602j3372k90406L82100J3124k30944l2869O1743J839k66142j23687
4020B046949l8773O1811K33367j62277k28263J79619j20713j34331J98544j32835
4010A903098J11045L4386o2608J43591m1866j37103p7426Q8967j34507K2192p2766
$$ y = [6526588, 6233194, 6093521, 5953599, 5887077, 5934300, 5818137, 5664018, 5417098, 5288590, 5094117, 5006778, 4893795, 4762356, 4733202, 4541973, 4432998, 4472787, 4337786, 4161444, 3841216, 3582212, 3671350, 3486704, 3500619, 3431047, 3597026, 3600512, 3379167, 3557639, 3298604, 3322154, 3025348, 2935492, 2860950, 2600090, 2671002, 2991887, 2997709, 2909012, 2891592, 2882397, 2883443, 2843221, 2846776, 2712577, 2742505, 2631053, 2598464, 2643129, 2658234, 2570976, 2458961, 2545563, 2532191, 2241785, 2623885, 2637009, 2406065, 2373196, 2434939, 2436778, 2170636, 2046949, 2008176, 2069987, 2303354, 2141077, 1912814, 2092433, 1971720, 1837389, 2035933, 1903098, 2014143, 2048529, 1985921, 2129512, 2087646, 1950543, 1873117, 1962084, 1827577, 1849769, 1777003]
3999A777003j3940m3566K25773j19671p1948R8752L1973o5537j42728J3718J7775
3988A707604j27755j144M2730p9273J16831J19738p5192l1206j0455j01763J36438
3977A696553j56014q8881O4715Q2108J20347j6987j38226j07707L1686r876P5059
3966A552777j07623r8880j3738J07251l4052J03845J18385J64258j8483j66870
3956A606870M6844p1644l6617m4485k78873k3546J28148N7439K7227j91841K50977
3945A470499Q62j66983n8951p4693J9908R4256N2366J01408k23745L9346l3084
3934A221189n9368m0001L0703J42321J38891k84252j51092P1504J1701j11030
3924I70566P8660J8500j78695Q8507L8601j08686p6842N3759p8601J98130J03350
$$ y = [1777003, 1763063, 1719497, 1945270, 1825599, 1753651, 1852403, 1884376, 1818839, 1676111, 1689829, 1707604, 1579849, 1578705, 1621435, 1542162, 1658993, 1778731, 1703539, 1672333, 1661878, 1560115, 1696553, 1540539, 1451658, 1516373, 1598481, 1718828, 1701841, 1563615, 1455908, 1487594, 1477718, 1552777, 1445154, 1346274, 1332536, 1439787, 1405735, 1509580, 1627965, 1792223, 1773740, 1606870, 1653714, 1582070, 1545453, 1500968, 1222095, 1198549, 1326697, 1384136, 1411363, 1219522, 1470499, 1471361, 1304378, 1245427, 1170734, 1190642, 1284898, 1337264, 1438672, 1214927, 1254273, 1221189, 1161821, 1121820, 1152523, 1294844, 1433735, 1149483, 998391, 1069895, 1081596, 970566, 1049226, 1067726, 889031, 977538, 1016139, 907453, 830611, 884370, 805769, 1003899, 1107249]
3913A107249p9797p8783j93308m4164n7016P9779P7460J99435j5856q2785L27534
3902A239748P7519j88701k0348J75019o812o4064j54631r3606J16885J11518N8455
3891A250982L7595j4463j1505K2648R5790P276l2180q6064j30460R2606P1943
3880A304168l2277L09630j60150O4466Q3385J95215J71823n4901J32242K85873
3870B299474R1385K85332K64867J48612j19916j98416l91360k42265L3110l43955
3860A826868j43384k25524r069J60732j9429k08300m7567J88132M1188k51465
3850A312182j98443Q941k03662m6989J97784p4510O4859p1888j15416K03862J02447
3839A179167r643j42562J67518J17756j35983q5019N4097N9748K077N1687m4221
$$ y = [1107249, 1027452, 948669, 755361, 711197, 654181, 733960, 811420, 1010855, 994999, 912214, 1239748, 1317267, 1128566, 1108218, 1283237, 1276425, 1212361, 1057730, 964124, 1081009, 1192527, 1250982, 1288577, 1274114, 1262609, 1285257, 1381047, 1388323, 1356143, 1270079, 1139619, 1232225, 1304168, 1271891, 1581521, 1421371, 1485837, 1569222, 1764437, 1936260, 1881359, 2013601, 2299474, 2390859, 2676191, 2941058, 3089670, 2969754, 2771338, 2379978, 2137713, 2170823, 1826868, 1683484, 1457960, 1448891, 1609623, 1590194, 1381894, 1334327, 1522459, 1563647, 1312182, 1113739, 1122680, 919018, 872029, 1069813, 995303, 1060162, 988274, 872858, 1076720, 1179167, 1169524, 1026962, 1194480, 1312236, 1176253, 1091234, 1145331, 1205079, 1207156, 1258843, 1214622]
3828A214622J6862J25404j31368k33581j43468K2409J29051n5656l7341o9223
3818H37711K34674J42718k09091p0151J37494J90455K0839J7606j86485L8189
3808A153959J5782N2045K11389o4889j47204k3888K20596o7115j69845N1579K18766
3797A451175J69283N1711o8916l5540J75945j75775l8832k7685j92557j08908
3787A199901j5988J74166J45796J26551p6821K0955k5123L1595j22529J7947J92710
3776A669160k75450M9384r4139M9564J33058N8848K2766L6980L3808l1286J55603
3765A808296J20746J54270k8400L2845n8856k69695j6756L32030M178j13351n8506
3754A906801o496q8280J967J53073M0608p2998R8392L5001j49948J2465L50857
$$ y = [1214622, 1231484, 1356888, 1225520, 991939, 848471, 870880, 999931, 944275, 906934, 837711, 1072385, 1215103, 1006012, 935861, 1073355, 1263810, 1284649, 1302255, 1115770, 1153959, 1169741, 1221786, 1433175, 1368286, 1221082, 1197194, 1417790, 1350675, 1180830, 1232409, 1451175, 1620458, 1672169, 1603253, 1567713, 1743658, 1567883, 1529051, 1501366, 1308809, 1199901, 1183913, 1358079, 1503875, 1630426, 1553605, 1574560, 1549437, 1581032, 1458503, 1476450, 1669160, 1393710, 1443094, 1348955, 1398519, 1531577, 1590425, 1613191, 1650171, 1683979, 1652693, 1808296, 1929042, 2083312, 2054912, 2087757, 2028901, 1759206, 1742450, 2074480, 2078658, 1965307, 1906801, 1900305, 1812025, 1813992, 1967065, 2007673, 1934675, 2033067, 2068068, 1918120, 1930585, 2281442]
3743B281442P8044l8726K59690J86123r3546K05990M9882r1102l7792K28505M30377
3732C458887J060J5788L9800m1679J95277L23057J65612J44993J84274J5606J97283
3721D699958K34184L28681K56725L80071M60174M85008M72976Q67895O72927R13913
3711I772512J129384J116750J045973J284033J718250K122738K424629L061915
3703B3676184L905828L930258K949135K92158l858695n663458m763140l679772
3695A6788498k615095k012262j536254j145808p45107o52522q01895n27574k50285
3686F501696m04223m03897l07710k07248j87059m1969l41893j3405l2319k86929
3676D275044k86214j05979k16772j87669J72059k40791j56934J69772j9023j41420
$$ y = [2281442, 2359486, 2320760, 2580450, 2766573, 2673027, 2879017, 2928899, 2837797, 2800005, 3028510, 3458887, 3459947, 3475735, 3515535, 3473856, 3669133, 3992190, 4157802, 4302795, 4487069, 4502675, 4699958, 4934142, 5262823, 5519548, 5899619, 6359793, 6844801, 7317777, 8185672, 8858599, 9772512, 10901896, 12018646, 13064619, 14348652, 16066902, 18189640, 20614269, 23676184, 27582012, 31512270, 34461405, 34753563, 30894868, 25231410, 20468270, 16788498, 14173403, 12161141, 10624887, 9479079, 8733972, 8081450, 7279555, 6751981, 6501696, 6097473, 5693576, 5385866, 5178618, 4991559, 4949590, 4607697, 4594292, 4561973, 4275044, 3988830, 3882851, 3666079, 3478410, 3650469, 3409678, 3252744, 3422516, 3403493, 3262073]
3666C262073k71743l5744P988j16006n7083j31511j08937N6363j52351J23992
3656B577041p8535J51200j72058n1447j8868J24783j57295L7197j28468k6459
3646B257091j4636k1493j03002N9094J33287j20655j59789M4258j8895o6838O4506
3635B052928j14502J9423K50515M5835j73837L9907j08735p8637J32333J36961
3625B202191k1415J00367n5559k38793j94892J7739J49077K00760r4714j41776
3615A922985N9690l2969n5841N9023Q9546k54284k63761J83490O6918p1697K2304
3604A725404K29882m7549o5652j24691J7343n4918L7845J76312N5148l6805k7733
3593A884586J53105p5696j93714J62788j61797Q6655J66985j30795p6049N8709
$$ y = [3262073, 2990330, 2954586, 2962574, 2846568, 2789485, 2657974, 2549037, 2605400, 2453049, 2577041, 2498506, 2649706, 2477648, 2426201, 2407333, 2532116, 2374821, 2412018, 2283550, 2257091, 2242455, 2220962, 2117960, 2177054, 2310341, 2189686, 2029897, 2074155, 2055260, 1988422, 2052928, 1938426, 1957849, 2208364, 2254199, 2080362, 2120269, 2011534, 1932897, 2065230, 2202191, 2180776, 2281143, 2225584, 1986791, 1791899, 1809638, 1958715, 2159475, 2064761, 1922985, 1982675, 1949706, 1893865, 1952888, 2042434, 1788150, 1524389, 1707879, 1774797, 1703100, 1725404, 1955286, 1907737, 1842085, 1717394, 1734737, 1679819, 1717664, 1893976, 1949124, 1912319, 1884586, 2037691, 1961995, 1768281, 1931069, 1769272, 1855927, 2022912, 1892117, 1816068, 1874777]
3583A874777j49879j1451l6266P4346j19948p0648l0676k25544l75L12661K63866
3572A880863Q4744j10762q8806j82683J38671K05032j15573P5459P1639j75408
3562A783176J78372l3177j83538J10035J27493l9698l05287m7541Q4724M3302
3552A717861L711K80729R0535j55191L0555J41406j03233k6777p58K5445j45380
3541A858903N8001J79213j74758l353J35912K2157M5203n0625K11726P4228r2370
3530B264237Q6772P864j21744k09084R7776J77833L6227k3812l9130r9964M1572
3519B218547K59528L67754K83589j40502o7195j3600r1386j53097k12000j37764
3509B313874r5887k8941R9220L1186j30611m5204k17576J38534k47717j47516
$$ y = [1874777, 1724898, 1713447, 1677181, 1751527, 1631579, 1560931, 1530255, 1304711, 1304336, 1616997, 1880863, 1965607, 1854845, 1766039, 1583356, 1722027, 1927059, 1811486, 1886945, 1958584, 1783176, 1961548, 1928371, 1744833, 1854868, 1982361, 1942663, 1637376, 1589835, 1674559, 1717861, 1721572, 2002301, 2092836, 1937645, 1968200, 2109606, 2006373, 1979596, 1978838, 2004283, 1858903, 1916904, 2096117, 1921359, 1918006, 2053918, 2076075, 2121278, 2070653, 2282379, 2356607, 2264237, 2351009, 2358873, 2237129, 2028045, 2125821, 2303654, 2339881, 2316069, 2276939, 2176975, 2218547, 2478075, 2845829, 3129418, 2988916, 2921721, 2908121, 2816735, 2663638, 2451638, 2313874, 2217987, 2189046, 2288266, 2319452, 2188841, 2143637, 1926061, 2064595, 1816878, 1669362]
3499A669362L88856m8310O4148J037n0772r691j39217O2094r3421R8168J82419
3488B124673j32699m8717J01921l6161k1263K57443k7351R249l43144J36468K31537
3477B251956k23437l1849J6475K6688j4826N0887l3199q7604M0108l0565j00005
3466A864629o0827K34570J53513J05159L9528l31892j29503P3764P2109J0909
3456B031959k8877j02302j256o2857K089J9848O8304J45581N7649l4168O4089
3445B160059j09582J0214P6368J8648N8472j09591N6219p7963m1476L13659j738
3434B353289k37060J5849K57007q6131j24294m9111L7018M1062J40835q72j82017
3423B165575k9443L15570J282j92004K97723j06414r1238J27496L4942k984p0561
$$ y = [1669362, 2058218, 2009908, 2074056, 2075093, 2024321, 2014630, 1875413, 1937507, 1844086, 1942254, 2124673, 1991974, 1943257, 2045178, 2009017, 1987754, 2245197, 2217846, 2227095, 1883951, 2020419, 2251956, 2028519, 1996670, 2013145, 2039833, 2025007, 2075894, 2042695, 1955091, 1995199, 1964634, 1864629, 1803802, 2038372, 2191885, 2297044, 2336572, 2004680, 1875177, 1948941, 2021050, 2031959, 2003082, 1900780, 1899524, 1836667, 1838756, 1858604, 1926908, 2072489, 2130138, 2095970, 2160059, 2050477, 2060691, 2137059, 2155707, 2214179, 2104588, 2160807, 2082844, 2041368, 2355027, 2353289, 2116229, 2132078, 2389085, 2302954, 2178660, 2129549, 2166567, 2207629, 2348464, 2347592, 2165575, 2136132, 2451702, 2452984, 2260980, 2558703, 2452289, 2361051, 2488547, 2523489, 2520505, 2449944]
3412B449944Q2316J34170r2882O3347J92561K70019p2339l5753P800K71167K22849
3401C493199K57634L8296J08275L4480J50722k21249l81920j9171j29112r5085
3391C236069j56188j15157J63996l3040n8593J27117J11581k92519J6159L46303
3381C345728K74r2676j86581l2452J72253J52436k947J5144J02397k58319r4810
3370C120447J00161K0518K3550j31845J7680K33340p5941m6328j125K24997K6938
3359C512392J01637R9485Q7357Q8944m547K55709j594r8424J9441K2305o642J02470
3347D178533J2391J96005Q3623j7414j50310J54022J03406P2733J79965L48659
3337E161613P5355Q3649l0423K36661R0251n7102r5901p6938J80892L91332r6635
$$ y = [2449944, 2532260, 2666430, 2573548, 2636895, 2829456, 3099475, 3027136, 2991383, 2999183, 3270350, 3493199, 3750833, 3789129, 3897404, 3931884, 4082606, 3861357, 3479437, 3460266, 3331154, 3236069, 3079881, 2964724, 3128720, 3095680, 3037087, 3164204, 3275785, 2983266, 2999425, 3345728, 3346002, 3253326, 3066745, 3034293, 3206546, 3358982, 3356035, 3371179, 3473576, 3215257, 3120447, 3220608, 3241126, 3264676, 3132831, 3150511, 3383851, 3307910, 3261582, 3260457, 3485454, 3512392, 3614029, 3713514, 3800871, 3889815, 3885268, 4140977, 4139383, 4040959, 4060400, 4082705, 4076063, 4178533, 4190924, 4386929, 4470552, 4453138, 4302828, 4456850, 4560256, 4632989, 4812954, 5161613, 5236968, 5320617, 5290194, 5526855, 5617106, 5560004, 5464103, 5387165, 5568057, 5959389, 5862754]
3326E862754J28331P0648K29386j3841j04016J30112j4140Q2216Q0327k0304J99834
3315F631307J27944K15910J43528Q8729l0481N2048L21093L77162K86704P2159
3305H286103J70332M86133J19825P8835K19342J21214J53814L61196K73477q8394
3295A0181877J4458R1533K05519R9353J54175N9894L8359L80620K23104M9036
3285A1497928K62098M27149K96856K05194L89153K89854L06964J99621M05702
3276A4280519L31450M35179M08346L12455M73068O26714M48812O03374O40608
3267A8560525Q10818N11355N80383R07559R89789Q99598J133744J231745R15002
3258B6540518R99931J065093J004219Q23323N33170N93581M991j1529M6531m9774
$$ y = [5862754, 5991085, 6061733, 6291119, 6277278, 6173262, 6303374, 6289234, 6371450, 6451777, 6431473, 6631307, 6759251, 6975161, 7118689, 7207418, 7176937, 7228985, 7550078, 7927240, 8213944, 8286103, 8456435, 8942568, 9062393, 9141228, 9360570, 9481784, 9635598, 9996794, 10270271, 10181877, 10196335, 10287868, 10493387, 10592740, 10746915, 10806809, 10845168, 11225788, 11448892, 11497928, 11760026, 12187175, 12484031, 12689225, 13078378, 13368232, 13675196, 13874817, 14280519, 14611969, 15047148, 15455494, 15767949, 16241017, 16867731, 17316543, 17919917, 18560525, 19371343, 19882698, 20463081, 21370640, 22360429, 23260027, 24393771, 25625516, 26540518, 27540449, 28605542, 29609761, 30433084, 30966254, 31559835, 31564826, 31553297, 31599828, 31550054]
3248C1550054j54579n4169l8706k37001p42408r31490j315294j519533j290115
3239B5266759j418293j153045j140410r61681r59939j044019q13823o77492p24666
3230A6373391p22556m29815m81563o57437l05578l87500p01015n73538J6073L460
3220A2133922o25280l47048k77000m26606j56755k19862k32908j76001k66333
3211I406129o5272k68106j00774k64532k32754j47809n1161M958r9446n3638k27282
3200G900313k68543j02160l2371j39524l19143l52153k36877K96396J00385m30672
3190F415651p0362j78440J45951L6054l02254j28137q053j45240j90947j21260
3180E452963J17207o8860j80086k61699O3784M6907k2321K7774j59066k06242
$$ y = [31550054, 31395475, 31341306, 31302600, 31065599, 30323191, 29391701, 28076407, 26556874, 25266759, 23848466, 22695421, 21555011, 20593330, 19633391, 18589372, 17775549, 17098057, 16373391, 15650835, 15221020, 14739457, 14082020, 13776442, 13388942, 12687927, 12114389, 12130462, 12133922, 11508642, 11161594, 10884594, 10457988, 10301233, 10081371, 9848463, 9672462, 9406129, 9340857, 9072751, 8971977, 8707445, 8474691, 8326882, 8275721, 8280679, 8181233, 8127595, 7900313, 7631770, 7529610, 7497239, 7357715, 7038572, 6686419, 6449542, 6745938, 6846323, 6415651, 6345289, 6166849, 6312800, 6348854, 6046600, 5918463, 5910410, 5765170, 5574223, 5452963, 5570170, 5501310, 5321224, 5059525, 5123309, 5170216, 5147895, 5175669, 5016603, 4810361]
3170D810361P0285q3885j38371R4631K2791r9192j05869L1115r9422m351k45459
3159D252634J18471M6477k78571L1266p7181j48382m5171k6335k3688L5353j30474
3148C754399M0863n5402j6436j80651O020J90159J67978k77666k69835J0624q2290
3137C287763l6996j76422J59074J54503p3928j42091K5937K0469p3590J10457
3127C255176L0344j402R3866n1649j25359k60769L8713R297n470J09003p0890
3116C020860k25834n0068o3045K3240J57986r263j7371l0333K8545m4200O1124
3105B851641r4428J87055j35298N0978j21027j37700J67309M7209j85826j22037
3095B507876m6097k2486j02918k827J33692O8626J8919K6704J37581j31543K8178
$$ y = [4810361, 4880646, 4796761, 4658390, 4753021, 4775812, 4676620, 4570751, 4601866, 4502444, 4498093, 4252634, 4371105, 4417582, 4139011, 4170277, 4093096, 3944714, 3899543, 3873208, 3849520, 3884873, 3754399, 3795262, 3739860, 3723424, 3542773, 3548793, 3738952, 3906930, 3629264, 3359429, 3370053, 3287763, 3250767, 3074345, 3233419, 3387922, 3313994, 3171903, 3197840, 3218309, 3144719, 3255176, 3285520, 3284118, 3377984, 3326335, 3200976, 2940207, 2978920, 2988217, 2982747, 3091750, 3020860, 2795026, 2744958, 2681913, 2705153, 2863139, 2853876, 2836505, 2806172, 2834717, 2790517, 2851641, 2757213, 2944268, 2808970, 2859948, 2738921, 2601221, 2768530, 2815739, 2629913, 2507876, 2461779, 2439293, 2336375, 2333548, 2467240, 2535866, 2554785, 2581489, 2719070, 2587527, 2615705]
3084B615705l1433r7755q7826k3135O0822O2332r4815N4903N2020l3699O107J9150
3072B502376R5504K5754j73265p0354K16311p1752P861j00338l9661l4520m7026
3061B310890J71757r2406M8641j50133J11461J39599r6421j7753k01185K3275
3051B247725J26073J4020k677J8788J39344k55210N9969J68175K6877j2865n4263
3040B475956j0240q7013j65840P1485k0721j09805O0860L51426O8000j44036J47138
3029B637210j6250j33658J59592K29368k09406l7724N4112O6288m2622J57731
3019B864641J18779j19001P4786J06286O4178L0551j1560J07242J2122j09727
3009C138297j608J63153J00326o7899J56913J07664K20992J41808N4264j41841
$$ y = [2615705, 2584272, 2486517, 2398691, 2375556, 2436378, 2498710, 2403895, 2458798, 2510818, 2477119, 2483226, 2502376, 2597880, 2623634, 2450369, 2380015, 2596326, 2524574, 2532435, 2432097, 2392436, 2357916, 2310890, 2482647, 2390241, 2438882, 2288749, 2400210, 2539809, 2443388, 2425635, 2224450, 2247725, 2373798, 2387818, 2385141, 2403929, 2543273, 2288063, 2348032, 2516207, 2543084, 2530219, 2475956, 2465716, 2378703, 2212863, 2284348, 2263627, 2153822, 2214682, 2566108, 2634108, 2490072, 2637210, 2620960, 2487302, 2646894, 2876262, 2666856, 2629132, 2683244, 2749532, 2706910, 2864641, 2983420, 2864419, 2939205, 3045491, 3109669, 3140220, 3128660, 3235902, 3248024, 3138297, 3136689, 3299842, 3400168, 3332269, 3489182, 3596846, 3817838, 3959646, 4013910, 3872069]
2999C872069J95815N5902K7063j60028j28865K29672J88622L1654j87248r8627
2989D026029R9291q8066J45268R4769M2932k3969J67707J55138q1541J77519j26157
2978D588920J77434J57660J64922j41281K50809J08055j04106K29492K81147J55200
2968E868252Q9460N42582O9266j34816M7639o9474l7235J14103k3083K4967j30798
2957F360863K2419J60861K40231J2543J06713J7023l5549J08540J6937J28641
2947G139222J20841M33857K82394L98433K20358L07363M35923L27855N70654L64927
2937A0601827J86268M59832L01211L33068K95107J81979M5625n415Q5617K9715
2927A2514834l1626K32490R41L0260j98673K1349J47359P8622K94198L59455L816
$$ y = [3872069, 4067884, 4123786, 4150849, 3990821, 3861956, 4091628, 4280250, 4311904, 4124656, 4026029, 4125320, 4037254, 4182522, 4277291, 4320223, 4296254, 4463961, 4619099, 4537558, 4715077, 4588920, 4766354, 4924014, 5088936, 4947655, 5198464, 5306519, 5202413, 5431905, 5713052, 5868252, 5957712, 6500294, 6569560, 6434744, 6482383, 6412909, 6375674, 6489777, 6466694, 6491661, 6360863, 6383282, 6544143, 6784374, 6796917, 6903630, 6920653, 6885104, 6993644, 7010581, 7139222, 7260063, 7693920, 7976314, 8374747, 8595105, 8902468, 9338391, 9666246, 10236900, 10601827, 10788095, 11247927, 11549138, 11882206, 12177313, 12359292, 12404917, 12399502, 12485119, 12514834, 12483208, 12715698, 12716639, 12746899, 12548226, 12569575, 12716934, 12795556, 13089754, 13449209, 13453025]
2916A3453025K30769L57423N15659O42388L67572L48858Q67320R15379J123236
2907A8821629J300916J054328N05493q06051j216080j211342j354001q78639p96297
2898A5419956q53130p38161m79338k64065k71266j46571k88988l20829j48398
2889A1909210O2379n3991J76692K20302J94424J1542J13875K39144l8445o0672
2879A2774460J78982K48934J90869K4580j61630j85108m61052n16430m98777n09551
2869A1085277n24692n43157l24833m54654l52768m01863l69075p4585j70235j75811
2859G693604p830q8270o8079k85107r6339j59636j71302j35518j96453k02170
2849F282900k7800k17291l29799j05693k55938j78969j07980j82756j47745k67504
$$ y = [13453025, 13683794, 14041217, 14556876, 15199264, 15566836, 15915694, 16783014, 17698393, 18821629, 20122545, 21176873, 21682366, 20876315, 19660235, 18448893, 17094892, 16216253, 15419956, 14566826, 13828665, 13349327, 13085262, 12813996, 12667425, 12378437, 12057608, 11909210, 11971589, 11917598, 12094290, 12314592, 12509016, 12520558, 12634433, 12873577, 12835132, 12774460, 12953442, 13202376, 13393245, 13417825, 13256195, 13071087, 12610035, 12093605, 11594828, 11085277, 10560585, 10017428, 9692595, 9237941, 8885173, 8483310, 8114235, 8039650, 7869415, 7693604, 7685774, 7597504, 7529425, 7244318, 7147979, 6988343, 6817041, 6681523, 6485070, 6282900, 6255100, 6037809, 5708010, 5602317, 5346379, 5167410, 5059430, 4876674, 4728929, 4461425]
2839D461425j66065k48036j70114L7989j1421o2593J3354J26544K63204j84073
2829D060214m87996q1962J8497L0719k49162j82048M426j35101M2532r3173K8453
2818B955399k7062N7211l509j93304j73557r9446J31142N9421j67173q3996Q0792
2807B535918n1344q9682j49783J4835q1201l8345m8136N7799n330j64134K33512
2796B214109l0039k06634j8447j03318J46661O1446k59656n7482J79812j8433
2786A908019j92909J49470o9674J7540q4363j45282j20551j13678R2769j23356
2776A317985K16939j42673p9888R3591Q9394j06884j47466l1523q1754J65996
2766A293717j62504M8231R4417l2326l1628q0743r8229j34645l499K89053n6127
$$ y = [4461425, 4295360, 4047324, 3877210, 3915199, 3903778, 3841185, 3854539, 3981083, 4244287, 4060214, 3572218, 3490256, 3508753, 3539472, 3290310, 3108262, 3112688, 2977587, 3020119, 2926946, 2955399, 2928337, 2985548, 2982039, 2788735, 2615178, 2515732, 2646874, 2706295, 2539122, 2455126, 2535918, 2484574, 2394892, 2245109, 2259944, 2178743, 2140398, 2092262, 2150061, 2144731, 1980597, 2214109, 2184070, 1977436, 1958989, 1855671, 2002332, 2063778, 1804122, 1746640, 1926452, 1908019, 1715110, 1864580, 1794906, 1812446, 1728083, 1582801, 1462250, 1348572, 1441341, 1317985, 1534924, 1392251, 1312363, 1405954, 1495348, 1388464, 1240998, 1209475, 1127721, 1293717, 1131213, 1179444, 1273861, 1241535, 1209907, 1129164, 1030935, 896290, 892791, 1181844, 1125717]
2755A125717p3209K73100r6972k92658j26808M2616L4642K2258j10181O3214o2150
2744G99569J36866m467J03392R7469o7613k17555q792K94442j16267l66010J73727
2733H24761L4843q13P2455L5519k88298M149K8949j07854P2464j0015J21111L291
2721G90562l1374j56785O4236k3194q0899M4694j6265k6723k1274m2327K11695
2710G12346q3971j47909J05553o4312j02545K1669l9490Q8580j4480N5130p3359
2699D57212P1831Q6753k29535K1350J46759j03539K27185J10323j3224o2295k07995
2688E04825J06875P7153O0823k8885j80943j66584Q7497M314j42622j71194J40197
2677B91456J58177m8952J16170J67157o2145j23435p6765o8366j4214M7944k1002
$$ y = [1125717, 1052508, 1325608, 1228636, 935978, 809170, 851786, 886428, 908686, 798505, 861719, 799569, 936435, 931968, 1035360, 1132829, 1065216, 847661, 838869, 1133311, 1017044, 651034, 824761, 859604, 858791, 931246, 966765, 678467, 682616, 711565, 603711, 676175, 666160, 787271, 790562, 759188, 602403, 666639, 643445, 562546, 607240, 590975, 564252, 542978, 500651, 712346, 628375, 480466, 586019, 521707, 419162, 440831, 401341, 489921, 475441, 530571, 457212, 529043, 615796, 386261, 407611, 554370, 450831, 678016, 788339, 775115, 712820, 504825, 611700, 688853, 749676, 720791, 539848, 373264, 460761, 465075, 322453, 151259, 291456, 449633, 400681, 516851, 684008, 621863, 498428, 421663, 353297, 339083, 387027, 366025]
2666C66025J12473q063J78661k8981R941m2359k22490Q0921n9379l3820J0608
2655C63537J48415M9625j4324R0618N7490o3343P3376J0679n1434l152R5827N6647
2643H13961L9182o8880k3464J5050N7001n7211n0552m6684k3478J31868M2670
$$ y = [366025, 478498, 470435, 649096, 620115, 630056, 587697, 365207, 446128, 386749, 352929, 363537, 511952, 561577, 547253, 637871, 695361, 632018, 705394, 716073, 664639, 661487, 757314, 813961, 853143, 784263, 760799, 775849, 832850, 775639, 725087, 678403, 654925, 786793, 829463]
$$ [...]
##END NTUPLES=NMR SPECTRUM
##END=
