##TITLE=1H_EC-3275(1)
 CDCl3
 8 sc, 
 3.06.2022
##JCAMPDX= 6.0         $$ Bruker NMR JCAMP-DX V2.0
##DATA TYPE= NMR SPECTRUM
##DATA CLASS= NTUPLES
##ORIGIN= UXNMR, Bruker Analytische Messtechnik GmbH
##OWNER= root
$$ XWIN-NMR		Version 3.5
$$ Fri Jun  3 14:11:53 2022 Russian Standard Time (UT+4h)  she@DPX200
##.OBSERVE FREQUENCY= 200.13135
##.OBSERVE NUCLEUS= ^1H
##.ACQUISITION MODE= SIMULTANEOUS
##.ACQUISITION SCHEME= undefined
##.AVERAGES= 8
##.DIGITISER RES= 18
##SPECTROMETER/DATA SYSTEM= spect
##.PULSE SEQUENCE= zg30
##.SOLVENT NAME= CDCl3
##.SHIFT REFERENCE= (INTERNAL, CDCl3, 0, 15.7337)
##AUDIT TRAIL= $$ (NUMBER, WHEN, WHO, WHERE, WHAT)
$$ ##TITLE= Audit trail, XWIN-NMR		Version 3.5
$$ ##JCAMPDX= 5.01
$$ ##ORIGIN= Bruker BioSpin GmbH
$$ ##OWNER= she
$$ F:/spectra/data/she/nmr/H-F/1/pdata/1/auditp.txt
$$ ##AUDIT TRAIL=  $$ (NUMBER, WHEN, WHO, WHERE, WHAT)
(   1,<2022-06-03 14:10:42.46 +0400>,<she>,<DPX200>,
      <created by zg, POWCHK disabled, PULCHK disabled
       configuration hash MD5:
       00 E9 B6 7A A2 85 ED C7 34 08 36 98 17 FE 4E 26
       data hash MD5: 16K
       91 42 86 5B 52 FA DE CD 87 D3 C4 54 1A AA 38 95>)
(   2,<2022-06-03 14:10:45.12 +0400>,<she>,<DPX200>,
      <Start of raw data processing
       efp BC_mod = 2 LB = 0.24 FT_mod = 6 PKNL = 1 PHC0 = -18051.98 PHC1 = 11.60074 SI = 16K 
       data hash MD5: 16K
       3D AC 63 91 D9 9E 7C 8D 51 FC 63 4C 24 68 1C 94>)
(   3,<2022-06-03 14:11:05.90 +0400>,<she>,<DPX200>,
      <pk PHC0 = -0.1184236 PHC1 = 0 
       data hash MD5: 16K
       EB AB E0 E7 DF 8C FA C1 B5 C9 74 F0 C6 A9 3D 9D>)
(   4,<2022-06-03 14:11:09.76 +0400>,<she>,<DPX200>,
      <abs ABSG = 5 
       data hash MD5: 16K
       A8 F3 0B 99 9E B1 3D F6 08 70 5D FB 58 4D 74 A6>)
$$ ##END=
$$ 
$$ hash MD5
$$ 93 0F 85 08 AD ED 2B 7C 74 0D F7 DC DF B3 16 C4
##$RELAX= 
##$RELAX= 
##$RELAX= 
##$RELAX= 
##$RELAX= 
##$RELAX= 
$$ Bruker specific parameters
$$ --------------------------
##$DU= <F:/spectra>
##$EXPNO= 1
##$NAME= <H-F>
##$PROCNO= 1
##$TYPE= <nmr>
##$USER= <she>
##$AMP= (0..31)
100 100 100 100 100 100 100 100 100 100 100 100 100 100 100 100 100 100 
100 100 100 100 100 100 100 100 100 100 100 100 100 100 
##$AQSEQ= 0
##$AQ_mod= 1
##$AUNM= <au_zg>
##$AUTOPOS= <>
##$BF1= 200.13
##$BF2= 200.13
##$BF3= 200.13
##$BF4= 200.13
##$BF5= 200.13
##$BF6= 200.13
##$BF7= 200.13
##$BF8= 200.13
##$BYTORDA= 1
##$CFDGTYP= 0
##$CFRGTYP= 5
##$CHEMSTR= <none>
##$CNST= (0..31)
1 1 145 1 1 1 1 1 1 1 1 1 1 1 1 1 1 1 1 1 1 1 1 1 1 1 1 1 1 1 1 1 
##$CPDPRG= <>
##$CPDPRG1= <>
##$CPDPRG2= <>
##$CPDPRG3= <>
##$CPDPRG4= <mlev>
##$CPDPRG5= <mlev>
##$CPDPRG6= <mlev>
##$CPDPRG7= <mlev>
##$CPDPRG8= <mlev>
##$CPDPRGB= <>
##$CPDPRGT= <>
##$D= (0..31)
0 1.2 0 0 0 0 0 0 0 0.06 0 0.03 0 0 0 0 0.0002 0 0 0 0 0 0 0 0 0 0 0 0 
0 0 0 
##$DATE= 1654251041
##$DBL= (0..7)
120 120 120 120 120 120 120 120 
##$DBP= (0..7)
150 150 150 150 150 150 150 150 
##$DBP07= 0
##$DBPNAM0= <>
##$DBPNAM1= <>
##$DBPNAM2= <>
##$DBPNAM3= <>
##$DBPNAM4= <>
$$ [...]
##$SUBNAM2= <"">
##$SUBNAM3= <"">
##$SUBNAM4= <"">
##$SUBNAM5= <"">
##$SUBNAM6= <"">
##$SUBNAM7= <"">
##$SUBNAM8= <"">
##$SUBNAM9= <"">
##$SW= 18.05172834244
##$SWIBOX= (0..15)
0 0 2 0 0 0 0 0 0 0 0 0 0 0 0 0 
##$SW_h= 3612.71676300578
##$TD= 16384
##$TD0= 1
##$TE= 0
##$TE2= 300
##$TE3= 300
##$TEG= 300
##$TL= (0..7)
0 120 120 120 120 120 120 120 
##$TP= (0..7)
150 150 150 150 150 150 150 150 
##$TP07= 0
##$TPNAME0= <>
##$TPNAME1= <>
##$TPNAME2= <>
##$TPNAME3= <>
##$TPNAME4= <>
##$TPNAME5= <>
##$TPNAME6= <>
##$TPNAME7= <>
##$TPOAL= (0..7)
0.5 0.5 0.5 0.5 0.5 0.5 0.5 0.5 
##$TPOFFS= (0..7)
0 0 0 0 0 0 0 0 
##$TUNHIN= 0
##$TUNHOUT= 0
##$TUNXOUT= 0
##$USERA1= <user>
##$USERA2= <user>
##$USERA3= <user>
##$USERA4= <user>
##$USERA5= <user>
##$V9= 5
##$VALIST= <valist>
##$VCLIST= <CCCCCCCCCCCCCCC>
##$VD= 0
##$VDLIST= <DDDDDDDDDDDDDDD>
##$VPLIST= <PPPPPPPPPPPPPPP>
##$VTLIST= <TTTTTTTTTTTTTTT>
##$WBST= 1024
##$WBSW= 4
##$XGAIN= (0..3)
0 0 0 0 
##$XL= 0
##$YL= 0
##$YMAX_a= 59984
##$YMIN_a= -132050
##$ZGOPTNS= <>
##$ZL1= 120
##$ZL2= 120
##$ZL3= 120
##$ZL4= 120
##$ABSF1= 15.74028
##$ABSF2= -2.311569
##$ABSG= 5
##$ABSL= 3
##$ALPHA= 0
##$AQORDER= 0
##$ASSFAC= 0
##$ASSFACI= 0
##$ASSFACX= 0
##$ASSWID= 0
##$AUNMP= <proc_1d>
##$AZFE= 0.1
##$AZFW= 0.1
##$BCFW= 0
##$BC_mod= 2
##$BYTORDP= 0
##$COROFFS= 0
##$CY= -3
##$DATMOD= 1
##$DC= 0
##$DFILT= <>
##$DTYPP= 0
##$F1P= 0
##$F2P= 0
##$FCOR= 1
##$FTSIZE= 16384
##$FT_mod= 6
##$GAMMA= 0
##$GB= 0
##$INTBC= 1
##$INTSCL= 0
##$ISEN= 128
##$LB= 0.24
##$LEV0= 0
##$LPBIN= 0
##$MAXI= 10000
##$MC2= 0
##$MEAN= 0
##$ME_mod= 0
##$MI= 1.114404
##$NCOEF= 0
##$NC_proc= -7
##$NLEV= 6
##$NOISF1= 3.799351
##$NOISF2= 2.8
##$NSP= 0
##$NTH_PI= 0
##$NZP= 0
##$OFFSET= 15.73367
##$PC= 1
##$PHC0= -18052.1
##$PHC1= 11.60074
##$PH_mod= 1
##$PKNL= yes
##$PPARMOD= 0
##$PSCAL= 0
##$PSIGN= 0
##$REVERSE= no
##$SF= 200.130007580004
##$SI= 16384
##$SIGF1= 3
##$SIGF2= 2
##$SINO= 5.538805
##$SIOLD= 16384
##$SREGLST= <1H.CDCl3>
##$SSB= 0
##$STSI= 16384
##$STSR= 0
##$SW_p= 3612.71676300578
##$SYMM= 0
##$S_DEV= 0
##$TDeff= 16384
##$TDoff= 0
##$TI= <>
##$TILT= no
##$TM1= 0
##$TM2= 0
##$TOPLEV= 0
##$USERP1= <user>
##$USERP2= <user>
##$USERP3= <user>
##$USERP4= <user>
##$USERP5= <user>
##$WDW= 1
##$XDIM= 16384
##$YMAX_p= 295126650
##$YMIN_p= -1060126
$$ End of Bruker specific parameters
$$ ---------------------------------
##NTUPLES= NMR SPECTRUM
##VAR_NAME=  FREQUENCY,     SPECTRUM/REAL,   SPECTRUM/IMAG
##SYMBOL=    X,             R,               I
##VAR_TYPE=  INDEPENDENT,   DEPENDENT,       DEPENDENT
##VAR_FORM=  AFFN,          ASDF,            ASDF
##VAR_DIM=   16384,         16384,           16384
##UNITS=     HZ,            ARBITRARY UNITS, ARBITRARY UNITS
##FACTOR=    0.220516191357247, 1,           1
##FIRST=     3148.77954332783, 0,            0
##LAST=      -463.937219677954, 0,           0
##MIN=       -463.937219677954, -1060126,    0
##MAX=       3148.77954332783, 295126650,    0
$$ Real data points
##PAGE= N=1
##DATA TABLE= (X++(R..R)), XYDATA
$$ [...]
7121I936640O81547P78270R62573Q33265J021225J252616J534321J745344J775449
$$ 9936640 10618187 11396457 12359030 13192295 14213520 15466136 17000457 18745801 20521250
7112B0521250K078363K219598K876180L303715L870671M853556O551710Q267737
$$ 20521250 22599613 24819211 27695391 30999106 34869777 39723333 46275043 54542780
7104E4542780R426205Q924694N792489m39342o581328j0831820j1828931r904350
$$ 54542780 63968985 72893679 78686168 78246826 71665498 60833678 49004747 39100397
7096C9100397p823591n399889l831760k962466k093747j747795j564332j037064
$$ 39100397 31276806 25876917 22045157 19082691 16988944 15241149 13676817 12639753
7088A2639753r68319r22744q55329o34316p98615o94085l39832l62696m81025
$$ 12639753 11671434 10748690 9893361 9259045 8460430 7766345 7426513 7063817 6582792
7079F582792l82230k92847k83937m4787j91839l16974l64192O7776k9311k88656
$$ 6582792 6200562 5907715 5623778 5578991 5387152 5070178 4705986 4773762 4744451 4455795
7069D455795l17334j19207k48005r2123k00811k52731j58847k2209j45591m9853
$$ 4455795 4138461 4019254 3771249 3679126 3478315 3225584 3066737 3044528 2898937 2849084
7059B849084p0572j69800j32800j97895j2523K4663j0457N89k21241p5853q8541
$$ 2849084 2778512 2608712 2475912 2278017 2265494 2290157 2279700 2280289 2059048 1983195 1894654
7048A894654j35826N8021J203j93122j36983J43891j64390j34385L4453r3398
$$ 1894654 1758828 1816849 1818052 1624930 1487947 1631838 1467448 1333063 1367516 1274118
7038A274118j13672R8834J0419j95262L1832m9083K3296J76355n9962n0150j07601
$$ 1274118 1160446 1259280 1269699 1074437 1106269 1057186 1080482 1256837 1196875 1146725 1039124
7027A039124M8593j51660n4099L5103n5747m8644o2834p686J38867n2600O52j69485
$$ 1039124 1087717 936057 881958 917061 861314 812670 749836 742150 881017 828417 829069 659584
7015F59584j09620R2531K1928K7139R3720j82300j39682J82342K0697n7177J13350
$$ 659584 549964 642495 664423 691562 785282 602982 463300 645642 666339 609162 722512
7004G22512j00424q8998M9628K8681J54692k20263r2976l8047k8494o66m4597
$$ 722512 622088 533090 582718 611399 766091 545828 452852 414805 386311 385645 341048
6993C41048K176K82149j23188p9692q5909K3384R7228o3854o3794l4373M2764
$$ 341048 343224 625373 502185 422493 336584 359968 457196 393342 329548 295175 337939
6982C37939j30356q2535j32893K52067J28695k9782P5827o5187J34787K7687j2040
$$ 337939 207583 125048 -7845 244222 372917 343135 418962 353775 488562 516249 504209
6971E04209m4264k17770J1553K6159j3772j01498K44171K4939k07098N258M03
$$ 504209 459945 242175 253728 279887 266115 164617 408788 433727 226629 231887 232290
6960B32290m7849m2422N2720O1987J2356q4332O1063q3383O2320m8812o973K6097
$$ 232290 184441 142019 194739 256726 269082 184750 245813 162430 224750 175938 168965 195062
6948A95062j21448O3023l6325j7926J65619N8792r9883P874n0621J45791j56406
$$ 195062 73614 136637 100312 82386 248005 306797 206914 214788 164167 309958 153552
6937A53552n152n7726m0208Q7619j3866N0480O4242p2463k1824K75932m8706r6102
$$ 153552 148400 90674 50466 138085 124219 174699 238941 166478 144654 420586 371880 275778
6925B75778R0447r4498J96271k9438k7444r6103j97566j45974K0498N8910l0245
$$ 275778 366225 271727 467998 438560 411116 315013 117447 -28527 -8029 50881 20636
6914B0636P2845Q5826q704j44203N8814l6974K9867q8359J05030j9074L5574j0559
$$ 20636 93481 179307 170603 26400 85214 48240 78107 -10252 94778 75704 111278 100719
6902A00719J23725l0482K6699R0274P4822p9595K1227m0219m1031m2915j40382
$$ 100719 224444 193962 220661 310935 385757 306162 327389 287170 246139 203224 62842
6891F2842l3071J17514m960l8499P1131j80794J92627k0641m0765L2799m1842
$$ 62842 29771 147285 142325 103826 174957 -5837 186790 166149 125384 158183 116341
6880A16341K0239n9430R7765n3082J0296J11854j19759K2895n5420P0391J83422
$$ 116341 136580 77150 174915 121833 132129 243983 124224 147119 91699 162090 345512
6869C45512p672j87095l0930m3997J35634J85177n3321p2121J27504j7794p3820
$$ 345512 337840 150745 119815 75818 211452 396629 343308 271187 398691 380897 307077
6858C07077n7654n8972n230j15282m9664j61295J49625P3281P7730J6865l3164
$$ 307077 249423 190451 185221 69939 20275 -141020 8605 81886 159616 176481 143317
6847A43317J88504M8298j03375q6934q2075M3228O040m7726K6272J26198R2565
$$ 143317 331821 380119 276744 189810 107735 150963 157003 109277 135549 261747 354312
6836C54312m1145r7491j00801L5220Q816k9111J51922j53230j78757J82935M3925
$$ 354312 313167 215676 114875 150095 158911 129800 281722 128492 -50265 132670 176595
6825A76595q3309j24495R0994J3194m7179l245R0255J31566P2459j34079Q4113
$$ 176595 93286 -31209 59785 72979 25800 22555 112810 244376 316835 182756 266869
6814B66869J06670R105M2897k9737j97340L0085j525O4303j24778j43460L762
$$ 266869 373539 382644 425541 395804 198464 228549 227024 291327 166549 23089 26851
6803B6851p0733l8270J99986J09095J33634R3583m0373j62691k7859n4177m3615
$$ 26851 -43882 -82152 117834 226929 360563 454146 413773 251082 223223 169046 125431
6792A25431J76711j85773K3496J11429M4028p4423p037p7193n7862r154r5435
$$ 125431 302142 116369 139865 251294 295322 220899 213862 136669 78807 69653 -25782
6781b5782K8199r457M8401K681L0140j3020p9217J0444p187J31696j85942K7579
$$ -25782 2417 -7040 41361 44042 74182 61162 -18055 -7611 -14798 116898 -69044 -41465
6769d1465J29217j32787r4984k795N6489J44651m8687n2622K5787m3792o8374
$$ -41465 87752 -45035 -140019 -142814 -86325 58326 9639 -42983 -17196 -60988 -129362
6758a29362J18391r333r5347r5610K1453J19325J01070M537M5672r1023P0790
$$ -129362 -10971 -20304 -115651 -211261 -189808 -70483 30587 35124 80796 -10227 60563
6747F0563J5036j06431L0329J51978P9528j54167j53467o7884p760N6916N1367
$$ 60563 75599 -30832 -503 151475 231003 76836 -76631 -144515 -152275 -95359 -43992
6736d3992P3483J07335j34444q8385O0823m8149J1317P2700K4998K3942j6456
$$ -43992 29491 136826 2382 -86003 -25180 -73329 -62012 10688 35686 59628 43172
6725D3172m8683j79429l8178J33650L0688J52453K0809j48647M1685K33408m0535
$$ 43172 -5511 -184940 -223118 -89468 -58780 93673 114482 -34165 7520 240928 200393
6714B00393j21549n0025L4519K03134P8805j42123k0683k9525K9217J03943K3508
$$ 200393 78844 28819 63338 266472 345277 203154 182471 152946 182163 286106 309614
6703C09614N4835L0311J11743j44693O0557O809l0316j42363j9064j62820n1856
$$ 309614 364449 394760 506503 361810 422367 429176 398860 256497 237433 74613 22757
6692B2757m2067j04722K69226J75413j14878j61969K43027k5550j68512o0966
$$ 22757 -19310 -124032 145194 320607 205729 43760 286787 261237 92725 31759
6682C1759L9606J4022j4426k1013K8308K9030k2411P0496m5120P814O0219k32199
$$ 31759 71365 85387 70961 49948 78256 107286 84875 155371 110251 118065 178284 -53915
6670e3915j44209K54198J11615N0379j45274j48340j4403J58541p4538J1858P5615
$$ -53915 -198124 56074 167689 218068 72794 -75546 -89949 68592 -5946 5912 81527
6659H1527M2333m3984O1874m937j08995m0908j607j389l3771K07524l47090M1735
$$ 81527 123860 79876 141750 136813 27818 -13090 -14697 -16086 -49857 157667 -189423 -147688
6647a47688J24073j08984L7866O3948Q6556J42046j5170j09458j4544p2663J60037
$$ -147688 -23615 -132599 -94733 -30785 55771 197817 182647 73189 58645 -14018 146019
6636A46019M4539j80710K6791m317P3782o3641l9811Q5899j62871j25222K1935
$$ 146019 190558 9848 36639 32322 106104 42463 2652 88551 -74320 -199542 -177607
6625a77607K03875M9327j86094j71497J74118K57500k01639q6414K4401O1617
$$ -177607 26268 75595 -110499 -281996 -107878 149622 -52017 -138431 -114030 -52413
6615e2413Q3844J0075j38950j01342J83740J18298J9122k99706O4666J41136p8842
$$ -52413 31431 41506 -97444 -198786 -15046 103252 122374 -177332 -112666 28470 -50372
6604e0372l4254J29481r8400m7654J389k6430j27948j116K51508j41097l1194
$$ -50372 -84626 44855 -53545 -101199 -99810 -126240 -254188 -255304 -3796 -144893 -176087
6593a76087J91224p1475L0532o6696J20473j02076O6079m9396J075Q5312J1087
$$ -176087 15137 -56338 -25806 -92502 27971 -74105 -8026 -57422 -56347 28965 40052
6582D0052N3915j29451j61312J99979j0458m3746J4588M1717O0173l15804n423
$$ 40052 93967 -35484 -196796 3183 -7275 -51021 -36433 5284 65457 -250347 -255770
6571b55770K7010R6957K14971K0885k03511k8788J1126J18132j62555R7771J36128
$$ -255770 -228760 -131803 83168 104053 -99458 -128246 -117120 1012 -161543 -63772 72356
6560G2356l9565J06210p9304k35527K32187P5368K9809j0016k43184k06257K84553
$$ 72356 32791 139001 59697 -175830 56357 131725 161534 151518 -91666 -297923 -13370
6549a3370O8160q0452K7170m600p803j68445n5697R3945l5690K6951J45078o7407
$$ -13370 54790 -25662 1508 -3092 -10895 -179340 -235037 -141092 -176782 -149831 -4753 -72160
6537g2160J03594K2500n3691P3263k2685N7228l5236k9599j43664n5720K74442
$$ -72160 31434 53934 243 73506 50821 108049 72813 43214 -100450 -156170 118272
6526A18272j08629k4645K30750l5584p4886J47226k11462j32610M4218J11767
$$ 118272 9643 -15002 215748 180164 105278 252504 41042 -91568 -47350 64417
6516F4417q7079K6142K04653l7441j92441l9749K67404j02972m7293k13728o0609
$$ 64417 -22662 3480 208133 170692 -21749 -61498 205906 102934 55641 -158087 -218696
6505b18696J45580J56617R9211R0648q7560l2746l02709J12688q0024J5529p1591
$$ -218696 -73116 83501 182712 273360 185800 153054 -149655 -36967 -116991 -101462 -173053
6494a73053J38629J54582j00911p6636N599j9983L3320R6378N2084j71574K5583
$$ -173053 -34424 120158 19247 -57389 -51790 -71773 -38453 57925 110009 -61565 -35982
6483c5982K02895j31765k3651r0292P3859R9473J9198o2850j8512o8245R2927
$$ -35982 166913 35148 11497 -78795 -4936 94537 113735 50885 32373 -35872 57055
6472E7055M0277N6666j23658j02533j02937Q4632L6613o0390J46257r876q5372
$$ 57055 97332 153998 30340 -72193 -175130 -90498 -53885 -114275 31982 22106 -63266
6461f3266N7579O5136l4695l1667J04496K9815K7613j56138M0828m1981K9779
$$ -63266 -5687 59449 24754 -6913 97583 127398 155011 -1127 39701 -2280 27499
6450B7499J51962k5533k46264R8669P2878k6433P6318o3130j54357Q7316J68765
$$ 27499 179461 153928 -92336 6333 79211 52778 129096 65966 -88391 -1075 167690
6439A67690M546j21672q3678l761J43502j29913N5679M5847N4033o4103j46423
$$ 167690 172236 50564 -33114 -36875 106627 -23286 32393 78240 132273 68170 -78253
6428g8253J26386J2321L1436n9445o6983J77212n6784P4168n5208j24820q0890
$$ -78253 48133 60454 91890 32445 -34538 142674 85890 160058 104850 -19970 -100860
6417a00860R3100p9224K7640P8945L8577k3334O135n18m7035J99885j20659q3745
$$ -100860 -7760 -86984 -59344 19601 58178 34844 40979 40461 -6574 193311 72652 -11093
6405a1093K1599M8818l693j3530L5392n8164n6694L0823M8121N7948p9096K595
$$ -11093 10506 59324 55631 42101 77493 19329 -37365 -6542 41579 99527 20431 23026
6393B3026J32992P1218m7304j00498j27788M2309p6812M6882J40874j3560P7669
$$ 23026 156018 227236 179932 79434 -48354 -6045 -82857 -35975 104899 91339 169008
6382A69008O0303j9543R8444j08425j41209j64904m9767m0128K928J68003L9451
$$ 169008 229311 209768 308212 199787 58578 -106326 -156093 -196221 -193293 -25290 14161
6371A4161J07014N9757l5956o1711j61001m9481n2984O5261J30298J06927J13796
$$ 14161 121175 180932 144976 83265 -77736 -127217 -180201 -114940 15358 122285 236081
6360B36081l572m125J19951n2484j65936j16210J00314L320j94107p3236J28828
$$ 236081 232509 228384 348335 295851 129915 13705 114019 117339 -76768 -150004 -21176
6349b1176K13569m8595r0873o125M0420P6047k9672q878R6884l6263J13338m6284
$$ -21176 192393 143798 52925 46800 87220 163267 133595 124717 221601 185338 298676 252392
6337B52392p636k0870n8050N2476L3559M7518m4953P2178J29724j54251O0488
$$ 252392 244756 223886 165836 218312 251871 299389 254436 326614 456338 302087 362575
6326C62575M0949k81665J45923K1749l0916j69302r2087J00436J22381j77304
$$ 362575 403524 121859 267782 289531 258615 89313 -2774 97662 220043 42739
6316D2739L9248L2678O0776j89533p9231N3096J64003M7428J02932j17021j43913
$$ 42739 81987 114665 175441 -14092 -93323 -40227 123776 171204 274136 157115 13202
6305A3202L4413J14538J63810P7972q2510J4651R888j55101J1727n3275K5177
$$ 13202 47615 162153 325963 403935 321425 336076 345964 190863 202590 149315 174492
6294A74492r9810J1206N3315R6220m8829j50881L1160O3306O0670L5046R8499
$$ 174492 74682 85888 139203 235423 186594 35713 66873 130179 190849 225895 324394
6283C24394k07888J9997k8279l3634O4164N6513J19566k12500n1726k5850M3961
$$ 324394 116506 136503 108224 74590 138754 195267 314833 102333 50607 24757 68718
6272F8718P8534N3388O2840j1562P8211L0698j08632m4371r1098m8233m8624J98887
$$ 68718 147252 200640 263480 251918 330129 360827 252195 207824 116726 68493 19869 218756
6260B18756Q204j47441J90894j14020o985N9534j0279j4168O3823R9592o2702
$$ 218756 226960 79519 270413 156393 149408 208942 198663 184495 248318 347910 285208
6249B85208o7276j56806R9977m745J95127k68J16028J6625j28754r2946K376o4414
$$ 285208 217932 61126 161103 156358 351485 351217 467245 483870 355116 262170 264546 200132
6237B00132O3891N3784j07016O8868O2093l5258J18849k00052n9141q2191J40508
$$ 200132 264023 317807 210791 279659 341752 306494 425343 225291 166150 83959 224467
6226B24467Q2356m0170J3185j7085j8388J9858j20617n3919P4664P4061Q127o8250
$$ 224467 306823 266653 279838 262753 244365 264223 143606 89687 164351 238412 246539 178289
6214A78289j09855J95693R3782j14608n8156J2537j6611j8381J20485K4406J15910
$$ 178289 68434 264127 357909 243301 185145 197682 181071 162690 283175 307581 423491
6203D23491q7701J7867R4179k2152m5042j5734m5260K57003J36556k55066k58372
$$ 423491 335790 353657 447836 425684 380642 364908 319648 576651 713207 458141 199769
6192A99769R3043J60095J59464L426j35435o7302m2181J02967L2983j75622q3529
$$ 199769 292812 452907 612371 615797 480362 413060 370879 473846 506829 331207 247678
6181B47678O1881J01668J52127O623r8395k8048P1189J06725j35467k2482k2767
$$ 247678 309559 411227 563354 569977 471582 443534 514723 621448 485981 463499 440732
6170D40732R994Q614P9472J90755j29975l8228J47079l8336m0403m9304j05558
$$ 440732 450726 459340 538812 729567 599592 561364 708443 670107 629704 580400 474842
6159D74842p9294J93382N9815o8807J23959k5576Q0051N8702K1924J21010L6906
$$ 474842 395548 588930 648745 579938 703897 678321 758372 817074 838998 960008 996914
6148I96914j21638K0239K0292p6080M8612r2153O5711R758n6530P3129K28374
$$ 996914 875276 895515 915807 839727 888339 796186 861897 871655 815125 888254 1116628
6137A116628M250J30140p9027r3745J18273Q2597J6821j25434J54369j8470q1803
$$ 1116628 1120878 1251018 1171991 1078246 1196519 1279116 1295937 1170503 1324872 1306402 1224599
6126A224599k5746j35199K54859J65986P1181K28828j26691k81193K75021J80680
$$ 1224599 1198853 1063654 1318513 1484499 1555680 1784508 1657817 1376624 1651645 1832325
6116A832325N91m1226j00311J9331P1959R4694l297Q9665J72727j2676p3964J8639
$$ 1832325 1832916 1791690 1691379 1710710 1782669 1877363 1874066 1963731 2136458 2123782 2049818 2068457
6104B068457J52925K28777n5436P4762P8273J5859m3632K50898K32693n9654R479
$$ 2068457 2221382 2450159 2394723 2469485 2547758 2563617 2519985 2770883 3003576 2943922 2953401
6093B953401p357M19879R2395J59606K18156J7939R5785J25534M74227L10194
$$ 2953401 2946044 3365923 3458318 3617924 3836080 3854019 3949804 4075338 4549565 4859759
6083D859759J43003K49983K68503J86296N30034O25923M12630M37771M29345M97813
$$ 4859759 5002762 5252745 5521248 5707544 6237578 6863501 7276131 7713902 8143247 8641060
6073H641060Q87357J065913J192963J446102J571765K216059K873277K708930
$$ 8641060 9528417 10594330 11787293 13233395 14805160 17021219 19894496 22603426
6065B2603426J432795p63342k282784k547705j730501p56807n49304J65515O28184
$$ 22603426 24036221 23272879 20990095 18442390 16711889 15955082 15405778 15571293 16199477
6056A6199477J314412J678194K007552K047631o0508k045877l212356k986547
$$ 16199477 17513889 19192083 21199635 23247266 23186758 21140881 17928525 14941978
6048A4941978k184153j621710j157061p63551n74848m76209k47552k14379k24329
$$ 14941978 12757825 11136115 9979054 9215503 8640655 8164446 7916894 7702515 7478186
6039G478186o1745j54806M001J50570q4476J7068L8007K54958J92057K16454L80000
$$ 7478186 7416441 7261635 7265636 7416206 7331730 7348798 7386805 7641763 7833820 8050274 8430274
6028H430274N70513M70930N39626O28378O54908P58500Q68034R76728J246196
$$ 8430274 9000787 9471717 10011343 10639721 11294629 12053129 12921163 13897891 15144087
6019A5144087J703249K089545K663992L526801L715799K788166N53885k326143
$$ 15144087 16847336 18936881 21600873 25127674 28843473 31631639 32185524 29859381
6011B9859381l543376l038331k047025r11631j42776M18145J030391J723716K662345
$$ 29859381 26316005 23277674 21230649 20319018 20176242 20594387 21624778 23348494 26010839
6002B6010839K841284J477964j436295l692663m605079l857944k878847j867025
$$ 26010839 28852123 30330087 28893792 25201129 20596050 16738106 13859259 11992234
5994A1992234j455594j143538j011643p88346o50399n12469l39969n11762m39865
$$ 11992234 10536640 9393102 8381459 7593113 6942714 6430245 6090276 5578514 5138649
5985E138649r0096k21075j47998j98074l45657k42271K1871j50110k32790j07136
$$ 5138649 5048553 4827478 4679480 4481406 4135749 3893478 3915349 3765239 3532449 3425313
5975C425313p2694l0267j6612L0357j22922j06657j38186J7025p5156n9788j63145
$$ 3425313 3352619 3322352 3305740 3336097 3213175 3106518 2968332 2985357 2910201 2850413 2687268
5964B687268r3305J75765r4129l38609R2750j275j3939k6844L2634m6648k50471
$$ 2687268 2593963 2769728 2675599 2336990 2429740 2428465 2414526 2387682 2420316 2373668 2123197
5953B123197J6440P0222q3405n2189n424m2052m2023m656r8999Q7691j05408k6338
$$ 2123197 2139637 2209859 2126454 2074265 2068841 2026789 1984766 1980110 1881111 1968802 1863394 1837056
5941A837056K61046N9466K7119j29059k8008M937j01608J4138K35767k29105j14607
$$ 1837056 2098102 2157568 2184687 2055628 2027620 2032557 1930949 1945087 2180854 1951749 1837142
5930A837142M2447M5840r42k36929j52178j00913J26425M7407l5122J65179k696
$$ 1837142 1879589 1925429 1924487 1687558 1535380 1434467 1560892 1608299 1573177 1738356 1735660
5919A735660k864O2279P5704J93552m4496j57074O5197O4466L5523J07050J26665
$$ 1735660 1732796 1795075 1870779 2064331 2019835 1862761 1927958 1992424 2027947 2134997 2261662
5908B261662J95239q8012J44857K36058j01751O3122J21311J0374J86952o7389
$$ 2261662 2456901 2368889 2513746 2749804 2648053 2711175 2832486 2842860 3029812 2962423
5898B962423o7155k31258l34789j76856j06140p3167j40824k6817J57393J02744
$$ 2962423 2895268 2664010 2329221 2152365 2046225 1973058 1832234 1805417 1962810 2065554
5888B065554l8336q4373P9897p5167p7695k8270Q6879L34695j31257j58342J76870
$$ 2065554 2027218 1942845 2022742 1947575 1869880 1841610 1928489 2263184 2131927 1973585 2150455
5877B150455J4968O2005K039J50910J15663m56j0438K51071P9381Q644K14487
$$ 2150455 2165423 2227428 2229467 2380377 2496040 2495584 2485146 2736217 2815598 2824242 3038729
5866C038729K71250j3806K72316N78110J98519J38343j89011k92733N9994J20385
$$ 3038729 3309979 3296173 3568489 4146599 4345118 4483461 4294450 4001717 4061711 4182096
5856D182096K05767J4206L72727O4696l23381n8671P1674J69632R0250p2673j85265
$$ 4182096 4387863 4402069 4774796 4839492 4516111 4457440 4529114 4698746 4788996 4716323 4531058
5845D531058j86115o3213J2046Q9485J05575P0580o2464k29140k44074k12064
$$ 4531058 4344943 4281730 4293776 4383261 4488836 4559416 4496952 4267812 4023738 3811674
5835C811674K0825k06363l09542q6059k9567k579J67216K1160K9186J84441J18793
$$ 3811674 3832499 3626136 3316594 3230535 3200968 3198389 3365605 3386765 3415951 3600392 3719185
5824C719185l3901K14242K17843J29642Q3345J65623O2712N04245M45382J60758
$$ 3719185 3685284 3899526 4117369 4247011 4330356 4495979 4558691 5062936 5508318 5669076
5814E669076K28672L65982K37113M5283r5968l69391j71812J73860L84052L45114
$$ 5669076 5897748 6263730 6500843 6546126 6450158 6080767 5908955 6082815 6466867 6811981
5804F811981J68488L16090q5699n4355q7214P4521K76982J32704k54618k99141
$$ 6811981 6980469 7296559 7210860 7156505 7069291 7143812 7420794 7553498 7298880 6999739
5794F999739k54486j15481K50133L5236K14573K68063k41154k62196j59179k75322
$$ 6999739 6745253 6629772 6879905 6915141 7129714 7397777 7156623 6894427 6735248 6459926
5784F459926j51820o808K22451j50910M4576L96651m4906L08714L74280M35143
$$ 6459926 6308106 6301298 6523749 6372839 6417415 6814066 6769160 7077874 7452154 7887297
5774G887297L88670N39834M14847M91690O85927Q10591J008186J070940J176732
$$ 7887297 8275967 8815801 9230648 9722338 10408265 11218856 12227042 13297982 14474714
5765A4474714J547184J934162K417979L299361L395054K190688n42216l091076
$$ 14474714 16021898 17956060 20374039 23673400 27068454 29259142 28716926 25625850
5757B5625850m133459l194024k219917j609256j055141p56319n22714l18118k42120
$$ 25625850 21492391 18298367 16078450 14469194 13414053 12657734 12135020 11816902 11574782
5748A1574782m4922K93255J21260K94728M22065O05761P66352R15122J064925
$$ 11574782 11529860 11823115 11944375 12239103 12661168 13266929 14033281 14948403 16013328
5739A6013328J473066J974467K460844L265257L461820K771757J02942k806277
$$ 16013328 17486394 19460861 21921705 25186962 28648782 31420539 31523481 28717204
5731B8717204m388622m104555k896838j953979j532177p73385n92263n50719m55139
$$ 28717204 24328582 20224027 17327189 15373210 13841033 13067648 12475385 11924666 11469527
5722A1469527p0303l7223j33346J42250O5665K54575N95215P04236R40721R68204
$$ 11469527 11399224 11362001 11228655 11370905 11436570 11691145 12286360 12990596 13931317 14899521
5712A4899521J335183K006760K562320K111659P63467j291600k944649k865903
$$ 14899521 16234704 18241464 20803784 22915443 23678910 22387310 19442661 16576758
5704A6576758k047065j496670r46468o03553o36953n08613j34408N0465j8545
$$ 16576758 14529693 13033023 12086555 11483002 10846049 10337436 10203028 10253493 10234948
5695A0234948O8947J74437K50214L70846N66105M47114Q45124O47986R94131J506662
$$ 10234948 10303895 10478332 10728546 11099392 11665497 12112611 12957735 13605721 14599852 16106514
5685A6106514K024942K530829K530685J393977p95631k794189l116393k727517
$$ 16106514 18131456 20662285 23192970 24586947 23791316 20997127 17880734 15153217
5677A5153217k076579j221198r65328n51210m96628n30306o41958m89259j80271
$$ 15153217 13076638 11855440 10890112 10338902 9842274 9311968 8670010 8180751 8000480
5668H000480l9405j02894K7734p2220J17171r0672j78005L2820K34437K59791
$$ 8000480 7961075 7858181 7885915 7813695 7930866 7840194 7662189 7695009 7929446 8189237
5658H189237p2559j92855l8614K0788Q4065J85730M2129k0782R0984L39515K36836
$$ 8189237 8116678 7923823 7885209 7905997 7990062 8175792 8217921 8197139 8288123 8627638 8864474
5647H864474J78866K33083J57526J02209J70630N3293J67357N8311K84169K54681
$$ 8864474 9043340 9276423 9433949 9536158 9706788 9760081 9927438 9985749 10269918 10524599
5637A0524599J34671K61631J71425J74403K59334O3894J14488k9546J21707J86524
$$ 10524599 10659270 10920901 11092326 11266729 11526063 11589957 11704445 11674899 11796606 11983130
5627A1983130L79172K69830O4190L63517J21168N23923L16563L64648K91891M73993
$$ 11983130 12362302 12632132 12696322 13059839 13181007 13704930 14021493 14386141 14678032 15152025
5617A5152025N67592M38174P47655N78855Q15622Q98042P32111O71585P99514
$$ 15152025 15719617 16157791 16905446 17484301 18299923 19197965 19930076 20601661 21401175
5608B1401175R67730Q35961J229577J181405J566507J543136J370215J745207
$$ 21401175 22368905 23204866 24434443 25615848 27182355 28725491 30095706 31840913
5600C1840913J775611K037083K366563K520395K772396K805515L289848L887410
$$ 31840913 33616524 35653607 38020170 40540565 43312961 46118476 49408324 53295734
5592E3295734M365455M975700N916862O928216Q146183R160414J0665658J2543203
$$ 53295734 57661189 62636889 68553751 75481967 83628150 92788564 103454222 115997425
5584A15997425J5013606J6603630J5537067J1879270J0762282J7722508K9323832
$$ 115997425 131011031 147614661 163151728 175030998 185793280 203515788 232839620
5577B32839620L6622656K5664374p369650m4382196n3336790m0669642k7709343
$$ 232839620 269462276 295126650 287757000 243374804 190038014 149368372 121659029
5570A21659029j9243300j4092501j0370108q068332o901702o020298n389627m372702
$$ 121659029 102415729 88323228 77953120 69884788 62983086 56962788 51573161 47200459
5562D7200459l361414k978337k245489j762851j540749j587673j543125j339937
$$ 47200459 43839045 40860708 38615219 36852368 35311619 33723946 32180821 30840884
5554C0840884j417643j310144j269894j414174j363025j226523j099456q17692
$$ 30840884 29423241 28113097 26843203 25429029 24066004 22839481 21740025 20922333
5546B0922333p87108o76333n62461p09000m92853m52826m19177n26505k28548
$$ 20922333 20135225 19458892 18896431 18187431 17694578 17241752 16822575 16296070 16067522
5537A6067522j88899k66735j81656l11960o52211m87339p27450o42306o47768
$$ 16067522 15878623 15611888 15430232 15118272 14466061 13978722 13251272 12608966 11961198
5528A1961198o55537m77435l42587n14937k49715k01090n17552k37274k07597
$$ 11961198 11305661 10828226 10485639 9970702 9720987 9519897 9002345 8765071 8557474
5519H557474k54969j88015j34198n4969J22876M1253k0074J00365p6601J51247
$$ 8557474 8302505 8114490 7980292 7925323 8048199 8089452 8069378 8169743 8093142 8244389
5509H244389P6801J80969J04272L4102j52038k51485j80413l80449n52819m98390
$$ 8244389 8321190 8502159 8606431 8640533 8488495 8237010 8056597 7676148 7123329 6624939
5499F624939m18147k92189k85273k20781k02189m4988j03075l54604M3677k35642
$$ 6624939 6206792 5914603 5629330 5408549 5206360 5161372 5058297 4703693 4747370 4511728
5489D511728j59725j6343j58552r7518k25823p1433K1149j42532R988j89166o930
$$ 4511728 4352003 4335660 4177108 4079590 3853767 3782334 3803483 3660951 3670939 3481773 3474843
5478C474843q1521j56939L39j58034q8349m2001o6760J22245j90595j41432J28635
$$ 3474843 3393322 3236383 3236722 3078688 2990339 2948338 2881578 3003823 2813228 2671796 2800431
5467B800431Q5749r7453j67102J35401J16438M2121j23156k68941j15411L1286
$$ 2800431 2886180 2788727 2621625 2757026 2873464 2915585 2792429 2523488 2408077 2439363
5457B439363r6856j38932k0325K6303j07079o4535o8792r5329J40556J70392m9711
$$ 2439363 2342507 2203575 2183250 2209553 2102474 2037939 1969147 1873818 2014374 2184766 2135055
5446B135055j11814j78078L575J07824n875J1862q530l6326m6099r6469q8210
$$ 2135055 2023241 1845163 1848738 1956562 1950687 1962549 1954019 1917693 1871594 1775125 1686915
5435A686915J27043p3156K27245N4674r5194q6444p8088J28972n6062J12746L3826
$$ 1686915 1813958 1740802 1968047 2022721 1927527 1841083 1762995 1891967 1835905 1948651 1982477
5424A982477j86067N1208p9416L7766K9863p2288K2625O57P178L1385j5015O4630
$$ 1982477 1796410 1847618 1768202 1805968 1835831 1763543 1786168 1786825 1794003 1825388 1810373 1875003
5412A875003l5551n6693k7593n040j26660K432j08627m715L47743j85398j27919
$$ 1875003 1839452 1782759 1755166 1750126 1623466 1625898 1517271 1512556 1860299 1674901 1546982
5401A546982j42559k7504J43513J17199j16046j24800K5392M1445j04333p2226
$$ 1546982 1404423 1376919 1520432 1637631 1521585 1396785 1422177 1463622 1359289 1287063
5391A287063m80j86850M8305J93350j45483J19833J34317K1390l0610j26225j3707
$$ 1287063 1286583 1099733 1148038 1341388 1195905 1315738 1450055 1471445 1440835 1314610 1300903
5380A300903J31722j34020l1696l3081J2695J07332J1097k17333Q3321J27941
$$ 1300903 1432625 1298605 1266909 1233828 1246523 1353855 1364952 1147619 1230940 1358881
5370A358881N2061K0455n5256O2258j25587k5501o7685M1853O4870R0351j47831
$$ 1358881 1410942 1431397 1376141 1438399 1312812 1287311 1219626 1261479 1326349 1416700 1268869
5359A268869N2133r240J14411K780k05602o6651l800J90481m2319k04676K58807
$$ 1268869 1321002 1311762 1426173 1428953 1223351 1156700 1152900 1343381 1301062 1096386 1355193
5348A355193M4713O9279K2478k02867q3241M4372J02086J45703q4168j92554M72
$$ 1355193 1399906 1469185 1491663 1288796 1205555 1249927 1352013 1497716 1413548 1220994 1221466
5337A221466Q1205N4217p9595K5031j67258L730J89430j8979j09829Q949J16430
$$ 1221466 1302671 1356888 1277293 1302324 1135066 1138796 1328226 1309247 1199418 1208367 1324797
5326A324797O1532j06562m5683O2526K1711p0971l2319j19989N8654k5348J04782
$$ 1324797 1386329 1279767 1234084 1296610 1318321 1247350 1215031 1095042 1153696 1128348 1233130
5315A233130j35227J38941r2833L5515q96K6303J83195m7096L3886j19890o4379
$$ 1233130 1097903 1236844 1144011 1179526 1178630 1204933 1388128 1341032 1374918 1255028 1190649
5304A190649j65537k22148J58474J76885p6221p2272J55903R7210j12019J10845
$$ 1190649 1025112 802964 961438 1138323 1062102 989830 1145733 1242943 1130924 1241769
5294A241769J5887j15833J936k1149O5731p3616o4662J52781j62608R1679p5376
$$ 1241769 1257656 1141823 1143759 1122610 1188341 1114725 1050063 1202844 1040236 1131915 1056539
5283A056539J00583M5508J05820j15489k6836J5140k6257J15747J4565J4488k095
$$ 1056539 1157122 1202630 1308450 1192961 1166125 1181265 1155008 1270755 1285320 1299808 1297713
5272A297713n0615K65367n8957j00524J50100J09653l9766p6008r072n2270L3508
$$ 1297713 1247098 1512465 1453508 1352984 1503084 1612737 1572971 1496963 1487891 1435621 1469129
5261A469129N0496J09451Q0386O2796L3652l809J85206J4972J99729Q5828P9851
$$ 1469129 1519625 1629076 1709462 1772258 1805910 1802101 1987307 2002279 2202008 2287836 2367687
5250B367687O7172J53170L64922k6575j18539l10783l94362o9876j23026k9733
$$ 2367687 2434859 2588029 2952951 2926376 2807837 2497054 2102692 2032816 1909790 1880057
5240A880057o2920k59595J26393k7437j49764o9809K6983K90109m1544O6530o6900
$$ 1880057 1817137 1557542 1683935 1656498 1506734 1436925 1463908 1754017 1712473 1779003 1712103
5229A712103j50990K3912L3837P2423n3384J11595L0851l6511p9423p7409K33918
$$ 1712103 1561113 1585025 1618862 1691285 1637901 1749496 1780347 1743836 1664413 1587004 1820922
5218A820922q3668k84154L82879l2556r86O9313J60773M2422N0907l3297P0994
$$ 1820922 1737254 1453100 1835979 1803423 1802437 1871750 2032523 2074945 2125852 2092555 2163549
5207B163549P1503r2545n1676N3819q677J98875n4924q0061J09207J11149J55810
$$ 2163549 2235052 2142507 2090831 2144650 2135973 2334848 2279924 2199863 2309070 2420219 2576029
5196B576029J24564J5785K1876P0719K0487j66130N6173K42657K17677j30949
$$ 2576029 2700593 2716378 2738254 2808973 2829460 2663330 2719503 2962160 3179837 3048888
5186C048888Q0450R7236m695J98076o7867J39358J47909o2522J60298K60032J16784
$$ 3048888 3129338 3226574 3221879 3419955 3352088 3491446 3639355 3576833 3737131 3997163 4113947
5175D113947P6798J96361J20651N2154K88651L30460K84958J38639M73281K94655
$$ 4113947 4190745 4387106 4507757 4559911 4848562 5179022 5463980 5602619 6075900 6370555
5165F370555K86047M79636L81910O39354Q26735R09435J072226R06794N10509
$$ 6370555 6656602 7136238 7518148 8157502 8984237 9893672 10965898 11872692 12383201
5156A2383201m01889m88582j08562N5045L52728N70418Q67806J277004J568900
$$ 12383201 11981312 11492730 11384168 11439213 11791941 12362359 13230165 14507169 16076069
5147A6076069J981522J586346O47243m47993r10512m88833J15445N92492O54041
$$ 16076069 18057591 19643937 20291180 19843187 18932675 18443842 18559287 19151779 19805820
5138A9805820J11446j11872K25887Q29626J477353J237788P77312j83733l59641
$$ 19805820 19917266 19805394 20031281 20860907 22338260 23576048 24353360 24169627 23809986
5129B3809986Q1049N08054P59474j03805j043361j573142r87655J70635R33056
$$ 23809986 23891035 24399089 25158563 25054758 24011397 22438255 21450600 21621235 22554291
5120B2554291R99145N93134l98399q34751k69099L63395J03959m41782j095300
$$ 22554291 23553436 24146570 23748171 22913420 22644321 23007716 23111675 22669893 21574593
5111B1574593j489903j216773o55171k97675o3217k01163o17607l11274K23682
$$ 21574593 20084690 18867917 18212746 17915071 17851854 17650691 17033084 16721810 16945492
5102A6945492P77360O37538j55706j297357k136599j892314j114554p72048p45074
$$ 16945492 17722852 18360390 18204684 16907327 14770728 12878414 11763860 10991812 10246738
5093A0246738l11131J40612L03J11222L09436r996n75715j058689j096370q32807
$$ 10246738 9935607 10076219 10076522 10187744 10497180 10487184 9911469 8852780 7756410 6923603
5083F923603o12464n24438n52971j50012l03656k52972j22538j85770J0912l14877
$$ 6923603 6311139 5786701 5233730 5083718 4780062 4527090 4404552 4218782 4229694 3914817
5073C914817j88048j95194J97583r6664n971k65092k75728K79515j94766K5056
$$ 3914817 3726769 3531575 3729158 3632494 3626523 3361431 3085703 3365218 3170452 3195508
5063C195508j22022j00847j05613r7338L8125j33119Q8223l8943N259k3222K8438
$$ 3195508 3073486 2972639 2867026 2769688 2807813 2674694 2762917 2723974 2729233 2706011 2734449
5052B734449Q5422j02435j88111n3254o8076m762J12393j82325M0524o9418j08738
$$ 2734449 2819871 2717436 2529325 2476071 2407995 2403233 2515626 2333301 2373825 2304407 2195669
5041B195669n6908R4363j44307j48404K56785o4639o9500q6040M2016L0794q5172
$$ 2195669 2138761 2233124 2088817 1940413 2197198 2132559 2063059 1977019 2019035 2049829 1964657
5030A964657k9600k01819K07145K6234R7330j48675m6750l8332k37559K34256
$$ 1964657 1935057 1733238 1940383 1966617 2063947 1915272 1868522 1830190 1592631 1826887
5020A826887N3117m237J36465p544J39785m6471R1289j07782N6992L2779P0890
$$ 1826887 1880004 1875767 2012232 2004688 2144473 2098002 2189291 2081509 2138501 2171280 2242170
5009B242170J07236N4865M5794J15173J48983J79208j1461p0420J22361o4433
$$ 2242170 2349406 2404271 2450065 2565238 2714221 2893429 2881968 2811548 2933909 2869476
4999B869476K27904j03566J20184J94225j08279K7576J96984J98140J88561J73459
$$ 2869476 3097380 2993814 3113998 3308223 3199944 3227520 3424504 3622644 3811205 3984664
4989C984664K30649m3542p925K12875q7462j1384L13J54571L22070j08254m2J61364
$$ 3984664 4215313 4171771 4163846 4376721 4289259 4277875 4278188 4432759 4754829 4646575 4646533 4807897
4977D807897K74349P7057K95562J43520L74430R0492j48932j56280k14627R6680
$$ 4807897 5082246 5159303 5454865 5598385 5972815 6063307 5914375 5758095 5543468 5640148
4967E640148k6794k28341j50073K78624J50517J69327J0915L32834L63607J01809
$$ 5640148 5613354 5385013 5234940 5513564 5664081 5833408 5844323 6177157 6540764 6642573
4957F642573l0919j53260r3295J109l133o6057n8167K3769P7763J67835M3240
$$ 6642573 6611654 6458394 6365099 6366208 6363075 6297018 6238851 6262620 6340383 6508218 6551458
4946F551458j22417L26471J2874n4722J01266j16j81215j64475j85443j51977
$$ 6551458 6429041 6755512 6768386 6713664 6814930 6814814 6633599 6469124 6283681 6131704
4936F131704k65569J4620N4685n7553Q0173J44782M8470R0457j84900k92616k62760
$$ 6131704 5866135 5880755 5935440 5877887 5958060 6102842 6151312 6241769 6056869 5764253 5501493
4925E501493j2635J01015k54727j31295j62902q1239j63667L2190j55100k04474
$$ 5501493 5488858 5589873 5335146 5203851 5040949 4959710 4796043 4828233 4673133 4468659
4915D468659L4787n1271J10936J30488M395k12096j77520P819j46127j79847m01192
$$ 4468659 4503446 4452175 4563111 4693599 4697994 4485898 4308378 4316197 4170070 3990223 3589031
4904C589031k12199j26946J24371j82474j68884j2953m7600l8360j30348n9436
$$ 3589031 3376832 3249886 3374257 3191783 3022899 3009946 2962346 2923986 2793638 2734202
4894B734202j83409J3077K8717j36848r7990O242p0167J49222j50240m5097r860
$$ 2734202 2550793 2563870 2592587 2455739 2357749 2363991 2293824 2443046 2292806 2247709 2237849
4883B237849k90279l6285M9472j77147j49959K0376P4864o9908m7011J02914J42784
$$ 2237849 1947570 1911285 1960757 1783610 1633651 1654027 1728891 1658983 1611972 1714886 1857670
4872A857670j57925j46575N4249k20461J27358O3706N2453j3345J85010K04628
$$ 1857670 1699745 1553170 1607419 1386958 1514316 1578022 1630475 1617130 1802140 2006768
4862B006768j57627k00402p3764Q1131j53538k07288K09984J16992n8583O155
$$ 2006768 1849141 1648739 1574975 1656106 1502568 1295280 1505264 1622256 1563673 1569828
4852A569828j40339K8885q310r6079J10128m9847q9953n3506K13789K04455j07719
$$ 1569828 1429489 1458374 1450064 1353985 1464113 1414266 1324313 1270807 1484596 1689051 1581332
4841A581332j61K4204o4254n8639L450M3005K342K15465o5097k0241n8584O8035
$$ 1581332 1581171 1605375 1541121 1482482 1485932 1528937 1531279 1746744 1681647 1661406 1602822 1670857
4829A670857j44341J02756J26945N0988o671J85715q2981L7664J47824k44638
$$ 1670857 1526516 1629272 1756217 1807205 1800534 1986249 1903268 1940932 2088756 1844118
4819A844118J39824N1738j8050j15403o0897K4271J99929j3973J36549R5362J5111
$$ 1844118 1983942 2035680 2017630 1902227 1841330 1865601 2065530 2051557 2188106 2283468 2298579
4808B298579M138K45584O2725m2947K4195K13482p1685J79133O2749j21381Q9444
$$ 2298579 2302717 2548301 2611026 2568079 2592274 2805756 2734071 2913204 2975953 2854572 2944016
4797B944016J52672J10751O3955q9747K32357J81282M3319K19665J82560J02353
$$ 2944016 3096688 3207439 3271394 3181647 3414004 3595286 3638605 3858270 4040830 4143183
4787D143183K69423M40366L98888L91706J45548j0965k82605p5078l02705l73682
$$ 4143183 4412606 4852972 5251860 5643566 5789114 5778149 5495544 5420466 5117761 4744079
4777D744079j17623r4716p0030K6274l9540n4237P0518R5211M5434J38480J98926
$$ 4744079 4626456 4531740 4461710 4487984 4448444 4394207 4464725 4559936 4605370 4743850 4942776
4766D942776R7309K63281J64594J43661K36873K03676K16961K34795J74306M56173
$$ 4942776 5040085 5303366 5467960 5611621 5848494 6052170 6269131 6503926 6678232 7134405
4756G134405M03149L60994L60701O09825N93635Q04111P37087P57948R13379J193995
$$ 7134405 7537554 7898548 8259249 8869074 9462709 10266820 11003907 11761855 12675234 13869229
4746A3869229J555857J969203K604699L089377L128899J661516j148038l337325
$$ 13869229 15425086 17394289 19998988 23088365 26217264 27878780 26730742 23393417
4738B3393417l111685k000478j047930p19733l6178K95978K21955Q97379J023581
$$ 23393417 20281732 18281254 17233324 16513591 16477413 16773391 16995346 17892725 18916306
4729A8916306J193460J802765J964680K543821L477811M375718M798336M195111
$$ 18916306 20109766 21912531 23877211 26421032 29898843 34274561 39072897 43268008
4721D3268008K125853N34289j157213l713832n877650n811560m251796k883804
$$ 43268008 45393861 45928150 44770937 41057105 35179455 29367895 25116099 22232295
4713B2232295k142951j428769q48941n32173l28946J18682M13140O38483J074872
$$ 22232295 20089344 18660575 17811634 17279461 16950515 17069197 17482337 18120820 19195692
4704A9195692J724764K494338L258571K767020Q74230k247279m646560m235112
$$ 19195692 20920456 23414794 26673365 29440385 30314615 28067336 23420776 19185664
4696A9185664l049525k170971j570718j199907r75048p55089q77361l72028m62741
$$ 19185664 16136139 13965168 12394450 11194543 10219495 9464406 8587045 8215017 7752276
4687G752276m95262k07035l52497k44030j86517N4275k3388j74569k74785O8039
$$ 7752276 7257014 7049979 6697482 6453452 6266935 6321210 6297822 6123253 5848468 5916507
4677E916507k2087k62329j46430J3296K331M2916K17171K8146j5129j40915J28539
$$ 5916507 5894420 5632091 5485661 5498957 5501288 5544204 5761375 5789521 5774392 5633477 5762016
4666E762016L3473J87462Q7642J02327J65805L32294L17821L59514P06533M68101
$$ 5762016 5795489 5982951 6070593 6172920 6338725 6671019 6988840 7348354 8054887 8522988
4656H522988L33406J9069k59688m64882k79325j32608j22565j30156J99794P47
$$ 8522988 8856394 8875463 8615775 8150893 7871568 7738960 7616395 7486239 7686033 7686780
4646G686780J55679K96147L75020L27897M91512O01488O32039P69785N41914N34075
$$ 7686780 7842459 8138606 8513626 8841523 9333035 9934523 10566562 11336347 11878261 12412336
4636A2412336N35476N54204N68311N36352N0511p68235j380280r52801p67374
$$ 12412336 12947812 13502016 14070327 14606679 14657190 13888955 12508675 11555874 10788500
4627A0788500n51909k04162j52051j91999J80254K82245L59307L80666O61059
$$ 10788500 10236591 10032429 9880378 9688379 9868633 10150878 10510185 10890851 11551910
4618A1551910Q19075R67664P25580P37406O19336q6831j98615k17596k73192n63317
$$ 11551910 12370985 13338649 14064229 14801635 15420971 15334140 15135525 14917929 14644737 14081420
4608A4081420j063684r17507n07056m58573j41057j82552J57574R5304L27497
$$ 14081420 13017736 12100229 11593173 11134600 10993543 10810991 10968565 11063869 11391366
4599A1391366J75420N39946N27677L82294P47199R36969J189990R97634J179635
$$ 11391366 11566786 12106732 12634409 13016703 13763902 14700871 15890861 16888495 18068130
4590A8068130O41521M9180M97114P18442R82045J313973J618372J933231J974682
$$ 18068130 18709651 18758831 19255945 19974387 20956432 22270405 23888777 25822008 27796690
4581B7796690K438679K576554L007714L794809L446286K218049m7310k412462
$$ 27796690 30235369 32811923 35819637 39614446 43060732 45278781 45231471 42819009
4573D2819009l077635k377848j445241p15443j19817P10058J746527K530159K945486
$$ 42819009 39741374 37363526 35918285 35202842 35083025 35793083 37539610 40069769 43015255
4564D3015255J559207p57263k858244l148631k159033j099331j72224O75746J060103
$$ 43015255 44574462 43817199 40958955 37810324 35651291 34551960 34379736 35055482 36115585
4555C6115585J664103Q00185j152499k545815l009792k129647j224961o69866
$$ 36115585 37779688 38579873 37427374 34881559 31871767 29742120 28517159 27847293
4547B7847293k73723J40058K86259Q70833J298088j70387j921356l416783l713841
$$ 27847293 27573570 27713628 27999887 28870720 30168808 29998421 28077065 24660282 20946441
4538B0946441l107199k190240j517048j221087q87324p79135o77767l68547m55885
$$ 20946441 17839242 15649002 14131954 12910867 12023543 11244408 10566641 10198094 9742209
4529I742209o47702m56086n05533k1643k17609j85580k58205l29447l09954j6555
$$ 9742209 9094507 8638421 8132888 8111245 7893636 7708056 7449851 7120404 6810450 6793895
4519F793895p1673q2438l26851j64373Q7798k91350k65229j43747q6883R2395
$$ 6793895 6722222 6639784 6312933 6148560 6236358 5945008 5679779 5536032 5449149 5541544
4509E541544j3781j72232j57197J6725R0029k3027j12288j79874n2811j19995
$$ 5541544 5527763 5355531 5198334 5215059 5305088 5282061 5169773 4989899 4937088 4817093
4499D817093j11994k50691j12157j29146j1883l4223j65255J26297j11118k28321
$$ 4817093 4705099 4454408 4342251 4213105 4201222 4166999 4001744 4128041 4016923 3788602
4489C788602N6175j83757p9587J67575k7976J4389R7958j70477j153J8862L888
$$ 3788602 3844777 3661020 3581433 3749008 3721032 3735421 3833379 3662902 3661749 3680611 3684499
4478C684499j74550j255Q8158j1286j58475M4837J00554j16059j77605l9323K27702
$$ 3684499 3509949 3508694 3596852 3585566 3427091 3471928 3572482 3456423 3278818 3239495 3467197
4467C467197n8228o3976J49758r7217m2952J33613K59404K42458R3040L7732N2347
$$ 3467197 3408969 3344993 3494751 3397534 3354582 3488195 3747599 3990057 4083097 4120829 4173176
4456D173176K31790L00851K50214K38820K24788L06860M91032P69876O97746O93311
$$ 4173176 4404966 4705817 4956031 5194851 5419639 5726499 6217531 6987407 7685153 8378464
4446H378464O68047J8983j93231o35320n25868m89561J0956K00997K53056M94059
$$ 8378464 9046511 9065494 8872263 8236943 7711075 7221514 7232470 7433467 7686523 8180582
4436H180582N91175L67299K24757j27305l80202m75801O6070J7246K41005P06933
$$ 8180582 8771757 9139056 9363813 9236508 8856306 8380505 8446575 8463821 8704826 9411759
4426I411759Q55006R77744P80770P3297o34997j270779q98131m81119k52330R822
$$ 9411759 10266765 11244509 12025279 12098576 11463579 10192800 9294669 8813550 8561220 8571042
4416H571042K73349M76812O84724R08647M94600j49911q28599j002681r65303
$$ 8571042 8844391 9321203 10005927 10914574 11409174 11259263 10430664 9427983 8462680
4407H462680o56358l66627k26897N4743L30183K66709l63921n27071n24347n38852
$$ 8462680 7806322 7439695 7212798 7267541 7597724 7864433 7500512 6973441 6449094 5910242
4397E910242m85324l04871M6873j9021K85352J73319J64439K16320O5513p63092
$$ 5910242 5424918 5120047 5166920 5147899 5433251 5606570 5771009 5987329 6052842 5289750
4387E289750q77340n59471j13452r7425k60640l63497j68308M824k17660j33276
$$ 5289750 4412410 3852939 3739487 3642062 3381422 3017925 2849617 2854441 2636781 2503505
4377B503505J2001j2858j1611r8498j43392Q6242J53143k16163J02617o3873L1091
$$ 2503505 2515506 2502648 2491037 2392539 2249147 2335389 2488532 2272369 2374986 2311113 2342204
4366B342204N0464j14455n2275R4418o0809O5239M5160P7308J1323j17138O0218
$$ 2342204 2392668 2278213 2225938 2320356 2259547 2324786 2369946 2447254 2458577 2341439 2401657
4355B401657J97745L5030J53616j90609l0474N6337J49373N5116r7821K14353
$$ 2401657 2599402 2634432 2788048 2597439 2566965 2623302 2772675 2827791 2729970 2944323
4345B944323N761J95287r5697j89911m1015m8661k0068N4324J14665J08358J22952
$$ 2944323 2950084 3145371 3049674 2859763 2818748 2770087 2750019 2804343 2919008 3027366 3150318
4334C150318O1763j34839p3343k44404j92253J42875l4852j68243J73364o6800
$$ 3150318 3212081 3077242 3003899 2759495 2567242 2710117 2675265 2507022 2680386 2613586
4324B613586n687k4205J02710L3542k00859O0707J47213k5724O2786R0826M235
$$ 2613586 2607899 2583694 2686404 2719946 2519087 2579794 2727007 2701283 2764069 2854895 2859130
4313B859130n2624j83898o1794r2968rr7855k77386K22832P6385q2643K3801j33482
$$ 2859130 2806506 2622608 2560814 2467846 2467837 2369982 2092596 2315428 2391813 2309170 2332971 2199489
4301B199489r9214P3776L5996O8782j43506J6589K54946n2322m5173r6793J58474
$$ 2199489 2100275 2174051 2210047 2278829 2135323 2151912 2406858 2354536 2309363 2212570 2371044
4290B371044J51683j335J3206o362j0573P8730R3511k8623o9285J82950n446n8302
$$ 2371044 2522727 2521392 2534598 2528236 2517663 2596393 2689904 2661281 2591996 2774946 2769500 2711198
4278B711198J87987r8810L3254m8390L4546o6890M5505J13679J42022o9332j06757
$$ 2711198 2899185 2800375 2833629 2785239 2819785 2752895 2798400 2912079 3054101 2984769 2878012
4267B878012J70040O5353R0842R5555L7924k6190K7864L32795m7982J66138J80421
$$ 2878012 3048052 3113405 3204247 3299802 3337726 3311536 3339400 3672195 3624213 3790351 3970772
4256C970772m7750K3575M2802J82735k7934m701P9052J29490J46747p5900M1500
$$ 3970772 3923022 3946597 3989399 4172134 4144200 4139499 4218551 4348041 4494788 4418888 4460388
4245D460388P9173J28998L15426N0779R4957J56831Q7263O3052J76182J9345J13187
$$ 4460388 4539561 4668559 4983985 5034764 5129721 5286552 5373815 5436867 5613049 5632394 5745581
4234E745581Q1505J52716J67817K6320K22637J38934J89645K97030L33838L34591
$$ 5745581 5827086 5979802 6147619 6173939 6396576 6535510 6725155 7022185 7356023 7690614
4224G690614J95630J62302K47940J26656N5301M2914L68276L34667J74064K11040
$$ 7690614 7886244 8048546 8296486 8423142 8478443 8521357 8889633 9224300 9398364 9609404
4214I609404J41617J59254K16674J98532K18815L05471k1422K16775L91687K50181
$$ 9609404 9751021 9910275 10126949 10325481 10544296 10849767 10828345 11045120 11436807 11686988
4204A1686988K70566K48621K34145J66840L75342M35086L51306M44183M53288
$$ 11686988 11957554 12206175 12440320 12607160 12982502 13417588 13768894 14213077 14666365
4195A4666365L73154P15217N40209P90529P21953O38341P23036R60328R23577
$$ 14666365 15039519 15754736 16294945 17085474 17807427 18445768 19168804 20129132 21052709
4186B1052709R33120J186284J073679J413367J465657J611138J544483J673920
$$ 21052709 21985829 23172113 24245792 25659159 27124816 28735954 30280437 31954357
4178C1954357J795122K113305K081517K429375K973605L396622L810416M172908
$$ 31954357 33749479 35862784 37944301 40373676 43347281 46743903 50554319 54727227
4170E4727227M695621N212164O054117O616620P849956R497176J0953904J3042552
$$ 54727227 59422848 64635012 70689129 77305749 85155705 94652881 105606785 118649337
4162A18649337J6122763K0615318K7018747L4331458L4824972K2281549l969624
$$ 118649337 134772100 155387418 182406165 216737623 251562595 273844144 269874520
4155B69874520k8116478l9563411l5108733k3055632j3697982q562291q755993
$$ 269874520 241758042 202194631 167085898 144030266 130332284 121769993 113014000
4148A13014000j2049826j4858297j3078054j0010122p439413n584076m537716
$$ 113014000 100964174 86105877 73027823 63017701 55578288 49994212 45456496
4141D5456496l741191l311863k791860k328111j913191j651900j675309j349102
$$ 45456496 41715305 38403442 35611582 33283471 31370280 29718380 28043071 26693969
4133B6693969j131960r53991j216572j084408r19689o58674n18201q50353p68756
$$ 26693969 25562009 24608018 23391446 22307038 21387349 20728675 20210474 19360121 18591365
4124A8591365o57074m97451j69992j71395N9855l59994p95492q02153r86858p70840
$$ 18591365 17934291 17436840 17266848 17095453 17155308 16795314 15999822 15197669 14210811 13439971
4114A3439971n51065n25150o91499n40022m02643m97690j97309m14129m12254
$$ 13439971 12888906 12363756 11672257 11132235 10729592 10231902 10034593 9620464 9208210
4105I208210l77508m19459k29655j41689m3670j77902m19232k58322n6859J31045
$$ 9208210 8830702 8411243 8181588 8039899 7996229 7818327 7399095 7140773 7083914 7214959
4095G214959j88015l60317j31727l6916m69200j91928l7816L9640k50433k31017
$$ 7214959 7026944 6666627 6534900 6497984 6028784 5836856 5799040 5838680 5588247 5357230
4085E357230l7094j90414o1592j95038j25013n9606r9612n8479l8462j27823j58203
$$ 5357230 5320136 5129722 5068130 4873092 4748079 4688473 4588861 4530382 4491920 4364097 4205894
4074D205894j54526n4570k44035j8688J8321k71462j46721p2313j2705M9234k81987
$$ 4205894 4051368 3996798 3752763 3734075 3752396 3480934 3334213 3261900 3249195 3298429 3016442
4063C016442j91270J10556n4086n2385p899N295j49641L0721J91101k50648m3419
$$ 3016442 2825172 2935728 2881642 2829257 2821358 2826653 2677012 2707733 2898834 2648186 2604767
4052B604767q3541j9961M5012k3067p2805K11853K1401j71376j25433K8991k19312
$$ 2604767 2521226 2501265 2546277 2523210 2450405 2662258 2683659 2512283 2386850 2415841 2196529
4041B196529J96677p6578k36288j42976J39004J42724j37933k0727q2989J35158
$$ 2196529 2393206 2316628 2080340 1937364 2076368 2219092 2081159 2060432 1977443 2112601
4031B112601R3974N0871k3858J56202j55974R5407q7373K03039Q6202P0670K17020
$$ 2112601 2206575 2257446 2233588 2389790 2233816 2329223 2241850 2444889 2531091 2601761 2818781
4020B818781J5611R267J05815k53288l51464j09629q5326k47619p7163j0734j75589
$$ 2818781 2834392 2843659 2949474 2696186 2344722 2235093 2149767 1902148 1824985 1814251 1638662
4009A638662j43722o2503m5517j05820J05395L7968J76078m2544n0208O9301p4020
$$ 1638662 1494940 1432437 1386920 1281100 1386495 1424463 1600541 1557997 1507789 1577090 1503070
3998A503070r2988J05404j39984J63598Q8063J4173k06746n0315k9127o8691J17959
$$ 1503070 1410082 1515486 1375502 1539100 1627163 1641336 1434590 1384275 1355148 1286457 1404416
3987A404416j28519K2636o3941J27854m3273K3757K5982j05280k19129O9442l2994
$$ 1404416 1275897 1298533 1234592 1362446 1319173 1342930 1368912 1263632 1044503 1113945 1080951
3976A080951M6875j30630J66494P4112M806J10282j02920Q5163k8797R206n4323
$$ 1080951 1127826 997196 1163690 1237802 1242608 1352890 1249970 1335133 1306336 1315542 1261219
3965A261219P2641j70016O8690J41268j41622J47996R204k03068j7804J33696
$$ 1261219 1333860 1163844 1232534 1373802 1232180 1380176 1389380 1186312 1168508 1302204
3955A302204r5106J60116P66M6897j24582k26089l0178L724L3473J0483P494k3224
$$ 1302204 1207098 1367214 1367980 1414877 1290295 1064206 1034028 1037752 1071225 1081708 1089202 1065978
3943A065978J21441r2317j4448l3065L2720p5825o1070j45018J03873O0809p1934
$$ 1065978 1187419 1095102 1080654 1047589 1080309 1004484 943414 798396 902269 963078 891144
3932H91144j67861r815J09753j4820j7060J54365k0730P6980k69943L2314M0092
$$ 891144 723283 713468 823221 808401 791341 945706 924976 1001956 732013 764327 804419
3921H04419L1535J68644j06292k312o3681N5219m0287O3552M5703j46839o7809
$$ 804419 835954 1004598 898306 895994 832313 887532 847245 910797 956500 809661 741852
3910G41852J42678n5767J202J26522r29l4424j28384n6945J73975M5299m1050
$$ 741852 884530 828763 829965 956487 955558 921134 792750 735805 909780 955079 914029
3899I14029K85314j8240j30041J72297J08662P3464R4647m9768p3267n7064j55342
$$ 914029 1199343 1181103 1051062 1223359 1332021 1405485 1500132 1450364 1377097 1320033 1164691
3888A164691k0636o0033J09761j55082l0529J09841N6292j8311P0475J16102J04287
$$ 1164691 1144055 1084022 1193783 1038701 1008172 1118013 1174305 1155994 1226469 1342571 1446858
3877A446858O1683j4893K1850M8662K32885J34606l4686j9766M4912K01631K08838
$$ 1446858 1508541 1493648 1515498 1564160 1797045 1931651 1896965 1877199 1922111 2123742 2332580
3866B332580R5186j97646l10524k46832j23288Q3027R8961k9270j50528j36420
$$ 2332580 2427766 2230120 1919596 1672764 1549476 1632503 1731464 1702194 1551666 1415246
3856A415246j28745n6874k53126k2039J62836j98486k00709J46964q439l3878
$$ 1415246 1286501 1229627 976501 954462 1117298 918812 718103 865067 856628 822750
3846H22750K13684p3087o9021j13975q7152K15368k0712N600p2281j75649N8792
$$ 822750 1036434 963347 894326 780351 693199 908567 887855 893455 821174 645525 704317
3835G04317m8441r6308J59992K8072J58840j13752n9112j1562n0337J80912j97745
$$ 704317 655876 559568 719560 747632 906472 792720 733608 722046 671709 852621 654876
3824F54876j57131P7845K78923J5527j87510K5499L7321J1602N7665j15209n1567
$$ 654876 497745 575590 854513 870040 682530 708029 745350 756952 814617 699408 647841
3813F47841K49032O668n8322J78679P3194j42612q998j12248j32977J60096k7403
$$ 647841 896873 903541 845219 1023898 1097092 954480 945482 833234 700257 860353 832950
3802H32950J65045J2325o8614J49193J27085J39967N1589L8606N192j27438n6618
$$ 832950 997995 1010320 941706 1090899 1217984 1357951 1409540 1448146 1453338 1325900 1269282
3791A269282Q6498j25020j95728O7596J65072p5891M4176M3484k71421K56186
$$ 1269282 1355780 1230760 1035032 1102628 1267700 1191809 1235985 1279469 1008048 1264234
3781A264234J00021j76362j4516J7623j19654K12871J1041j25427k2320J40214
$$ 1264234 1364255 1187893 1173377 1191000 1071346 1284217 1295258 1169831 1147511 1287725
3771A287725n008o5563P4225l5603L6477N6991L13789N3922o9513J9980M2877
$$ 1287725 1282717 1217154 1291379 1255776 1292253 1349244 1663033 1716955 1647442 1667422 1710299
3760A710299J07869j36800j09655O0814j9513N5794j92503M6442R8742J19632
$$ 1710299 1818168 1681368 1571713 1632527 1613014 1668808 1476305 1522747 1621489 1741121
3750A741121o0213M6562J0207p4173L07644q2110j58279R6483J04250J04527j6613
$$ 1741121 1680908 1727470 1737677 1663504 1971148 1889038 1730759 1827242 1931492 2036019 2019406
3739B019406J03748j46683k7876J69068M3474J35604k1412R524m4074O6808J10272
$$ 2019406 2123154 1976471 1948595 2117663 2161137 2296741 2275329 2284853 2240779 2307587 2417859
3728B417859J2244J86813r3976R2868L07930K36582K13575j71936K61209J87771
$$ 2417859 2430103 2616916 2522940 2615808 2923738 3160320 3373895 3201959 3463168 3650939
3718C650939J86355M3224R6012K10864J50876J88680K14480L57760L66765L87721
$$ 3650939 3837294 3880518 3976530 4187394 4338270 4526950 4741430 5099190 5465955 5853676
3708E853676L58248M94362L51430M48114M66765M87402Q14309Q31661R99613J061096
$$ 5853676 6211924 6706286 7057716 7505830 7972595 8459997 9274306 10105967 11105580 12166676
3698A2166676R65814J278907J351523J692991J846630K061593K383081K483087
$$ 12166676 13132490 14411397 15762920 17455911 19302541 21364134 23747215 26230302
3690B6230302K141672P89665r75470k473177l121929l005601k887103k196958
$$ 26230302 28371974 29161639 28186169 25712992 22591063 19585462 16698359 14501401
3682A4501401j908842j517155r62098r35179r44957q00920n22913o28114m95061
$$ 14501401 12592559 11075404 10113306 9178127 8233170 7432250 6909337 6281223 5786162
3673E786162k37068k94749m45900k06899k55052k23845j83764l19367n5835J911
$$ 5786162 5549094 5254345 4808445 4601546 4346494 4122649 3938885 3619518 3563683 3565594
3663C565594l7863k09601j11658k45101l9078j17731k88186j7223J00978j03205
$$ 3565594 3527731 3318130 3206472 2961371 2922293 2804562 2516376 2499153 2600131 2496926
3653B496926j86892J38170m0367l00624J38432q5884j75257K7516q5839M3829
$$ 2496926 2310034 2448204 2407837 2107213 2245645 2159761 1984504 2012020 1926181 1970010
3643A970010r802j26586k01946j48502L8705J3053j2692m324n6968M6378Q8269
$$ 1970010 1960208 1833622 1631676 1483174 1521879 1534932 1522240 1517916 1460948 1507326 1595595
3632A595595J08104j96319j92255p1935p7031o5209J75149J8243k1720J5085q3966
$$ 1595595 1703699 1507380 1315125 1243190 1166159 1100950 1276099 1294342 1272622 1287707 1203741
3621A203741M9710J38340j13448j88510j39079J37829J0733J01024l2758q0841
$$ 1203741 1253451 1391791 1278343 1089833 950754 1088583 1099316 1200340 1167582 1086741
3611A086741O2997j99578O568L2238J45261l9541o2753Q2502j92142k7756K3234
$$ 1086741 1149738 950160 956728 988966 1134227 1094686 1031933 1114435 922293 894537 917771
3600I17771K4792l6003L4636O4643m5680m4280j04251J94759M9249k76954Q878
$$ 917771 942563 906560 941196 1005839 960159 915879 811628 1006387 1055636 778682 787560
3589G87560N2796n6513P4748j33278l0324J11503k708O4440l2264j43755M8694
$$ 787560 840356 783843 858591 725313 694989 806492 803784 868224 835960 692205 740899
3578G40899q8493q0941O2163p3373q6460P4886Q0376K60520J8839k89453q1962
$$ 740899 652406 571465 633628 560255 473795 548681 629057 889577 908416 618963 537001
3567E37001o562J59286q977l9324M7801L0062m7347K4021J4161O3954p8526L654
$$ 537001 530439 689725 680748 641424 689225 719287 671940 695961 710122 774076 695550 699204
3555F99204O2749r3759r6283L791R5161J7446K8590p1172M5048q2023R3902L5731
$$ 699204 761953 668194 571911 575702 670863 688309 716899 645727 690775 608752 702654 738385
3543G38385j36591q0382n1616P7273k8307k1495q8672k9769K32214L6457q6895
$$ 738385 601794 521412 469796 547069 518762 497267 408595 378826 611040 647497 560602
3532E60602M2602j9020o8776J13702Q1912j74118j15414q8864J58329K91057N3825
$$ 560602 603204 584184 515408 629110 711022 536904 421490 332626 490955 782012 835837
3521H35837p8548J07355l4065n572q7014k3923j37183K6161K0696j15567m2028
$$ 835837 757289 864644 830579 825007 737993 714070 576887 603048 623744 508177 466149
3510D66149m2116j19134L2970K31293O69J14979M6664n8568j41216J2314m9629
$$ 466149 424033 304899 337869 569162 569831 684810 731474 672906 531690 544004 494375
3499D94375Q3520R5131m6680l5816o6104q0000J22413Q7786K7448p0045j01504
$$ 494375 577895 673026 626346 590530 524426 444426 566839 654625 682073 612028 510524
3488E10524j0437R9769J20141j32739j5732l1120j25157J17397p1532J11103N5238
$$ 510524 500087 599856 719997 587258 571526 540406 415249 532646 461114 572217 627455
3477F27455j02292J15095q3907n2453K2101N5115Q6588O8550n208r0297M3426
$$ 627455 525163 640258 556351 503898 525999 581114 667702 736252 731044 640747 684173
3466F84173q4759N0762M0093J2226m1817o1274j06198R8111K32217r6224m9157
$$ 684173 599414 650176 690269 702495 660678 599404 493206 591317 823534 727310 678153
3455F78153J6026j19577q9270N0929J06147j09536M7719N7142l9324L9043J02079
$$ 678153 694179 574602 485332 536261 642408 532872 580591 637733 598409 637452 739531
3444G39531O1947r745j12844K4247J01002k76463r1162J66242q4076J58034R7273
$$ 739531 801478 791733 678889 703136 804138 527675 436513 602755 518679 676713 773986
3433G73986j05873j4509k2399K3043O735O3524P5707j28151k7648K08129J9464
$$ 773986 668113 653604 631205 654248 660983 724507 800214 672063 644415 852544 872008
3422H72008j72297q902Q1243k8257M1337k8329r9320K19344J3134r2468l8214
$$ 872008 699711 690809 772052 743795 785132 756803 657483 876827 889961 797493 759279
3411G59279O9299R391J55538j25900j94315J23911O8641k5555p7877L4957M7850
$$ 759279 828578 837969 993507 867607 673292 797203 865844 840289 762412 797369 845219
3400H45219J15055j5092M0819k33230J8430j40875J65539R997k5458n3370O6054
$$ 845219 960274 945182 986001 752771 771201 630326 795865 805862 780404 727034 793088
3389G93088m1249J03586K2602P3223k2717n1050o6741k239K6761M6029J16111
$$ 793088 751839 855425 878027 951250 928533 877483 810742 808503 835264 881293 997404
3378I97404R4159R4787j19755j8173j23823j03196J87021J3304j14783J3715J11180
$$ 997404 1091563 1186350 1066595 1048422 924599 821403 1008424 1021728 906945 920660 1031840
3367A031840K1106l7987j38129P4614R0919O0620R0609j700O7960M3666n1316
$$ 1031840 1052946 1014959 876830 951444 1042363 1102983 1193592 1191892 1259852 1303518 1252202
3356A252202q4660j33136J86797m791p9594p6314o716J42312k742J82114k0788
$$ 1252202 1167542 1034406 1221203 1216412 1136818 1060504 1053788 1196100 1193358 1375472 1354684
3345A354684m2122l6781K4728k7824J25010K8023J90800k83430J0260J60952J44846
$$ 1354684 1312562 1275781 1300509 1272685 1397695 1425718 1616518 1333088 1343348 1504300 1649146
3334A649146j3568k37869N2592m5273J05972J65469q6408J41960j10134P0334
$$ 1649146 1635578 1397709 1450301 1405028 1511000 1676469 1590061 1732021 1621887 1692221
3324A692221j6721R5017J02584j83205J49398J09960J5518r2738m0148J25751
$$ 1692221 1675500 1770517 1873101 1689896 1839294 1949254 1964772 1872034 1831886 1957637
3314A957637R0351n1206R9502K549j24470j595J00032Q8221J1874P5711q544J43352
$$ 1957637 2047988 1996782 2096284 2098833 1974363 1972768 2072800 2161021 2172895 2248606 2240062 2383414
3302B383414R6276M1284j3545K11359j43169o8773m007J78248L349j33931o8820
$$ 2383414 2479690 2520974 2507429 2718788 2575619 2506846 2502839 2681087 2684436 2550505 2481685
3291B481685K20824J02343j17644J00391k9043j60381J23251K24652P4008O6347
$$ 2481685 2702509 2804852 2687208 2787599 2758556 2598175 2721426 2946078 3020086 3086433
3281C086433l5145J04361J56840n1760J79663K33450j67096p5684K13477L18145
$$ 3086433 3051288 3155649 3312489 3260729 3440392 3673842 3506746 3431062 3644539 3962684
3271C962684j13052M6185K32511J36126K87680j54963l0257L61022K2617K27091
$$ 3962684 3849632 3895817 4128328 4264454 4552134 4397171 4366914 4727936 4750553 4977644
3261D977644m0378L88637J84340J30288J80422K38989J76740L01481K45872J63656
$$ 4977644 4937266 5325903 5510243 5640531 5820953 6059942 6236682 6538163 6784035 6947691
3251F947691L56998k028J42240K68578K13160P2690j99862j87741j69632j75136
$$ 6947691 7304689 7302661 7444901 7713479 7926639 7999329 7799467 7611726 7442094 7266958
3241G266958l01338m21449n09465m52276l64345O8119k25858l11601j93044j87655
$$ 7266958 6965620 6544171 6034706 5582430 5218085 5286204 5060346 4748745 4555701 4368046
3231D368046o8312j41449j37448j62947P612j40048j00117j04877o9190o1576
$$ 4368046 4299734 4158285 4020837 3857890 3865502 3725454 3625337 3520460 3451270 3389694
3221C389694p9990k0019k425l4190j77026l2084j13587K2027j47461q4689l8619
$$ 3389694 3309704 3289685 3287260 3253070 3076044 3043960 2930373 2952400 2804939 2720250 2681631
3210B681631l5678p979P7517j26448k16714J58624J52825r0418k81156R81j3358
$$ 2681631 2645953 2637974 2715491 2589043 2372329 2530953 2683778 2593360 2312204 2313185 2299827
3199B299827j02772j12135K19166j4263k26524r9193q3869p2500Q0788r1078m5163
$$ 2299827 2197055 2084920 2304086 2289823 2063299 1964106 1880237 1807737 1888525 1797447 1752284
3188A752284k4969L18799R982r4856o4226k88081N6010J25436J651j53848l9041
$$ 1752284 1727315 2046114 2056096 1961240 1897014 1608933 1664943 1790379 1792030 1638182 1599141
3177A599141j27699O3321J29712M8529q5490L7266j13293J6476P1858m5104j61052
$$ 1599141 1471442 1534763 1664475 1713004 1627514 1664780 1551487 1567963 1639821 1594717 1433665
3166A433665N2937J77629j68171K783j993j14860l4161m6551r9970N8241J54226
$$ 1433665 1486602 1664231 1496060 1498843 1496850 1381990 1347829 1301278 1201308 1259549 1413775
3155A413775K7049L1991p2007n0024N1778J8221p6763o8069p3979j103O7768j92947
$$ 1413775 1440824 1472815 1400808 1350784 1402562 1420783 1344020 1275951 1201972 1200869 1268637 1075690
3143A075690P2850O8030j06782l7636r0771n5200k9806J909R4942J14729J14527
$$ 1075690 1148540 1216570 1109788 1072152 981381 926181 896375 898284 993226 1107955 1222482
3132A222482K7833m9888j46738l3128n2472J21979m366l9293K9719Q2721P317
$$ 1222482 1250315 1200427 1053689 1020561 968089 1090068 1085702 1046409 1076128 1158849 1166166
3121A166166j87932o6746j21267K2467J01419K2236K12679j90756k81210O4613
$$ 1166166 978234 911488 790221 812688 914107 936343 1149022 958266 677056 741669
3111G41669J05009J16410l3866j93566J55001o696O3497N7544r9389O9189o3640
$$ 741669 846678 963088 929222 735656 890657 883961 947458 1005002 905613 974802 911162
3100I11162O4234n8045k93383l5094J85754R1087n4806k3758j17729j14508O222
$$ 911162 975396 917351 623968 588874 774628 865715 810909 787151 669422 554914 561136
3089E61136K10086L0895Q0617O7465k06624p4892p6682L6600m3417O8585r9588
$$ 561136 771222 802117 882734 950199 743575 668683 592001 628601 585184 653769 554181
3078E54181Q7889J58526O5308j00020q7809J5635N3560j6005q0517K07865j4667
$$ 554181 642070 800596 865904 765884 678075 693710 747270 731265 650748 858613 843946
3067H43946j8421p3523J9862r2764o116k3553J873p2114j4859J32799P2713l9483
$$ 843946 825525 752002 771864 679100 672984 649431 651304 579190 564331 697130 769843 730360
3055G30360J96148r4108j34749J44633j36701r4592M5544R5518J248J9225j31217
$$ 730360 926508 832400 697651 842284 705583 610991 656535 752053 753301 772526 641309
3044F41309k669J45956j59557k8754K08886M8766j08962j25018J36977J06856
$$ 641309 638640 784596 625039 596285 805171 853937 744975 619957 756934 863790
3034H63790q9133j13040l5643k6243J23672J0176l6967L6465J02979q9186p468
$$ 863790 774657 661617 625974 599731 723403 733579 696612 733077 836056 746870 739402
3023G39402n2041k4892M0173J42489k9019O2752j22703Q6720l3994J2929J33425
$$ 739402 687361 662469 702642 845131 816112 878864 756161 842881 808887 821816 955241
3012I55241R6180j39978j84744K2526J54420j98306R2827J91913J14243M9820
$$ 955241 1051421 911443 726699 749225 903645 705339 798166 990079 1104322 1154142
3002A154142p4240J4121j4022j06738J9629K76403O2344m4666j31932J4353K9162
$$ 1154142 1079902 1094023 1080001 973263 992892 1269295 1331639 1286973 1155041 1169394 1198556
2991A198556j5193p1042K9061n6684J24516k9834J75828N8771k39536j73094J84495
$$ 1198556 1183363 1112321 1141382 1084698 1209214 1179380 1355208 1413979 1174443 1001349 1185844
2980A185844R5206J79423K4195r992J10252j58149J02362P6685p4451P7799K4068
$$ 1185844 1281050 1460473 1484668 1474676 1584928 1426779 1529141 1605826 1531375 1609174 1633242
2969A633242J24093K08994k80404m0003j5954O7665J24503n3245O900J54680o4479
$$ 1633242 1757335 1966329 1685925 1645922 1629968 1697633 1822136 1768891 1775791 1930471 1865992
2958A865992L632l7091k73331j4353M4227K08946K9194j9401l8222j9113K3194
$$ 1865992 1869624 1832533 1559202 1544849 1589076 1798022 1827216 1807815 1769593 1750480 1773674
2947A773674K09575j883p6059j0369Q9063n6105n960J07561P7329q8908J56205
$$ 1773674 1983249 1981366 1905307 1894938 1984001 1927896 1921936 2029497 2106826 2017918 2174123
2936B174123L48539P9768K00422j6403j95834J10840P0213r1096K8150j24135
$$ 2174123 2522662 2602430 2802852 2786449 2590615 2701455 2771668 2680572 2708722 2584587
2926B584587l6805n8415J11052O4400m2257n2597j75550J31722J74811K21462
$$ 2584587 2547782 2489367 2600419 2664819 2622562 2569965 2394415 2526137 2700948 2922410
2916B922410J41421j20747r2506P1344j6609o1128j3287L79089K59937K5003J35809
$$ 2922410 3063831 2943084 2850578 2921922 2905313 2844185 2830898 3209987 3469924 3494927 3630736
2905C630736Q3537P7602j99296j68349L0329M3067l00963j68793N5498j15277
$$ 3630736 3714273 3791875 3592579 3424230 3454559 3497626 3196663 3027870 3083368 2968091
2895B968091j0748j16496P858k01636L0185O637Q0740K5794J31648J22820j03705
$$ 2968091 2957343 2840847 2848705 2647069 2677254 2683891 2764631 2790425 2922073 3044893 2941188
2884B941188j66790J24245Q1497l3321Q8335J63643l186r9547J22915j93279k8847
$$ 2941188 2774398 2898643 2980140 2946819 3035154 3198797 3195611 3096064 3218979 3025700 2996853
2873B996853L9816j58258J7449k21064k68531m9281j19325k24378J46096N3663
$$ 2996853 3036669 2878411 2895860 2674796 2406265 2356984 2237659 2013281 2159377 2213040
2863B213040j3724o1532m0159m3400m2994J74179o1980O2598K3927j46601j32414
$$ 2213040 2199316 2137784 2097625 2054225 2011231 2185410 2123430 2186028 2209955 2063354 1930940
2852A930940j67054n8784L8777m2432k397l8691j13221j83178j1983J2376N7080
$$ 1930940 1763886 1705102 1743879 1701447 1699050 1660359 1547138 1363960 1351977 1364353 1421433
2841A421433j40170n7947k8943J802n5490P4025K0135R627j48019N066j11805
$$ 1421433 1281263 1223316 1194373 1196175 1140685 1214710 1234845 1244472 1096453 1101519 989714
2830I89714p6861l1470Q943J19700O0208j53300j01504m7409J50201J2305j60469
$$ 989714 912853 881383 890326 1010026 1070234 916934 815430 768021 918222 930527 770058
2819G70058J06965P3313k7684j12236n3954L4416m9441o1511J13445j33742j08837
$$ 770058 877023 950336 922652 810416 756462 790878 741437 679926 793371 659629 550792
2808E50792R5448j36940l3193l2264R1738O6496N6186N2937n3374k0775R8855
$$ 550792 646240 509300 476107 443843 535581 602077 658263 711200 657826 637051 735906
2797G35906r9227n0362k8216M281j51034l2266j1053N8617j77244J30616J54975
$$ 735906 636679 586317 558101 562382 411348 379082 368029 426646 249402 380018 534993
2786E34993J38454q8193l3822j00099r7039L4271K4258P3930l07228P0253R8222
$$ 534993 673447 585254 551432 451333 354294 388565 412823 486753 179525 249778 348000
2775C48000J12124o6868p0747j08615Q4505j11401J48305k3290q8683M4362L3142
$$ 348000 460124 393256 322509 213894 298399 186998 335303 312013 223330 267692 300834
2764C00834o0891K15839r1152k92999P7918o823k3234M6726N6262j7715O3044
$$ 300834 239943 455782 364630 71631 149549 142726 119492 166218 222480 204765 267809
2753B67809l6427J12048j927m0682R4211j34502j34049k9669J7793k5132O1167
$$ 267809 231382 343430 341503 300821 395032 260530 126481 96812 114605 89473 150640
2742A50640o5601J31270J04920j3471j84805O613j1271m7643J25885j13757m0604
$$ 150640 85039 216309 321229 307758 122953 129566 118295 70652 196537 82780 42176
2731D2176K36491j2515j21808l3081k5976J4715J28699o545q0216j48581J11670
$$ 42176 278667 266152 144344 111263 85287 100002 228701 222156 141940 -6641 105029
2720A05029m5920J4182p8078m060K6015J55873n5014p148n0663j1775J23618n5569
$$ 105029 59109 73291 -4787 -8847 17168 173041 118027 110879 60216 48441 172059 116490
2708A16490j0342M1279M6134n8723J3069j41982j05804o9395K7301J68715P4676
$$ 116490 106148 147427 193561 134838 147907 5925 -99879 -169274 -141973 26742 101418
2697A01418Q6445o3972l6835j00501K296J70401j18383k21751N1549P2287O354
$$ 101418 187863 123891 87056 -13445 -11149 159252 40869 -180882 -129333 -57046 -50692
2686e0692L5780P6253J3694k5182K04033j04718J48113o7225j19575J12278L6797
$$ -50692 -14912 61341 75035 49853 253886 149168 297281 230056 110481 222759 259556
2675B59556l5588o2864j06693r991P1626O5607J2570m4974j03675O9176l2896
$$ 259556 223968 161104 54411 44420 116046 181653 194223 149249 45574 114750 81854
2664H1854m8480O8689j5210J3706J64906j43471j28404K7981K07000N8097o1720
$$ 81854 33374 102063 86853 100559 265465 121994 -6410 21571 228571 286668 224948
2653B24948K4405L8626j25109K8912q8281m8699J18633K3549J7037k20320m228
$$ 224948 249353 287979 162870 191782 103501 54802 173435 196984 214021 -6299 -10527
2642a0527K40063j22979q21O9326Q6784n9749l0758J2928k13732j57215J45532
$$ -10527 229536 106557 105736 175062 261846 202097 171339 184267 -29465 -186680 -41148
2631d1148K54838R9774r792j5712m4690j2353J05004K8493m4093K2224p6319n6331
$$ -41148 213690 313464 303672 287960 243270 230917 335921 364414 320321 342545 266226 209895
2619B09895j747J7049J53684j44463m9135J19242j65398j35155J22188k8392L973
$$ 209895 208148 225197 378881 234418 185283 304525 139127 3972 126160 97768 101741
2608A01741J01183K1769K27660K0786j60422j0726j9953K9939M0642N4298o6929
$$ 101741 202924 224693 452353 473139 312717 301991 282038 311977 352619 406917 339988
2597C39988j97096J82934M9868k5765K3663j82819k32115M5486K53959n4188N0803
$$ 339988 142892 325826 375694 349929 373592 190773 -41342 4144 258103 203915 254718
2586B54718K5935j5338J2008J66075j86110j38561P1234j11613j14188K89428
$$ 254718 280653 265315 277323 443398 257288 118727 189961 78348 -35840 253588
2576B53588K4577P7399j01456r3631J28761j30883j57736J15061J29396j33545
$$ 253588 278165 355564 254108 160477 289238 158355 619 115680 245076 111531
2566A11531J85678j43856j34023n9657P6086J29368p8833J05482M767j07958K6090
$$ 111531 297209 153353 19330 -40327 35759 165127 86294 191776 196543 88585 114675
2555A14675M2357J1202K8371m923M2300Q9493k01821m7678P6964J00265O4476
$$ 114675 157032 168234 196605 191682 233982 323475 121654 73976 150940 251205 315681
2544C15681k31916n6880k3655m8600J07536p9602k10779J75631K04902l0434j71846
$$ 315681 83765 26885 3230 -45370 62166 -17436 -228215 -52584 152318 121884 -49962
2533d9962j14718R6317M5245M6532O2427N1089L7643k72847K1886J899p1350N6847
$$ -49962 -164680 -68363 -23118 23414 85841 136930 174573 -98274 -76388 -74489 -145839 -88992
2521h8992O3341l3632P2038k542p6284j40305J13520J03812J12883N3528r0728
$$ -88992 -25651 -59283 12755 10213 -66071 -206376 -92856 10956 123839 177367 86639
2510H6639O0095j50723K9154l6641n4824n154J67576m6504q7309k9178n9199j61606
$$ 86639 146734 -3989 25165 -11476 -66300 -71454 96122 49618 -37691 -66869 -126068 -287674
2498b87674p3055M2109R0597p2102J73601J47025J47172k17710n9699O136j33233
$$ -287674 -360729 -318620 -228023 -300125 -126524 20501 167673 -50037 -109736 -103600 -236833
2487b36833O3025k1217J29776r391P8859q0845J09096M812l0889R7939l9891j20575
$$ -236833 -173808 -195025 -65249 -74640 4219 -76626 32470 37282 6393 104332 64441 -56134
2475e6134j26096R0861q8205J36340O5693k36303J12116j4969l1262J6536k9117
$$ -56134 -182230 -91369 -179574 -43234 22459 -213844 -101728 -116697 -147959 -131423 -160540
2464a60540P7535J00219O2041O9760j99402q2995o3942J36519Q2552Q6069j63916
$$ -160540 -83005 17214 79255 149015 -50387 -133382 -197324 -60805 21747 107816 -56100
2453e6100m6101J76907M8977Q4160j43498J3946p4235j13681l7622P05j43358
$$ -56100 -102201 74706 123683 207843 64345 78291 4056 -109625 -147247 -146542 -289900
2442b89900P6293l828J18572J92902k61063R850p3116j5595P7581Q4899m5599
$$ -289900 -213607 -217435 -98863 94039 -167024 -157174 -230290 -245885 -168304 -83405 -129004
2431a29004J27503J65526m2426l2062k6376m8543J4782j7004k0362j9368r8067
$$ -129004 -1501 164025 121599 89537 63161 14618 29400 12396 -7966 -27334 -125401
2420a25401j9325K04174J8375o9774N2379l4206R9469j86012l9311j2851Q3563
$$ -125401 -144726 59448 77823 8049 60428 26222 125691 -60321 -99632 -112483 -28920
2409b8920O1443o4829R9269m7739J5905J0264l63337J16722Q9397P0518O8967
$$ -28920 32523 -32306 66963 19224 35129 45393 -317944 -201222 -111825 -41307 27660
2398B7660K1466k5467K1064L0764k0217k4417j68852j20338L43094J33775k37132
$$ 27660 49126 23659 44723 75487 55270 30853 -137999 -258337 84757 218532 -18600
2387a8600j8549M8811P2769k9405K573p8476M3920k1605M8738K4292o8242J40591
$$ -18600 -37149 11662 84431 55026 57599 -20877 23043 1438 50176 74468 6226 146817
2375A46817J59103J6711j903Q0819M987j90693K2990L2745p6902j51862r3977
$$ 146817 305920 322631 320728 401547 406534 215841 238831 271576 194674 42812 -51165
2364e1165J2488K70894j20796n6492L3406j0143K8283J84335K44059j43814m0049
$$ -51165 -38677 232217 111421 54929 88335 78192 106475 290810 534869 391055 351006
2353C51006m2565j49637r6368N5238L5795l5576p6603J63718J0210j0853l05494
$$ 351006 308441 158804 62436 117674 153469 117893 41290 205008 215218 204365 -101129
2342a01129k8053K26359L6683j96783k9187j6651L1986J92195j9426l00518J27230
$$ -101129 -129182 97177 133860 -62923 -92110 -108761 -76775 115420 95994 -204524 -77294
2331g7294O2815o0303l2304n1850l105M03K07116J9312j6272P4774K92983j27881
$$ -77294 -14479 -74782 -107086 -158936 -162041 -161638 45478 64790 48518 123292 416275 288394
2319B88394k20010j31708K90504L6335q141j3078j98881j292j16737j48814O8646
$$ 288394 68384 -63324 227180 263515 255374 242296 43415 42123 -74614 -223428 -154782
2308a54782K11739o2082q83L4007l9962J51805P676n1991q9927o1147K19365o2744
$$ -154782 56957 -5125 -6008 27999 -11963 139842 147518 95527 5600 -55547 163818 101074
2296A01074R9948N2061J76570m3445j00109j4380j26871J1602q6593Q515J07032
$$ 101074 201022 253083 429653 386208 286099 271719 144848 156450 69857 78372 185404
2285A85404J46454o5127M1267j59298j18649J52734j7928J96441j24781j3466
$$ 185404 331858 266731 307998 148700 30051 182785 164857 361298 236517 223051
2275B23051q3473q531J581o1471k9121K0599K46964l9864r5021m9122Q5367N4898
$$ 223051 139578 131047 132628 71157 42036 62635 309599 269735 174714 125592 210959 265857
2263B65857K0334j76607J33694M3644j38517J9706J17134J1333j25946J55510
$$ 265857 286191 109584 243278 286922 148405 168111 285245 296578 170632 326142
2253C26142K07825P825j4428m3244n1009j24207k4501m7552J78106j13934o542
$$ 326142 533967 541792 527364 484120 433111 308904 284403 236851 414957 301023 294481
2242B94481K6064p4378p7005K6151K6063J0239l9591J88643J29403j20487p6661
$$ 294481 320545 246167 169162 195313 221376 231615 192024 380667 510070 389583 312922
2231C12922J42114Q2536O0981Q7141j50674l1830j15769m9142M7995J03407J4099
$$ 312922 455036 537572 598553 685694 535020 503190 387421 338279 386274 489681 503780
2220E03780o5717n4965n5568Q4081J78982q2849J6983K4384K19672m9735k3215
$$ 503780 438063 383098 327530 411611 590593 507744 524727 549111 768783 719048 695833
2209F95833J8694n2547K31340M0822l023j87356M2004Q455P1100K2859K46718
$$ 695833 714527 661980 893320 934142 931119 743763 785767 794222 865322 888181 1134899
2198A134899r8368k39265K5774K15844J81290o7332q5708q1331P9568O5889J49451
$$ 1134899 1036531 797266 823040 1038884 1220174 1152842 1067134 985803 1065371 1131260 1280711
2187A280711N8063o1243L8090r0063P4921J34587k9090l8825J82610L94009q0983
$$ 1280711 1338774 1277531 1315621 1225558 1300479 1435066 1405976 1367151 1549761 1943770 1862787
2176A862787o9520j34160J67240R6422P293K54935K2796N4134k9522m0457L2759
$$ 1862787 1793267 1659107 1826347 1922769 1930062 2184997 2207793 2261927 2232405 2191948 2224707
2165B224707J1026L8292J17763K01373R0119m8551j18436K78901M604K7933r3021
$$ 2224707 2235733 2274025 2391788 2593161 2683280 2634729 2516293 2795194 2799798 2827731 2734710
2154B734710j38178J96538K4791L7011K08865P8383J78893J59013K14749J07629
$$ 2734710 2596532 2793070 2817861 2854872 3063737 3142120 3321013 3480026 3694775 3802404
2144C802404K00261K42445j35351J88010K53918J60604K96940J41844L84556K79906
$$ 3802404 4002665 4245110 4109759 4297769 4551687 4712291 5009231 5151075 5535631 5815537
2134E815537L43002K66792L83107M59892M35676K82005M04187N80276N59157O85524
$$ 5815537 6158539 6425331 6808438 7268330 7704006 7986011 8390198 8970474 9529631 10215155
2124A0215155O27270P80646J187164J083345J515476J481957J244332J003844
$$ 10215155 10842425 11623071 12810235 13893580 15409056 16891013 18135345 19139189
2116A9139189J245354J907589K087062K198675L040248M113577M900444N449616
$$ 19139189 20384543 22292132 24379194 26577869 29618117 33731694 38632138 44081754
2108D4081754P473966J0504103J5139390J4827136N052920j2790796k1556117
$$ 44081754 51555720 62059823 77199213 92026349 97079269 84288473 62732356
2101F2732356j5161043r839715o473784n019322l908292k848607k221751j938754
$$ 62732356 47571313 37731598 31257814 26238492 22330200 19481593 17259842 15321088
2093A5321088j196506j020453o77962n21708m51450p62434r42080p73579o28556
$$ 15321088 14124582 13104129 12426167 11904459 11453009 10690575 9748495 8974916 8346360
2084H346360p45644m71413m09559k23760j72948j47399k52195l26851l14509k94673
$$ 8346360 7600716 7129303 6719744 6495984 6323036 6175637 5923442 5596591 5282082 4987409
2074D987409j80407j35472j22153k75731k28176j83772r888k57078p5381m8315
$$ 4987409 4807002 4671530 4549377 4273646 4045470 3861698 3851810 3594732 3519351 3471036
2064C471036k77741j36075l0036j32110j23937k02469k28965M6763j28403L6203
$$ 3471036 3193295 3057220 3027184 2895074 2771137 2568668 2339703 2386466 2258063 2294266
2054B294266O8306K2143p1799k7501j88299j48070l3324j19745j21445j03415
$$ 2294266 2362572 2384715 2312916 2285415 2097116 1949046 1915722 1795977 1674532 1571117
2044A571117K2658J56615k433j64386j54047P1168K5064j5086j23091r0914J2409
$$ 1571117 1593775 1750390 1747957 1583571 1429524 1500692 1525756 1510670 1387579 1296665 1309074
2033A309074K6899M3373k3517p0416l2524o4943k14468M6221J20199l8033l7436
$$ 1309074 1335973 1379346 1355829 1285413 1252889 1187946 973478 1019699 1139898 1101865 1064429
2022A064429j17900k0459N4420J0516k18390k23400R3108J08734J65606L9525
$$ 1064429 946529 926070 980490 991006 772616 549216 642324 751058 916664 956189
2012I56189j72273Q5972j37149N2389O923j44558o8528p2864j4783J16311N8127
$$ 956189 783916 869888 732739 785128 792051 647493 578965 506101 491318 607629 665756
2001F65756m6325j07418l0999m0003J6405J50852m2091P6061l00193N1259q1870
$$ 665756 619431 512013 481014 441011 457416 608268 566177 642238 342045 393304 311434
1990C11434L6834R2188r2717k3818r177k9262N18j4555J19951N2540r4175j03339
$$ 311434 348268 440456 347739 323921 314744 285482 286000 271445 391396 443936 349761 246422
1978B46422Q3695j5738j49405k4367J00182J14357n723m0612J91212J51978j44126
$$ 246422 330117 314379 164974 140607 240789 355146 349423 308811 500023 652001 507875
1967E07875j07054j0236q8627L9198p3720j7955j23770j37521K09517Q9158k06685
$$ 507875 400821 390585 301958 341156 267436 249481 125711 -11810 197707 286865 80180
1956H0180N9023J26893K2304k31570o1398J41283J70451n1354j07326m021J9280
$$ 80180 139203 266096 288400 56830 -4568 136715 307166 255812 148486 144465 163745
1945A63745P2395m539n9146L8519k3796P8669j4985p2775Q5628j62902M73K31286
$$ 163745 236140 231601 172455 210974 187178 265847 250862 178087 263715 100813 101286 332572
1933C32572L7127j12322p2935k4968N739L817j45465m0938J26056l6675j52326
$$ 332572 369699 257377 184442 159474 165213 169030 23565 -17373 108683 72008 -80318
1922h0318J09220J49640N8412n8661j37533J73970m4196J22968r1784L5695J1793
$$ -80318 28902 178542 236954 178293 40760 214730 170534 293502 201718 237413 249206
1911B49206j69664j7877L749J33424q2291r9505K8948J96820j76953m8366J02394
$$ 249206 79542 61665 65414 198838 116547 17042 45990 242810 65857 17491 119885
1900A19885r5191O2880J25745P1399n9594m4011O3362j24273j30495J31328J60877
$$ 119885 24694 87574 213319 284718 225124 181113 244475 120202 -10293 121035 281912
1889B81912k72764j17719K13178L955j60550P6067m0885j12243Q7470j43205J43878
$$ 281912 9148 -108571 104607 108562 -51988 24079 -16806 -129049 -41579 -184784 -40906
1878d0906J75775n9795j74840K13488m617P9759j32186n3202K19821L358j51432
$$ -40906 134869 75074 -99766 113722 109105 188864 56678 3476 223297 226655 75223
1867G5223j05049O0865M0836p8555K7016O7697m7530K5996O1682k8148l8447N1158
$$ 75223 -29826 31039 71875 -6680 20336 88033 40503 66499 128181 100033 61586 112744
1855A12744n0470K4155J7915q5889N7922N2166J700J00349K9918j37246L7296
$$ 112744 62274 86429 104344 18455 76377 128543 130243 230592 260510 123264 160560
1844A60560k6881J01748p6641K5421N8343o3217R8507J99109n1060o4808O9831
$$ 160560 133679 235427 158786 184207 242550 179333 277840 476949 425889 361081 430912
1833D30912k7958J7127j56171j61330K0591M6081n364K6387J26955r2060j76327
$$ 430912 402954 420081 263910 102580 123171 169252 163888 190275 317230 225170 48843
1822D8843r1298J85648J17789j40577J9142j37187n9540o3685O2518P7436J80339
$$ 48843 -42455 143193 260982 120405 139547 2360 -57180 -120865 -58347 19089 199428
1811A99428J02534j6160j29497p5394O5359j89421O0219k9840o0054N648J41302
$$ 199428 301962 285802 156305 80911 146270 -43151 17068 -12772 -72826 -67178 74124
1800G4124J19204j24287O0358r3513l0287j6389k16845j9453J7242m590J29291
$$ 74124 193328 69041 129399 35886 5599 -10790 -227635 -247088 -229846 -234436 -105145
1789a05145L37762m5640j77294R8268K8462O1536j75658j21808R6561o3281o1319
$$ -105145 232617 186977 9683 107951 136413 197949 22291 -99517 -2956 -66237 -127556
1778a27556R988j87567J37146K28731J3789k5068j8889N081j54292r2479N6480
$$ -127556 -117568 -305135 -167989 60742 74531 49463 30574 35655 -118637 -211116 -154636
1767a54636J9862J17721l1274J38417p0392k34321n0912L5007J07587j49491J41935
$$ -154636 -134774 -17053 -48327 90090 19698 -214623 -265535 -230528 -122941 -272432 -130497
1756a30497K84450j041m4902j62478m1655L9890J63345q6252O9605R8521m9220
$$ -130497 153953 152912 108010 -54468 -96123 -56233 107112 20860 90465 188986 139766
1745A39766j07169J40395o7742P9941m8798j17398q9138J68322J3046k77618K91467
$$ 139766 32597 172992 105250 185191 136393 18995 -70143 98179 111225 -166393 125074
1734A25074j67938n328R1407j59800Q9258l3949j11009J3443O1020J02378r8625
$$ 125074 -42864 -48192 43215 -116585 -27327 -61276 -172285 -158842 -97822 4556 -94069
1723i4069q7459K00563j84695J15585m9021l8702J35707j42882P2534m6327K4346
$$ -94069 -181528 19035 -165660 -50075 -99096 -137798 -2091 -144973 -72439 -118766 -94420
1712i4420m1802r4817j26216K34004Q1291R6787Q4682j2724J52146o4133k02776
$$ -94420 -136222 -231039 -357255 -123251 -41960 54827 139509 126785 278931 214798 12022
1701A2022J28261r2659n6703P9926k233l4490j03219M5709J0620P772j14012j35033
$$ 12022 140283 47624 -9079 70847 68614 34124 -69095 -23386 -12766 -4994 -119006 -254039
1689b54039L5073J3932J7914K7741J64556q53J62406j69988j9390k9302m4357
$$ -254039 -218966 -205034 -187120 -159379 5177 4324 166730 -3258 -22648 -51950 -96307
1678i6307p230j08363l1142R2785J0602m502o8337J4369J51479O5691o2493L7152
$$ -96307 -103537 -211900 -243042 -150257 -139655 -144157 -212494 -198125 -46646 19045 -43448 -6296
1666f296J52139l9571k42074J36038M0521k6910m8650o3147O6813K9171Q7687
$$ -6296 145843 106272 -135802 236 40757 13847 -34803 -97950 -31137 -1966 85721
1655H5721j22881Q7040l09998P6131P8541R9596J5083j55037J12643K1264L0223
$$ 85721 -37160 49880 -260118 -183987 -105446 -5850 9233 -145804 -33161 -11897 18326
1644A8326j13289j16758K21712Q7686o490q8786Q6708k74448o1001L37191K7238
$$ 18326 -94963 -211721 9991 97677 91187 2401 89109 -185339 -246340 90851 118089
1633A18089j20292m649R2652j25865m2200r5181K6581N2590N1595J25245k31352
$$ 118089 -2203 -6852 85800 -40065 -82265 -177446 -150865 -98275 -46680 78565 -152787
1622a52787M7289m476k4687J27717q9276j25454J69119N9848q2752p0967J36398
$$ -152787 -105498 -109974 -134661 -6944 -96220 -221674 -52555 7293 -75459 -146426 -10028
1611a0028r600j01951N9780J57611o6459q0773J49644m9914k8650o8271J23126
$$ -10028 -19628 -121579 -61799 95812 29353 -51420 98224 48310 19660 -48611 74515
1600G4515m0456M065M5645M2012n6504m5383L1257J24860j47062j34631M8869
$$ 74515 34059 38124 83769 125781 69277 23894 55151 180011 32949 -101682 -52813
1589e2813J90485L5427j37130k5860j68459l1943j56625J2889j36M7353J33349
$$ -52813 137672 173099 35969 10109 -158350 -190293 -346918 -334029 -334165 -286812 -153463
1578a53463J04414M9977O4308J13438j71650M2135K8901o7091m8259p6538J28397
$$ -153463 -49049 928 65236 178674 7024 49159 78060 10969 -37290 -113828 14569
1567A4569l8991K80M8862o2481J4126o5545K244n8984j1102K8627J29063J47655
$$ 14569 -24422 -24142 24720 -37761 -23635 -89180 -86936 -145920 -157022 -128395 668 148323
1555A48323r4837j53703j78979J83887K61941p1141r5368o3947P6209O0203n2306
$$ 148323 53486 -100217 -279196 -95309 166632 95491 123 -63824 12385 72588 20282
1544B0282r3856k5733J533J01040M5128l9453p2319p3659J1788j1445j01381J0119
$$ 20282 -73574 -99307 -97774 3266 48394 8941 -63378 -137037 -125249 -136694 -238075 -227956
1532b27956J02791J79453o9108o6752j30353L9999l8568O4539J95561p0704Q351
$$ -227956 -125165 54288 -14820 -81572 -211925 -171926 -210494 -145955 49606 -21098 -12747
1521a2747K34060R8759k06668q5275J7191j26685p9310K08106j19509o4566J69125
$$ -12747 221313 320072 113404 28129 45320 -81365 -160675 47431 -72078 -136644 32481
1510C2481R300J58216j8384K742j01736o369j00820K6447K05087R5108n0552k14035
$$ 32481 41781 199997 181613 184355 82619 76250 -24570 1877 206964 302072 251520 37485
1498C7485j12199Q1540J45703r6338j62738P3433j38128j29133J15659k3499J07572
$$ 37485 -74714 6826 152529 56191 -106547 -33114 -171242 -300375 -184716 -208215 -100643
1487a00643n3063J12087Q4238J7429k86843Q9346R7175J24032j0457M1430k00945
$$ -100643 -153706 -41619 42619 60048 -226795 -137449 -40274 83758 73301 114731 -86214
1476h6214Q3352J92500k08064k7961J32335m6135n6435n2817J69891L2493j71162
$$ -86214 -2862 189638 -18426 -46387 85948 39813 -16622 -69439 100452 132945 -38217
1465c8217M4429j4415o4048J03365P0877j56999j35711K8399J23776Q4071K3119
$$ -38217 6212 -8203 -72251 31114 101991 -55008 -190719 -162320 -38544 45527 68646
1454F8646j46208N9174l0728l8594K48650m315k23489Q8637j37423Q616J12430
$$ 68646 -77562 -18388 -49116 -87710 160940 156625 -66864 21773 -115650 -107034 5396
1443E396k45493o0114K48361M9209J13624k7001j59491j7634K6498k8550J38051
$$ 5396 -240097 -300211 -51850 -2641 110983 83982 -75509 -93143 -66645 -95195 42856
1432D2856o3140p6190J71864o6165m8685j47139J5505k3063K02720L937p9355
$$ 42856 -20284 -96474 75390 9225 -39460 -186599 -171094 -194157 8563 12500 -66855
1421f6855J31879K4854j68571j64468J49416M8619j22883K32180J93465k88834
$$ -66855 65024 89878 -78693 -243161 -93745 -45126 -168009 64171 257636 -31198
1411c1198j4017j33905M4652r1045R5712P1745n4396K5963P0530Q7948j36216
$$ -31198 -45215 -179120 -134468 -225513 -129801 -58056 -112452 -86489 -15959 71989 -64227
1400f4227l7671Q6998j7399J12014M1846q9096l2643l4275J06581M4202M4103
$$ -64227 -101898 -14900 -32299 79715 121561 32465 -178 -34453 72128 116330 160433
1389A60433j5878m5274j80662j5691o3021J01744j29090K9298o2650J55990M4264
$$ 160433 144555 99281 -81381 -97072 -160093 -58349 -187439 -158141 -220791 -64801 -20537
1378b0537o6663O690M0928j8092k9148J03642J87204j04511r0287K20560m7562
$$ -20537 -87200 -80510 -39582 -57674 -86822 16820 204024 99513 9226 229786 182224
1367A82224N9690p9387K9957o2141J264m3650J6922j02718k06780k7558L2517
$$ 182224 241914 162527 192484 130343 131607 87957 104879 2161 -204619 -232177 -199660
1356a99660J33067K71467k9863M1344j43277n8864Q5054J73866q0173n4971K49
$$ -199660 -66593 204874 175011 216355 73078 14214 99268 273134 192961 137990 138239
1345A38239m0098j00981p3923R7257O3796j30604K2167K4053m642j21169j20672
$$ 138239 98141 -2840 -76763 20494 84290 -46314 -24147 -94 -4736 -125905 -246577
1334b46577J45061k03473J64038L83403l95088j5687L7811P158K6685M3860J12795
$$ -246577 -101516 -304989 -140951 242452 -152636 -168323 -130512 -123354 -96669 -52809 59986
1323E9986m2211j21549l1615j272K04233j42332O561J22284M3214J19832o6154
$$ 59986 17775 -103774 -135389 -136661 67572 -74760 -68199 54085 97299 217131 150977
1312A50977q2168j12049J73717o4425k8606j44137J06493k00354K9243J49864
$$ 150977 68809 -43240 130477 66052 37446 -106691 -198 -200552 -171309 -21445
1302b1445J62886k00904k89575J88431L9424p8201K3498r996N2030K18184J38695
$$ -21445 141441 -59463 -349038 -160607 -121183 -199384 -175886 -185882 -133852 84332 223027
1291B23027k91557l8645j15276K35194J24504l622m3697k38857J41833o666n3044
$$ 223027 -68530 -107175 -222451 12743 137247 133625 89928 -148929 -7096 -13762 -66806
1280f6806j95672R4844N7892p9Q3786k982p6234j57891J96042K48444k02412j40662
$$ -66806 -262478 -167634 -109742 -109821 -26035 -29017 -105251 -263142 -67100 181344 -21068 -161730
1268a61730J01610Q9058j8691q4583K8155J11600o3759j36764J39232J08802j02135
$$ -161730 -60120 28938 10247 -74336 -46181 65419 1660 -135104 4128 112930 10795
1257A0795M8769j12692P4511M2607J5531O2844p2465j12945J8877p6589p9748
$$ 10795 59564 -53128 21383 63990 79521 142365 69900 -43045 -24168 -100757 -180505
1246a80505J61635n9265j577O0975Q023N2702p3801k03478J21757Q0474N8559
$$ -180505 -18870 -78135 -79712 -18737 -10714 41988 -31813 -235291 -113534 -33060 25499
1235B5499o225o3401j06938R1817J37068l258j94168k0196N6892l0049K6822j16873
$$ 25499 19274 -44127 -151065 -59248 77820 74562 -119606 -139802 -82910 -112959 -86137 -203010
1223b03010J129J2182o5410J37962L9845r174r1032r213l5803J22366q8754l2987
$$ -203010 -201881 -189699 -255109 -117147 -77302 -86476 -177508 -186721 -222524 -100158 -188912 -221899
1211b21899N0274j02143J7959K00684J28656L1364j34687L7588j5834R4092K9565
$$ -221899 -171625 -273768 -255809 -55125 73531 104895 -29792 7796 -8038 86054 115619
1200A15619j90107q5800O9904j5297J58492j7599R3224j68328k8310K18548j66406
$$ 115619 -74488 -160288 -90384 -105681 52811 35212 128436 -39892 -68202 150346 -16060
1189a6060O4217J74157M3367j43649L0139q6511O5813j25438q825j29597J169
$$ -16060 48157 222314 265681 122032 152171 65660 131473 6035 -2790 -132387 -131218
1178a31218J31869J59957m8207K5440k3866J11012P5857M0568k34814O1737o2715
$$ -131218 651 160608 112401 137841 113975 224987 300844 341412 106598 168335 105620
1167A05620j37746M4508L3103L3961J86836j9229j79653q550j20170M8281J4952
$$ 105620 -32126 12382 45485 79446 266282 247053 67400 58850 -61320 -13039 1913
1156A913m0640N7206j24564K10472K2840o6643n3456J02339m4998j57146r6691
$$ 1913 -38727 18479 -106085 104387 127227 60584 7128 109467 64469 -92677 -189368
1145a89368J18892n0750l3682R0117j40921J29846l5398R2397p4012j21535J92339
$$ -189368 -70476 -121226 -154908 -64791 -205712 -75866 -111264 -18867 -92879 -214414 -22075
1134b2075J04881p9091M0376N2088j21953j6423R7832Q6821j37155J4763j5530
$$ -22075 82806 3715 44091 96179 -25774 -42197 55635 142456 5301 20064 4534
1123D534j28758o9324J39692r2288J3396J02439l6235L8919K3520j1513k04887
$$ 4534 -124224 -193548 -53856 -146144 -132748 -30309 -66544 -27625 -4105 -15618 -220505
1112b20505r2832J62261J76907j10724p1838J74764q0492o7473J07103J12255
$$ -220505 -313337 -151076 25831 -84893 -156731 18033 -62459 -129932 -22829 89426
1102H9426K20192l40371j53444k0237L9663K47924p3807j43294J15815L5001J85980
$$ 89426 309618 -30753 -184197 -204434 -164771 83153 9346 -133948 -18133 16868 202848
1091B02848r7531j18286P8534N2466l2130R1541N1962j46690k68581J07302R0326
$$ 202848 105317 -12969 65565 118031 85901 177442 229404 82714 -185867 -78565 11761
1080A1761R5457n1388l7062K23833j13986k06219O9998m6338L651Q2017O2626
$$ 11761 107218 55830 18768 242601 128615 -77604 -7606 -53944 -50293 31724 94350
1069I4350k1782k8044r0467J17247r482k63134L3505K60946j8190q6319k958J2619
$$ 94350 72568 44524 -45943 71304 61822 -201312 -167807 93139 74949 -11370 -14328 -1709
1057a709K575l779j9227J3765o3616P5176P3976j21865L5074j39R984R1257m2024
$$ -1709 866 -2913 -22140 -8375 -71991 3185 77161 -44704 -9630 -9769 215 91472 49448
1044D9448q358j56364K7571J53883R0610j6758k70460J60518j21182k29890J35799
$$ 49448 41090 -115274 -87703 66180 156790 140032 -130428 30090 -91092 -320982 -185183
1033a85183Q8171J7207P2424J98259m3937m2187j31794r495J79249j56463k9355
$$ -185183 -97012 -79805 -7381 190878 146941 104754 -27040 -36535 142714 -13749 -43104
1022d3104J18259K14546j24758r012O423r3432q9528J08364l2969j90702J0960
$$ -43104 75155 289701 164943 155931 162354 68922 -20606 87758 54789 -135913 -124953
1011a24953j4742L5393n8309P0605q294K6544N4762k5998j48525L9299J33034
$$ -124953 -139695 -104302 -162611 -92006 -100300 -73756 -18994 -44992 -193517 -154218 -21184
$$ [...]
##END NTUPLES=NMR SPECTRUM
##END=
