##TITLE=1H_EC-3274
 CDCl3
 8 sc, 
 31.05.2022
##JCAMPDX= 6.0         $$ Bruker NMR JCAMP-DX V2.0
##DATA TYPE= NMR SPECTRUM
##DATA CLASS= NTUPLES
##ORIGIN= UXNMR, Bruker Analytische Messtechnik GmbH
##OWNER= root
$$ XWIN-NMR		Version 3.5
$$ Wed Jun  1 14:36:15 2022 Russian Standard Time (UT+4h)  she@DPX200
##.OBSERVE FREQUENCY= 200.13135
##.OBSERVE NUCLEUS= ^1H
##.ACQUISITION MODE= SIMULTANEOUS
##.ACQUISITION SCHEME= undefined
##.AVERAGES= 8
##.DIGITISER RES= 18
##SPECTROMETER/DATA SYSTEM= spect
##.PULSE SEQUENCE= zg30
##.SOLVENT NAME= CDCl3
##.SHIFT REFERENCE= (INTERNAL, CDCl3, 0, 15.7425)
##AUDIT TRAIL= $$ (NUMBER, WHEN, WHO, WHERE, WHAT)
$$ ##TITLE= Audit trail, XWIN-NMR		Version 3.5
$$ ##JCAMPDX= 5.01
$$ ##ORIGIN= Bruker BioSpin GmbH
$$ ##OWNER= she
$$ F:/spectra/data/she/nmr/H-F/1/pdata/1/auditp.txt
$$ ##AUDIT TRAIL=  $$ (NUMBER, WHEN, WHO, WHERE, WHAT)
(   1,<2022-06-01 14:35:03.70 +0400>,<she>,<DPX200>,
      <created by zg, POWCHK disabled, PULCHK disabled
       configuration hash MD5:
       00 E9 B6 7A A2 85 ED C7 34 08 36 98 17 FE 4E 26
       data hash MD5: 16K
       25 42 51 19 4D FC 71 91 38 0C 18 8F 1D 81 1B 90>)
(   2,<2022-06-01 14:35:06.76 +0400>,<she>,<DPX200>,
      <Start of raw data processing
       efp BC_mod = 2 LB = 0.24 FT_mod = 6 PKNL = 1 PHC0 = -18040.85 PHC1 = 16.40074 SI = 16K 
       data hash MD5: 16K
       2E AD CD 6E E9 0A 2C EB A2 D6 F6 36 77 56 77 85>)
(   3,<2022-06-01 14:35:27.15 +0400>,<she>,<DPX200>,
      <pk PHC0 = 7.746092 PHC1 = -10.8 
       data hash MD5: 16K
       A2 61 48 D9 3B 1D 46 8F 27 87 CE 53 08 F9 13 1A>)
(   4,<2022-06-01 14:35:30.54 +0400>,<she>,<DPX200>,
      <abs ABSG = 5 
       data hash MD5: 16K
       CC 5D 99 AB 37 6F F8 8C 7D 4E 30 E3 C3 45 B8 38>)
$$ ##END=
$$ 
$$ hash MD5
$$ C3 37 7D C8 B8 D3 C5 FF 52 23 D7 50 8E 9B DF 4E
##$RELAX= 
##$RELAX= 
##$RELAX= 
##$RELAX= 
##$RELAX= 
##$RELAX= 
$$ Bruker specific parameters
$$ --------------------------
##$DU= <F:/spectra>
##$EXPNO= 1
##$NAME= <H-F>
##$PROCNO= 1
##$TYPE= <nmr>
##$USER= <she>
##$AMP= (0..31)
100 100 100 100 100 100 100 100 100 100 100 100 100 100 100 100 100 100 
100 100 100 100 100 100 100 100 100 100 100 100 100 100 
##$AQSEQ= 0
##$AQ_mod= 1
##$AUNM= <au_zg>
##$AUTOPOS= <>
##$BF1= 200.13
##$BF2= 200.13
##$BF3= 200.13
##$BF4= 200.13
##$BF5= 200.13
##$BF6= 200.13
##$BF7= 200.13
##$BF8= 200.13
##$BYTORDA= 1
##$CFDGTYP= 0
##$CFRGTYP= 5
##$CHEMSTR= <none>
##$CNST= (0..31)
1 1 145 1 1 1 1 1 1 1 1 1 1 1 1 1 1 1 1 1 1 1 1 1 1 1 1 1 1 1 1 1 
##$CPDPRG= <>
##$CPDPRG1= <>
##$CPDPRG2= <>
##$CPDPRG3= <>
##$CPDPRG4= <mlev>
##$CPDPRG5= <mlev>
##$CPDPRG6= <mlev>
##$CPDPRG7= <mlev>
##$CPDPRG8= <mlev>
##$CPDPRGB= <>
##$CPDPRGT= <>
##$D= (0..31)
0 1.2 0 0 0 0 0 0 0 0.06 0 0.03 0 0 0 0 0.0002 0 0 0 0 0 0 0 0 0 0 0 0 
0 0 0 
##$DATE= 1654079703
##$DBL= (0..7)
120 120 120 120 120 120 120 120 
##$DBP= (0..7)
150 150 150 150 150 150 150 150 
##$DBP07= 0
##$DBPNAM0= <>
##$DBPNAM1= <>
##$DBPNAM2= <>
##$DBPNAM3= <>
##$DBPNAM4= <>
$$ [...]
##$SUBNAM2= <"">
##$SUBNAM3= <"">
##$SUBNAM4= <"">
##$SUBNAM5= <"">
##$SUBNAM6= <"">
##$SUBNAM7= <"">
##$SUBNAM8= <"">
##$SUBNAM9= <"">
##$SW= 18.05172834244
##$SWIBOX= (0..15)
0 0 2 0 0 0 0 0 0 0 0 0 0 0 0 0 
##$SW_h= 3612.71676300578
##$TD= 16384
##$TD0= 1
##$TE= 0
##$TE2= 300
##$TE3= 300
##$TEG= 300
##$TL= (0..7)
0 120 120 120 120 120 120 120 
##$TP= (0..7)
150 150 150 150 150 150 150 150 
##$TP07= 0
##$TPNAME0= <>
##$TPNAME1= <>
##$TPNAME2= <>
##$TPNAME3= <>
##$TPNAME4= <>
##$TPNAME5= <>
##$TPNAME6= <>
##$TPNAME7= <>
##$TPOAL= (0..7)
0.5 0.5 0.5 0.5 0.5 0.5 0.5 0.5 
##$TPOFFS= (0..7)
0 0 0 0 0 0 0 0 
##$TUNHIN= 0
##$TUNHOUT= 0
##$TUNXOUT= 0
##$USERA1= <user>
##$USERA2= <user>
##$USERA3= <user>
##$USERA4= <user>
##$USERA5= <user>
##$V9= 5
##$VALIST= <valist>
##$VCLIST= <CCCCCCCCCCCCCCC>
##$VD= 0
##$VDLIST= <DDDDDDDDDDDDDDD>
##$VPLIST= <PPPPPPPPPPPPPPP>
##$VTLIST= <TTTTTTTTTTTTTTT>
##$WBST= 1024
##$WBSW= 4
##$XGAIN= (0..3)
0 0 0 0 
##$XL= 0
##$YL= 0
##$YMAX_a= 261626
##$YMIN_a= -341856
##$ZGOPTNS= <>
##$ZL1= 120
##$ZL2= 120
##$ZL3= 120
##$ZL4= 120
##$ABSF1= 15.7524
##$ABSF2= -2.299449
##$ABSG= 5
##$ABSL= 3
##$ALPHA= 0
##$AQORDER= 0
##$ASSFAC= 0
##$ASSFACI= 0
##$ASSFACX= 0
##$ASSWID= 0
##$AUNMP= <proc_1d>
##$AZFE= 0.1
##$AZFW= 0.1
##$BCFW= 0
##$BC_mod= 2
##$BYTORDP= 0
##$COROFFS= 0
##$CY= -3
##$DATMOD= 1
##$DC= 0
##$DFILT= <>
##$DTYPP= 0
##$F1P= 0
##$F2P= 0
##$FCOR= 1
##$FTSIZE= 16384
##$FT_mod= 6
##$GAMMA= 0
##$GB= 0
##$INTBC= 1
##$INTSCL= 0
##$ISEN= 128
##$LB= 0.24
##$LEV0= 0
##$LPBIN= 0
##$MAXI= 10000
##$MC2= 0
##$MEAN= 0
##$ME_mod= 0
##$MI= 1.114404
##$NCOEF= 0
##$NC_proc= -5
##$NLEV= 6
##$NOISF1= 3.799351
##$NOISF2= 2.8
##$NSP= 0
##$NTH_PI= 0
##$NZP= 0
##$OFFSET= 15.74248
##$PC= 1
##$PHC0= -18033.1
##$PHC1= 5.600739
##$PH_mod= 1
##$PKNL= yes
##$PPARMOD= 0
##$PSCAL= 0
##$PSIGN= 0
##$REVERSE= no
##$SF= 200.130005815857
##$SI= 16384
##$SIGF1= 3
##$SIGF2= 2
##$SINO= 5.538805
##$SIOLD= 16384
##$SREGLST= <1H.CDCl3>
##$SSB= 0
##$STSI= 16384
##$STSR= 0
##$SW_p= 3612.71676300578
##$SYMM= 0
##$S_DEV= 0
##$TDeff= 16384
##$TDoff= 0
##$TI= <>
##$TILT= no
##$TM1= 0
##$TM2= 0
##$TOPLEV= 0
##$USERP1= <user>
##$USERP2= <user>
##$USERP3= <user>
##$USERP4= <user>
##$USERP5= <user>
##$WDW= 1
##$XDIM= 16384
##$YMAX_p= 282015521
##$YMIN_p= -652753
$$ End of Bruker specific parameters
$$ ---------------------------------
##NTUPLES= NMR SPECTRUM
##VAR_NAME=  FREQUENCY,     SPECTRUM/REAL,   SPECTRUM/IMAG
##SYMBOL=    X,             R,               I
##VAR_TYPE=  INDEPENDENT,   DEPENDENT,       DEPENDENT
##VAR_FORM=  AFFN,          ASDF,            ASDF
##VAR_DIM=   16384,         16384,           16384
##UNITS=     HZ,            ARBITRARY UNITS, ARBITRARY UNITS
##FACTOR=    0.220516191357247, 1,           1
##FIRST=     3150.54266959518, 0,            0
##LAST=      -462.174093410597, 0,           0
##MIN=       -462.174093410597, -652753,     0
##MAX=       3150.54266959518, 282015521,    0
$$ Real data points
##PAGE= N=1
##DATA TABLE= (X++(R..R)), XYDATA
$$ [...]
11505 -88248 -13759 39951 -8904 49803 -2355 -52226 14069 4644 38139 54201 25454 -7571
11493 -7571 -11872 48272 11880 -39722 -54286 -117376 22498 31934 -117156 -37683 3940 -7888
11481 -7888 -9664 -11884 -72365 -101319 -54715 12534 44631 -46141 -43472 26217 82781 4785
11469 4785 338 109996 103840 53321 56235 50466 -26927 -138382 -105285 -139511 -63557 -103618
11457 -103618 -60395 -53547 -13438 -7040 -192 5117 -29068 -57870 -10139 42039 117986 87717
11445 87717 127641 95811 37341 21797 -106614 -9808 6348 457 -24920 -25347 -53583 -31369
11433 -31369 -64796 -48698 -20108 -48601 -18269 3959 21034 49858 24375 13591 -15133 47877
11421 47877 9413 -85677 -93542 9671 8051 30100 11860 -43541 39781 107840 44373 34982
11409 34982 28274 16540 -5848 -52697 -41466 -14657 15546 56801 40584 -71668 -64754 -62758
11397 -62758 -67553 39622 103489 70783 79993 47257 -67056 -151353 -91481 -16057 -6793 62857
11385 62857 41730 44566 10985 73000 -8281 5193 105052 119358 112207 58767 35197 29248
11373 29248 44357 16970 34730 4122 -79587 -29152 31108 20627 -24825 -35928 -2350 -10393
11361 -10393 -68945 -60419 18942 28185 44584 46913 71557 47773 -58749 5950 7703 -75060
11349 -75060 -69427 -19842 14877 -64457 -23627 40607 70266 34724 -10458 -36513 -87716 -70313
11337 -70313 -77960 -40463 -13222 -56266 -32763 -38561 -20102 -49398 -105467 -73565 32705 -26273
11325 -26273 35120 85527 39397 -12857 -52929 33828 73000 15699 -44723 -27973 41545 -60713
11313 -60713 -12127 6600 -27649 46521 7451 -16540 -30646 17899 -8790 43053 94964 35642
11301 35642 30086 52654 16508 31854 10597 -1860 18528 85782 42336 12922 22556 63854
11289 63854 15151 -7753 49160 39257 41650 26011 31305 -455 26587 -44553 -23911 68859
11277 68859 35966 -39229 51262 22487 -33049 67120 -14614 2648 6143 -21480 6847 -57534
11265 -57534 42147 8754 -34698 -56592 -101926 -91953 -80468 -52910 7612 2366 60629 85698
11253 85698 110681 94883 10511 48562 22310 66527 60899 -38921 -63600 23150 34508 -12636
11241 -12636 -103857 -16598 38253 15247 8663 16231 75470 -12518 -10524 36233 17584 -10668
11229 -10668 24323 7005 -3988 7414 -30212 -35720 19321 46595 55983 68595 18531 -8364
11217 -8364 -18514 -31529 -56814 -95995 -76223 -68597 -131145 -104350 -88862 -62422 -39765 5239
11205 5239 -11071 -66599 -9736 -16650 3382 -36000 -46569 -53397 -90179 -83353 -36888 16351
11193 16351 28689 -85127 -75398 -19135 -72116 28647 22271 23597 6736 88320 16896 -72721
11181 -72721 -52006 -33243 -111126 -79683 10659 2111 -3732 -10544 28738 26907 -7711 19815
11169 19815 -116543 -115762 -69543 -37732 8288 -18715 10040 -15500 -25212 19195 42463 7931
11157 7931 73745 25191 -41454 23553 79139 -31077 -52820 -47284 -4216 -10321 32602 -45018
11145 -45018 -60087 -285 1839 -13833 -13936 -7339 -24624 39515 35856 3342 -22300 -78546 -44489
11132 -44489 10162 3680 36571 24810 -18193 -50008 -42116 -25071 17546 -71533 -118460 -99896
11120 -99896 -12664 -9949 -26458 17942 21764 14354 -42264 -63763 -91271 -51028 -43541 42427
11108 42427 -3441 -32203 -22056 -40605 -55660 -56220 -11925 -16939 -71851 -40715 -52116 -16630
11096 -16630 -39128 -114526 -87593 -114457 -33507 -18150 -62582 -7010 -16545 -71494 -20314 -24703
11084 -24703 -2228 -51645 -109911 -156025 -119615 -29203 23433 36758 5739 16803 -55215 -39607
11072 -39607 3093 40417 28783 35196 26963 30324 46815 36371 -23078 -78554 -9274 -24465
11060 -24465 12728 -22235 45862 30144 73225 33573 -65389 -87840 -117955 -52997 -118766 -206985
11048 -206985 -97546 53542 38643 119391 122294 22993 18031 27326 52423 34281 14209 -42746
11036 -42746 -11958 7225 82097 100764 36481 -8438 -43243 -67342 -66918 -11477 52983 -78414
11024 -78414 -148904 -108444 -43752 29246 5644 -29456 -32580 7883 -31752 -137238 -58268 -17465
11012 -17465 -14483 48567 -8943 31547 -6941 -7330 -56930 -24536 -12618 -34186 4395 12037
11000 12037 -21680 19561 45053 -42293 -53002 -23658 -41082 -59863 -89823 -43395 -38071 53903
10988 53903 30463 14466 -13059 -7566 -36299 8111 90104 35424 -28092 -60773 23987 -50806
10976 -50806 -32898 15617 60013 79571 21257 -25514 -92714 -79418 -32367 -20545 -17496 6901
10964 6901 17322 -43107 -23388 -1628 43569 11306 -840 19773 -23942 -54110 3666 96590
10952 96590 92861 70416 84195 112119 14059 4689 25240 16398 -30886 -47238 -21592 15724
10940 15724 -43068 -6320 -35801 14148 -1865 -12317 -36746 -32168 16354 48187 -17427 -22426
10928 -22426 83637 50888 76644 7961 59497 -14133 -5528 1899 41297 75167 57355 16428
10916 16428 -10081 -70467 -39190 35109 -35806 -42529 -46772 -36090 -46193 -61895 23085 -20838
10904 -20838 -10987 -24434 15999 -16460 -62427 -55618 4186 29952 31891 70384 57690 53049
10892 53049 60468 24152 27698 -86640 -9953 34971 4585 23330 -23451 -76678 -45643 70739
10880 70739 111969 95392 29234 -79023 -31323 44448 54978 54498 46947 -79901 -62146 19098
10868 19098 -55280 -45927 -97229 -19211 -25496 -54672 -46822 -101076 -43675 10290 -68810 -18305
10856 -18305 -33722 -52700 -7123 -22870 -22395 36492 -6743 16735 -60807 -126391 -117187 -3804
10844 -3804 23796 12334 37594 4147 9490 98755 30809 -3871 44038 26034 -60728 -46813
10832 -46813 -27063 -29922 -38000 -80128 -102183 -30098 24923 -46884 -27828 36386 -4038 12563
10820 12563 15246 16855 -12106 4407 5907 22281 32859 42431 49496 5645 -21541 65810 111390
10807 111390 68974 37664 32999 58185 54369 12669 6516 10296 -25471 66662 -12397 37807
10795 37807 45527 71896 82423 60344 -15014 -19398 14061 27548 27607 -20786 -124636 -75283
10783 -75283 -9866 11635 -36028 -60274 -32691 -60315 -36154 -2490 -57079 -63502 -13294 -12267
10771 -12267 -54100 -987 -27767 -11000 36125 2155 -19492 -14413 -12971 28398 24953 -92386
10759 -92386 -87283 -75703 -128453 -73414 80417 13957 -27401 42656 72698 3629 -49124 -40837
10747 -40837 34556 -20881 -94354 -72653 33002 -18295 -41937 -5770 -22992 -5460 -33878
10736 -33878 12574 59321 91716 28110 -4431 -43346 -5996 15681 76864 62448 15847 18721
10724 18721 8938 4415 11476 21560 24059 81077 15774 20176 21105 33840 -58144 -137792 -58528
10711 -58528 -40219 1948 34152 1136 -3609 -670 -22396 -17279 -2924 38617 22549 -17878
10699 -17878 1978 -37636 -14674 -55260 11 25011 -14961 -63970 -48475 55606 32891
10688 32891 59937 -7583 -40607 -37642 -61739 -80688 -45130 -46508 -118809 -17286 5328 -32990
10676 -32990 -68830 19176 879 16106 -10525 -95381 -99621 -73145 -57674 -90728 -41987 11430
10664 11430 44398 75071 -15982 -27291 -45947 -22040 14389 -12960 59524 52475 34177 -20475
10652 -20475 -43842 22163 37971 -26932 38866 13701 42099 59484 -6782 -17067 -2353 37902
10640 37902 48537 -49574 -88250 -113564 -137958 -133453 -86274 -97406 -44698 1121 -8019 -19376
10628 -19376 -57377 -35663 -3605 -9712 -3288 37453 36038 5932 -66299 -68150 -37359 -55357
10616 -55357 -86369 -15995 -17746 -75443 -10071 -3301 -44058 -83684 -61883 -50438 11273 20570
10604 20570 21881 25669 25189 20792 6992 -17721 -22987 -47709 8772 -6813 -35208 14975 -26924
10591 -26924 -21311 -62711 -82039 -33393 996 27080 -11271 -137797 -119401 -41348 -56807 -38938
10579 -38938 35007 7133 -45715 -82089 -48737 -16901 -7362 4604 -15442 -31444 12429 -35646
10567 -35646 18935 57548 32801 -40872 -14286 -30314 71370 23620 -28001 -38006 -90862
10556 -90862 -51698 -20256 1036 -1847 26327 -18620 14824 3438 37850 65507 -27365 -41741
10544 -41741 34657 43942 30610 28004 24067 31545 70552 54990 23070 -86118 -158328 -101750
10532 -101750 23405 -86304 -38965 -49837 -50351 25618 31318 3288 -35732 17552 60362 66809
10520 66809 22395 23774 70686 51198 -39501 11631 -62500 -41075 -34582 26430 84653 -124
10508 -124 26699 -15524 -34088 19481 16184 10427 -32977 16166 46148 -11390 -29393 -19135
10496 -19135 16738 -97584 -61863 22793 -691 -48712 -63958 -22260 -2041 -9765 88689 10813
10484 10813 -96450 -16712 9189 -50162 -45977 45390 88120 40322 -76243 -32967 49422
10473 49422 43715 84086 54365 33343 -28765 -4293 103860 82839 99385 14463 -50733 -32900
10461 -32900 -17932 -33532 -59576 -47948 -1784 -17277 8042 20519 -6410 3686 6266 -1707
10449 -1707 34628 110061 115703 73001 -7360 -31498 36921 -15502 -31179 76198 79768 56453
10437 56453 61522 -42929 -46167 15033 49049 35543 39409 39578 25900 108886 72954 -50266
10425 -50266 -89363 -21182 -27896 14542 16157 -16857 4347 21728 19235 -49655 -67285 -75829
10413 -75829 -17713 33513 61804 20002 -40657 -85643 -29334 -12208 13443 -72674 -41654 15310
10401 15310 30735 9239 29812 -32580 -23336 81712 -22105 -21597 3145 -80555 -63138 -34030
10389 -34030 -36321 -2218 20904 49426 -13438 -51671 -34859 -13053 -71372 10842 22343 1988
10377 1988 1502 127152 85667 29664 81974 101788 43888 334 73108 123640 57548 1683
10365 1683 -102812 -86234 -43169 -28254 61300 128797 109852 116130 21340 46182 15066 -17807
10353 -17807 33947 17952 62011 98285 26025 21105 -27077 16904 -12236 -76039 -18648 -21972
10341 -21972 -34574 -42772 1071 64053 60651 -41030 34553 94794 66676 45165 47877 77463
10329 77463 41646 8038 36124 -6545 11056 19156 12423 21479 33938 -30420 -52649 -35558
10317 -35558 20508 -61982 -13375 -86973 -24587 -12293 18602 59299 119628 68976 -38033
10306 -38033 -38829 -61923 -23988 -30936 -31084 -6593 25312 17420 36337 47318 98269 110696 65452
10293 65452 58775 7787 7998 748 9419 -804 -88104 -30617 19390 -10518 -64815 -63550 -32670
10280 -32670 -41591 14605 58431 61133 8379 -71752 -19813 -3997 15705 2336 28243 10294
10268 10294 -23582 -55714 -79864 13624 26714 50320 -23668 -125207 -93198 -72972 -70572 -120168
10256 -120168 -65227 -66321 -31199 -9425 -49854 -43636 -21933 3342 31580 28367 -14567 -58738
10244 -58738 -31561 -12260 -14919 15105 26970 -50638 -44443 -77840 -67831 -50070 -16926 32015
10232 32015 -20770 -3330 62725 11267 -14972 32400 34513 2196 -13769 14051 6044 14482
10220 14482 8243 17822 18434 20557 -5344 5157 -8285 4475 105480 110135 76713 26890 75117
10207 75117 155091 72929 -18296 -9018 -28521 -13753 42007 -34909 -107466 -20799 -6040 -62637
10195 -62637 8539 103134 62023 51463 30746 -43614 -18861 67352 36152 -24875 9947 365
10183 365 64529 25176 -27818 -59429 -40265 1505 12449 -21846 -3351 -14024 -28828 -31562
10171 -31562 -26886 -22091 -30545 83 17496 -56839 -61071 -64868 -29764 34675 16592 -62702 -67637
10158 -67637 -3728 55893 95060 31224 -74569 23745 76602 37100 18934 -25040 -28413 -78039
10146 -78039 -23083 -27547 -28054 -81707 24078 107587 71680 25985 -80264 -109795 -33750 -33459
10134 -33459 -996 23063 -6136 7540 -6334 -25632 -4250 -27557 -29316 -4179 -53201 -32998
10122 -32998 -22115 -33856 -36262 -73260 -5125 -41205 -123111 -96416 -41646 9006 -18698 -32814
10110 -32814 -8404 -100135 -71810 -49916 5071 95942 48411 30956 32341 -12020 -28278 -51079
10098 -51079 -76548 -47624 -28761 -4090 -55249 -9914 24426 -6298 -14934 -19388 23532 2768
10086 2768 -16698 30811 40954 -26538 -61072 -35493 -7749 28340 28042 -7014 31100 68194
10074 68194 -35366 -90466 -52405 39983 37209 34535 -21631 -54861 -12660 -14609 -39868 -35448
10062 -35448 -37602 -13440 -53002 -59788 -49122 -19772 -10257 734 41165 13699 37101 -46196
10050 -46196 -118950 -92341 -1729 41883 2360 -66912 -57905 -3324 32126 -10584 -35051 -2752
10038 -2752 -14051 -46715 -62696 -23923 -2260 -25162 -15748 9920 92 39164 -9212 -61058
10026 -61058 -3786 39776 72969 28617 -1933 62755 42842 3235 -37028 12396 13686 -28489
10014 -28489 -16053 -25387 -20711 15452 41163 22014 54229 34449 -50651 -22865 -5084 -32683
10002 -32683 26659 73867 52683 28701 27722 81999 26675 -6338 -61803 -61450 10912 -42434
9990 -42434 -61712 -60708 -32907 6367 -45652 -60525 -4728 25733 -58862 -42244 -110643 -140656
9978 -140656 -41739 -3644 80581 5283 17112 6899 1413 -66677 -93694 -44269 67254 2439
9966 2439 -31593 -496 -21310 -56469 -20913 -1966 -11188 -8208 -116335 -107745 -21205 432
9954 432 23536 51541 76539 -1442 -33907 -16504 59048 31414 -73603 -26965 50175 -4424
9942 -4424 -61715 -53971 -99715 -50920 22199 71369 -16862 24805 60888 -41628 -7583 28676
9930 28676 42082 -24345 -59096 -52840 -59040 11183 12140 67355 50455 61903 4083 63437 38129
9917 38129 41306 14223 -102433 -56511 -86186 -51563 12350 28255 10913 32066 47376 52026
9905 52026 34558 -40800 -41711 -80711 -76012 -22029 -19596 -69497 -72080 17639 -9795 -34011 -19453
9892 -19453 15541 15086 -14167 -39131 -65156 -36661 10997 -43640 -123153 -44659 -34576 -54111
9880 -54111 25096 4014 -35836 -1480 22232 16088 -34265 -13195 22111 -29856 34066 32591
9868 32591 -15253 11440 -31687 -47179 -24844 -8298 11209 -75200 -46078 -40670 -62738 -24705
9856 -24705 -14449 1057 3693 -79952 -136105 -32901 -5559 -14297 -5132 18081 70505 24155
9844 24155 -13070 18967 -43548 -38228 32408 -59239 -38909 64969 93058 43798 17773 5258
9832 5258 -10757 -30832 21613 80947 69133 -19878 -55366 -3921 10061 -11653 -12053 -5213 -2705
9819 -2705 -16954 30064 95830 41260 3879 -23693 19929 27054 2048 16275 57304 -11230
9807 -11230 48504 31993 25735 -33779 -90679 6716 41077 23260 13855 17149 51097 52042 -8472
9794 -8472 28094 47005 10372 61685 9670 26073 -30854 -63126 -109743 -143084 -98387 -26708
9782 -26708 34447 -31806 -43183 -25064 -6744 16405 15019 -119084 -102394 -17390 -107077 -83756
9770 -83756 -49836 -78652 -25266 -11827 13062 -30535 -91920 -58280 20691 -31087 -21977 10948
9758 10948 72697 29868 -17178 -34991 12813 33067 25025 -50778 -48940 -26926 -45487 78905
9746 78905 87010 9105 6798 -8142 -26272 -28406 -80188 -98942 -79022 -37409 46680 59279
9734 59279 45652 83318 85883 88943 53835 1543 3083 118141 78356 47656 20204 14472
9722 14472 76102 52660 25370 23050 -2664 -20389 1117 -20048 -18986 3180 6074 -27151
9710 -27151 -22851 -71877 -4415 33230 41745 72838 38460 28679 17337 23977 -5510 44311 44099
9697 44099 -34694 6333 63698 -42066 -52426 -14802 -9486 3441 3473 -31340 -95962 -140869
9685 -140869 -55401 -35360 -11569 -54829 -86075 -69901 -39562 43519 -44714 -62277 -135792 -61454
9673 -61454 -69555 -99994 -93691 -48195 1173 47339 -30932 -19450 -23620 14318 -26311 -41573
9661 -41573 4899 4951 63951 62151 3949 -19944 -34995 -50591 4827 -15566 20214 -29951 -96695
9648 -96695 -64664 9262 -29259 -47072 -11275 -12656 -27876 -52259 -43858 11982 -27233 5059
9636 5059 6127 26105 49616 51152 -58223 -5909 13446 8211 89718 45760 -24612 -44241
9624 -44241 -36389 36073 43626 47215 -20676 -34691 -67039 13145 63231 62183 12197 -32518 -37173
9611 -37173 6165 -30773 -86802 -98303 -47557 -30470 74368 64396 38331 140566 67521 41454
9599 41454 -43596 -16275 30502 90660 82417 108136 51175 95898 65208 8592 28918 35155
9587 35155 73336 16366 -28148 43386 3303 -24624 18066 -35239 -17501 -26034 -100294 -66685
9575 -66685 -77459 -8918 72566 45196 106116 119061 39685 31877 59808 101377 47180 -122
9563 -122 18895 60662 52406 77353 92654 79912 -28812 -85765 -15514 20886 3157 114777
9551 114777 70993 16740 -4836 19711 87172 58668 32795 52286 48811 88637 106670 3223
9539 3223 -47966 -67640 -5414 12489 51277 92038 97055 24746 -3890 -4125 -25991 28727 75290
9526 75290 15297 -65604 82 5570 -6154 76835 42026 118261 195488 155298 121900 131873
9514 131873 206998 145698 75326 175764 186790 203498 246311 325405 293256 212879 146329
9503 146329 151305 212421 240669 337150 272000 170101 234743 262229 332336 289204 247116 291863
9491 291863 296594 375879 339332 291785 225410 287963 330252 275629 260211 188381 255917 271652
9479 271652 274131 169551 239817 208873 157783 196230 185354 163844 118181 245674 246370 211586
9467 211586 220917 274632 280956 220647 166886 285572 259951 255082 269166 273737 320537 309984
9455 309984 222120 212722 374721 397209 446257 379188 339446 312094 297480 324570 394183 361834
9443 361834 271906 310118 232557 216401 183276 150211 153959 167194 123718 165665 132332 167742
9431 167742 162185 111496 110694 90364 110466 136470 141920 146897 184999 233535 164919 103404 54977
9418 54977 78113 74357 26100 32713 32770 32331 37099 58541 47720 121471 77386 56917 102619
9405 102619 103076 65296 122761 155422 159163 89311 -6558 74485 78755 119928 153573 116790
9393 116790 119374 122178 168599 115532 119303 109605 77598 85044 114434 62474 85632 123156 165161
9380 165161 62035 78788 108056 100263 130971 152379 175611 165681 138950 152813 154864 131790
9368 131790 184428 233964 224036 242061 185824 147753 225959 209891 229085 286238 226205 189872
9356 189872 162880 182875 193056 181436 237033 220084 182838 174479 153601 64779 199005 301302
9344 301302 291174 275829 204192 130812 118691 201622 188862 159003 260793 326212 270576
9333 270576 232160 271638 300750 369035 260467 321160 300245 275876 322801 291616 321106
9322 321106 314299 300791 258770 234732 300858 361541 397776 289296 355094 386019 311139 336170
9310 336170 354512 367851 328377 256194 222096 276632 352142 312706 330107 338503 376728 352657
9298 352657 299997 370921 401981 421099 405171 415734 462490 444457 429991 435562 476888 500167
9286 500167 503628 519485 503822 385882 468206 521418 431949 506238 562501 555736 486447 553784
9274 553784 589368 677018 674641 616663 626407 716182 673686 678966 645119 628741 609764 594529
9262 594529 638466 713246 716833 741841 835961 765128 685887 702864 723285 800262 780404 783496
9250 783496 883883 880521 868749 838881 879445 985166 999530 984555 996494 998390 1062385 1081418
9238 1081418 1066086 1059519 1088014 1159869 1174022 1197142 1187907 1178024 1205719 1261421 1231227 1224250
9226 1224250 1284964 1297255 1342144 1355241 1431871 1464282 1526444 1561536 1554338 1564826 1639418 1672350
9214 1672350 1676863 1737346 1845857 1949650 1970224 2014907 1969172 2047839 2098919 2095889 2154231
9203 2154231 2200236 2281268 2353504 2342040 2431890 2520434 2623431 2671765 2653216 2692216 2808459
9192 2808459 2918257 2944367 3090457 3145466 3182377 3292049 3412838 3523544 3563341 3714039
9182 3714039 3838272 3912743 4083582 4106517 4171724 4267690 4390718 4599404 4768693 4848078
9172 4848078 4916808 5081233 5275764 5457299 5640685 5793758 5946452 6046381 6216751 6409389
9162 6409389 6647232 6875306 7148977 7453457 7756767 8097903 8439634 8889393 9343072 9748464
9152 9748464 10237568 10755987 11305465 11892333 12505169 13159160 13883006 14726812 15597912 16609399
9142 16609399 17753737 18986526 20146419 20930324 21595353 22372966 23566776 25153868 27169602
9133 27169602 29619840 32563718 36174243 40518326 45564183 51565132 58386583 65909813
9125 65909813 71260247 70815297 65168288 57518316 50306045 44982897 41683609 39752606
9117 39752606 38880348 38747574 38690418 37519933 35047060 31843918 29273674 27423922 26168361
9108 26168361 25364730 24843015 24640538 24691793 24856290 25268856 25795411 26579198 27763603
9099 27763603 29226626 31090317 33472694 36238310 39382330 42489147 44611195 45329781
9091 45329781 45778851 47008058 49514272 53316834 58184573 64063519 70265758 75214545
9083 75214545 76487833 71000581 60337234 49462861 41161277 35415499 31207521 28091931
9075 28091931 25631801 23699304 22236089 21155502 20306721 19808488 19429463 19027615 18187118
9066 18187118 16808398 15291945 14075001 13090611 12306565 11537512 10878796 10319976 9735577
9057 9735577 9178095 8820099 8396411 7986683 7755485 7346927 7112815 6829120 6650599 6375055
9047 6375055 6172083 5995427 5807472 5571292 5368420 5152342 4912202 4782040 4636077 4455804
9037 4455804 4255063 4182014 4112942 3954057 3796902 3727523 3615390 3563817 3516318 3418026 3366039
9026 3366039 3336567 3251028 3263659 3066843 2985992 2984207 2876075 2754415 2764299 2732766 2689023
9015 2689023 2565473 2505710 2442872 2342467 2337474 2352458 2277054 2191349 2152514 2062374 2058199
9004 2058199 2114113 1993154 1970363 1887630 1905864 1932669 1872563 1832399 1729860 1787879 1730715
8993 1730715 1679563 1689739 1668581 1804825 1740446 1629888 1541474 1474858 1442934 1452592 1519375
8982 1519375 1529329 1479848 1490648 1460947 1328771 1363165 1355453 1356327 1352871 1312919 1304165 1359600
8970 1359600 1323358 1246549 1315190 1303764 1283676 1390326 1356803 1315107 1367908 1398805 1406027
8959 1406027 1474144 1461767 1517190 1597218 1616912 1632560 1669232 1640452 1671097 1594072 1480157
8948 1480157 1437309 1387148 1265503 1272063 1279472 1317535 1237994 1167364 1165183 1090380 1089284 1110375
8936 1110375 1106161 1048434 1042817 1058110 1067460 1133277 1123800 1094410 996787 1013659 1046487 1048741
8924 1048741 1099022 1172869 1256626 1287926 1194492 1208474 1278460 1326395 1368114 1347885 1408753
8913 1408753 1430551 1419037 1455738 1407075 1283208 1148429 1046137 995808 906856 868338 796857
8902 796857 704580 729834 778294 759196 675694 692607 672421 700431 685544 599745 614618 702036
8890 702036 673143 564535 651782 583985 574066 583034 520747 495219 557334 544004 494101 516059
8878 516059 529196 552280 555041 554299 430483 337701 325972 408991 401512 322761 404685 384985
8866 384985 371035 380825 367869 361203 394488 398892 406674 416501 426675 359092 337306 328786 353169
8853 353169 377704 356534 325547 357284 400696 402581 400090 380025 261956 311258 383726 360331
8841 360331 259183 239411 223334 329176 299216 250703 315875 283629 296931 356826 311600
8830 311600 294331 291164 357105 383549 385985 329921 236745 268510 334441 374981 375359 289412
8818 289412 296429 344670 361660 374036 349261 316003 260506 346163 331009 315704 288730 313998
8806 313998 336087 329727 375969 394735 339150 369854 382236 410097 366903 360772 374194 441033
8794 441033 472223 475016 402710 358805 400225 420184 482939 489876 456282 431273 421982 482964
8782 482964 531220 543971 610220 589830 549422 543811 578616 596266 604539 579066 530142 536402
8770 536402 595333 630782 608809 737223 709658 790655 794698 848441 917852 900572 968353 937646
8758 937646 964686 980944 1024144 953382 1025196 1127579 1102877 1065929 984156 1026344 1022002 1038101
8746 1038101 963418 985558 959980 992703 951377 1000396 959664 980614 1009340 1012721 1003347 1021313
8734 1021313 1064551 1060047 1078366 1131476 1161360 1121519 1145395 1274839 1404457 1439032 1550850
8723 1550850 1542077 1656493 1712346 1770790 1818204 1908782 1989228 2039583 2121882 2313606 2409848
8712 2409848 2556811 2685854 2886082 3206649 3575590 3932940 4421898 4918267 5605810 6351972
8702 6351972 7255823 8342857 9645810 10670215 10048438 8184295 6235870 4989544 4185892
8693 4185892 3539733 3077381 2709867 2427730 2194793 1985393 1795141 1716006 1657407 1517227
8683 1517227 1398353 1348190 1291885 1195579 1021205 1057058 1062457 1028428 997439 915972 931181
8672 931181 883914 845157 744491 757509 759080 704891 732943 689384 689468 708508 687788 671010
8660 671010 610117 623385 611142 563514 602723 627034 597022 547359 545997 560908 478453 525659
8648 525659 494876 412224 421362 357996 306110 334384 385337 438522 481624 364114 447703 472781
8636 472781 456954 368904 414034 331592 289370 416764 406438 324747 364173 420147 362002
8625 362002 356793 387872 415525 402176 361270 383985 376524 367545 399270 366026 372979 314087
8613 314087 339266 343741 336920 412082 368582 341730 379622 349657 488342 418376 431225 422374
8601 422374 363103 323513 430771 407450 434686 478224 458243 405595 385800 391759 364338 418009
8589 418009 357601 438425 485164 449125 515668 476607 421895 405997 448523 472279 436450 472259
8577 472259 472033 360440 414824 441723 495349 450693 352695 450113 397269 440993 466117 461449
8565 461449 376307 458854 540182 542129 509142 513035 508387 572192 638171 606980 604949 573585
8553 573585 514121 538929 635504 632283 706297 760671 641704 597227 578222 635864 683335 713770
8541 713770 680592 648442 748388 761533 762868 748873 759188 779167 767757 803505 834500 826602
8529 826602 842494 746547 707657 761124 854351 858669 853681 859307 845473 851676 872323 900344
8517 900344 970492 995450 1013774 990474 1074702 1033844 1009058 1046479 1034535 1074630 1163352 1201860
8505 1201860 1172668 1152588 1152671 1255663 1263536 1246630 1315682 1330832 1353044 1418799 1406975 1433287
8493 1433287 1453120 1567911 1590033 1604042 1634373 1616351 1673422 1804280 1802717 1885286 1868105
8482 1868105 1941825 1952492 1996547 2072878 2075042 2237712 2255719 2292822 2351348 2390086 2440257
8471 2440257 2452312 2524785 2520266 2611895 2761369 2859710 2968791 3013608 3059550 3066574 3162861
8460 3162861 3239261 3353869 3477417 3563699 3606621 3728312 3791715 3850346 3977663 4159124
8450 4159124 4305781 4421211 4511111 4596478 4766790 4844230 4959484 5127713 5364879 5389550
8440 5389550 5506199 5703987 5845170 5957391 6230217 6531167 6718166 6918481 7163433 7389649
8430 7389649 7643036 7931318 8383056 8792706 9141518 9574004 9948482 10391403 10927366 11506301
8420 11506301 12079885 12770857 13491777 14267148 15202493 16149042 17187479 18433464 19722781
8411 19722781 21196866 22628979 23662091 24422707 25286873 26406305 27987620 30078384
8403 30078384 32728246 35958768 39831421 44415529 49833463 56190785 63652044 71913193
8395 71913193 78828870 80359953 75531471 67063803 58561207 51865216 47202262 44318348
8387 44318348 42816445 42176381 42071477 41349422 39254069 36090157 32881555 30631499 28907793
8378 28907793 27676265 26870479 26331191 26045234 25990192 26084916 26405354 26909982 27747262 28943932
8368 28943932 30478085 32452934 34845454 37616460 40623002 42941644 44037934 44515453
8360 44515453 45064420 46741521 49734306 53644565 58539750 63947628 68549071 70679273
8352 70679273 67913857 59814376 49984215 41553044 35442045 31113581 27898564 25428923
8344 25428923 23497644 21909095 20775125 19937496 19305470 18937333 18494062 17820751 16765190
8335 16765190 15441671 14136585 13078603 12161114 11355097 10661593 10104444 9596268 9083382
8326 9083382 8662365 8322348 8049704 7685185 7389729 7087516 6802374 6496598 6241627 5972121
8316 5972121 5793006 5677421 5456511 5206021 5002321 4926890 4665436 4464934 4332182 4200769
8306 4200769 4063504 3834324 3747513 3617360 3518639 3411459 3304407 3320753 3206457 3119877
8296 3119877 3033096 3054453 3047803 2895875 2857668 2815573 2713538 2630261 2593381 2515224 2458942
8285 2458942 2410808 2326746 2373267 2342757 2212319 2123565 2086060 2029848 2063982 2071617 2021496
8274 2021496 1898703 1838897 1856834 1788594 1697592 1627111 1636804 1555139 1558248 1495698 1518883 1556978
8262 1556978 1501560 1450799 1410655 1447188 1444647 1384891 1369118 1332109 1203482 1181177 1159300
8251 1159300 1223350 1225669 1162000 1167172 1152819 1176768 1195242 1139160 1118208 1117815 1088062 1001928
8239 1001928 1026676 1039372 967736 962228 976595 935174 1011952 965319 906271 867741 859441 881162
8227 881162 872123 866157 850379 954030 907486 887254 863320 777683 775525 804731 721873 675453
8215 675453 620382 659886 714526 708935 681722 695931 644021 601327 600490 664959 585275 685069
8203 685069 556700 621473 585360 519122 516955 532648 456299 510026 351889 335124 -262780
8192 -262780 -652753 637696 641907 643404 583590 568664 610687 604067 559225 533015 517959 512314
8180 512314 501789 476447 528434 484264 505814 458534 393236 449814 413248 383694 434870 508080
8168 508080 520482 395492 434078 363939 328063 380727 422970 439080 419879 339748 316463
8157 316463 337829 340911 345985 337760 315335 352274 361776 381798 431684 393861 428572 406977
8145 406977 375693 430262 432849 411798 371174 390769 369516 361605 322023 363155 318917 324425
8133 324425 304893 317621 287594 262496 282323 308255 263875 185286 271210 264968 228367 259542
8121 259542 221736 212179 194718 217891 249868 230260 199456 168322 211425 224479 225388 142007
8109 142007 194923 216402 128083 277248 290106 225578 209687 254930 272011 217199 267490
8098 267490 182097 101047 167555 192458 180005 124396 50456 29760 106126 96122 131654 197617
8086 197617 140943 180740 94503 75136 29895 77615 89833 89278 127224 128784 148567 189870
8074 189870 109078 114761 182708 231250 166452 89653 101761 87899 116097 109298 87877 142313
8062 142313 181631 135760 101719 108442 167726 136447 147305 137873 158171 87436 109648 156737
8050 156737 242712 150631 113760 127386 229187 295939 295087 317322 273314 296926 184882 214756
8038 214756 281361 240593 239209 308739 256770 259617 308308 305777 291735 305455 360618 348629
8026 348629 320104 271008 288280 273235 253942 194813 232534 230651 184292 202899 148266 215198
8014 215198 262067 255241 222614 226052 192980 170686 224424 211012 173316 204548 216475 264075
8002 264075 262498 230015 194145 182505 291751 272109 211240 261282 300543 309880 289591 260733
7990 260733 240119 196707 214116 234801 211963 187144 91217 156778 268101 268127 220131 289034
7978 289034 274643 271970 233903 196439 187997 243135 277656 193119 182743 116889 64347 50237
7966 50237 81037 106549 165002 146068 133468 187907 138783 70516 98060 88137 22870 -50719
7954 -50719 -50938 12527 52475 116086 84788 22815 54420 78080 70259 70419 71882 116281 63125
7941 63125 50856 57241 34394 86418 68214 129988 137600 49837 8440 -18834 54293 24641
7929 24641 69693 37976 -3482 19730 -42773 -58351 -35025 40212 54238 83856 13727 27951
7917 27951 52937 26219 -11004 39504 -18476 -11303 -28867 -59437 -24448 -10099 -48204 30884
7905 30884 49741 75963 88073 46702 68365 24971 94528 55989 40175 -41520 -23310 -9290
7893 -9290 13060 56618 72529 41531 19901 87016 67514 21583 -18245 -16402 1821 25617
7881 25617 -27198 33768 84788 13854 -7397 29093 18501 -41893 -69553 -22148 -2131 -19657
7869 -19657 -56370 -54782 14057 -34427 -77259 1977 77586 37852 -581 25166 96022 66210
7857 66210 8065 -24254 -41305 -26939 -13859 42449 18419 8809 19131 64004 64998 -3456
7845 -3456 -33064 -29071 -80923 -71063 -42814 -22636 -42217 -27282 16687 -7094 55433 73989
7833 73989 91898 70519 2737 -41307 9349 -27605 -35753 24477 20646 -29890 -60117 -64233
7821 -64233 -1410 28225 -68989 -42621 43497 -11462 -51165 -119701 -62154 6478 -3284 38915
7809 38915 -2061 -10434 48171 65407 -33611 -15105 58292 -2906 31934 9259 -60374 -6709
7797 -6709 -2350 95975 98454 34594 -9391 -71299 -39601 37260 20048 -11365 21378 -10843
7785 -10843 10290 -59288 -11803 -31215 -9652 -79089 -69010 15768 -65992 -130666 -109218 -80501
7773 -80501 -46797 -59845 -89068 -4301 22516 -10954 9230 42059 24113 12776 1688 42389
7761 42389 15776 69784 90969 40184 15206 -13497 -27327 14815 31939 -27952 -32596 -3697
7749 -3697 5902 6102 -34934 -29248 -35101 -22235 -96801 -84146 -82572 24118 46953 19608 -31611
7736 -31611 -32077 -41509 -111399 -121964 -82965 -52292 -25064 18376 52130 41383 -55864 -90264
7724 -90264 -80356 -77607 -39874 -55893 -75321 -104171 -132162 -148526 -96237 10572 -31322 -67112
7712 -67112 -61605 28062 -23783 -82094 -139266 -78815 -38451 -102121 -40669 -91324 -31806 53061
7700 53061 -81860 -93535 -42431 3425 -57754 -11464 92178 59354 -41530 -10549 -87015
7689 -87015 -82152 45798 75450 68321 44134 44872 24202 22924 -27003 -88880 -135210 -134428 -123472
7676 -123472 -37888 -55320 -7521 -41031 -86813 -85787 -67717 -12585 -32263 11328 -38056 -66096
7664 -66096 -66163 -76155 -37566 -36221 -60423 -7087 27414 -26437 -66173 1816 -30795 47354 -2704
7651 -2704 -28487 33583 12538 -26125 -44171 -19593 -3008 38965 -5455 -59954 -72197 2889
7639 2889 -57023 -66337 -11775 1462 -58840 -61167 -128831 -35938 7509 32285 75781 78948 16308
7626 16308 18461 -977 -14744 -22148 -42411 13936 43314 53050 -62170 -92301 -38166 -59864
7614 -59864 -50703 -94038 -10749 -38508 -103941 -64895 -76837 -19759 -51439 -49973 -20692 19488
7602 19488 -33552 -91884 -80346 -17059 24276 -11409 -16792 -41969 -101530 -16949 39771 68647
7590 68647 -857 -27822 -80905 -78606 -85526 -28788 -62051 -23397 -31195 -31083 47434 2485 -107669
7577 -107669 -123770 -8792 10550 -18205 -12259 -52595 546 -78793 -33876 -68148 -101421 -49356
7565 -49356 -66985 34412 26467 -6353 -368 -41746 -3784 -43334 -1536 -20193 -74253 5986
7553 5986 -64407 -109287 -76783 -44781 -174091 -121860 -153038 -149005 -94118 -80846 -112160 -44136
7541 -44136 -1438 -12151 -116574 -136653 -155265 -21396 23056 -6163 -51504 -37777 -36804 -76390
7529 -76390 -16918 -58473 11094 43846 20779 -53414 -15380 16683 -2353 -21884 35363 -14854
7517 -14854 -21771 -27701 -46791 -29557 -28547 -38405 29249 96175 40890 1896 -125298 -54972
7505 -54972 -15177 17786 -44163 -71746 -25671 -17711 58500 7274 20425 -31 -82340 -12727
7493 -12727 -15380 -38393 -39886 -62443 -92955 -80924 -89394 21797 42725 -2129 47039 77107
7481 77107 -16501 -104852 -52006 -33868 -29559 -906 32302 53916 7656 4083 -13070 -100912
7469 -100912 -42450 -51804 -12848 12768 23482 -6470 -4562 -46251 -14374 56487 35840 -7947
7457 -7947 -47694 -39348 16863 -4082 -88755 -49613 -49772 -67104 -78480 -65152 -90164 -110856 -35659
7444 -35659 16183 -31302 -121425 -84364 -67094 -9688 -354 -30863 -2508 26761 -17081 -21952
7432 -21952 36927 -26811 -69883 -26856 -14685 -106852 -100191 -88549 -106101 -71313 -7374 40973
7420 40973 66504 82910 53813 9310 1017 2930 -27547 -100069 -88486 -20651 -83507 -94179
7408 -94179 -68296 -133940 -84295 -54844 -3134 16909 17324 -8382 -105205 -53088 -45771 -118637
7396 -118637 -105946 -52976 -87758 -141662 -146975 -113814 -108856 -55971 -3134 48663 52470 11464
7384 11464 23129 48559 6166 -78005 12102 21987 -58544 -26754 -21698 59290 28875 25963
7372 25963 37659 49053 33929 45844 -4463 -50771 -86539 -95802 -29185 -2014 -18411 58442
7360 58442 59488 22423 65206 20539 -56914 -49609 8944 13346 -14097 -81730 -44242 -78703
7348 -78703 -76340 19606 33733 -59387 -72386 -54790 -85800 -79327 -17703 -30849 -28403 -50118
7336 -50118 -114719 -104649 -17130 -24070 -77106 -69912 -47479 -78671 -65050 -35561 -64647 -42536
7324 -42536 -46351 -78641 -122921 -75607 -68102 -33464 -67490 -132630 -132878 -116934 -35564 -34441 -7396
7311 -7396 -8213 4811 -62017 -62121 -10981 -41656 -88481 -74574 -47842 -91008 -70054 -63070 -93643
7298 -93643 -99281 -4340 25792 -46255 55047 2793 2818 -9466 12269 6953 -20475 -21592 4350
7285 4350 71063 23747 33195 16081 27899 77298 67289 -20303 -60505 -33426 -23767 -55364
7273 -55364 -32207 -29714 -54417 -43238 -66558 -13747 47299 -51233 -19547 62254 82005 -6607
7261 -6607 -35701 31450 3419 -87758 -29967 -13493 -31158 -29080 -42886 -41161 -78567 -31389
7249 -31389 -42288 -15622 -49558 -42453 -23095 -50545 30610 59076 59476 14459 -23499 -58935
7237 -58935 -34021 41356 -30920 5470 4646 -41295 -20653 -3132 -28037 -73337 -75802 -2954
7225 -2954 49579 -29555 -70305 -54067 -88908 -96208 -73142 -47857 14420 -58755 -108381 -35822
7213 -35822 -71008 -93996 -11977 -22676 -103252 -146482 -92104 15647 20897 -36616 -44916 -47792
7201 -47792 4458 -67528 -53760 -57751 -58692 -20988 -25038 -83476 -44163 59526 37041 30056 17833
7188 17833 25352 334 -16347 82722 68040 36716 106062 147900 46867 -93104 -20511 43554
7176 43554 10181 -10575 -24537 -58519 -14991 42413 47757 29035 -71463 -92612 -84439 -24812
7164 -24812 54995 -31706 926 -22755 -45994 34487 56688 -10310 35484 93080 -7830 -52250
7152 -52250 -149206 -91952 -75528 -35454 -7308 39362 22840 27481 -24772 -78768 -31602 9327
7140 9327 -54971 -63351 -40068 -4155 7719 -59292 2894 51624 -25982 39896 65780 -38061
7128 -38061 -11611 -63814 -58631 -103516 -59941 -114050 -115343 -80971 38086 21201 -12385 18867
7116 18867 55616 20441 35675 12157 -86374 -56816 -75544 -34119 12135 -18463 26985 45752
7104 45752 98193 12759 -5152 -40168 -6169 43862 12603 18397 7436 16491 -12542 -8633
7092 -8633 -35186 -37952 -60676 -42751 -43012 9112 246 -17881 -33681 -60752 -78524 -65831 -37629
7079 -37629 -23505 -63484 -71793 -14489 3427 -75829 -49070 -12559 -6983 -86319 -51192 221
7067 221 5376 105550 87979 8566 17708 12430 59674 -7473 -130732 -38376 24875 8117
7055 8117 -53318 -50659 -131575 -93958 -99758 -31978 -98873 -117861 -9090 7118 -11868 -13749
7043 -13749 -31124 33749 34075 -42886 -31766 -47557 231 35361 8992 17983 87325 44853
7031 44853 67002 59861 11737 -8384 -14503 38429 28967 19545 -43393 -108095 -51440 157 34945
7018 34945 60565 38985 38786 -20246 -95738 -75962 -101917 -17608 58981 80681 62254 54799
7006 54799 116714 107588 47974 50984 2939 99708 60142 65416 83619 47242 18278 34452
6994 34452 44901 68830 67171 95063 118218 129649 138556 74885 38342 92528 73148 67717
6982 67717 96900 34861 5092 19577 35685 42883 72676 80785 44873 72167 70748 23708
6970 23708 93374 100091 26037 13550 87418 109675 113796 111081 124488 135765 105953 48517
6958 48517 30745 47956 47465 90342 136430 138664 252306 278764 296830 325229 281164 308310
6946 308310 347708 350075 434404 444919 472103 626993 653747 721321 860265 905180 918904
6935 918904 855255 871971 864439 745057 635969 555868 425618 404436 339320 369719 313731
6924 313731 187500 214619 157228 128360 159248 135120 145919 215141 180071 52737 68313
6913 68313 86559 122380 112916 109681 95536 134369 54477 -44715 -13745 -41273 -11555 -6519
6901 -6519 101926 114921 92260 63910 76899 62739 17704 23587 -18883 -55477 -6890 70650
6889 70650 71684 58995 4746 14914 -36111 -56320 28764 -22018 -44071 -65160 -21325 2688
6877 2688 14065 5568 59211 185002 102337 80685 89027 34010 -13266 79875 85617 63904
6865 63904 98824 94530 41287 -79442 -19120 70154 66139 -2476 -3092 11346 6009 3105 -67716
6852 -67716 -83757 23228 54277 92757 65678 -8665 -25901 7449 -2476 13159 -105722 -72675
6840 -72675 -44001 -100741 -54539 9447 -8865 4714 4212 -2452 42589 18262 30033 75441
6828 75441 94723 38037 -62544 -119571 -44810 -5990 34210 73322 38955 3424 -25968 -21087
6816 -21087 -16701 -7705 -29131 12698 44670 27241 7023 -26968 29290 -21313 -8469 22770
6804 22770 24782 -58732 -81231 -50557 -70583 -31564 26730 14576 1560 833 -36165 -68763
6792 -68763 -74074 -84542 -44023 -52651 31990 39763 18693 4896 36317 -17111 35358 155222
6780 155222 159420 81183 36564 -22641 -97223 -39193 52671 143373 92543 30252 -15489 42896
6768 42896 77086 77221 33309 39598 15308 19946 37694 35514 18504 41086 77405 136129 55927
6755 55927 -1968 368 351 47951 23415 -27333 30652 35096 17417 -5249 -52115 10273 -6184
6742 -6184 -48051 -67117 -72611 -70744 -65628 -34770 -36685 -47784 -58256 -29329 -53724 -72809 -93754
6729 -93754 -49469 -28631 37855 53870 16006 -4168 -24576 4955 1658 13414 -5765 -42887
6717 -42887 -59232 7068 16692 -45711 1714 -11404 13468 13048 -57366 5620 -9535 54375
6705 54375 5947 -35128 -25485 78639 65389 68936 37186 70936 51495 28190 -5898 -22844
6693 -22844 -42445 -63405 12690 -5374 -34365 -34258 30393 26068 44295 15027 622 -24031
6681 -24031 -40616 -78766 -1701 51520 24659 -31546 -52661 40292 29211 -1210 52389 70432
6669 70432 39273 19352 25415 51973 45267 371 39296 57363 37613 57824 105466 45488
6657 45488 5645 19012 -63716 -74413 -66745 -42126 -62119 -34351 15487 10247 1091 21899
6645 21899 14723 -76505 -42095 -35403 -25728 -45612 22138 41956 39887 -24035 47944 257 -14276
6632 -14276 -16118 -72114 27706 38387 94965 139569 204053 70938 7993 24484 27489 104935
6620 104935 169526 119528 30939 22058 22357 80337 15431 -12025 -11394 -4841 11896 -19259 46721
6607 46721 4892 -18515 33986 217 -13325 61931 43683 34375 59788 57852 8545 108288
6595 108288 14514 35628 38049 -27769 24067 402 112374 108274 64150 53406 58827 78973
6583 78973 33540 -46706 -81976 -58940 -92948 -100966 -51769 -26827 30235 28957 -15896 -74241
6571 -74241 -37231 -4161 62522 59291 -6500 5390 -15808 22638 50961 63952 54044 50140
6559 50140 -4272 -35839 -56343 -29213 -23321 -78470 -12685 -7605 -73912 11959 -51418 -20188
6547 -20188 8507 28437 52607 10485 2292 45211 28191 7205 51223 34575 -13726 -39348
6535 -39348 340 36388 10244 68808 142735 65100 43432 52524 70819 29719 67331 67250 85182
6522 85182 50542 -76631 -43921 10217 -27816 121020 68490 -1420 -13491 50178 -732
6511 -732 -9965 22594 -32270 -39083 47184 31703 12154 -15740 -1943 73356 11528 -27185 14928
6498 14928 46571 23692 44423 25689 17399 27210 7555 15656 34923 103448 52968 11569
6486 11569 -3103 3109 58975 50104 120556 116909 130508 93316 87794 20335 938 3046 14644
6473 14644 -861 -20317 -56892 -10858 65076 -33674 29006 51827 66786 42583 35580 32048
6461 32048 -25741 48030 75310 2093 -40793 -14690 -3833 -9442 -42728 63235 102580 52292
6449 52292 28313 47625 57507 10309 -18962 -1598 12249 53366 12227 38624 44076 1095
6437 1095 -23419 -70916 -8351 43190 31671 -46025 -27480 20138 -46807 -37910 43354 31365
6425 31365 -36098 -90468 -53232 16954 3705 36233 -15010 -68553 -50738 -60261 14813 39455
6413 39455 19573 34558 25201 74363 79535 51630 101274 117057 -2469 -9688 41063 28883
6401 28883 25328 -32252 39917 51474 20423 71499 42802 -21909 8137 -19619 -63393 -37913
6389 -37913 -4585 5821 -39827 -17758 4845 -20112 -1936 39752 16752 67421 11641 -4477
6377 -4477 -49039 40274 137174 85899 39909 77885 74038 83019 44274 72075 136208 134383 151965
6364 151965 20437 -22385 16982 45302 9870 -93972 -61433 -11508 -68860 -77280 709
6353 709 25850 -63963 -103868 -60306 -39215 31289 97765 39898 48280 10078 39292 34999 -2523
6340 -2523 60877 30192 -7802 8861 14421 -59663 -152942 -66039 -81560 -80590 -51978 -12075 -6405
6327 -6405 39622 -18743 34085 82302 58720 124913 242332 201477 113479 91900 98982 99754
6315 99754 88578 66735 92138 577 54110 93451 -2451 -111349 -91822 -76755 -22937 22217
6303 22217 -69325 -18999 15115 50746 -20689 -307 32027 -14812 73159 113545 124766 75157
6291 75157 57933 145433 59052 70222 69492 126554 114672 6149 29617 43080 41705 40383
6279 40383 15100 61303 60621 58704 51249 -15870 8326 -4863 -22420 48191 8253 43567 46001
6266 46001 39296 55694 92737 131253 130389 86632 59174 76359 56414 21502 38077 62536
6254 62536 122330 180827 63881 81481 88202 55843 86150 1005 102726 157311 93117 69936
6242 69936 21389 46002 52754 -11330 55140 114072 83312 116058 75217 68730 137533 127081
6230 127081 123248 101171 126568 129758 100213 85060 52814 69799 52654 72681 221143 141061
6218 141061 67956 94605 62350 78237 101107 69548 46120 13075 12554 -43227 -13767 -751
6206 -751 21428 72530 43404 -77960 19986 103780 65391 33413 -24572 2410 -4267 18404
6194 18404 31847 26078 42258 -64150 -39696 -12166 25329 -8528 -37016 34306 7262 135649
6182 135649 89867 45458 -48794 20674 17765 24836 27387 45020 8805 -37083 74228 30189
6170 30189 -10353 69075 18782 -33398 98697 74438 109077 68274 46023 153482 86628
6159 86628 89129 38590 89169 91862 39336 93288 117356 54426 -26343 36788 104250 85995
6147 85995 118452 193816 146773 61600 47237 -5675 17175 66508 -26147 30930 17829 79757
6135 79757 76189 38855 17577 -55410 -74552 -25361 1446 -75093 -42218 7604 16209 53989
6123 53989 125086 111264 139592 110929 47180 33817 84883 59702 90820 89104 104686 100608
6111 100608 91454 61018 59255 62377 355 39078 -4856 -61365 -15670 48480 12389 -21106
6099 -21106 68367 88308 105807 9947 43558 -12816 -43119 56924 63836 127301 227348 93579
6087 93579 8146 31751 71590 111666 295 -51314 -24567 6262 6114 -38160 -2749 23767
6075 23767 63898 112303 110517 128580 141258 199569 139985 69735 52143 157585 141602 83487
6063 83487 67449 85521 121071 -6905 17437 137582 107752 57983 45370 77091 69983 70703
6051 70703 38083 66826 -15722 11512 100836 86898 27161 65189 45989 36646 56165 115431
6039 115431 93188 90991 77148 67686 86806 88772 146616 193732 213437 213023 135139 140851 108631
6026 108631 97821 84640 108572 157531 178250 164243 121618 182211 160910 68218 117946 114610
6014 114610 100647 195835 177462 219486 142457 145829 139863 98602 108667 75710 78533 73910
6002 73910 67761 61853 54455 98879 218285 183818 59057 43370 116154 165571 149649 184092
5990 184092 214956 223755 165198 71834 174966 224522 243235 196529 101947 107435 149679 156188
5978 156188 132500 84536 157434 192193 233318 296344 332024 313864 278638 283033 247694 280418
5966 280418 267228 230962 226434 246041 205683 266476 254626 236754 249131 276119 266087 205473
5954 205473 228592 273140 201880 231039 309598 308174 281114 400029 327759 351836 356899 351611
5942 351611 353669 398675 437634 420079 409333 296944 276526 306106 329320 395205 407536 429366
5930 429366 408515 475199 494310 523913 521817 511357 584904 582089 659627 705473 669703 622540
5918 622540 534508 536036 583249 542806 518707 539780 529318 486396 422797 488385 407785 403997
5906 403997 460325 442874 467265 422856 444051 519462 574938 516538 523975 557310 562797 597849
5894 597849 680362 571531 509625 530254 565904 601708 639432 657080 696717 758802 806583
5883 806583 891928 1074566 1103310 1090165 1172495 1334281 1506945 1628005 1722115 1778676 1656343
5872 1656343 1498912 1298508 1124697 1013863 950726 900520 828634 734826 675405 690094 661629
5861 661629 566583 580978 599011 607075 577250 558349 515180 489727 485531 457758 448186 402396
5849 402396 492397 562617 434923 390351 373575 422845 462132 426280 423757 414028 496097 534151
5837 534151 410019 342658 396084 427001 435892 455928 461643 414493 482778 524279 403769 413617
5825 413617 441671 410163 451137 515527 532806 497194 430316 451943 530223 593336 629828 548198
5813 548198 480049 479095 470496 542977 563808 558881 426698 420310 502359 504679 540541 535712 651422
5800 651422 713911 656179 557170 579133 539442 551356 648330 696404 641419 621640 571128 606051
5788 606051 644339 657375 689182 594876 679525 659752 605597 557496 569466 650947 627207 642641
5776 642641 662847 726161 722931 724904 739646 719795 711263 710253 744063 671169 735840 827930
5764 827930 867041 885315 863580 819537 766242 853438 836376 822272 765488 798550 776905 838170
5752 838170 770385 753936 740346 779899 852446 889721 889208 896138 894383 921805 935616 979040
5740 979040 969220 1077972 1081084 1085389 1173748 1128119 1097121 1042470 981690 1003808 1081218 1115239
5728 1115239 1091768 1064857 1019169 1005544 1048586 1051361 1103507 1119935 1105342 1053877 1044987 992048
5716 992048 1023222 1113446 1254874 1196585 1256318 1234064 1273825 1381593 1395276 1342008 1382292
5705 1382292 1442889 1533932 1511871 1521192 1498013 1627764 1684684 1664359 1633241 1604006 1612917 1612630
5693 1612630 1615092 1639878 1717620 1644371 1734891 1840767 1811738 1788471 1823633 1811706 1862020
5682 1862020 1894215 1994077 2038623 2027772 1993936 2070528 2108892 2054771 2090659 2158287 2194823
5671 2194823 2155086 2260870 2303566 2383804 2478072 2482424 2439701 2426993 2517611 2525463 2595113 2701484
5659 2701484 2757378 2792088 2777845 2806143 2898413 2988688 3011560 3052298 3212239 3321326 3421387
5648 3421387 3534664 3645974 3682152 3756718 3840408 3905575 4050631 4223857 4310157 4415232
5638 4415232 4566331 4707347 4940895 5034206 5153572 5302251 5464214 5559060 5678637 5794442
5628 5794442 5889311 5956861 6087512 6341714 6569566 6709973 6793089 6942591 7122258 7239549
5618 7239549 7370025 7623160 7908912 8070905 8267727 8495640 8682181 8862834 9074605 9316594
5608 9316594 9579323 9937427 10205865 10533422 10756136 11016935 11326521 11581952 11713741 12003594
5598 12003594 12245391 12481326 12870159 13235468 13665249 14068816 14466762 14908068 15431524
5589 15431524 16031151 16653920 17366062 18032413 18804549 19596158 20510053 21511122 22520269
5580 22520269 23598085 24608165 25716006 26822365 28118472 29409906 30713157 32119533
5572 32119533 33708168 35546714 37478800 39736995 42307934 45366669 48957288 53119507
5564 53119507 57984286 63797958 70459700 78095662 87068141 97596645 109814321 123963848
5556 123963848 141099131 161512237 185264284 212768858 243728868 273026891 282015521
5549 282015521 257322488 212282611 168899666 137127451 114994824 98775992 86444473
5542 86444473 76578836 68621218 61887167 56082785 51096067 46881418 43405052 40467344
5534 40467344 37975900 35829498 33907823 32007036 30249531 28607367 27244659 26064264
5526 26064264 24829580 23746768 22656843 21727717 20884342 20088272 19449608 19030477 18590278
5517 18590278 18072367 17752614 17351703 17003117 16610196 16236110 15912190 15739066 15594676
5508 15594676 15435848 15179634 14990855 14715083 14400554 13861607 13344221 12749054 12235266
5499 12235266 11933982 11617181 11339986 11240907 11104375 10980071 10944675 10986544 11115969 11224191
5489 11224191 11429419 11581038 11678102 11806139 11954708 12093824 12226812 12442576 12827567 13176724
5479 13176724 13526949 14005775 14505950 14878876 15278722 15301771 15170119 14835375 14180874 13349233
5469 13349233 12473019 11652792 11087083 10511581 9978582 9533049 9200647 8873143 8705277
5460 8705277 8619802 8582731 8599741 8525644 8514458 8668292 8834435 8983390 9191209 9475422
5450 9475422 9823861 10246941 10782100 11296125 11858037 12341202 12915276 13253954 13347081 13206918
5440 13206918 12712700 12009866 11135041 10249542 9522606 8901924 8221817 7661220 7252964
5431 7252964 6926491 6647963 6339455 6098593 5786834 5633790 5526676 5472926 5424686 5313579
5421 5313579 5324411 5329879 5370092 5507625 5642762 5615725 5773388 5908651 6011576 6163067
5411 6163067 6178056 6118082 6046192 5777854 5411839 5071611 4779740 4470644 4149267 3952346
5401 3952346 3757608 3548258 3387087 3288260 3144814 3033197 2974738 2930996 2878851 2788653
5391 2788653 2581585 2475229 2567661 2469409 2409332 2344648 2247779 2231811 2183680 2159344 2209996
5380 2209996 2218284 2088560 2033329 1994692 1975814 1988488 1996102 1976235 1987008 1980456 1921625 1810887
5368 1810887 1814102 1829760 1786581 1828593 1822962 1837517 1809087 1769713 1726424 1662332 1659874 1667372
5356 1667372 1632602 1680263 1678329 1619483 1612047 1660592 1746923 1738902 1702359 1658707 1607633 1664575
5344 1664575 1639384 1608321 1609309 1627402 1706567 1654602 1718931 1717956 1683004 1692133 1746262 1800727
5332 1800727 1752309 1699526 1635962 1627068 1649688 1629357 1630558 1610252 1705840 1862704 1830462 1805661
5320 1805661 1834485 1846203 1863207 1851808 1775445 1766728 1759054 1762571 1782890 1772823 1794079 1781590
5308 1781590 1716766 1689219 1738029 1745306 1861208 1892404 1915814 1920314 1986088 2054704 2026550 2002879
5296 2002879 2017541 2037058 2063500 2105107 2138665 2186012 2216095 2277334 2300452 2352868 2421493
5285 2421493 2382583 2419331 2520335 2606376 2707396 2781711 2763842 2760764 2860625 2928757 3065686
5274 3065686 3090469 3198441 3329433 3364536 3462370 3587451 3710372 3711579 3800002 3881086 4035498
5263 4035498 4129046 4168849 4303943 4344344 4395706 4567638 4616853 4669323 4817825 4844582 5020951
5252 5020951 5111601 5277862 5448389 5570488 5723469 5822120 5947439 6137659 6228564 6331454
5242 6331454 6542838 6744575 6950450 7181967 7350882 7542071 7767345 7994422 8139832 8263022
5232 8263022 8509043 8821979 9109656 9441074 9788436 10096669 10516158 10995871 11519013 12059229
5222 12059229 12559988 12874335 13167630 13453805 13812715 14201686 14700416 15339620 15977629
5213 15977629 16552281 17288822 18133770 19005433 19937592 20873194 21861526 23067333 24405778
5204 24405778 25817611 27504271 29484712 31777560 34346375 37339660 40899162 44963635
5196 44963635 49579469 55122151 61458638 68801308 77429944 87657390 98929400 110313538
5188 110313538 121388768 131777894 139843877 142485099 140207383 135668490 127569337 115011773
5180 115011773 100764773 87368082 75196777 64498416 55642585 48609708 43147970
5173 43147970 38750185 35201365 32241398 29668981 27479248 25505005 23755326 22222623
5165 22222623 20771483 19465348 18385867 17437631 16511370 15622757 14835921 14038343 13390584
5156 13390584 12833670 12272941 11842669 11416969 10933389 10486437 10085094 9628942 9298101
5147 9298101 8942519 8567497 8248488 7959010 7658736 7264398 7003172 6780454 6499632 6272616
5137 6272616 5932025 5789424 5576557 5350528 5173259 5012672 4787754 4722657 4671395 4533369
5127 4533369 4454311 4300278 4184043 4153387 4055440 3947941 3952890 3894229 3791382 3716220 3559078
5116 3559078 3467874 3458617 3427217 3303993 3091964 2976619 2909678 2767554 2747078 2748346 2629234
5105 2629234 2468931 2433483 2381218 2325820 2394697 2331513 2254027 2204903 2138521 2058161 2096597
5094 2096597 2030488 1961341 1944355 1881143 1876288 1895270 1873422 1800329 1768817 1649198 1619589
5083 1619589 1700804 1644228 1685583 1577168 1570608 1516211 1480993 1442471 1502338 1465911 1361396
5072 1361396 1453579 1346103 1271785 1180978 1169525 1221298 1196648 1124596 1089183 1106845 1051393
5061 1051393 1022998 984902 972511 1000810 970796 936689 945845 999063 952817 943560 871538 904078
5049 904078 811715 795698 833289 886294 870652 840956 817620 736675 675460 732092 646690 657534
5037 657534 658023 602462 601659 597932 613144 583186 647745 645827 636361 619131 631535 672614 604859
5024 604859 600513 692132 601375 608509 596973 701019 611992 560766 493330 499147 527547 543626
5012 543626 472147 513252 537707 547883 546811 495693 518617 536657 591497 466600 398250 461478
5000 461478 442097 454006 419482 459910 445668 434751 448799 430742 496575 464397 438899 411115
4988 411115 374322 396412 437339 414985 438188 430746 399322 352291 437696 487008 420450 381294
4976 381294 343144 345894 324930 290570 306005 308407 286721 232003 167863 237151 256823 253618
4964 253618 314091 363031 325999 267132 242694 291104 278575 351421 404418 356721 352901 239773
4952 239773 296658 231088 188700 237634 230269 115126 132820 219191 244938 262759 201889 128379
4940 128379 129973 184025 220649 236896 275040 285610 296656 228342 140360 163334 148749 138002
4928 138002 237812 178706 160869 150218 166919 202749 151121 166820 174233 174586 190251 166528
4916 166528 235225 215184 184747 184884 214128 220830 198747 235640 191160 177339 258304 239673
4904 239673 248981 299877 259950 331498 237825 240733 367697 453174 475064 490645 459351 443690
4892 443690 459083 446201 496479 568097 577391 656852 805012 770224 816393 852344 831157 844620
4880 844620 826749 814913 727526 658783 627644 506197 427101 323582 261969 267987 243791
4869 243791 221683 147470 172915 170133 234814 211081 193388 111448 142197 160637 191762 175533
4857 175533 95258 177047 160151 123645 70059 97917 71840 62156 81352 124911 146936 264642
4845 264642 286041 216045 156876 189495 193385 139081 64065 60115 61799 77987 125334 79139
4833 79139 90279 115343 160791 75687 107385 111299 135117 149674 160784 90735 74854 82670
4821 82670 52384 84457 88424 117058 106393 181630 230561 155417 79391 73352 88306 67795
4809 67795 39364 83834 93170 70458 26982 30246 97010 75294 67810 114787 80102 63399
4797 63399 33432 -60744 -12545 19763 2916 36747 47190 82916 23452 9240 57724 18371
4785 18371 -15238 -15393 -1324 68205 112487 84732 23898 67681 93110 44331 55073 84825
4773 84825 114226 63899 -14181 14365 82606 62083 22813 -23689 -51855 -36506 5673 69664
4761 69664 100732 40473 57405 22156 47166 70974 -8270 -1272 21775 41880 101617 134991
4749 134991 77553 72315 64099 66401 51582 81772 54128 -31591 36460 102661 139852 190421
4737 190421 158273 102470 105846 102880 22553 11761 88769 65399 -25299 -33284 41580 58367
4725 58367 41926 117538 190096 80481 40711 79238 91826 3916 19448 56115 18550 15190
4713 15190 -23524 -81918 560 71269 43528 38641 6717 -24163 -2418 56494 15388 75684
4701 75684 -3095 1838 103677 -1853 -28857 -10558 -7639 -10275 50515 3662 49747 82562
4689 82562 12421 84295 52502 79542 69006 45223 63655 88912 30765 94042 116354 87744
4677 87744 83084 115879 152049 27173 61389 39104 27864 124086 32035 21088 31914 51067
4665 51067 100260 108976 114497 63862 67965 128011 99594 31493 51991 69862 19818 72366
4653 72366 111005 -342 -15008 50470 78732 24125 28013 59399 45700 54383 -733 11417
4641 11417 30201 25527 18178 35813 55391 2360 27799 12836 49090 -6829 7365 127893
4629 127893 127342 144699 122627 72390 97511 41858 41770 82165 102493 92349 111752 118746 20444
4616 20444 91500 52526 19017 55638 60564 51738 124719 50496 -8204 41873 90021 122051
4604 122051 70383 10013 18899 -10248 22936 139436 189738 141428 88978 140198 93680 113772
4592 113772 113054 114049 131256 159615 147551 117753 104663 82589 112644 45203 123231 118771 32132
4579 32132 41756 48509 32316 -45613 47038 97916 87444 -19728 -56388 -31739 -65228 73859
4567 73859 71895 42010 91127 123766 162461 164116 184369 202074 179685 92995 125290 228751
4555 228751 196489 98416 121795 85902 116319 77691 48489 105904 134582 2635 609 84043
4543 84043 90302 72157 119629 74918 172603 172247 123413 191710 174529 92330 173738 94774
4531 94774 10303 91586 39630 22162 68524 98924 133750 207651 153342 158772 114903 82708
4519 82708 101132 137583 235301 185193 140907 153648 222174 246573 203590 197734 179243 193606
4507 193606 194368 142532 162201 212501 195857 274882 255719 326297 285411 291776 246288 192362
4495 192362 166089 145511 132582 88621 144407 182952 109977 128822 117806 66833 138311 206591
4483 206591 171485 238148 191082 116227 125352 220020 193299 104279 114060 69895 65921 126436
4471 126436 151762 185794 106647 125690 140303 172275 189439 177444 152672 154514 180439 173059
4459 173059 169279 149863 126486 149272 148128 173654 130209 103566 161546 187770 211440 124635
4447 124635 113148 195455 266930 176665 185360 182852 189460 256757 238685 189127 230916 246426
4435 246426 266718 268313 204128 214351 192528 102611 180894 199472 220010 170039 204754 241709
4423 241709 310271 287972 242309 242521 239631 264454 322644 325162 277835 325970 353574 348539 298262
4410 298262 329136 304539 329569 380969 387520 324239 306483 276907 244633 299688 294186 206314
4398 206314 261011 303995 247131 262969 333699 386697 398339 361845 384045 414355 393460 436832
4386 436832 463727 480034 401938 441992 486185 485744 532683 525491 532587 542419 566253 618352 686860
4373 686860 685602 707434 784218 840655 882105 905324 1093660 1223921 1297000 1356405 1418415
4362 1418415 1502899 1527014 1469122 1378927 1227214 1117171 1004353 869460 784435 653795
4352 653795 578904 581864 545594 622387 682180 641133 580830 549778 537714 547125 629707 612452
4340 612452 539840 566037 619695 666119 668841 649027 552473 506097 585089 597075 562008 527626
4328 527626 495995 587286 620107 592592 644023 614662 682214 670387 634654 682319 736685 719082
4316 719082 655348 720523 673288 688627 744354 782038 885974 841864 797069 835299 954740
4305 954740 1020437 988232 1051429 1123023 1198862 1305181 1402069 1426665 1350039 1330386 1244189
4294 1244189 1270508 1211737 1193596 1117793 1169032 1197496 1121493 1027941 982088 1033832 983146
4283 983146 1006621 942684 1042722 1060610 980660 993078 964885 932293 913347 964277 965689 1051155
4271 1051155 1082801 1072675 1099830 1155847 1203190 1325751 1436071 1518278 1546964 1539681 1521068
4260 1521068 1372948 1359107 1314519 1268549 1311751 1268130 1286115 1256805 1225837 1262364 1189291
4249 1189291 1182507 1159944 1194691 1228184 1172330 1164684 1115205 1153437 1183000 1149627 1167383 1228804
4237 1228804 1227783 1187329 1224012 1252629 1283483 1287465 1352479 1378020 1364721 1438315 1523863 1511536
4225 1511536 1473536 1507566 1562492 1579152 1628285 1708207 1728714 1704454 1750076 1745888 1809023 1863773
4213 1863773 1869022 1969612 1948375 1898326 1984462 2038046 2003494 2009839 1975790 2002021 2079014 2138609
4201 2138609 2195181 2209992 2311271 2354518 2266299 2349048 2438691 2384742 2410955 2455166 2511207
4190 2511207 2506569 2561400 2599966 2652604 2721406 2868201 2958285 2932473 2990136 2976096 2975633 2956775
4178 2956775 3084764 3105971 3126623 3230480 3292721 3351986 3371433 3406679 3528704 3563549 3574818
4167 3574818 3702091 3840983 3915279 3913306 3935491 4121068 4240153 4276155 4501218 4631419
4157 4631419 4756635 4829348 4966581 5186934 5327916 5392380 5456935 5579446 5699347 5862851
4147 5862851 6042988 6168184 6283068 6391334 6539778 6692310 6873734 7111980 7232277 7403132
4137 7403132 7644562 7838350 7979560 8127977 8308014 8500007 8777995 9048144 9272150 9554213
4127 9554213 9855871 10130575 10433022 10663267 10921551 11131463 11364414 11646643 11868585 12131940
4117 12131940 12388490 12740153 13053297 13441213 13914703 14412521 14826094 15291186 15877754
4108 15877754 16466133 17120961 17835850 18609657 19414701 20370198 21363799 22360497 23418820
4099 23418820 24487612 25541705 26744682 27964639 29384318 30899845 32475662 34323861
4091 34323861 36362966 38485793 40920850 43711074 46941143 50625491 54817314 59676633
4083 59676633 65529357 72272887 80096057 89397208 100497885 113416263 128322120 145619568
4075 145619568 165377674 186066263 203944840 216869427 226172289 228629049 217874686
4068 217874686 197839750 175797025 153306701 130170955 109056909 92252192 79607843
4061 79607843 69912855 62164876 55940069 50854833 46634413 43083884 40038200 37475882
4053 37475882 35203292 33105771 31158533 29382367 27713972 26148626 24678213 23392374
4045 23392374 22186971 20947106 19967597 19043757 18199690 17424997 16753937 16079559 15446533
4036 15446533 14842544 14258306 13762861 13270780 12671678 12155079 11748945 11341012 10788923
4027 10788923 10273440 9881616 9441368 9032993 8671151 8397059 8057459 7780672 7582250
4018 7582250 7340058 7069678 6930985 6765056 6639580 6464472 6322195 6234809 6170204 6034232
4008 6034232 5904060 5777642 5624683 5507219 5373009 5288874 5139463 5001596 4852723 4679630
3998 4679630 4658707 4588308 4421902 4275747 4163608 4038174 3958527 3858103 3725746 3679675
3988 3679675 3556866 3434929 3350981 3311420 3326541 3264340 3229528 3136780 3065255 3044903 3039240
3977 3039240 3044392 2981826 2928271 2828219 2846936 2772195 2601729 2545077 2532654 2532911 2437134 2443777
3965 2443777 2406510 2389143 2393229 2419918 2343064 2374943 2318469 2222713 2224693 2154890 2067887 1967405
3953 1967405 1985104 1875166 1943042 1958982 1972553 1967450 1860724 1833715 1783240 1691668 1647007
3942 1647007 1646575 1583694 1570853 1619512 1582517 1597028 1578991 1563453 1590061 1600315 1532683 1520649
3930 1520649 1446167 1475156 1468267 1475088 1475075 1432016 1367594 1352075 1402430 1382333 1396748 1418280
3918 1418280 1369959 1308601 1344502 1401258 1423764 1438830 1400237 1445013 1479397 1482121 1434977 1407230
3906 1407230 1394329 1388672 1404810 1472272 1496100 1434043 1340665 1378187 1448777 1391077 1331161 1299279
3894 1299279 1387775 1360546 1377043 1362264 1317228 1412337 1379465 1323116 1336721 1350815 1261153
3883 1261153 1337117 1375330 1425156 1436820 1470796 1529165 1550429 1529445 1452220 1466360 1487606
3872 1487606 1612686 1622182 1634327 1644227 1672719 1624741 1658246 1712954 1674262 1755602 1749831 1739067
3860 1739067 1749519 1839503 1914410 1892107 1864810 1846731 1908418 1924631 1983708 2005080 2122921
3849 2122921 2094542 2131524 2144273 2218970 2236205 2314449 2328473 2370009 2356602 2360606 2449666 2522931
3837 2522931 2630446 2666298 2763750 2759350 2759256 2796067 2835028 2899155 3068534 3185716 3192236 3236859
3825 3236859 3326594 3393363 3437911 3431272 3570282 3759820 3958445 4109180 4215105 4309261 4412687
3814 4412687 4525849 4590628 4773629 4926956 5013173 5120614 5379743 5580019 5709045 5895780
3804 5895780 6115161 6322249 6508283 6729079 6965600 7157507 7396935 7575152 7821596 8081450
3794 8081450 8360445 8565606 8738592 9020845 9284388 9513024 9775869 10065519 10262442 10383063
3784 10383063 10551861 10751918 10930038 11123558 11264380 11223983 11164782 11177907 11079734 10895892
3774 10895892 10693942 10425289 10039388 9706279 9375579 9008557 8706533 8473247 8138213
3765 8138213 7869801 7680780 7406169 7128099 6937977 6702527 6562485 6313218 6049051 5797343
3755 5797343 5622210 5505492 5310017 5174080 4932720 4808686 4661954 4504819 4415939 4272323
3745 4272323 4224709 4147564 4090639 3914429 3744449 3624053 3567726 3517426 3437613 3286336 3121567
3734 3121567 3033550 3001306 2979263 2848815 2699821 2617612 2600338 2539329 2478978 2485045 2383526
3723 2383526 2307707 2282771 2268604 2267117 2257121 2222881 2235760 2153332 2087256 2041541 2007178 1964142
3711 1964142 1924246 1902813 1935488 1853145 1838504 1837221 1789681 1784373 1676309 1662723 1681677 1630982
3699 1630982 1615053 1579336 1601413 1596502 1568604 1560030 1566971 1494327 1464110 1488329 1447798 1435580
3687 1435580 1443030 1429463 1332267 1296527 1356980 1354564 1319690 1289830 1236701 1270159 1268852 1222612
3675 1222612 1205478 1227220 1230222 1220365 1183988 1275428 1236892 1247355 1227452 1160932 1202262 1294592
3663 1294592 1289160 1214794 1154231 1168746 1159330 1215066 1173485 1205790 1212648 1256340 1316489 1273166
3651 1273166 1159313 1103212 1109514 1208655 1193960 1109748 1127434 1144025 1171835 1203031 1198675 1179623
3639 1179623 1213209 1277487 1279029 1275510 1267197 1212618 1262556 1224636 1283731 1288909 1259860 1286859
3627 1286859 1243703 1278607 1296790 1315578 1292761 1289438 1312378 1363004 1504743 1468858 1446011
3616 1446011 1466674 1414116 1421833 1438892 1468057 1430527 1415897 1519025 1502525 1585119 1632442
3605 1632442 1584381 1536595 1525111 1584395 1545272 1554677 1634367 1661614 1763874 1765753 1749618 1734717
3593 1734717 1736448 1734823 1743071 1714861 1773560 1859021 1924086 1988079 1968614 1936042 1900631 1883418
3581 1883418 1914141 1961283 2012260 2130094 2135173 2112289 2161936 2146069 2163279 2207139 2191409
3570 2191409 2200061 2318048 2330388 2330066 2331056 2339236 2338726 2402357 2437469 2358501 2389632 2344342 2388606
3557 2388606 2455895 2414308 2430563 2440871 2412130 2431225 2422825 2468090 2406057 2413583 2415115 2408875
3545 2408875 2308627 2344438 2388718 2372651 2407693 2417043 2414333 2399784 2423049 2341866 2369398 2383856
3533 2383856 2399835 2374964 2335678 2347640 2347821 2314887 2257912 2228808 2222885 2159267 2086980 2056123
3521 2056123 2128979 2130627 2093193 2050809 2011709 1969847 1884159 1916136 1866589 1792474 1702495 1752311
3509 1752311 1787272 1763343 1748526 1771793 1675828 1680546 1679900 1626941 1632683 1573251 1514529 1486996
3497 1486996 1461931 1464910 1554244 1502283 1537824 1487132 1442536 1370154 1354884 1345074 1243634 1186390
3485 1186390 1208798 1180768 1197071 1171795 1127858 1059582 1038884 944032 966647 986562 1058049
3474 1058049 1040379 1029401 972303 885304 917101 935720 988743 924543 958141 946325 948853 918878
3462 918878 840195 861145 867292 821101 767349 806858 796801 763617 773973 783423 756821 671589
3450 671589 714112 690796 644019 609479 654212 737794 584517 580352 665909 687221 614453 573683
3438 573683 618102 509602 535371 575023 603208 540558 658028 658189 523549 530374 544789 479243
3426 479243 566347 573753 605188 631009 595888 531661 592865 557983 576486 583256 539276 590351
3414 590351 649769 629303 548735 532504 463332 440456 494601 558743 490423 482870 531199 515877
3402 515877 369253 422852 458248 421757 448940 443379 440906 430924 435808 437934 519814 524882 474127
3389 474127 487639 464909 484277 444572 458898 480498 473385 451127 435405 357658 386897 378274
3377 378274 398876 406209 474410 523775 490993 454144 430911 496612 462962 477343 518807 430606
3365 430606 475517 452186 452105 506838 477651 444862 467144 530943 483246 451132 434913 417802
3353 417802 448559 527803 496230 564149 528594 486498 482345 460374 511094 565789 501412 585517
3341 585517 590660 572847 575006 561368 553249 488141 553551 580288 635920 681044 691478 679627
3329 679627 725145 691358 658051 723655 659908 736038 725880 701483 729901 696182 740130 761810
3317 761810 767464 789199 787799 839588 846709 847686 925337 891353 883787 953528 1016875 1006443 1016368
3304 1016368 1091290 1097105 1092284 1066492 1114617 1245465 1331109 1412724 1463738 1436990 1482489 1518191
3292 1518191 1497573 1577735 1621400 1640216 1624174 1683355 1693667 1747777 1785841 1801540 1847395
3281 1847395 1833633 1866168 1943792 1986410 2080608 2199977 2280062 2337443 2458510 2588063 2664895
3270 2664895 2730875 2886755 3105548 3214846 3259566 3342411 3383842 3576514 3675121 3901052
3260 3901052 4187265 4424639 4693700 5008246 5319292 5639549 6040102 6599386 7169649 7959343
3250 7959343 8770142 9762463 11102320 12504093 14180887 16084580 17674645 17374260 15163988
3241 15163988 12561924 10634672 9338888 8502019 7899897 7518374 7298227 7153873 7036789
3232 7036789 7013427 6954589 7059546 7160465 7294084 7606337 7955052 8514479 9076004 9647510
3222 9647510 10470559 11362843 12441506 13781242 15369525 17404062 19588314 22353202 25520894
3213 25520894 29108665 31553471 29929109 25029960 19807538 16050768 13471333 11701644
3205 11701644 10427393 9450906 8715572 8185141 7713342 7310406 6960508 6679722 6469101
3196 6469101 6395228 6373327 6394843 6498003 6590221 6770477 7025762 7336491 7811073 8402580
3186 8402580 9121073 9966760 10987030 12271418 13779050 15338325 16204034 15130369 12602100
3177 12602100 10103747 8316054 7079877 6194707 5485878 4939949 4595464 4174425 3837759
3168 3837759 3579088 3334759 3083001 2845466 2678820 2602292 2529486 2338108 2206943 2172073
3158 2172073 2042246 1983604 1905530 1864852 1729998 1619662 1609859 1525885 1455539 1428780 1361840
3147 1361840 1320617 1326665 1322178 1302945 1278518 1201305 1162287 1111563 1069608 987182 936278 1031765
3135 1031765 1012257 891380 913433 931977 817472 795836 837179 786160 735862 719142 732171
3124 732171 711841 648957 656166 669447 623277 646610 544990 501293 476269 470739 500752 478885
3112 478885 510894 482131 470217 471441 506942 471693 475579 496273 506492 433154 369008 375912
3100 375912 317542 336602 343999 423653 350599 265653 272835 296190 272851 245755 349703 311589
3088 311589 231268 254163 242985 198699 248219 213568 188326 210832 266914 234843 304178 338712
3076 338712 249533 242136 235771 161533 151049 218854 201197 227201 46011 21456 197917 179332
3064 179332 199595 180010 156984 175727 150938 129472 142277 183591 139630 47745 83488 57739
3052 57739 113912 82523 112778 105008 104570 158261 146268 98021 97063 194046 160715 94391 77002
3039 77002 128323 159537 64378 34036 115325 124277 95128 78299 77097 37068 16100 974
3027 974 36897 68255 126520 144476 172536 157357 145964 49746 75641 82275 208451 158006
3015 158006 108526 76718 70210 104001 27548 97766 125496 64316 24492 26389 73724 69178
3003 69178 -16380 11147 22921 77256 19992 -3251 46443 70138 89044 79307 25050 18726
2991 18726 47168 95821 -14440 -11814 4127 -29341 -12222 38721 50316 25373 5130 41334
2979 41334 10176 -39691 1923 71827 107276 76817 60018 13831 -12878 -33124 -7536 21473
2967 21473 27974 13148 -29193 70516 108517 123303 127844 10506 32772 157932 136801 58223
2955 58223 83992 145037 160560 122159 55506 72044 89815 98772 83525 70973 68728 114965
2943 114965 58481 82495 137789 72435 65570 58880 61435 32455 49635 71322 114975 152613
2931 152613 161218 127594 139842 188449 206768 161273 136202 194486 149288 58435 114019 78496
2919 78496 81968 96902 44868 52877 71589 -57698 -58254 -32446 -28362 -3727 2129 58593 79349
2906 79349 47010 -9883 -3184 1179 49149 60066 8590 60242 19226 11274 7307 4749 85989
2893 85989 110362 105984 116945 16952 5946 47491 45610 -4626 59271 72289 -12105 -40927
2881 -40927 -27548 24593 -48754 -42143 11734 62172 75127 60720 97376 13291 4415 -46989
2869 -46989 -65596 -92883 -17163 45733 4213 41943 34848 21174 -29361 -80107 -7442 19086
2857 19086 -17713 47025 30169 21534 -17136 -3779 4569 16272 26008 -9761 -23684 1534
2845 1534 -287 29342 15960 13038 -16686 7685 3052 11636 -98616 -108512 -77898 -8072 14615
2832 14615 26125 -30575 -3726 15812 7487 -81442 -139115 -133968 -78176 -47505 -125466 -100271
2820 -100271 -52823 24103 96984 109639 54148 -11205 -70135 -26052 -81320 -83514 -44189 -44465
2808 -44465 -89181 -44307 -70451 -82401 -28818 -41607 27441 -5138 9327 -14031 -106493 -89887
2796 -89887 -68314 -65141 -37073 -39747 -972 39408 44584 26425 -61255 -68356 -38721 -29270 -95419
2783 -95419 -22902 -57635 -101246 -34729 -66513 -25476 32056 -80438 -154857 -160934 -185058 -159503
2771 -159503 -91423 -59732 -7244 -17509 -65320 -33722 -40004 39102 17934 -11042 10468 -14623
2759 -14623 -58157 -91303 -112928 -70859 15511 -79854 -115435 -156100 -84737 32774 25769 4725
2747 4725 -43382 -81474 -68707 -80665 -61180 -52630 38063 82236 22566 22958 45743 -48283 -77411
2734 -77411 27847 7274 -12893 6989 -20350 -41130 -56780 -72134 -125743 -94416 -102163 -67074
2722 -67074 14735 -50715 -129326 -66995 -65926 -68397 -124097 -113995 -145992 -151152 -83361 -53992
2710 -53992 -32821 -63522 -141136 -129291 -14301 33271 61795 53745 -41819 -28014 -57902 -40898
2698 -40898 -27486 -72394 -46309 -103249 -31214 -1971 -20762 -24181 -44964 -87654 -106610 -147996
2686 -147996 -100360 -103465 -125867 -81287 -7585 -48796 -38088 -65508 -128604 -139652 -106806 -117028
2674 -117028 -41952 -91451 -130509 -30005 -2995 12455 -93086 -134227 -55749 25564 -17146
2663 -17146 -30321 4447 -36116 -60327 -53452 -37274 -70058 3632 -26537 -53589 -80529 -66133
2651 -66133 -66297 -78257 -58459 -37688 -79385 -135547 -85309 -86485 -42839 -16399 -46284 -87519
2639 -87519 -119275 -90122 -28214 -56165 -119979 -93148 -90098 -139567 -12976 -45562 -110347 -23075
2627 -23075 -25535 7395 -32077 14665 -49896 -108335 -66929 -37198 31621 52544 41021 17298
2615 17298 35725 27584 12293 41376 11863 -124494 -95974 -65086 -69446 -66793 -55526 -51594
2603 -51594 27889 66757 -74851 -44450 -23408 3890 28451 -10685 -19260 -44410 18918 32767
2591 32767 28685 29181 86177 34968 33695 57259 22138 73040 20229 -34745 -23528 -64615 -52760
2578 -52760 -37958 -22820 26598 -68693 -86252 -45929 6540 -41233 188 -1262 7257 -61384
2566 -61384 -58635 -32415 -62383 -55751 -104906 -120378 -129064 -65263 -87700 -135529 -126046 -57913 7618
2553 7618 -2486 -95595 -92701 -139154 -118623 -112530 -78479 15864 40943 27415 -14611 -79985
2541 -79985 -97213 -65281 -24103 -48550 -51843 -41919 -15774 -58433 19642 13701 37382 -56490
2529 -56490 -74586 -70227 -21205 -52194 -28519 4549 46722 51838 51585 96261 22935 -14729 -37184
2516 -37184 -69186 -91370 -36554 -721 -56918 -87457 -58203 -153487 -109255 -47734 -50293 -66274
2504 -66274 -75989 -26177 38943 43106 -46667 -50656 -28629 -44691 -68418 -1540 -46863 -96345
2492 -96345 -63240 -63816 22899 8303 -40381 -131733 -82008 -118948 -98272 -11675 -14064 -98714
2480 -98714 -132689 -87821 29973 4050 -25130 -11937 -52650 -97597 -11706 -77461 -134325 -129928
2468 -129928 -98822 -55797 1359 12165 -37634 -12938 -4007 -54062 -74858 -21196 10190 5421
2456 5421 -24224 -39078 1864 -7198 -87039 -112085 -37633 -61514 17860 -39248 -68758 -42382
2444 -42382 -82795 65376 4231 -58963 -88467 -127186 -101601 -61193 11750 14228 -67145 -57857
2432 -57857 -45841 -68268 33946 56508 3510 -20478 4441 -29644 -4592 -5508 -1072 7793
2420 7793 -28743 4789 33170 -40210 25769 39266 -23039 -56875 -69489 -38059 24947 51635
2408 51635 11301 -8109 19188 31348 -50622 -17276 -60582 -28643 58967 48035 44888 80326
2396 80326 -49586 -56770 -34205 -25079 19676 57060 22363 -25667 -53376 16043 73111 131810
2384 131810 140368 104222 26982 68641 33162 100174 141362 60543 -1916 -52814 33239 98660
2372 98660 126747 146494 97232 77365 125341 195153 185120 138495 181397 163922 186083 235952
2360 235952 143419 53461 25692 -61073 10741 11805 26704 21443 2389 -23373 -36756 -50526
2348 -50526 -16721 -9395 -51784 -43722 -56094 -20094 -56263 -16966 111222 118839 87120 80730
2336 80730 -10635 12905 51594 108970 55490 41882 27512 53154 134997 120538 183309 140069
2324 140069 110998 66437 57198 106128 21079 -75819 -46289 -34882 -30006 62115 85191 9508
2312 9508 20669 -1443 8511 -1718 85151 127750 63733 65888 105541 85149 -1577 -7742 15220
2299 15220 85155 93631 95748 130116 115265 108110 139374 58682 76501 63198 14749 41449
2287 41449 77772 123514 91694 75704 140089 111481 161592 160299 77023 111846 182480 200355
2275 200355 167773 127110 114387 30657 61857 179003 184728 95206 58399 137222 109107 90807
2263 90807 113740 119648 128562 103154 113711 119314 104775 128396 116285 49336 36332 152332
2251 152332 130365 117839 147912 209716 197503 177670 190896 266074 251251 205806 110137 101555
2239 101555 179913 202383 168220 231992 216532 222967 202676 200338 232573 292272 312893 332364
2227 332364 345876 222824 206156 289568 411628 303669 213429 268507 183268 179670 276084
2216 276084 211847 245766 307678 319478 283750 301034 243179 244311 332470 352070 262907 278300
2204 278300 304889 354883 361685 302975 381867 436806 465941 389189 379859 419953 464360 468767
2192 468767 526539 513296 463718 482373 484059 452680 522431 593256 624873 591601 546372 573807
2180 573807 643654 649968 632713 608053 644009 716819 734708 762378 712754 784368 802503 834003
2168 834003 802922 860011 913212 890109 916993 910956 945507 934436 1033199 1094646 1081712 1105430
2156 1105430 1192321 1168710 1214726 1296844 1339340 1363847 1352485 1471759 1492350 1537264 1564120
2145 1564120 1637788 1675153 1647722 1624494 1672293 1756802 1832164 1879195 1921973 2067237 2109503
2134 2109503 2171346 2327264 2422363 2492228 2637153 2726102 2906007 3041163 3099966 3255149
2124 3255149 3326054 3584822 3754967 3991277 4264867 4450024 4687337 4961087 5265433 5626982
2114 5626982 6106385 6660352 7124521 7683677 8195184 8824811 9600834 10441334 11571848
2105 11571848 12924630 14614393 16629713 18962020 21814075 25046383 28808910 33268188
2097 33268188 37760378 37947297 32373742 25104170 19510059 15967890 13398893 11543117
2089 11543117 10003115 8915429 8056980 7246451 6732680 6365251 6088990 5852127 5516206
2080 5516206 5116675 4659328 4240774 3829844 3603819 3395453 3162126 3038595 2924296 2743775
2070 2743775 2611860 2418640 2294809 2172058 2100539 1982065 1946282 1950227 1901510 1840118 1707397
2059 1707397 1541428 1500253 1533535 1424518 1411121 1374839 1268923 1210533 1120982 1129653 1047288
2048 1047288 915779 954477 951256 847688 795437 800579 825407 784461 772462 759556 704386
2037 704386 719673 787053 695466 663161 596937 568190 589947 581180 579903 551032 499030 498769
2025 498769 486652 405767 518204 519911 506885 478529 483445 438756 401006 361521 318525 288764
2013 288764 359664 366512 299320 335124 270144 283939 285466 314835 318710 291033 255789 267491
2001 267491 184623 185470 234352 237666 313098 263630 271768 222518 246584 226837 175844 193030
1989 193030 241077 264216 302867 232884 153775 211638 215481 327061 293154 237298 129956
1978 129956 127247 94760 103511 181651 238357 209702 159882 72694 134656 188995 192717 294486
1966 294486 232228 195068 141085 163062 101633 136945 130580 61551 36397 108131 65188 21032
1954 21032 105625 104209 114086 100219 45509 24597 48210 14130 -29968 11832 3644 5194 73947
1941 73947 57587 31979 -4624 42638 101225 52723 77596 5809 70097 63214 -19772 4266
1929 4266 6583 27529 68831 93074 83886 24936 47384 108360 116453 32487 37679 114097 100704
1916 100704 50068 30512 -5616 -36748 -24024 -24155 3884 9728 43383 37895 42716 46570 -17749
1903 -17749 -8697 27710 18587 36274 68655 23637 -12177 33374 91129 57766 50312 -23705
1891 -23705 -77165 -56848 14828 62508 37932 63723 55692 65651 33117 65191 46412 54554
1879 54554 26008 2897 32415 -52552 -18240 64647 15309 4261 39290 -23821 23408 101514
1867 101514 122714 68981 -28791 5651 -35366 8674 82760 48754 -87709 -48907 -30094
1856 -30094 31696 117 -10490 4937 -50593 47519 73869 76011 1635 -24709 -69851 42062
1844 42062 99398 112416 170281 121596 74920 50847 23416 66217 104384 62128 50369 88204
1832 88204 145394 173235 118651 99729 110316 169092 139395 32472 77840 126930 102475 28526
1820 28526 46185 81193 100058 102755 74055 65933 110203 62449 48144 80954 19749 24782
1808 24782 -25871 -56760 -58964 26961 20988 -68316 -92224 -59256 -43748 -39849 -15427 -17247 -26595
1795 -26595 -40408 9313 -45351 -85768 -42286 -166352 -144958 -98328 -41872 47985 11362 83447
1783 83447 68192 -23537 19550 30665 -54432 -29974 7093 23990 -33020 9543 -15537 160
1771 160 -21771 2678 -7865 -54090 -89637 -59777 -24385 24653 -36183 -74219 -3702 14053
1759 14053 -19398 -91670 -108893 -112541 -15965 26460 -12037 9757 -68337 -50057 -10396 -44259
1747 -44259 -91264 -40444 -91674 -44289 -62890 -86809 -46419 -61117 8452 -117053 -79468 -75458
1735 -75458 -42466 15927 4079 -9672 28523 -42563 -52642 -31248 -45459 -11972 1081 -77178
1723 -77178 -24497 -24276 -348 -5300 12980 82546 23200 -103411 -121977 -35055 -109422 -143902
1711 -143902 -88034 -1302 52966 43453 -50596 -89557 -57735 -26964 27774 10011 53535 78823
1699 78823 69279 102119 118671 20978 -54272 -44348 -11154 -102336 -114998 -135968 -111336 -86259
1687 -86259 -26740 -56607 -26901 -41169 -50300 -24418 -12207 -75214 -53045 32845 20598 37306
1675 37306 -5651 -50902 -6440 -48137 -8421 -2528 -74603 -38180 -72256 -64742 -23927 -13839
1663 -13839 -16118 35215 -58157 -121940 -46884 18266 -53997 -53828 -41165 -18081 37180 55750
1651 55750 41675 51625 -18152 -5532 -3882 -20736 27659 -13178 -86649 -4120 46975 41731
1639 41731 -28638 -55559 -148 40144 13460 16675 -62525 -31156 -10082 -55702 2231 66690
1627 66690 68392 37253 -36426 -41647 -5017 16101 34147 47896 7865 -15751 -24329 57293
1615 57293 91457 -10501 -98952 -31112 -3651 -33333 34062 47325 11030 -12255 -77277 -72482
1603 -72482 -66745 17437 4210 -93360 -62261 -108347 -82731 -60630 -29033 -23952 49850 38100
1591 38100 -9189 -34810 -20651 32590 63965 15464 -33244 -976 -3550 22581 -865 -26793
1579 -26793 -39900 -53373 -8055 -8976 4583 -17644 33452 66064 124065 8873 -80081 -69109
1567 -69109 -33066 -77745 -21765 3890 -80596 -44235 -35504 -30504 -49031 -65278 19732 66414
1555 66414 18646 99066 47613 19282 34631 27619 77508 -4029 -19612 28267 -49916 -22374
1543 -22374 34663 20560 32361 -9006 -92235 -56873 -27461 2698 -94463 -21009 5892 -25539
1531 -25539 3708 -6359 20115 45043 10224 -69857 -71850 -64390 -9970 -66507 -55485 -95661
1519 -95661 -47103 -25558 -71373 -54402 -83342 -116384 -98082 9485 16940 -54385 -71817 -30767
1507 -30767 17529 67929 25309 10326 14914 -28981 22856 15341 24266 -33703 3601 4457 -82464
1494 -82464 -33617 23311 27886 7286 -104728 -57131 45322 66914 91772 68001 2569 -96778
1482 -96778 -225302 -179517 -62690 -75973 -43605 -56657 -45883 -26592 -36829 -95328 -120079
1471 -120079 -181 17261 -40482 -52988 -46487 -36773 -68755 -21159 18125 24989 -17212 -89974
1459 -89974 -115484 -62838 -24258 -10198 -12776 -12076 31438 37670 17762 38694 32236 33156 -10135
1446 -10135 -21463 -70403 -34689 2206 61165 22918 -92926 -28588 32624 -34653 -103945 -100553
1434 -100553 -45385 16209 -41906 11885 -11232 -44593 -6676 -4895 -63547 -83527 -55182 -25340
1422 -25340 -12687 23039 31167 -51888 -96426 -72025 -7510 -58347 -90255 -68119 -9332 -42098
1410 -42098 43526 -12082 -56879 30180 -4733 -24821 80134 139367 80716 35896 -29136 -3222
1398 -3222 36316 -25451 -66658 -51529 -6503 -37485 -9763 47023 93266 81242 39851 29750
1386 29750 -15521 -53109 -38429 5092 -40029 36718 -49624 -62110 -29429 6276 -17951 -70852
1374 -70852 -63390 -58793 -107793 -103491 -72165 -91867 -94598 -4875 58452 -13494 -62805 -95067 -135722
1361 -135722 -141873 -70661 -8207 -17440 9327 19552 54677 36325 -32489 -59285 -44761 874
1349 874 36406 94566 50122 41165 -41599 -35304 7234 -8566 -39916 -29228 -14315 -45920 -94073
1336 -94073 -12670 38980 32243 16848 -71338 -44810 -54666 -33293 -5401 16897 -6085 34311
1324 34311 -12514 -54779 -55262 -59542 -67581 -59641 -57168 -113021 -63278 -50238 -14133 -2614 -63869
1311 -63869 -56432 -115456 -103042 -37627 16282 26779 -4942 -48819 -37732 -16850 -71485 -116921
1299 -116921 -92695 -54999 -17778 58180 -7673 -55965 17837 67996 -22888 19303 51787 -2174
1287 -2174 -15586 -47681 -51651 -7843 -38608 -54178 45360 54786 34654 58177 -13628 -50148
1275 -50148 -52799 -20720 6254 81102 42625 13324 -13653 36400 82759 67008 -16677 -11138
1263 -11138 14063 -78843 -30253 -9805 -45951 -90406 -101229 -71783 -33306 -62410 15908 49341
1251 49341 -61012 -53808 -55510 -66418 -33751 -59259 -75562 -76660 -38140 -37533 -65442 -38883 -9714
1238 -9714 -50294 -22324 -100685 -91350 -2991 -28909 -37364 -13601 -76739 -45142 -41197 -77617 10260
1225 10260 20869 -30025 -26948 -47067 -85581 -66966 16997 56796 -33419 -41985 -42614 -56797 -21257
1212 -21257 -67998 -61904 43885 -56492 -60721 -99606 -80930 -37731 -29763 -29692 31227 -16627 -57806
1199 -57806 62593 9812 -46665 -101565 -86342 -35605 -22226 -12452 -91287 -109711 -72224 -71366
1187 -71366 16624 8199 -54407 -72319 -43210 -74832 -38034 2607 -28380 -17508 -46260 -83422
1175 -83422 -56957 7991 13258 -35318 -28138 -1863 13293 -35364 -22613 -4114 -72870 -21536
1163 -21536 94788 31502 14176 28920 42220 -14480 24330 7316 -12597 -54902 -16807 3554
1151 3554 -96446 -94683 -62441 -30147 2481 -71203 -93470 -38918 -69572 -62768 -32203 -60310
1139 -60310 -37784 11087 -26893 32438 6256 58655 34603 -15984 50905 68052 -1839 -23993
1127 -23993 -1389 -3402 27035 50389 67352 -10520 -5914 63804 -8615 -44943 -3987 46740
1115 46740 40279 -29354 -80891 8999 -989 -56778 -13320 1896 52073 50493 48835 35579 -49212
1102 -49212 -28941 -115697 -74206 -91273 -64842 -28973 -17766 2504 9882 42665 74009 21401
1090 21401 12815 11124 -15807 -19022 -24555 -26236 -77742 -30387 -11949 -33727 31087 12691 15551
1077 15551 -2490 -42659 -41320 -76081 -55509 -75027 -25871 -13433 -59480 -60758 -46212 -55138
1065 -55138 -38640 -84306 -6631 -3339 19830 20810 48249 61357 65957 29977 98197 78612 -36828
1052 -36828 -25795 34103 62983 112254 90056 72945 145413 71657 83181 52319 84748 -39983
1040 -39983 29378 100324 15358 -7292 -34669 -42283 -4353 38101 -55326 -48221 -11307 7868
1028 7868 -40232 -58008 1403 77147 62214 -5716 -17398 -65052 -115985 -25578 90506 54109
1016 54109 764 38936 20582 92125 63769 48661 5268 -13672 20828 -7704 -18507 24202
1004 24202 30496 -78098 -104613 -57616 -41352 -61688 13164 64406 69040 24091 13482 -72491
992 -72491 -87341 -25988 -48340 -86525 -87025 -39245 6181 28339 -40700 -8 84823 23184
980 23184 72269 332 64909 93840 70242 10590 20666 -25285 -122715 -64123 56037 73297
968 73297 130496 65562 -12384 -8453 -52858 -38792 30999 -36742 -80650 65027 79553 -45617
956 -45617 -117921 -30095 14488 4796 -19541 81452 14425 21099 -45700 -34418 9445 -7131
944 -7131 4055 30965 19820 -48414 -52246 -96790 -68400 -8293 -27102 -961 6150 32320 11265
931 11265 34093 33114 59314 72372 64042 -24954 -100930 -160934 -33408 1275 40933 24824
919 24824 -1147 23879 17706 23789 92681 33016 -29059 41695 -4729 11873 7587 32270 8379
906 8379 -77043 -120036 -40579 31161 84698 106457 23362 -14252 79016 91119 52947 17579
894 17579 59068 66322 7973 3718 12457 31787 32011 23612 55194 -275 26672 49364 45359
881 45359 65488 68748 -26605 20637 122354 -20326 -39934 2122 28067 -42345 -20755 32792
869 32792 30138 102353 112604 86945 44778 39257 9991 100184 24987 -763 24368 109680
857 109680 43934 -15488 -9065 -50375 -89419 6989 -37827 -60931 -15666 78452 -23238 -47806
845 -47806 9336 56544 10716 36174 40113 -31858 -9042 26060 31852 -27015 -37356 -15958
833 -15958 -12519 -15681 -22091 -52038 -2778 -53990 5842 -41178 -37035 -35785 -34056 30977 55122
820 55122 -19989 -6275 -16874 -12409 -37143 15833 10910 -108829 -78443 -39600 -62342 -36074
808 -36074 -62579 -4080 915 83247 143354 25256 21799 48749 50050 72980 -4167 -28243
796 -28243 51161 57321 872 1391 16129 26701 31210 -12627 -24843 84228 -3399 -64253 8217
783 8217 -30232 6633 47767 -6513 -36743 -24428 137388 126787 -3049 -5228 -4741 8848
771 8848 -6 -13490 -31307 13916 -8932 -78723 -39594 -25942 -23677 36461 -33562 -16374 8137
758 8137 -732 89400 20628 -69392 -16035 -9424 16628 -75073 -53871 130640 116008 32420
746 32420 -304 49914 49921 74058 48530 9640 61517 43927 -3882 28817 49060 48379 60058
733 60058 82355 45792 47407 57199 35747 -870 -980 -48007 5799 26720 9946 41000 38992
720 38992 28746 -59694 39631 38253 24930 43059 -29846 2766 5670 78880 130720 45361
708 45361 -12993 -21434 -51961 -11039 -11757 -6627 35318 19631 45089 36571 24317 -2550 -5341
695 -5341 -40262 -15219 -10886 -68148 -50846 -14543 37798 43264 -28432 13964 -29990 19575 -9618
682 -9618 -5944 608 99758 85662 -80536 -4026 106250 102293 69230 -8528 17932 -104816
670 -104816 -16063 105683 21639 94443 83136 91186 64007 32174 5440 25773 -47427 -24286
658 -24286 -11764 94882 40374 50754 107705 -33990 -34154 -6780 13945 24206 40354 25558
646 25558 6466 -65458 -41097 61858 53215 20786 -32509 -5413 69067 28442 37091 71391
634 71391 74813 -31904 -8747 -20403 -3537 -23865 -16790 53075 6512 84984 91776 40347
622 40347 59549 21507 4322 -39537 7576 76657 48473 44224 47985 21747 -13608 162
610 162 -3406 -32530 -25452 -7914 13641 104285 64268 24075 -53933 26297 31527 -4436 -8465
597 -8465 -39791 3011 8577 51506 35653 59992 86781 62280 72029 54950 2834 24765 71651
584 71651 7384 44751 80457 102166 70360 8579 -38561 9463 46608 57834 34727 76479
572 76479 114284 29256 -13874 -56188 28555 33678 -40948 -31599 -2617 26316 42269 -35494
560 -35494 1360 25546 10592 2720 24973 76211 43959 27423 54592 32689 44543 59308
548 59308 -6263 18085 -11368 -9965 36472 51581 -24643 -61762 -62212 12240 18518 16984 94296
535 94296 24850 -13537 -9377 -21700 26425 59927 66178 61898 1581 -29932 79651 60287
523 60287 56999 72453 2408 18762 32178 40693 -32466 -19000 61725 38830 4292 -10042
511 -10042 -72261 -1138 89336 83733 72497 106741 59945 32660 27471 -31990 -24316 4792 55919
498 55919 61289 56370 21044 23247 57607 27485 2341 80682 67639 79982 102496 66624 -6474
485 -6474 3841 39783 17642 114249 57745 35674 -2213 56942 68187 46923 -15472 -65782
473 -65782 -47373 -37560 7899 61074 6864 40033 66144 13008 45785 71578 16013 -350
461 -350 5838 -62655 38145 18282 -45178 -30729 -21779 -6706 -8563 15604 58585 32744 -5335
448 -5335 -8527 42850 22543 48784 -20357 -32581 -7465 -40322 17325 -17722 -7027 -12892 -11733
435 -11733 -57103 -49739 -27447 -82370 -39857 -31391 -10218 76946 36158 32349 30619 46189 74890
422 74890 98970 89896 86774 102134 -7760 -20349 41672 46572 113232 90533 -50917 -87682
410 -87682 -40894 6856 80957 9810 -28943 7974 5885 3376 27980 99362 120224 148306
398 148306 187353 155152 67929 135347 151953 82615 80284 44533 60821 32346 10608 64343
386 64343 2706 1010 -46757 -84553 16441 58530 84450 82862 70835 16917 16575 24571 -11445
373 -11445 19581 48203 63350 11393 65536 88922 34616 41485 77301 109131 73434 -10400
361 -10400 62725 84411 -9686 6322 31925 94491 112769 4576 4469 -9760 -56487 -20707
349 -20707 -9876 9549 6032 4158 49748 55298 87918 54308 2638 14421 44330 55001 51567
336 51567 110213 88976 71797 62907 63696 24193 8421 72303 104192 90471 83411 115119 133382
323 133382 117234 85394 29929 -28834 13457 16575 -10179 -15899 -12670 26756 66613 60780 27183
310 27183 59073 111602 99620 87523 307 136147 135353 23539 50677 32015 79564 -38213
298 -38213 -17349 55592 2252 41243 100536 105182 71373 63720 71305 144863 113737 95551 65546
285 65546 86333 83836 46043 48325 6529 51294 93377 79179 -15347 -16735 63165 124891 71414
272 71414 85214 75390 -2952 21748 87806 119808 152945 190850 88436 5523 95459 32094
260 32094 25819 79137 370 96200 87976 14378 82340 87116 54381 29478 57827 16263 15717
247 15717 21262 51901 44449 3700 -7601 34003 43243 16157 50024 115122 34037 1568 23234
234 23234 28586 26308 10172 -8740 -24410 28944 79491 128442 89513 86433 42767 88470 53835
221 53835 33237 125445 40822 -44008 17233 51177 73366 110290 126605 8092 40982 97439
209 97439 23488 31805 56957 54589 63715 25217 1208 63440 433 -57738 -15792 49356 88161
196 88161 46614 85990 147708 130744 98743 69737 2834 -11593 2590 51432 77095 11470
184 11470 54389 -32290 19932 109657 98762 47893 30516 34174 2480 14639 1452 -14464
172 -14464 -1878 16475 47966 85317 84358 24226 63126 30237 -68958 -22212 -30965 193 90016
159 90016 106173 52337 97100 85092 73475 117570 28807 48773 84399 124352 122606 162516
147 162516 117657 48300 117548 86133 99845 101971 79699 69235 119880 125897 121229 138677
135 138677 166395 159775 90161 90057 107017 103519 94595 69746 84763 5091 272 32546 33373
122 33373 36014 40902 24373 36852 58998 76693 87849 -20 -11805 -704 -14184 15219
110 15219 37982 68257 65016 53508 64966 53889 69585 47504 82766 122797 53690 46375
98 46375 88878 69758 59616 70063 43060 31958 37010 65574 83473 -27453 -19859 18931
86 18931 22164 18096 -13424 5341 77216 57343 -27206 23970 -1437 38627 55759 5655 -28571
73 -28571 66577 105803 77553 76138 70278 57552 28986 25366 39260 49402 44410 26039 41473
60 41473 44668 61954 78288 78294 91305 122455 145217 67073 55974 141287 128263 133810 127086 96656
46 96656 103240 101479 33229 -49197 19494 3873 51932 68033 98354 91331 52357 65460 83699
33 83699 84215 56715 69533 124224 123779 64110 19197 28923 49505 31728 13100 60383 102601
20 102601 33405 83183 86305 63575 29243 16297 57204 56576 61674 9507 329 67283 68447
7 68447 57857 53155 35573 90747 70689 79068 50012
0 50012
$$ Imaginary data points
##PAGE= N=2
##DATA TABLE= (X++(I..I)), XYDATA
16383 -445546 -424228 -369830 -388826 -392981 -343411 -298461 -333336 -356123 -302610 -318817 -307906 -326415
16371 -326415 -378390 -376981 -319040 -306146 -327726 -276561 -250222 -235907 -224481 -243008 -238733 -144626
16359 -144626 -136009 -165669 -207572 -147944 -137675 -142958 -134278 -150571 -164092 -131179 -131438 -140549 -123468
16346 -123468 -89825 -74976 -103454 -62718 -46897 -66137 -23128 -57808 -68953 -57232 -37030
16335 -37030 -6282 -39599 6801 833 24991 77100 42004 -17517 45966 97838 47780 102263
16323 102263 105416 136619 74520 94975 88494 99357 125816 114500 184509 173925 166047 126395
16311 126395 149161 127183 152817 223009 208400 149977 154242 203969 201348 239756 218617 167074
16299 167074 194880 239007 251819 294786 268392 265331 279316 255445 286391 343184 332741 337769
16287 337769 333239 333342 400436 417138 418039 383611 372020 416491 450682 419496 461907 419251
16275 419251 394472 500336 496113 452565 470567 472077 424577 465148 495257 512134 538827 530466
16263 530466 531622 461019 465949 466975 508098 512954 527147 538935 489449 486948 525099 569940
16251 569940 602995 554416 507168 519668 537586 558447 581773 623187 640689 683340 659798
16240 659798 632202 677771 662623 645775 632657 631065 626699 630990 711200 699446 706215 683805
16228 683805 662361 665592 676044 707427 708742 689261 613643 706388 728979 734193 732748 694848
16216 694848 679580 725949 767701 737176 727778 740879 786095 760925 766805 787410 783838 824810
16204 824810 801143 775357 829838 802489 760103 778928 862323 853494 826042 852046 844612 873081
16192 873081 786054 754191 802931 843982 846278 823164 807940 854389 833797 804243 872216 816183
16180 816183 770020 851993 811678 876387 888571 841867 824891 836936 817615 829682 823985 819306
16168 819306 834277 811268 822206 866640 957252 966506 889124 926716 949027 891831 874568 897238
16156 897238 928468 885789 899345 887693 883436 837369 854361 852566 932916 939340 879138 875219
16144 875219 963967 939439 970714 930084 959615 987301 939840 906938 955009 936285 957385
16133 957385 936795 920612 886120 847664 967645 932426 906955 881848 928308 889383 868851
16122 868851 917693 916895 919615 929917 955780 972727 965122 983009 940331 978819 957865 878555
16110 878555 904435 897478 956047 941251 958551 911493 902865 870404 911963 942715 901847 1014606
16098 1014606 949115 904973 999144 995932 960720 943466 957373 985766 894482 917513 985734
16087 985734 972589 932140 893098 939148 962580 958883 948812 904173 882333 961320 979441 973198
16075 973198 968299 889523 888822 989509 989574 951259 975420 954736 995757 984076 1012945 995308
$$ [...]
##END NTUPLES=NMR SPECTRUM
##END=
