##TITLE=1H_EC-3274(3t)
 CDCl3
 8 sc, 
 4.07.2022
##JCAMPDX= 6.0         $$ Bruker NMR JCAMP-DX V2.0
##DATA TYPE= NMR SPECTRUM
##DATA CLASS= NTUPLES
##ORIGIN= UXNMR, Bruker Analytische Messtechnik GmbH
##OWNER= root
$$ XWIN-NMR		Version 3.5
$$ Mon Jul  4 13:55:21 2022 Russian Standard Time (UT+4h)  she@DPX200
##.OBSERVE FREQUENCY= 200.1313499994
##.OBSERVE NUCLEUS= ^1H
##.ACQUISITION MODE= SIMULTANEOUS
##.ACQUISITION SCHEME= undefined
##.AVERAGES= 8
##.DIGITISER RES= 18
##SPECTROMETER/DATA SYSTEM= spect
##.PULSE SEQUENCE= zg30
##.SOLVENT NAME= CDCl3
##.SHIFT REFERENCE= (INTERNAL, CDCl3, 0, 15.7359)
##AUDIT TRAIL= $$ (NUMBER, WHEN, WHO, WHERE, WHAT)
$$ ##TITLE= Audit trail, XWIN-NMR		Version 3.5
$$ ##JCAMPDX= 5.01
$$ ##ORIGIN= Bruker BioSpin GmbH
$$ ##OWNER= she
$$ F:/spectra/data/she/nmr/H-F/1/pdata/1/auditp.txt
$$ ##AUDIT TRAIL=  $$ (NUMBER, WHEN, WHO, WHERE, WHAT)
(   1,<2022-07-04 13:53:59.87 +0400>,<she>,<DPX200>,
      <created by zg, POWCHK disabled, PULCHK disabled
       configuration hash MD5:
       00 E9 B6 7A A2 85 ED C7 34 08 36 98 17 FE 4E 26
       data hash MD5: 16K
       65 DC 5F 7D BD 17 F3 3E 8A 73 69 12 45 40 F5 77>)
(   2,<2022-07-04 13:54:02.32 +0400>,<she>,<DPX200>,
      <Start of raw data processing
       efp BC_mod = 2 LB = 0.24 FT_mod = 6 PKNL = 1 PHC0 = -18044.38 PHC1 = 10.00069 SI = 16K 
       data hash MD5: 16K
       E4 A7 DE 3D 47 C4 15 9F 8E AF 81 8F F3 47 EB 60>)
(   3,<2022-07-04 13:54:20.12 +0400>,<she>,<DPX200>,
      <pk PHC0 = -8.074389 PHC1 = -1.4 
       data hash MD5: 16K
       CB 95 07 A2 11 34 2A B5 64 1F 60 17 F2 16 37 CE>)
(   4,<2022-07-04 13:54:23.82 +0400>,<she>,<DPX200>,
      <abs ABSG = 5 
       data hash MD5: 16K
       B0 60 EA D1 94 8D 20 3E FD 59 74 5C DC 37 B8 D1>)
$$ ##END=
$$ 
$$ hash MD5
$$ BB B5 4B 3A 10 FB CC 31 14 84 A2 7D C8 DA A6 C0
##$RELAX= 
##$RELAX= 
##$RELAX= 
##$RELAX= 
##$RELAX= 
##$RELAX= 
$$ Bruker specific parameters
$$ --------------------------
##$DU= <F:/spectra>
##$EXPNO= 1
##$NAME= <H-F>
##$PROCNO= 1
##$TYPE= <nmr>
##$USER= <she>
##$AMP= (0..31)
100 100 100 100 100 100 100 100 100 100 100 100 100 100 100 100 100 100 
100 100 100 100 100 100 100 100 100 100 100 100 100 100 
##$AQSEQ= 0
##$AQ_mod= 1
##$AUNM= <au_zg>
##$AUTOPOS= <>
##$BF1= 200.13
##$BF2= 200.13
##$BF3= 200.13
##$BF4= 200.13
##$BF5= 200.13
##$BF6= 200.13
##$BF7= 200.13
##$BF8= 200.13
##$BYTORDA= 1
##$CFDGTYP= 0
##$CFRGTYP= 5
##$CHEMSTR= <none>
##$CNST= (0..31)
1 1 145 1 1 1 1 1 1 1 1 1 1 1 1 1 1 1 1 1 1 1 1 1 1 1 1 1 1 1 1 1 
##$CPDPRG= <>
##$CPDPRG1= <>
##$CPDPRG2= <>
##$CPDPRG3= <>
##$CPDPRG4= <mlev>
##$CPDPRG5= <mlev>
##$CPDPRG6= <mlev>
##$CPDPRG7= <mlev>
##$CPDPRG8= <mlev>
##$CPDPRGB= <>
##$CPDPRGT= <>
##$D= (0..31)
0 1.2 0 0 0 0 0 0 0 0.06 0 0.03 0 0 0 0 0.0002 0 0 0 0 0 0 0 0 0 0 0 0 
0 0 0 
##$DATE= 1656928439
##$DBL= (0..7)
120 120 120 120 120 120 120 120 
##$DBP= (0..7)
150 150 150 150 150 150 150 150 
##$DBP07= 0
##$DBPNAM0= <>
##$DBPNAM1= <>
##$DBPNAM2= <>
##$DBPNAM3= <>
##$DBPNAM4= <>
$$ [...]
##$SUBNAM2= <"">
##$SUBNAM3= <"">
##$SUBNAM4= <"">
##$SUBNAM5= <"">
##$SUBNAM6= <"">
##$SUBNAM7= <"">
##$SUBNAM8= <"">
##$SUBNAM9= <"">
##$SW= 18.0517283424941
##$SWIBOX= (0..15)
0 0 2 0 0 0 0 0 0 0 0 0 0 0 0 0 
##$SW_h= 3612.71676300578
##$TD= 16384
##$TD0= 1
##$TE= 0
##$TE2= 300
##$TE3= 300
##$TEG= 300
##$TL= (0..7)
0 120 120 120 120 120 120 120 
##$TP= (0..7)
150 150 150 150 150 150 150 150 
##$TP07= 0
##$TPNAME0= <>
##$TPNAME1= <>
##$TPNAME2= <>
##$TPNAME3= <>
##$TPNAME4= <>
##$TPNAME5= <>
##$TPNAME6= <>
##$TPNAME7= <>
##$TPOAL= (0..7)
0.5 0.5 0.5 0.5 0.5 0.5 0.5 0.5 
##$TPOFFS= (0..7)
0 0 0 0 0 0 0 0 
##$TUNHIN= 0
##$TUNHOUT= 0
##$TUNXOUT= 0
##$USERA1= <user>
##$USERA2= <user>
##$USERA3= <user>
##$USERA4= <user>
##$USERA5= <user>
##$V9= 5
##$VALIST= <valist>
##$VCLIST= <CCCCCCCCCCCCCCC>
##$VD= 0
##$VDLIST= <DDDDDDDDDDDDDDD>
##$VPLIST= <PPPPPPPPPPPPPPP>
##$VTLIST= <TTTTTTTTTTTTTTT>
##$WBST= 1024
##$WBSW= 4
##$XGAIN= (0..3)
0 0 0 0 
##$XL= 0
##$YL= 0
##$YMAX_a= 145399
##$YMIN_a= -187761
##$ZGOPTNS= <>
##$ZL1= 120
##$ZL2= 120
##$ZL3= 120
##$ZL4= 120
##$ABSF1= 15.78655
##$ABSF2= -2.265302
##$ABSG= 5
##$ABSL= 3
##$ALPHA= 0
##$AQORDER= 0
##$ASSFAC= 0
##$ASSFACI= 0
##$ASSFACX= 0
##$ASSWID= 0
##$AUNMP= <proc_1d>
##$AZFE= 0.1
##$AZFW= 0.1
##$BCFW= 0
##$BC_mod= 2
##$BYTORDP= 0
##$COROFFS= 0
##$CY= -3
##$DATMOD= 1
##$DC= 0
##$DFILT= <>
##$DTYPP= 0
##$F1P= 0
##$F2P= 0
##$FCOR= 1
##$FTSIZE= 16384
##$FT_mod= 6
##$GAMMA= 0
##$GB= 0
##$INTBC= 1
##$INTSCL= 0
##$ISEN= 128
##$LB= 0.24
##$LEV0= 0
##$LPBIN= 0
##$MAXI= 10000
##$MC2= 0
##$MEAN= 0
##$ME_mod= 0
##$MI= 1.114404
##$NCOEF= 0
##$NC_proc= -6
##$NLEV= 6
##$NOISF1= 3.799351
##$NOISF2= 2.8
##$NSP= 0
##$NTH_PI= 0
##$NZP= 0
##$OFFSET= 15.73587
##$PC= 1
##$PHC0= -18052.46
##$PHC1= 8.600691
##$PH_mod= 1
##$PKNL= yes
##$PPARMOD= 0
##$PSCAL= 0
##$PSIGN= 0
##$REVERSE= no
##$SF= 200.130007137458
##$SI= 16384
##$SIGF1= 3
##$SIGF2= 2
##$SINO= 5.538805
##$SIOLD= 16384
##$SREGLST= <1H.CDCl3>
##$SSB= 0
##$STSI= 16384
##$STSR= 0
##$SW_p= 3612.71676300578
##$SYMM= 0
##$S_DEV= 0
##$TDeff= 16384
##$TDoff= 0
##$TI= <>
##$TILT= no
##$TM1= 0
##$TM2= 0
##$TOPLEV= 0
##$USERP1= <user>
##$USERP2= <user>
##$USERP3= <user>
##$USERP4= <user>
##$USERP5= <user>
##$WDW= 1
##$XDIM= 16384
##$YMAX_p= 266169814
##$YMIN_p= -1291020
$$ End of Bruker specific parameters
$$ ---------------------------------
##NTUPLES= NMR SPECTRUM
##VAR_NAME=  FREQUENCY,     SPECTRUM/REAL,   SPECTRUM/IMAG
##SYMBOL=    X,             R,               I
##VAR_TYPE=  INDEPENDENT,   DEPENDENT,       DEPENDENT
##VAR_FORM=  AFFN,          ASDF,            ASDF
##VAR_DIM=   16384,         16384,           16384
##UNITS=     HZ,            ARBITRARY UNITS, ARBITRARY UNITS
##FACTOR=    0.220516191357247, 1,           1
##FIRST=     3149.21984772671, 0,            0
##LAST=      -463.496915279069, 0,           0
##MIN=       -463.496915279069, -1291020,    0
##MAX=       3149.21984772671, 266169814,    0
$$ Real data points
##PAGE= N=1
##DATA TABLE= (X++(R..R)), XYDATA
$$ [...]
7510D6468k1481L9042m9941l0942L337J2035L6120j4018o6227K7227J7969m1483
7498d1894M8236p3592R2919p4634o8518J23705l1368j5838N7170p7239J7604J6039
7486b7410k4946J50489Q5609l8519m0069r2685O0129q0216Q202k1924N511R9536
7474H3707o2550q1977M2830M0669o4864k6563J45074R6717j02466p4899J3037
7463H715R1909k1841p5489J4406P8255l4193p117n7323N901k9751K6424j7542
7451a7646j6210J3623J4070j2051k3004N8416k7803p222k6336J26850j24863O4426
7439B2250N8566k8934q8939J06207J2407q6020Q0331J4954L2565k1610o5493J6285
7427E2569O5428r8339P9406L6577m8188J2744k4579J2939J6068k346l6179j2346
$$ plain form
7510 46468 24987 64029 14088 -16854 -13517 -1482 34638 20620 -45607 -18380 -411 -41894
7498 -41894 6342 -67250 25669 -48965 -117483 6222 -25146 -40984 16186 -61053 -43449 -27410
7486 -27410 -52356 98133 183742 145223 105154 12469 72598 -7618 584 -21340 -15829 83707
7474 83707 21157 -60820 -17990 22679 -42185 -68748 76326 173043 70577 -4322 8715
7463 8715 100624 78783 3294 17700 95955 61762 54645 -2678 3223 -26528 -104 -17646
7451 -17646 -33856 -20233 -6163 -18214 -41218 17198 -10605 -17827 -44163 82687 -42176 22250
7439 22250 80816 51882 -37057 69150 81557 -4463 75868 90822 123387 101777 36284 52569
7427 52569 117997 19658 99064 135641 87453 100197 75618 88557 104625 102279 66100 53754
7415E3754L7152o4469J30196o5956o0355k2048J691m1190k8839J10225N379M2223
7403I7763k9042n5154R4494q835L8266O1497j11732j11352J4324K6882L7986L2461
7391H7558m958j3119K4267J7685o0469M935P9810p4824O8946J5305j0731P2602
7379B07007o6781J2854j915K9179o2709M2421J15401n7384O7341O2037J0911J21359
7367D79721M8312M0836j3950M9994l3565k9635Q0033O2071n8986j7876j6709j90217
7355D00029j34378l339J3461J0199M5579p6582j14933m7736M7179o2096j3253
7344F4130O7315r2320k0224K7754P27o6215R2288j9157n3143M6040R1515r4169
7332D4541J865K1662l0211n7052l8498N9733J07929J087j31192M3093n9189j2353
$$ plain form
7415 53754 90906 26437 156633 90677 30322 8274 9965 -31225 -60064 50161 55540 97763
7403 97763 68721 13567 108061 99226 137492 198989 87257 -24095 -9771 17111 55097 87558
7391 87558 82600 69481 93748 111433 50964 55899 135709 60885 129831 145136 134405 207007
7379 207007 140226 153080 151165 180344 117635 160056 275457 218073 285414 347451 358362 479721
7367 479721 528033 568869 554919 604913 571348 541713 621746 683817 624831 606955 590246 400029
7355 400029 265651 262312 275773 285972 331551 254969 140036 92300 139479 77383 64130
7344 64130 131445 39125 18901 46655 47382 -18833 73455 54298 1155 47195 138710 44541
7332 44541 46406 68068 37857 -19195 -57693 2040 109969 111056 -20136 22957 -36232 -48585
7320d8585Q4084m6018r3133Q7743Q0834k0787k6728n297l9796K2449m9921o849
7308f2004L5944N9730J0207J7299J3906M8453r287k6297m476m183q6538K3625
7296A6379L0609K6437K8599p2169l0509N42K392l4635K5331j054j12575O7918
7284e2735j1369K0152J25332K6754p3168j4324j7339O692L2299k6484k6080Q066
7272b204k7201M5100O720k8196L2416m146L4236k1693q378K6421J9133l4897M6267
7259H3578k4023r7377L2837k6172j4429J3895j948Q7074K859j17428L1829M1643
7247A2338K7270l8280k7956P165l8582J18258O2053o480r6506o4292r977J4707
7235d0282j7162j3099j260R5002Q358l6645L0286O9352m7331K0162L4254q0907
$$ plain form
7320 -48585 35499 -10519 -103652 -15909 64925 44138 17410 12113 -27683 -5234 -55155 -62004
7308 -62004 -26060 33670 43877 61176 75082 123535 114248 87951 83475 79292 -7246 16379
7296 16379 46988 73425 102024 29855 -654 -112 2280 -32355 -7024 -8078 -120653 -52735
7284 -52735 -64104 -43952 81380 108134 34966 20642 3303 9995 42294 15810 -10270 -2204
7272 -2204 -29405 15695 22415 -5781 26635 22489 56725 35032 26654 53075 72208 37311 83578
7259 83578 59555 -37822 -4985 -31157 -45586 -31691 -33639 53435 56294 -61134 -29305 12338
7247 12338 39608 1328 -26628 -19463 -58045 60213 122266 115786 19280 -45012 -54989 -40282
7235 -40282 -57444 -70543 -71803 23199 31557 -5088 25198 94550 47219 67381 101635 20728
7223B0728q5177O906j0858N3691l7742M7663L4408J45607p2806N299P8595o3310
7211A23004l8137k9257o5252J53602m5366m6796j4051n8154J7136n398M2672L9535
7199G3538N8930j06483j8081k4108J4043k3082R1835m7703M0005o4261J6929k7212
7187a5650J3547O9830k7379m3544J5629m3187k1336L7716K3675J3301L9262k817
7175E9047j748J2293l3702n410N7486K2562p4964L722j15198P6124j8047j11N4014
7162C6068M1481Q967q9808k0074k2680K0945o2296j5119O4936J4738Q3815K2732
7150H3705j6815J6575p7183l7649L6200o8412q2015J8896Q4028N9912j00112J9895
7138f2975M7313J59637j30106m1832r147P235K6577K8365K2174m6842m6593K8113
$$ plain form
7223 20728 -64449 -57543 -68401 -14710 -52452 -4789 29619 175226 102420 107719 186314 123004
7211 123004 84867 55610 -9642 143960 98594 51798 37747 -20407 -3271 -8669 34003 73538
7199 73538 132468 25985 7904 -16204 -2161 -25243 66592 18889 58894 -5367 11562 -15650
7187 -15650 -2103 67727 40348 -3196 12433 -30754 -52090 -14374 9301 22602 61864 59047
7175 59047 57299 69592 35890 30480 87966 110528 35564 39286 -75912 212 -17835 -17946 36068
7162 36068 77549 86516 -3292 -23366 -46046 -25101 -87397 -102516 -37580 -22842 60973 83705
7150 83705 66890 83465 6282 -31367 4833 -63579 -145594 -126698 -42670 17242 -82870 -62975
7138 -62975 -15662 143975 13869 -27963 -37110 -29875 -3298 25067 47241 399 -46194 -18081
7126a8081K5649o9150L6174q601O6647L0538q7249J3349N7515J7693K3739j20425
7114c2202k2164L9362Q577j4847R0064n1229q2726Q7190L9046l8546L0896j8416
7102C5005j064K4400o219r7276m8596K6711K9601j01770O6872N4054k0112J279
7090c7115K4696R0165j25406p0589L7123J3235m0197k9677J19885M2203k722K3168
7078D4769n0995k4365k3748P8520n682o8119k6547J26325m5534K7828p3255m3838
7066h4641J32730N709q473L6811n6535L4646l7388n5343M6549M707J895N7597
7054G8264J4548o0474K0000N9599O350j15521p7825k0525M3826m7410R244O2090
7042b7834k0257q8012J4200J00417j271l1161P98M3653m6330M3237K8541o5839
$$ plain form
7126 -18081 7568 -61582 -25408 -34009 32638 63176 -24073 -10724 46791 64484 88223 -32202
7114 -32202 -54366 -15004 -6427 -21274 68790 17561 -65165 22025 61071 22525 53421 35005
7102 35005 33941 58341 52122 -45154 -93750 -67039 -37438 -139208 -72336 -18282 -38394 -37115
7090 -37115 -12419 77746 -47660 -118249 -81126 -67891 -108088 -137765 -17880 24323 21601 44769
7078 44769 -6226 -30591 -54339 24181 18499 -49620 -76167 50158 4624 32452 -40803 -84641
7066 -84641 48089 53798 45325 82136 25601 60247 22859 -32484 14065 18772 20667 78264
7054 78264 92812 32338 52338 111937 118287 2766 -75059 -95584 -51758 -99168 -89924 -27834
7042 -27834 -48091 -136103 -121903 -21486 -22757 -53918 -53120 -9467 -55797 -12560 15981 -49858
7030d9858P9711k9381j5397m6507j5367r154k2768K0234M037L51O0506O267K0659
7017C333m4259n1271n3521Q1323P5199p3619k3106q999N4223j5312J0981N6891
7005A1863N237K2423n99m1131n6005M5918p8200N7756Q661k0484j4562P18J16022
6992E7617k5254k4111j0802l576P20j25735j2872J12523l5083P8011j0283j23633
6980a22478M4134j7310O1270J5164M4401N4366j605q6119m6863N5427l5307p2535
6968a07455R3654J32867j25208J05566K7113l4553l6397p1859l8718J22645r9588
6957c1933q0257Q6857l8077l0483K3896j084O4993M8923O4548r5281j06089J4277
6945g9710M0625j7296k0284O7619o5378J7598J69605k8755r912l3362m5840K7971
$$ plain form
7030 -49858 29853 472 -14925 -61432 -76799 -85953 -108721 -88487 -84450 -84099 -23593 -17326 3333
7017 3333 -40926 -92197 -145718 -64395 10804 -62815 -85921 -94920 -40697 -56009 -45028 11863
7005 11863 17100 39523 38924 -2207 -58212 -12294 -90494 -32738 -24077 -44561 -59123 -58405 57617
6992 57617 32363 8252 -2550 -6126 -5406 -131141 -144013 -31490 -66573 11438 1155 -122478
6980 -122478 -78344 -95654 -34384 -19220 25181 79547 77942 -8177 -55040 387 -34920 -107455
6968 -107455 -13801 119066 -6142 99424 126537 91984 55587 -16272 -54990 67655 -31933
6957 -31933 -112190 -25333 -63410 -93893 -69997 -71081 -6088 42835 107383 12102 -93987 -79710
6945 -79710 -39085 -56381 -76665 -9046 -74424 -56826 112779 84024 74112 40750 -5090 22881
6933B2881p177K6076L4690q8538J9382m2092P6974J0265q8127n4098P8609J10270
6921I9115m2263R757k2448p1038l1668K5109M9964O1271j14932J7477l7225J33717
6909G6836o1997l3006l8494Q0396J6468q2316m3515P035M3946l0789q7016O7380
6897h5072l9935K8277J18864J0860j50114j8463J1864N2935L3268J11898J14727
6886A89109j60464p4612r0926M7064P4868L4786l0552m9405L526L4891m1130N0208
6874a2637l1428k9881m1693Q3147N0976j12485L1284K9138o4273M7024N814o8464
6862a13478L3284R0817N441m2621l4809N2985l4853K6037k7442j1517N4766j3844
6850a5234J5161N0072n3182q759R6396o2086k3234M4748N3185l7605j5103R128
$$ plain form
6933 22881 15704 41780 76470 -12068 7314 -34778 42196 52461 -35666 -89764 -11155 99115
6921 99115 56852 66609 44161 -26877 -58545 -33436 16528 77799 -37133 -19656 -56881 76836
6909 76836 14839 -18167 -56661 23735 40203 -42113 -85628 -78593 -34647 -65436 -152452 -85072
6897 -85072 -125007 -96730 22134 32994 -117120 -135583 -123719 -70784 -37516 74382 189109
6886 189109 28645 -45967 -136893 -89829 -14961 19825 -10727 -60132 -56606 -21715 -62845 -12637
6874 -12637 -44065 -73946 -115639 -32492 18484 -94001 -62717 -33579 -97852 -50828 -45014 -113478
6862 -113478 -80194 10623 16064 -26557 -61366 -8381 -43234 -17197 -44639 -56156 -1390 -15234
6850 -15234 -73 49999 -3183 -11942 84454 22368 -866 43882 97067 59462 44359 53487
6838E3487L079l8660n7926M3443J4384P185P2042j02000j33071J36829n9447j4481
6826g5136J9821J5112k0565M1850J7935p1982l3702O1821k7675P3426N3511l8341
6814A6075Q8864l8374o1570K501p102j5650L7396q1927L4533n8538P4733J44721
6802A35662j36698k8623Q64j344m5197j9568N4567L3429n8327M1671R0613j0321
6790E6728n9908Q142K9533K990n0606N1218n7799j02571J22586K4594j0379n8045
6778d3517j01151N0006N5831N5069m1901m3407J15224q6734n0227k5810L5173
6767h1444L1596p830p0924L3954L1359l5776M8522R4508j81133M5862n6206O5515
6755h1997N6894R3866L8954o5063J2170l3777r5192r1685M6752J48776L3644j14870
$$ plain form
6838 53487 56566 17906 -40020 3423 17807 24992 97034 -4966 -138037 -1208 -60655 -75136
6826 -75136 -55315 -40203 -60768 -18918 -983 -72965 -106667 -44846 -72521 905 54416 16075
6814 16075 104939 66565 4995 7496 394 -15256 22140 -59787 -25254 -83792 -9059 135662
6802 135662 -1036 -29659 -28795 -30139 -75336 -94904 -40337 -6908 -65235 -23564 67049 56728
6790 56728 -3180 4962 34495 37485 -13121 38097 -19702 -122273 313 24907 14528 -43517
6778 -43517 -144668 -94662 -38831 16238 -25663 -69070 46154 -40580 -90807 -116617 -81444
6767 -81444 -49848 -57678 -128602 -94648 -63289 -99065 -50543 43965 -137168 -91306 -147512 -81997
6755 -81997 -25103 68763 107717 42654 54824 21047 -74145 -165830 -119078 29698 63342 -51528
6743e1528m4556M8287L8670Q282m7345m0889N2938N9263l445L9337k300n3882
6731B832J1661j7925L2354q8528q188k4240L5671l6356M1166l0203Q0527p0983
6719g2212l460R5951r7548L6310N3704m3379n5730P1922K8948o9329j00342l7084
6707a92249J67705L328r8132j8272J31883K5045o6035p441k5334M7375R8474R7404
6695A63751l4735j44839o319N52j360K9457L1569j8903k1580j2303k7915n4364
6683i6989N5055j9741J9624N7020J0219L3324n0768p3212M4792R8249q3641K6168
6671B0100k5520l5558o3455Q7902N4397n0256p1989q5396N3717Q8941n432K5096
6659g453m4810m9579M4267K435q30R028L6336M7062N4531r063l0144J2243N754
$$ plain form
6743 -51528 -96084 -47797 -9127 -845 -48190 -89079 -36141 23122 19677 59014 56714 2832
6731 2832 14493 -3432 28922 -59606 -67794 -92034 -56363 -92719 -51553 -81756 -1229 -72212
6719 -72212 -75672 20279 -77269 -40959 12745 -30634 -86364 -14442 14506 -54823 -155165 -192249
6707 -192249 -24544 -21216 -119348 -137620 -5737 19308 -46727 -54168 -79502 -32127 66347 163751
6695 163751 129016 -15823 -22142 -21590 -22950 6507 38076 19173 -2407 -14710 -42625 -96989
6683 -96989 -41934 -61675 -42051 14969 25188 58512 7744 -65468 -20676 77573 -6068 20100
6671 20100 -5420 -40978 -104433 -16531 37866 -12390 -84379 -169775 -116058 -27117 -32549 -7453
6659 -7453 -52263 -101842 -57575 -55140 -55970 -46942 -10606 36456 90987 81924 51780 64023 69777
6646F9777K8238j7043j8114K0001n1338l8273o9550J777N8055K522N4008j7707
6634B2353J5020N0985q270p6447J3361j00242m2848L7909l9000J09288q8328Q1815
6622b4404l0259O8563p7309l1378M0154m8317l681K561N6556Q4815k0979q1497
6610f5175m1665k3694N9345N2653l1580N1123J52715j72279O6955k8591L1507
6599E1314L4710K5470j1266r3659r7456j1815O5020L2057j2675m9980m836J2080
6587f1036O4108L7632m2803k7330k1307R560J00916j7611m5315p4977j3071J05746
6575A4512M6289k6639o4397k2047n3112k7612m3255P5393J17121R797l9804M2123
6563B8369n8058j7016O6812j6485L0815l2147o8361p6742M1997R4510J0229n6416
$$ plain form
6646 69777 98015 80972 62858 82859 31521 -6752 -76302 -74525 -16470 -13948 40060 22353
6634 22353 37373 88358 80088 3641 17002 -83240 -126088 -88179 -127179 -17891 -106219 -24404
6622 -24404 -54663 13900 -63409 -94787 -54633 -102950 -106631 -104070 -47514 37301 16322 -65175
6610 -65175 -106840 -130534 -71189 -18536 -50116 1007 153722 -18557 48398 19807 51314
6599 51314 86024 111494 100228 6569 -90887 -102702 -37682 -5625 -18300 -68280 -73116 -61036
6587 -61036 3072 40704 -2099 -29429 -50736 -41176 59740 42129 -3186 -78163 -91234 14512
6575 14512 60801 34162 -30235 -52282 -105394 -133006 -176261 -100868 16253 26050 -13754 28369
6563 28369 -29689 -46705 20107 3622 34437 2290 -66071 -142813 -100816 -6306 3923 -52493
6551e2493J5211o467R7690o6395n206O8670k907l4612M458J0764m0356n8182m0052
6538a09877L5389l4123R9267N293j1831l7525r4639N6802k6880M574Q3134Q9946
6526E9530l1496m3067o9209r3562R6292J5092j0195p878m5960o919J00045J38962
6514A01635q2966o0820k0541L9559m5697N7229M1179l0737M4430k560K2779m545
6502E8945m4463o702P294n1363O3621n7282K0890J4474l5031m3571O4488N6822
6490D8122m4238j09031J23181L3981k7817P418o8067J16851j8281k00157J7866
6479a20172K6940L4184k0359p0726M5235J4313N4727J4556N3124o1340P1615k8238
6467A3859Q988l0519m6948j4582j2170K3492p0200L3614J03865m2362k0617J16101
$$ plain form
6551 -52493 -37282 -43749 53941 -12454 -17660 51010 48103 13491 17949 28713 -11643 -69825 -109877
6538 -109877 -74488 -108611 -9344 -4051 -15882 -53407 -148046 -91244 -118124 -113550 -30416 59530
6526 59530 28034 -15033 -84242 -177804 -81512 -66420 -76615 -84493 -130453 -137372 -37327 101635
6514 101635 18669 -42151 -62692 -23133 -68830 -11601 29578 -1159 43271 40711 63490 58945
6502 58945 14482 7780 15074 -36289 27332 -29950 -9060 5414 -29617 -73188 -8700 48122
6490 48122 3884 -105147 18034 52015 24198 31616 -36451 80400 62119 -138038 -120172
6479 -120172 -93232 -59048 -79407 -150133 -104898 -90585 -35858 -21302 31822 -29518 42097 13859
6467 13859 22847 -7672 -54620 -69202 -81372 -57880 -128080 -94466 9399 -32963 -53580 62521
6455F2521k5186K085j4961o7216p3244O4704n534k909K6299j3423K8354j7660
6443c6170O4104J8913m1016K3412Q6724j27053j18126J3720Q0583N0594o4770
6432d9085L4185j8864L9534M4087j9172l7341j15032Q7721M1064n2139O2138m2595
6420b5499l8760K5134J5157m9468m947J6932o8861o5601K3389P5566N7649J4012
6408b5297j9139R4034l6328q9748J0263K6112j0782O776l8812J9182K5811J9028
6396a8900L7984l9334K6812P1051n4212o4924P0598M3524n9252M7669r745q0800
6384b9529j14154n571J31669o9677n123R9225L1337j03233L301O6942k1517m1317
6372e7647J7562N3692M6145N087m8221r848n9773J3455J6389R0443L209k9486
$$ plain form
6455 62521 37335 39420 24459 -42757 -116001 -51297 -56831 -59740 -33441 -46864 -18510 -36170
6443 -36170 27934 46847 5831 29243 115967 -11086 -129212 -115492 -34909 15685 -49085
6432 -49085 -14900 -33764 5770 49857 30685 -6656 -121688 -33967 7097 -45042 17096 -25499
6420 -25499 -64259 -39125 -23968 -73436 -78383 -61451 -130312 -195913 -172524 -96958 -39309 -25297
6408 -25297 -44436 49598 13270 -76478 -66215 -40103 -50885 -44109 -82921 -63739 -37928 -18900
6396 -18900 19084 -20250 6562 77613 23401 -41523 29075 72599 13347 61016 51271 -29529
6384 -29529 -143683 -149254 -17585 -87262 -92385 6840 38177 -65056 -61755 5187 -16330 -57647
6372 -57647 -40085 13607 59752 64839 16618 6770 -53003 -39548 -23159 67284 70493 41007
6360D1007p3323m2672M3520p100Q7415j2762K4739l4652K4866j0237q0952N536
6348c4615J30142r6281r4365J78788M7316l8601p4838j1281M6105j06568P0514
6337A6316Q7272o9466l0549m4077l7385J09022N0501k0810J06246k2916j2476
6326A31678K2849o0928k4171L7714j4532M4666j3600J20864K9166j8580m7061
6315B08065k5393j7057n5543K0742m7639l08j8707N0301o0276n9573K0597L8525
6303E3734n1723O9132J791j30642q927j8484J01157N8550K0766m8924L344J7018
6291F6792p0250M626n678J05785p3987l1587q0479O3199j6905r912R0929K4139
6279F6672L4625p6204O9283K9294r2199l608K90K2810J5031m0233M7152k219J2811
$$ plain form
6360 41007 -32316 -74988 -31468 -38568 48847 36085 60824 26172 51038 40801 -40151 -34615
6348 -34615 95527 -754 -95119 83669 130985 92384 17546 6265 52370 -54198 16316
6337 16316 103588 34122 3573 -40504 -77889 31133 81634 60824 167070 144154 131678
6326 131678 154527 93599 69428 107142 92610 137276 123676 244540 273706 255126 208065
6315 208065 182672 165615 110072 130814 83175 82867 64160 114461 54185 -5388 15209 53734
6303 53734 2011 71143 72934 -57708 -66635 -85119 16038 74588 95354 46430 49774 66792
6291 66792 -3458 1168 -4510 101275 27288 -4299 -84778 -21579 -38484 -48396 42533 66672
6279 66672 101297 25093 94376 123670 31471 27863 28153 50963 65994 25761 72913 70694 83505
6266H3505l6325J4798m2007N5384o8804p830K4091O685m3043k0283J0092p6598
6254a00335l0980J43746J14104q0816q2569N7379J28521n2395n5240m2895K819
6243A339q5477M2225R833l6422Q3093L49m1761M9732k7239j5649k1730k6933M8797
6230a9843k9533P3791K1434o1430q1343O047J61204K4535j9907m7080P6867p074
6218I7668j33576m554M0106O6523l5531m2367j1830l9053K0808J09486k4177p2342
6206b8839j1526O8732Q9264N0689p2659o5215O0820n3019J0431n912L4644J3630
6194I1040p7007p0418O36P0994O6510j4691J3663m4632J9007l1660n7765m276
6182c8599L4384R322r0878P5067K4558n8989l7124J26204N7931K9577m9344j6859
$$ plain form
6266 83505 47180 61978 19971 75355 6551 -1279 22812 29497 -13546 -33829 -23737 -100335
6254 -100335 -131315 12431 126535 45719 -36850 20529 149050 96655 41415 -1480 1339
6243 1339 -84138 -41913 -32080 -68502 14591 14940 -26821 22911 -4328 -19977 -41707 -68640 -19843
6230 -19843 -49376 24415 45849 -15581 -96924 -90877 70327 94862 74955 27875 104742 97668
6218 97668 -35908 -40462 -356 66167 30636 -11731 -23561 -62614 -41806 67680 43503 -28839
6206 -28839 -40365 28367 117631 168320 95661 30446 91266 38247 48678 42766 77410 91040
6194 91040 14033 -56385 -55749 15245 81755 67064 80727 36095 55102 23442 -34323 -38599
6182 -38599 -4215 5107 -85771 -10704 13854 -45135 -82259 43945 101876 131453 82109 65250
6170F5250o6607K9952J6700j883j22507K1358p4442N9411N7673P0129J8129k4238
6158D8925J6133j32636J03858k5980l4620q802p0806o8390P6487J76101K5239
6147A05509m2779j42190o0531P2670k7803J29479m0861m300N6693k4836o4123
6136d3072k8834J04839N9456P377r894m2016n0841M5890m66j00625K8301N2354
6124B2469P5590k3836o5844J6405L8240N7687j0975j44337J54367q8770k9296
6113A700j1316k4154N8248l0916N4454m9471q0266L9480L8660N3968J2126n5526
6101F987l548K2390j5666l1116Q4613L389o8661m5612k863Q3033n3597o3652J50896
6088F6593n0702l7315J0098j9013l725q854J12722L0815r4495N5511P1549r0686
$$ plain form
6170 65250 -1357 28595 45295 43412 -79095 -57737 -132179 -72768 -15095 55034 73163 48925
6158 48925 65058 -67578 36280 10300 -24320 -33122 -103928 -172318 -95831 80270 105509
6147 105509 62730 -79460 -139991 -67321 -95124 34355 -6506 -10806 45887 21051 -43072
6136 -43072 -71906 32933 92389 99766 89872 47856 -2985 42905 42439 -58186 -29885 22469
6124 22469 98059 74223 8379 24784 63024 120711 109736 -34601 119766 30996 1700
6113 1700 -9616 -33770 24478 -6438 48016 -1455 -81721 -42241 -3581 50387 62513 6987
6101 6987 3439 25829 10163 -20953 63660 67049 -1612 -47224 -50087 32946 -20651 -84303 66593
6088 66593 15891 -21424 -11326 -30339 -34064 -42918 69804 100619 6124 61635 133184 42498
6076D2498l6571P2714j1411N0707n9166n249l5590L75n1026J4529P0655N1596
6064A04061n7613j6923P9234l9654j2213J0315k656o689r511n850k7350j5149
6052BN3563o8788j00582m4347r625M1773O8808P0980Q4369l5111j20548m4305
6040a03811P2206M4788N8295m4477K622L2897k1572k2998R8813m36m4550J07325
6028A79102n0304k1445R7515j0035L2429p8614j06001k007R9536n014m4016J5243
6016A06389k1405q6212j5711l525n477J18705L6373q679l1494k1083J2998j9783
6004F1096R4055K9608p3696n6024J645M5560J0498O2474l4897j08423K6034N9487
5992A17417P0867l0507j03215j422j1586M175q796K5989J4316N0203L5680Q1685
$$ plain form
6076 42498 5927 78641 67230 117937 58771 53522 17932 18307 -32719 -18190 52465 104061
6064 104061 46448 29525 108759 69105 56892 67207 64551 57862 48351 42501 15151 2
6052 2 53565 -15223 -115805 -160152 -169777 -128004 -59196 11784 96153 61042 -59506 -103811
6040 -103811 -31605 13183 71478 27001 29623 62520 40948 17950 116763 116327 71777 179102
6028 179102 128798 107353 204868 194833 227262 148648 42647 40640 140176 135162 91146 106389
6016 106389 84984 -1228 -16939 -20464 -25941 92764 129137 120458 88964 67881 80879 61096
6004 61096 155151 184759 111063 55039 56684 102244 112742 175216 140319 31896 57930 117417
5992 117417 188284 157777 54562 53140 41554 45729 36933 62922 77238 127441 163121 244806
5980B44806j8194l3396J9029K3416r04J7602K7951j3527K0736O3469j04589m2048
5968B04351K6612J55134m7531l205k0199R4649L2114j18742Q0014N8702l1481
5957D30418j073K9120K7624p627J8092l006K3120N5248K594o0648k7927J09116
5945E95051K9458P9048k9351N549j5522O5135J0323N9034L4332J84862N5025K00605
5933A273549J58669J26448R4725P901j18225k16324l7554j33298m2007L9602L0129
5922A183615N851R522m1963j22170j51331j15420L3159j15160l3462Q7550k7099
5911G13092k960L1488L102j6443l1859n5203o249j8332q651o564M4571p8137L6386
5898F04241O9189R0284L6535k5010k1953M4364J46081J27019Q08J85257R4694
$$ plain form
5980 244806 226612 193216 212245 235661 234757 252359 280310 266783 287519 350988 246399 204351
5968 204351 230963 386097 338566 335361 315162 409811 441925 323183 403197 461899 430418
5957 430418 429345 458465 486089 478462 496554 493548 516668 571916 574510 513862 485935 595051
5945 595051 624509 703557 674206 679755 664233 729368 739691 798725 833057 1017919 1072944 1273549
5933 1273549 1432218 1558666 1653391 1661292 1543067 1326743 1289189 1155891 1113884 1153486 1183615
5922 1183615 1189466 1198988 1157025 1034855 883524 768104 801263 686103 652641 740191 713092
5911 713092 710132 741620 744722 728279 696420 641217 634968 616636 607985 601421 645992 567855 604241
5898 604241 673430 763714 800249 775239 753286 797650 943731 1070750 1071558 1256815 1351509
5887A351509Q5338J23249K508O6420J19950Q7352O3183J8578k14456k90000j78976
5876A234655j87945j59228l785j5086K7912q8002k1501j06942o1550N0823M3954
5865G13305k3184l9108j18965n1070J11675K1631J17690N7527p7198L1031K8387
5854G71721m0084j34990n1104Q015M2520l326J2304Q9786o6309o3880r2661J4602
5842D86594J5431N5506r1861K3327O4607m3818L1123M5994J0579r1151n9558J2503
5830D59276j001M9791n4658J1211P1022j7314o8193L8094K9248m8299J41484p2201
5818E38460L7664l9129m3936J55355l074m4422K1031j6309K7183L7058p6319K1442
5806F15004m6252n8053J35404k6134q5600Q5922R2952n1283l734n3376M9463q29
$$ plain form
5887 1351509 1436847 1560096 1562604 1629024 1748974 1836326 1899509 1918087 1703631 1413631 1234655
5876 1234655 1046710 887482 883697 868611 896523 808521 787020 680078 618528 669351 713305
5865 713305 690121 651013 532048 480978 592653 614284 731974 789501 712303 743334 771721
5854 771721 731637 596647 545543 553558 596078 592752 605056 694842 628533 564653 471992 486594
5842 486594 502025 557531 465670 488997 553604 509786 540909 586903 597482 506331 446773 459276
5830 459276 458275 508066 453408 464619 535641 518327 450134 488228 517476 469177 610661 538460
5818 538460 576124 536995 493059 648414 645340 600918 621949 605640 632823 669881 593562 615004
5806 615004 568752 510699 646103 619969 534369 620291 713243 661960 658226 604850 654313 653484
5794F53484m6276J8815o8111l1595k1720m361P534K1937K134j3172l0346R6185
5782E84508o5334j5518Q339n3299J21505O6855L5950q859j0423M1977o8485O067
5770F43283N1689J10086M5967M0784o5448L5899Q718j25581M4520O2055O1667
5759I13639r2462k6639M0309L8320p1166N8466L8353L2881j8827Q6699O7318j3797
5747A053094j6027J13256n3816p2692l3677P0999J37186J06194O0977o3418J44852
5736A446928Q1902n4730j15817l1400l5464Q059m8645R895o7556J6203l7919J0067
5724A181523l6906l087Q1733r396K179j1942p2756p8954K8558L6876q2462M0198
5712A075564J1993j05934N7665J0302M4931P2176j3261m9716J22987N2399P3079
$$ plain form
5794 653484 607208 626023 557912 526317 504597 500236 507770 529707 531841 518669 488323 584508
5782 584508 519174 503656 511995 458696 580201 647056 683006 674147 663724 705701 637216 643283
5770 643283 694972 805058 851025 891809 826361 862260 870978 745397 789917 851972 913639
5759 913639 821177 794538 834847 873167 802001 860467 898820 931701 912874 999573 1066891 1053094
5747 1053094 1037067 1150323 1096507 1023815 990138 1061137 1198323 1304517 1365494 1302076 1446928
5736 1446928 1528830 1474100 1358283 1326883 1291419 1299478 1250833 1260728 1193172 1209375 1171456 1181523
5724 1181523 1144617 1141530 1223263 1213867 1216046 1204104 1131348 1052394 1080952 1117828 1035366 1075564
5712 1075564 1087557 981623 1039288 1049590 1094521 1166697 1153436 1103720 1226707 1279106 1352185
5701A352185M7187n2925J5629L523k8506Q7817P6423o9035K2377j37704J02331
5690A419302P6497J02692k7646k2457Q6990L1300R1908K863p85l8015J6045O7938
5678A806632M6088L9730K927m7702L3270m4105n1581K3588Q6656L4884q386M3398
5666A965399K6025R7661R4322J29857R3635k8896R901M7284J52200N6130J23645
5655B767163R6030m0440J18306N2696J05822K41537J13145J8432K7844Q1375J80233
5644C762143J40863L0354J55032R5870Q7955N6981J63779J83930J51961J48793
5634D977661J59571J46167J32364J4154M6898J80587J14445J30200J04500J29278
5624F135825J34024J42677K21057J74265J81484J32709K21177J82920K15123J56080
$$ plain form
5701 1352185 1399372 1346447 1362076 1365599 1337093 1424910 1501333 1432298 1454675 1316971 1419302
5690 1419302 1495799 1598491 1570845 1548388 1635378 1666678 1758586 1761449 1760664 1722649 1738694 1806632
5678 1806632 1852720 1892450 1895377 1847675 1880945 1836840 1785259 1808847 1895503 1930387 1922001 1965399
5666 1965399 1991424 2089085 2183407 2313264 2406899 2378003 2387904 2435188 2587388 2643518 2767163
5655 2767163 2863193 2822753 2941059 2993755 3099577 3341114 3454259 3472691 3500535 3581910 3762143
5644 3762143 3903006 3933360 4088392 4184262 4272217 4329198 4492977 4676907 4828868 4977661
5634 4977661 5137232 5283399 5415763 5429917 5476815 5657402 5771847 5902047 6006547 6135825
5624 6135825 6269849 6412526 6633583 6807848 6989332 7122041 7343218 7526138 7741261 7897341
5614G897341J75597L05058J41189K96795L39324M22136L73764L64506L39172K96599
5604A0951481L11328L91557L87313N06130N49834N10262N40291O17115O21834
5595A5387145Q57462Q32052R64993R87126J057484J179386Q76298N78397L70248
5586B3090591M80585O66879P55754R20731P91229P85777Q54798Q53220J102989
5577C0302553J264458J436097J696534K110697K377472K927577L431014M099953
5569D9646355M840857N832278O812086P890281R674426J2156734J5148974J9904643
5561A31906634K5852450L2800164L8634536L3883978L092052l0671040m4803675
5554A90695099m2968577l1207543k1186074j4656466j0846520q307946o919437
$$ plain form
5614 7897341 8072938 8377996 8519185 8815980 9155304 9577440 9951204 10315710 10654882 10951481
5604 10951481 11262809 11654366 12041679 12547809 13097643 13607905 14148196 14765311 15387145
5595 15387145 16244607 17076659 18041652 19028778 20086262 21265648 22141946 22720343 23090591
5586 23090591 23571176 24238055 24993809 25914540 26705769 27491546 28346344 29199564 30302553
5577 30302553 31567011 33003108 34699642 36810339 39187811 42115388 45546402 49646355
5569 49646355 54487212 60319490 67131576 75021857 84696283 96853017 112001991 131906634
5561 131906634 157759084 190559248 229193784 263077762 266169814 235498774 190695099
5554 190695099 147726522 116518979 95332905 80676439 69829919 61521973 54602536
5547E4602536n728599m830512l930763l498958k897067k634755k284183j998496
5539B6799203j868243j642844j322968j098930j199369j086419q24641p16576
5531A7039213n71719o60274n81795m37386m03524l33832m98887m29996m99669
5522A2622131m32362m29048m13305l59826m17211j91381k00979j78481j83183
5513I816355j38845j18821M0555q8497l65843m01613m38128l63544k76817l15605
5503G349197k91436j37906j17227j46880k03374r7549L8520L3281O0737k6695
5493F460668k06997j07374k03227j83349r9264o8152o9828N992l8189l6492r621
5482E444167N500L3030J7402j45236j73441j04944k44721k18715j36362k43612
$$ plain form
5547 54602536 48873937 44043425 40112662 36613704 33716637 31081882 28797699 26799203
5539 26799203 24930960 23288116 21965148 20866218 19666849 18580430 17755789 17039213
5531 17039213 16467494 15807220 15225425 14788039 14384515 14050683 13551796 13121800 12622131
5522 12622131 12189769 11760721 11347416 10987590 10570379 10378998 10178019 9999538 9816355
5513 9816355 9677510 9558689 9599244 9510747 9144904 8743291 8305163 7941619 7664802 7349197
5503 7349197 7057761 6919855 6802628 6655748 6452374 6354825 6393345 6426626 6487363 6460668
5493 6460668 6253671 6146297 5943070 5759721 5660457 5592305 5522477 5528469 5490280 5453788 5444167
5482 5444167 5449667 5482697 5500099 5354863 5181422 5076478 4831757 4613042 4476680 4233068
5472D233068k33732r7001j41988j50697r1794p9712o7348k5873m0764J1743k7583
5461C288319o9712p8312L6851J5786M9934R6740P6865M9215P2468M5680N6153
5450C639987J52269M9159M508r886j70352k10061k57175j70006j57683j34701
5440B736059k59564j01347j3097j52695r4323k1830o6525l8573N4623r9663m3365
5429A899700n2320M128l4757Q3939J05368K832m1073Q9037N1056N7713k3957J520
5417B143186k4644m7616r2146l3021j142k9688p1980j09274q0673j4339j03012
5406A535651p0875J2264j5293m3173j1053k3630m0598n6833j19302M8085k190
5395A213053k7863j78605l8979Q489O5915j24343J6997M71o5348K9740K5307k6462
$$ plain form
5472 4233068 3999336 3902335 3760347 3609650 3517856 3438144 3370796 3344923 3304159 3315902 3288319
5461 3288319 3218607 3140295 3177146 3192932 3242866 3339606 3416471 3465686 3538154 3583834 3639987
5450 3639987 3792256 3841415 3845923 3836037 3665685 3455624 3198449 3028443 2870760 2736059
5440 2736059 2476495 2375148 2362051 2209356 2115033 2093203 2026678 1988105 2042728 1943065 1899700
5429 1899700 1847380 1851508 1816751 1900690 2006058 2008890 1967817 2056854 2107910 2165623 2141666 2143186
5417 2143186 2118542 2070926 1978780 1945759 1944617 1914929 1842949 1733675 1653002 1638663 1535651
5406 1535651 1464776 1477040 1461747 1418574 1407521 1383891 1343293 1286460 1167158 1215243 1213053
5395 1213053 1185190 1006585 967606 976095 1042010 917667 934664 935135 869787 899527 924834 898372
5383H98372M5661K3338N1364L0758q6123j9897j38633J4341k8281J01296K2020
5372I14216O8808j02085l3976j7528L4275o0921j50848O9179K2744j41572J8805
5361F21097O6825m2980N6080p5424j6948J2179K2114J4683n0326J1288k8037Q211
5349E98762k5823l242J01018o3140j3671K3244n3201L5022o0744L5961j1849o4372
5337D97965k1663Q4115L8576J6439j5761q5280O864j1091M0562l8603K0248K35
5325E32606Q2339K8224lk0285j6815l9416J594K2611m1051l2410M6358r0478J1770
5312D85044k1983p0692l2109q015l358Q552L236Q0445L9550j27563k2498J3380
5300C43989j3434k292K5055k9993j0493k9415L1073Q4095N1971J255r2995K50
$$ plain form
5383 898372 944033 967371 1018735 1049493 963370 943473 804840 819181 790900 892196 914216
5372 914216 983024 880939 846963 829435 863710 802789 651941 721120 743864 602292 621097
5361 621097 687922 644942 701022 625598 608650 620829 642943 657626 607300 618588 590551 598762
5349 598762 572939 569697 670715 607575 593904 617148 563947 598969 538225 574186 562337 497965
5337 497965 476302 560417 598993 615432 599671 514391 521255 510164 550726 512123 532371 532606
5325 532606 614945 643169 643166 622881 606066 566650 568244 590855 549804 517394 563752 473274 485044
5312 485044 463061 392369 360260 352245 348887 357439 360675 441120 480670 353107 330609 343989
5300 343989 330555 328263 353318 323325 312832 283417 314490 398585 450556 451811 358816 359066
5288C59066N4162k6918j0811N270j9995p3830J9032O2479N390J6044M4825j4832
5276D19882l0465j1011k4281K8700o1811M391J1355J9379L6262n554m5492K9892
5264C71247K3524J17643k215m9485N561k9334M6395n7740l0813R0135L1322k0954
5252D95286K1394J8616N0704l2532n398L2770o6896O6806P4020K3881N8300q6242
5240F50709J57819l7240j9164Q4409L9119J48553J27882Q4617J20728J53039J56085
5229A666556M1150j58942j93336j94165j88511l3049o1148q8377j9168j28989
5219F42021n6391l5644J9162j7210n6354K2648r0965j498J6324k8743O8844J3575
5207D95769J29R9284n0979j35364J3232K4011L8652j6192J06269n2104L9949o7557
$$ plain form
5288 359066 413228 386310 375499 380769 360774 286944 305976 368455 373845 389889 434714 419882
5276 419882 389417 378406 354125 382825 321014 325405 336760 356139 392401 386847 341355 371247
5264 371247 394771 512414 510199 460714 466275 436941 483336 425596 394783 484918 516240 495286
5252 495286 516680 535296 586000 553468 548070 580840 513944 580750 654770 678651 736951 650709
5240 650709 808528 771288 752124 836533 875652 1024205 1152087 1236704 1357432 1510471 1666556
5229 1666556 1707706 1548764 1355428 1161263 972752 939703 878555 790178 771010 642021
5219 642021 585630 549986 569148 551938 495584 518232 427267 425769 442093 413350 482194 495769
5207 495769 495898 595182 544203 408839 422071 446082 484734 468542 574811 522707 562656 495099
5195D95099L1127J72669N5107M0924L5429Q0718L5441R2888K798M677j24199n1740
5183H70938m1489j70743n7881r9421K9164m6800p3327J282J479J4804l935p1525
5171C52546j18061l8243o236Q164P1315P9685q0945K3425P3156l870m3160l4445
5159B83331q1661J03720J7550o412n3706M1974m123J0349n3320O2874o1771r9703
5147A59102r9827J22130P9542j6356O2284m6071l8636n749m4932q6243J81162
5136B66406q7802K8320Q4350M1646q7261m9963K3608n5283P54l5362M424j0017
5124A23820K6385k3051p328J07063m1723r0667n9875Q4674Q371L6607Q8648R072
5112B61996P7031n2548j45637n4022N8229M9702Q5693l5905q3276j0293L1153
$$ plain form
5195 495099 526226 698895 754002 794926 830355 911073 946514 1039402 1042200 1046877 922678 870938
5183 870938 829449 658706 600825 501404 530568 483768 410441 411723 413202 428006 424071 352546
5171 352546 234485 196242 190006 198170 269485 349170 268225 291650 364806 360936 317776 283331
5159 283331 201670 305390 322940 316528 262822 304796 300673 311022 257702 320576 258805 159102
5147 159102 59275 181405 260947 244591 306875 260804 222168 216419 171487 85244 266406
5136 266406 178604 206924 291274 332920 245659 195696 219304 164021 164775 129413 133837 123820
5124 123820 150205 127154 119826 226889 185166 94499 34624 119298 127669 164276 252924 261996
5112 261996 339027 286479 140842 86820 145049 194751 280444 244539 161263 150970 182123
5101A82123L2326O0847L9129o4618m8620J2783n579k1787q8143n2524j3236k4396
5089H305k563L0940M7947P0897R1145p4316k238O3844q6488q3594Q4221o651J9995
5076A61444o5052j00701K2322Q4289n3019P7295J6352K7447M8993j23210n3495
5065D2665R0193P4270r6750M5682N4011J431l0392n400n2542m2749P0123m6114
5053A04428q213M881J8675L8071L5250m2536j1649M6646o5606j4842K4520K0556
5041A50181p1193p742J05446l0087K4061M7031n4977m5623L8998q1210L9087Q0191
5029A94163J3429o3791q0583q513q2326j6175R7789P1982R3527m7391m3802J838
5017A30147K4198q217p034j5681r465j57039N7098m0989j11584J37990J47720
$$ plain form
5101 182123 214449 275296 314425 249807 201187 213970 208391 186604 98461 45937 32701 8305
5089 8305 5742 36682 84629 155526 246671 172355 170117 233961 147473 63879 148100 141449 161444
5076 161444 96392 -4309 18013 102302 49283 126578 142930 170377 219370 96160 42665
5065 42665 132858 207128 110378 156060 210071 211502 181110 175710 123168 80419 150542 104428
5053 104428 96215 101096 119771 157842 193092 150556 138907 185553 119947 105105 129625 150181
5041 150181 78988 71246 176692 146605 170666 217697 162720 117097 156095 74885 113972 194163
5029 194163 207592 143801 63218 54705 -27621 -43796 53993 125975 219502 172111 128309 130147
5017 130147 154345 146128 139094 123413 113948 -43091 14007 -26982 -138566 -576 147144
5006A47144m9783n4302O1772q9675p405O3118m7177l2829J29839L7201j6091J8897
4994A60709J5069r7224O3481k0220j7062l3109j5943R0142L6377j6393M0518k9472
4982A76873J9007j49598j0748K7421K9670j22362j7286L4290P171O6417l313k354
4970E5188M488O3985J0283P447m8637N486K447O7297R770k1902P801k7665K1239
4957A57227m7040j8651J3206p8956K2915J4336O2565L2112p0937O6546J7065j8136
4945A52252o2145J2804k1781L7018j06043P6380N2405M9145q1304r091M7979p130
4933A40489k9342m7956N5305k1496m2942j1119R6386p9062L0840k5035j9832n728
4921D0508m2525Q6096m764j0096Q3783P6163K7861j11787o3520j5897J40711j6633
$$ plain form
5006 147144 97361 43059 104831 15156 7751 70869 23692 -9137 120702 157903 141812 160709
4994 160709 175778 78554 142035 121815 104753 71644 55701 145843 182220 165827 206345 176873
4982 176873 195880 46282 35534 62955 92625 -29737 -47023 -12733 -5562 60855 57542 55188
4970 55188 59676 123661 133944 141391 92754 98240 100687 167984 177754 155852 163653 135988 157227
4957 157227 110187 91536 104742 25786 48701 63037 125602 157714 86777 153323 170388 152252
4945 152252 90107 102911 81130 118148 12105 88485 140890 190035 108731 99640 147619 140489
4933 140489 111147 63191 118496 97000 54058 42939 139325 60263 91103 66068 46236 40508
4921 40508 -2017 84079 79315 69219 153002 229165 257026 145239 81719 65822 206533 189900
4909A89900j4702M9219o3862k8771m0785L0163J6767k7787m419M015P2143l7303
4897A44578l1569j9219J3271L8519P023M3363q362n9109m4062l77L0573j2371
4885A02258L2427j5437J5506O3783n5270j3291J24342l2226p4650L9194J9546
4874B06182n1647j3592k6561K2692K1503k4356N1577j0443J7247j5868o4211L1524
4862A44047J9824M1966q2113l7298l5068N6334Q9745K3771j256r5125N075m079
4850A25823l2582p322n0556Q5117K6280l7146O3779J4812L8377j3308k0423l6174
4838A56677Q8582o422j04946l9868N1901J6707k7866Q4238K2517m7930j8525m3047
4826A32018O6701J07242j7641p0404j4207J2244j6220K6356P1409k4930l9980
$$ plain form
4909 189900 175198 224417 160555 131784 90999 121162 137929 110142 105723 109738 181881 144578
4897 144578 113009 93790 107061 145580 152603 195966 187604 128495 84433 84056 114629 102258
4885 102258 134685 119248 134754 198537 143267 129976 254318 222092 147442 186636 206182
4874 206182 154535 140943 114382 137074 158577 134221 185798 175355 192602 176734 112523 144047
4862 144047 163871 205837 123724 86426 51358 107692 197437 221208 219952 124827 129902 125823
4850 125823 93241 85919 35363 120480 146760 109614 173393 188205 226582 213274 192851 156677
4838 156677 245259 238837 133891 94023 145924 162631 134765 219003 241520 193590 175065 132018
4826 132018 198719 305961 288320 217916 203709 215953 199733 226089 297498 272568 232588
4815B32588P450l7934J5929j6598J310n2726J15129l4201Q6453M0137l3150n4080
4803B70307N3231l2333L6769p2892l5747n3531M9169J32585m546l3701J2343P1469
4791C93123m6727L4765N534O8773j3652l786N8950p6993n0781N2830m3654K8584
4779D06966j2560l730r5908J00932M9473J389o398j77N946J98661Q6787L124o8916
4766F65589O9494O9635J08221J45290J48944J72037R5133J06165o8160j01378
4756A410970p9966j18085j16319j68054l2140r9577j01328j77284O6065J04970
4746F89252j5182l5852p8218j0097L9294K8678j02940J7192J7815k2426J5661
4735E43177p2078J0714N8492k2396K5994p6611j1566j2869L3140O4827R785O0482
$$ plain form
4815 232588 240038 202104 218033 201435 202745 150019 265148 230947 317400 357537 324387 270307
4803 270307 323538 291205 327974 255082 219335 165804 214973 347558 343012 309311 321654 393123
4791 393123 346396 381161 386695 455468 441816 438030 496980 419987 369206 422036 378382 406966
4779 406966 394406 390676 294768 395700 445173 446562 440164 439987 445933 644594 731381 734505 665589
4766 665589 735083 804718 912939 1058229 1207173 1379210 1474343 1580508 1512348 1410970
4756 1410970 1331004 1212919 1096600 928546 896406 796829 695501 518217 584282 689252
4746 689252 674070 638218 560000 549903 589197 617875 514935 532127 549942 527516 543177
4735 543177 471099 481813 540305 517909 543903 467292 455726 442857 475997 540824 550609 611091
4723F11091J2862j01203q503j1082m8787K3609Q6549n989j0975L5564K7649j07906
4711E02879p4064J46691L0120K8219j0176j7655n2154m9080p291N0510q2534L3666
4699D99131L1251m1667l1613j7640O6882n3414j1104R3580L3818N1809j4381P8285
4687F84937J6542m3231Q5108k6054N1162M3435j06525l0511M8569K2227P1904
4676H17563m3425M7376k4280J3799n2343o972K7257p6439O554Q1865P480r8302
4664G00133Q5203P4440l5694l5535R0757M9937r8420O5678K5506P3661o7667J4719
4652I42718N953N6969m09o832k4448q2070O1741M0494l0099N5922M1975L1396
4640A093310j2096M5510J4429l2481J0012M4713L527q6547M0844Q2435N57M8259
$$ plain form
4723 611091 623953 522750 514247 503165 454378 477987 564536 558547 547572 583136 610785 502879
4711 502879 428815 575506 605626 633845 623669 606014 553860 504780 497489 547999 465465 499131
4699 499131 530382 488715 457102 439462 506344 452930 441826 535406 569224 621033 606652 684937
4687 684937 701479 658248 743356 717302 768464 811899 705374 674863 723432 745659 817563
4676 817563 774138 821514 797234 811033 758690 751718 778975 702536 709090 790955 798435 700133
4664 700133 785336 859776 824082 788547 879304 929241 830821 896499 922005 995666 927999 942718
4652 942718 948671 1005640 1005231 998399 973951 891881 953622 994116 964017 1019939 1061914 1093310
4640 1093310 1081214 1126724 1141153 1108672 1118684 1163397 1166924 1080377 1121221 1203656 1204213 1252472
4628A252472P094m9676j36689o379M8695N7599N3855O1236l5830K319P5020O3791
4616A393507j5729L2730P7102K2052L2299N8681m4317j09729J1773L7418M2295
4605A538082O8630Q0297k487l1126K0665P8518o448p160L9123O7976N8169J00517
4593B004756K8806k03K6201J22861l4452J4309J34808K6361L7490L4392l2818
4582B362511l0316J9177O3074m9319O2082J50206J47319K5490J08225M3028J40403
4571C041880J66520K27847K62545K77708K39076O9345k6332r5635m6366l8838
4561D077750J3577m2357l608J08267K7630O1765J69624O5258k4057J59115J37295
4550D750259J49210r892L9067J62419J86498J04024O8258K05813J71251R2290
$$ plain form
4628 1252472 1259566 1209890 1073201 1066822 1115517 1173116 1226971 1288207 1252377 1254696 1329716 1393507
4616 1393507 1377778 1410508 1487610 1509662 1541961 1600642 1556325 1446596 1458369 1495787 1538082
4605 1538082 1606712 1687009 1684522 1653396 1674061 1752579 1746131 1738971 1778094 1846070 1904239 2004756
4593 2004756 2033562 2033359 2059560 2182421 2147969 2162278 2297086 2323447 2360937 2395329 2362511
4582 2362511 2332195 2351372 2414446 2365127 2427209 2577415 2724734 2750224 2858449 2901477 3041880
4571 3041880 3208400 3436247 3698792 3976500 4215576 4284921 4258589 4162954 4116588 4077750
4561 4077750 4091327 4048970 4045362 4153629 4181259 4243024 4412648 4477906 4453849 4612964 4750259
4550 4750259 4899469 4889577 4928644 5091063 5277561 5381585 5449843 5655656 5826907 5919197
4540E919197J64984P4934J44232M4035M5922J07947K21295J41816K10639J74790
4530G249791K03807K57500J13337K38344J97503K90297J07555L97248L69012K82331
4520I706725M77723N05679M35705L01976J91264J68701J90157K27526K21191M17830
4510A2844477N01748M45361M43577L76600M04597M46491M66252N10341M20905
4501A6860349O17925N58899O58338O95201P94643Q45077R35940J083722R99697
4492B4049791J097090J148505J155364J272344J351307J546213J692893J994647
4484C5308154K531191K813388L127993L701154M197091M827087N618333O559044
4476F8683435Q135847J0060869J2880132J6607211K1105502K6092208K9379050
$$ plain form
4540 5919197 6084181 6159115 6303347 6347382 6393304 6501251 6722546 6864362 7075001 7249791
4530 7249791 7453598 7711098 7824435 8062779 8260282 8550579 8658134 9055382 9424394 9706725
4520 9706725 10184448 10690127 11125832 11427808 11619072 11787773 11977930 12205456 12426647 12844477
4510 12844477 13346225 13791586 14235163 14611763 15016360 15462851 15929103 16439444 16860349
4501 16860349 17478274 18037173 18695511 19390712 20185355 21030432 21966372 23050094 24049791
4492 24049791 25146881 26295386 27450750 28723094 30074401 31620614 33313507 35308154
4484 35308154 37839345 40652733 43780726 47481880 51678971 56506058 62124391 68683435
4476 68683435 76819282 86880151 99760283 116367494 137472996 163565204 192944254
4469A92944254K6645333J4602564m238352k2634660l3012279l3512929k7977486
4462A12816445k0707012j4793305j0535668p962108o179844n096554m313538l587147
4454C9641269l139798k841309k487157k250232k109891j817473j686322j474410
4446B1834677j171737j023847q48245p91192q42875o36062m91950m44834m17161
4437A5166774m31094m25693k83464m80055o15024n25114m47264l57705l03634
4428A1297727l07960k98019k38847j66532p9970j34647k06363k19495j13344p7921
4418I454629m0633N48j3824j12821k09396k94595k08325k77972k92993q9235k38183
4407G677200K933n2909p6565o9787j29843l8359p1632k4354J23542j46881l7045
$$ plain form
4469 192944254 219589587 234192151 229953799 207319139 174306860 140793931 112816445
4462 112816445 92109433 77316128 66780460 58818352 52638508 47541954 43228416 39641269
4454 39641269 36501471 33660162 31173005 28922773 26812882 24995409 23309087 21834677
4446 21834677 20662940 19639093 18790848 17999656 17156781 16520719 16028769 15583935 15166774
4437 15166774 14735680 14309987 14026523 13546468 12931444 12406330 11959066 11601361 11297727
4428 11297727 10989767 10691748 10452901 10286369 10206399 10071752 9865389 9645894 9532550 9454629
4418 9454629 9413996 9414544 9400720 9287899 9078503 8783908 8575583 8297611 8004618 7915383 7677200
4407 7677200 7680133 7627224 7550659 7480872 7351029 7312670 7241038 7216684 7340226 7193345 7156300
4396G156300o7559j45844r7993l0827p9112r7800k4816k5724j3611o0686l7023
4385F475305Q2642J2652J77376J76625J02026J96360L00065L34693L51529M75791
4375H685064N31206L74558n570l58541n48077m52977k95403k14739j30815M5696
4365G630402O1509L7014K0046l686K1606J38572J00933K5117K5503J24595J06465
4354H288076J27949K3743J43758M8468R6006J15144N3434J73245O7914J86971
4344I324708P8843P1124J26643R8472J52883K43220K63881N8317K73517K43095
4334A0934703J66694L29106K75794J89350L13479L88636L52446L53211M37752
4325A3741171L80603M20001M53677L60390M88520M16960M03545O03554O60198
$$ plain form
4396 7156300 7088741 6942897 6844904 6814077 6734965 6637165 6612349 6586625 6573014 6512328 6475305
4385 6475305 6557947 6570599 6747975 6924600 7026626 7222986 7523051 7857744 8209273 8685064
4375 8685064 9216270 9590828 9585258 9226717 8678640 8225663 7930260 7715521 7584706 7630402
4365 7630402 7691911 7728925 7748971 7745285 7766891 7905463 8006396 8031513 8057016 8181611 8288076
4354 8288076 8416025 8439768 8583526 8631994 8728000 8843144 8896578 9069823 9137737 9324708
4344 9324708 9403551 9474675 9601318 9699790 9852673 10095893 10359774 10418091 10691608 10934703
4334 10934703 11101397 11430503 11706297 11895647 12209126 12597762 12950208 13303419 13741171
4325 13741171 14121774 14541775 14995452 15355842 15844362 16261322 16664867 17268421 17928619
4316A7928619O83172N90737P52356P21980P90965Q33767R29254Q35529R54146
4307B5020525J054161J241819J435832J401589J464715J417506J201668J263346
4299C5501161J319810J314010J294408J315587J451137J692151J998480K297599
4291D8184343K434433K628578L124806L922614M827521N855557P122737Q619156
4283H6719745J0647648J3134520J6318550K0411984K5076291K8667762K7424190
4276B28400690J7235866j691466k1165291l2052799l2992803k7388461k0303135
4269A10042601j4550499j0677192q141958o337683n200971m238622l634169k921119
4261E4340388k236045j798518j502960j207408j058997r25344n77799k81526q4648
$$ plain form
4316 17928619 18611791 19202528 19954884 20676864 21467829 22301596 23230850 24066379 25020525
4307 25020525 26074686 27316505 28752337 30153926 31618641 33036147 34237815 35501161
4299 35501161 36820971 38134981 39429389 40744976 42196113 43888264 45886744 48184343
4291 48184343 50618776 53247354 56372160 60294774 65122295 70977852 78100589 86719745
4283 86719745 97367393 110501913 126820463 147232447 172308738 200976500 228400690
4276 228400690 245636556 243945090 222779799 190727000 157734197 130345736 110042601
4269 110042601 95492102 84814910 76672952 70335269 65134298 60895676 57261507 54340388
4261 54340388 52104343 50305825 48802865 47595457 46536460 45611116 45033317 44751791 44667143
4252D4667143L4275L82869M80731P31255R32341J309605J714593K129841K492423
4243E4875076K930578L357597L899335M764865N577080O649606Q368418J0468528
4235A00891083J3506831J7190805K1654676K5525904K6594105K1348915Q521336
4228B35233655q373508k3216769l0847054l0713100k5700632j9453123j4273329
4221H2656140j0432391p924521o323998n215072m447949l804215l387724k933193
4213C8187077k621927k432917k261788j976956j793463j595321j273696j152409
4205B3078600j059452r30511q94129q39494o94117o67903m91587m99509m87339
4196A6514559n38461n49437m83597o53099n53522m59998m46483l73452m68292
$$ plain form
4252 44667143 44701418 45084287 45565018 46296273 47228614 48538219 50252812 52382653 54875076
4243 54875076 57805654 61163251 65062586 69827451 75404531 82054137 90422555 100891083
4235 100891083 114397914 131588719 153243395 178769299 205363404 226712319 235233655
4228 235233655 226860147 203643378 172796324 142083224 116382592 96929469 82656140
4221 82656140 72223749 64299228 57975230 52760158 48312209 44507994 41120270 38187077
4213 38187077 35565150 33132233 30870445 28893489 27100026 25504705 24231009 23078600
4205 23078600 22019148 21088637 20194508 19355014 18660897 17992994 17501407 17001898 16514559
4196 16514559 15976098 15426661 14943064 14289965 13736443 13276445 12829962 12456510 11988218
4187A1988218l82928l63007k64078k78231k44354k47621j55704j85666k10860
4178I655769j25045K753M4734k7159n7659l07343k31968l75638l52292k51511
4168G974641j81400k27251j93260j48167k41069j19567r3405k51869j51802j98659
4158F168192k46285j54563j02412n6660j93608j64684q6187p9112l8283k05900
4148D840498o8292j27945j08994q9379J0352j37037j43660j56803m4808j9051
4138C954881j8599q4842o8816m7444j10210n5584p0662P90l0827l6502m6166n7915
4126C328104j5586k0496l3505q812m2788N8837j34973m345j48879n9438m0095
4115B878024j89943J7973l5925j43285j03728R8384n8446j02046N0036l9220k2173
$$ plain form
4187 11988218 11605290 11242283 10978205 10699974 10455620 10207999 10052295 9866629 9655769
4178 9655769 9530724 9533477 9578211 9551052 9493393 9186050 8954082 8578444 8226152 7974641
4168 7974641 7793241 7565990 7372730 7224563 6983494 6863927 6770522 6518653 6366851 6168192
4158 6168192 5921907 5767344 5664932 5608272 5414664 5249980 5163793 5084681 5046398 4840498
4148 4840498 4772206 4644261 4535267 4445888 4456240 4319203 4175543 4018740 3973932 3954881
4138 3954881 3936282 3851440 3782624 3735180 3624970 3569386 3498724 3499514 3468687 3432185 3386019 3328104
4126 3328104 3312518 3292022 3258517 3249705 3206917 3265754 3130781 3126436 2977557 2918119 2878024
4115 2878024 2688081 2706054 2670129 2526844 2423116 2521500 2463054 2361008 2411044 2371824 2349651
4104B349651R8779j2569K822o0378j5610K1999L550j5296n5429q4527K6060R945
4092B268997j5189q321l894l3151M7303l039L0518R5982M300P9156l3339Q5280
4080B514603Q3910N3472J80810O5359J59784J53667K53652J83056J19252m9743
4070C717822l0220O1256J76130L1495l70008m15954n06637k21457k37117j89248
4060B016062k9806j20741j18345m9038J7732q2537k3087p0855k9305L5008j5852
4049A529236P6711m1938j23687j8492r0181Q276K6568p531n5773j21338O9613
4038A251464j9883k2452m9644N5168j10801K9631P9251P2322j03780m2162n0491
4027A088623l631o0115p3439Q6785j0285q9017J02594q2740j47987q129Q459q4719
$$ plain form
4104 2349651 2448430 2435861 2438683 2378305 2362695 2384694 2388244 2372948 2317519 2232992 2259052 2268997
4092 2268997 2253808 2245487 2241593 2208442 2255745 2252706 2283224 2379206 2383506 2462662 2429323 2514603
4080 2514603 2598513 2651985 2832795 2898154 3057938 3211605 3465257 3648313 3767565 3717822
4070 3717822 3687602 3748858 3924988 3956483 3586475 3170521 2663884 2442427 2205310 2016062
4060 2016062 1986256 1865515 1747170 1698132 1715864 1633327 1610240 1539385 1510080 1545088 1529236
4049 1529236 1605947 1564009 1440322 1421830 1331649 1339925 1366493 1358962 1303189 1181851 1251464
4038 1251464 1231581 1209129 1159485 1214653 1103852 1133483 1212734 1285056 1181276 1139114 1088623
4027 1088623 1084992 1024877 951438 1038223 1027938 938921 1041515 958775 810788 802659 811118 726399
4015G26399O0435P2006Q411Q4501J9601n5703M5000p555q30M8288l7462j04217
4003H58874j7831J15553n4073o1148P3510M6747m3258j4869k7865P0191J14472
3992A060303j2094M255K0852O9570J29236j5626J61130J01658J41125K02543J41765
3981B004717K1535j91741k69422k17356j42109k6757k0018p4723p1324K8858j1604
3970A030056j27204j4970J6020K2137p8225p2513P3937m6059n463q2551o5045
3959F50120P3097O9377O7354O1794L7718m1807m2935M9200M6535J0613P377o6954
3947I21489k0235O2133o3299P5948J46308J38319R1982J14167J07437J22440L6078
3936A732767q6057j85839j41986j48296j82042j12197n2729j74094m0054J4211
$$ plain form
4015 726399 786834 858840 867251 951752 971353 915650 960650 953095 952265 1000553 963091 858874
4003 858874 841043 956596 902523 841375 914885 961632 918374 903505 875640 945831 1060303
3992 1060303 1048209 1052464 1073316 1142886 1272122 1256496 1417626 1519284 1660409 1862952 2004717
3981 2004717 2026252 1834511 1565089 1347733 1205624 1178867 1158849 1084126 1012802 1041660 1030056
3970 1030056 902852 887882 903902 926039 847814 775301 849238 803179 797716 715165 650120
3959 650120 723217 792594 859948 921742 959460 917653 874718 923918 970453 981066 988443 921489
3947 921489 901254 963387 900088 976036 1122344 1260663 1352645 1466812 1574249 1696689 1732767
3936 1732767 1646710 1460871 1318885 1170589 988547 876350 823621 649527 609473 623684
3926F23684K8806O141r757p2299l5314P8166R6165j1091r8685n6596p1487M7440
3914E25173M5049j12368O5246k5804q8121R7952k1193j15200n1639J35694O319
3903D61108j7796J5037o0899K4455M718M5337r8415K8523P1844m0239Q978p0146
3891C72505J1519j2090L4669l4188N636j4503L1312M4915l5595j15174N2831j5157
3879C26680j24182p6022Q6816J03934M8145m5341l4435j1467N2887Q4137j1614
3868C99538p3373N9467l6202j2723K5142p9952m08Q3086j6816N8343q8804M7023
3856C64321O2295j02133o2254j3672Q0891m91Q5184k2519Q0530n4535L7661M4331
3844D99609k2627r545n8943j21199j6280Q1577K0138j5202j9884K5417K3737k0940
$$ plain form
3926 623684 652490 658631 648874 576575 541261 619427 715592 704501 605816 549220 477733 525173
3914 525173 570222 457854 523100 497296 409175 507127 485934 370734 319095 454789 461108
3903 461108 443312 458349 397450 421905 426623 471960 373545 402068 473912 433673 442651 372505
3891 372505 384024 371934 406603 372415 378051 363548 394860 439775 404180 289006 341837 326680
3879 326680 202498 126476 213292 317226 365371 320030 285595 274128 327015 411152 399538
3868 399538 326165 385632 349430 336707 361849 281897 281489 364575 347759 406102 317298 364321
3856 364321 426616 324483 262229 248557 329448 328957 414141 391622 472152 417617 455278 499609
3844 499609 476982 467437 408494 287295 271015 352592 372730 357528 337644 363061 386798 365858
3832C65858P2107O7266Q725m5119J089N5180n3183n1002N3526K9958o3109N5223
3820D96519Q1411M9989O9183J1797R5391J25683J05921P9596j1114l2780r514
3809A062082r750j59511j31523j63821m5121m7762p921K7404J01581m2806n8856
3798E23996m0972k5727J148J6905K4168n1432K6464l4775M2161r8429M6862M0401
3786D70770P6808n2712r785R3613n6573j4655L0985j344n5448Q318m8878L983
3774D45082O8309K660k6763j2431q9854j2951O1244j0197l610R1738K3391k6243
3762E10375J06552p8541o0672o0232J24861N9736p1128n3560M5922J04936K8349
3751F56598o5888J0164M3353l9593J5077j27032M3172O391Q6589l3900K2369L8118
$$ plain form
3832 365858 437965 505231 513956 468837 469926 525106 471923 420921 474447 504405 441296 496519
3820 496519 577930 627919 697102 708899 804290 929973 1035894 1115490 1104376 1071596 1062082
3809 1062082 1052332 892821 761298 597477 552356 504594 496673 524077 625658 582852 523996
3798 523996 483024 457297 458445 475350 499518 448086 474550 439775 481936 383507 430369 470770
3786 470770 547578 494866 485081 578694 522121 507466 538451 537107 481659 489977 441099 445082
3774 445082 513391 516051 489288 476857 387003 374052 435296 425099 421489 513227 536618 510375
3762 510375 616927 538386 477714 417482 542343 602079 530951 477391 523313 628249 656598
3751 656598 590710 600874 644227 604634 619711 492679 535851 542242 628831 594931 617300 655418
3739F55418q1574j5791K5705p827N4876L8151l5451P5909O9838J4262n9690R2752
3727H26578M5560n8612p1946k0114j6783Q2370J19381l6544N2676j19102K6007
3716H29471L5289N0443L2743J7809K1591J3098M2378O1411K9321L8429J4327Q9373
3704A275683p4392j48090P1595L7419J22039M2498O8335R9897J23033k5788J33555
3693A725784O2160K3743O6026N7354M8600L7297O7798J34014P0560J32165J28372
3682B553873R4596j6611J60510L00867J10731M9145J20441K70591K38960L03698
3672D186801K04400K65119L00395L36146K90157K70315N03782M85724K86747L60493
3662G490079L91147L38167L27110J40449n3339p9062r5015k07630l12511l34142
$$ plain form
3739 655418 573844 558053 583758 575931 630807 668958 633507 709416 779254 793516 733826 826578
3727 826578 872138 813526 741580 721466 704683 787053 906434 869890 922566 803464 829471
3716 829471 864760 915203 947946 965755 987346 1000444 1042822 1104233 1133554 1171983 1186310 1275683
3704 1275683 1201291 1053201 1124796 1162215 1284254 1326752 1395087 1494984 1618017 1592229 1725784
3693 1725784 1787944 1811687 1877713 1935067 1983667 2020964 2088762 2222776 2293336 2425501 2553873
3682 2553873 2648469 2631858 2792368 3093235 3203966 3253111 3373552 3644143 3883103 4186801
3672 4186801 4391201 4656320 4956715 5292861 5583018 5853333 6357115 6842839 7129586 7490079
3662 7490079 7881226 8219393 8546503 8686952 8633613 8554551 8459536 8251906 7939395 7605253
3652G605253m53701m11136l43735m15660m08031l67987k53730l00410m08312k76163
3642C966388j26194k42993k37795k69700j22946j34736j13794j01216p3015q0844
3632B463155j40845j34625j33275L705p2504j47300j19112M5232K532j07051j00925
3621A558987N8888m2499j31640p5275n5774k6659r2393J2763r0668K0360J3958
3610A150048j8043o3756p4296O6138L8232M0022j09447q0567m7645N231K0337
3599I26254o4940P0914n8744j03375J5351m9162q385r7967J3103J1233N7284m9681
3587F61885n580L7360r7558p0772M8144M3476m6281n1171K7480M1155M2499j11999
3575E18638n2153K3352J2199k0452L7294R7936j05832N38J5614p8681N8192M7957
$$ plain form
3652 7605253 7151552 6740416 6396681 5981021 5572990 5205003 4951273 4650863 4242551 3966388
3642 3966388 3840194 3597201 3359406 3089706 2966760 2832024 2718230 2617014 2543999 2463155
3632 2463155 2322310 2187685 2054410 2058115 1985611 1838311 1719199 1764431 1766963 1659912 1558987
3621 1558987 1617875 1575376 1443736 1368461 1312687 1286028 1193635 1206398 1115730 1136090 1150048
3610 1150048 1132005 1068249 993953 1060091 1098323 1138345 1028898 948331 900686 905917 926254
3599 926254 861314 932228 873484 770109 785460 736298 727913 629946 643049 654282 711566 661885
3587 661885 656305 693665 596107 525335 573479 616955 570674 519503 546983 588138 630637 518638
3575 518638 466485 489837 502036 481584 518878 616814 510982 511520 527134 448453 506645 554602
3563E54602r6547P1477L629J0900p7183l3031M0616m4523J1809j1777n5684J9071
3551C93359K1179P1960p2457l2082K4809j12199Q1764M5835n1584j7728J6027
3540C68883l0255n8223K2416N6467k2752l5178O093M7121O5223M5111r4703k2172
3528C48031N3523m592m1518M6208j8809p9180J0298l4042J8427l2583K4423J6417
3516C06603n0115L7846j0015M6226l2903M5134O0898j25424j0581J42269j9798
3505C90140n1023O1052N7533o7278o2473m6410m920J33660j9501l0794K2067N0940
3493D32993M8702n1478q2932j08150k2779J24662K6171j9157P9465L2556q0665
3482C79388k8372o820L80N5119J47090j12049n9960R0073N6676q6235j50405o7340
$$ plain form
3563 554602 458055 529532 533161 544061 466878 433847 474463 429940 441749 429972 374288 393359
3551 393359 414538 486498 414041 381959 406768 294569 376333 422168 370584 352856 368883
3540 368883 338628 280405 302821 359288 336536 301358 307451 354572 419795 464906 370203 348031
3528 348031 401554 396962 355444 401652 382843 303663 313961 279919 298346 265763 290186 306603
3516 306603 256488 294334 284319 330545 297642 342776 403674 278250 267669 409938 390140
3505 390140 339117 400169 457702 390424 327951 281541 276621 410281 390780 359986 382053 432993
3493 432993 481695 430217 347285 239135 216356 341018 367189 348032 427497 460053 379388
3482 379388 351016 344196 344576 399695 546785 434736 374776 464849 521525 435290 284885 217545
3470B17545P7304J50232P354q151m339L7562r9423K34Q5111Q6586p7284j2482
3458D60249K7139l2294j71776Q7266J89535o7095q0929J4413J85231r6917o0888
3447D53934M4038k7527j0895J4013O0826j2222o8615J31426J3442k920p7803k2520
3435D95177L1053j4919l1927k269K7895P66J1495L3821j8558q8276j1659Q8118
3423E20717j21411Q9880L5075k4369O2659J02251j03136j7633N5470j2672K4942
3412F11773o5353J3974K7804m078N2541L3892n9932n7533P820L8945r0657Q1282
3400E90478K327K205m7150K4240K2413l9050m0445P9605p0102M6041P920j3503
3388E64979l6097J066K8132n035M7800K5301O8017K6119L315m0867j38521q0154
$$ plain form
3470 217545 294849 445081 452435 444284 439945 477507 378084 378318 463429 550015 472731 460249
3458 460249 487388 455094 283318 370584 560119 493024 412095 426508 611739 514822 453934
3447 453934 497972 470445 459550 473563 534389 522167 453552 584978 598420 595500 517697 495177
3435 495177 526230 511311 479384 477115 505010 505776 517271 551092 532534 444258 432599 520717
3423 520717 399306 489186 524261 499892 562551 664802 561666 544033 599503 586831 611773
3412 611773 546420 560394 588198 584120 636661 670553 610621 553088 560908 599853 509196 590478
3400 590478 592805 595010 547860 572100 594513 555463 515018 594623 524521 570562 578482 564979
3388 564979 528882 529948 558080 553045 600845 626146 694163 720282 723597 682730 544209 464055
3376D64055L0541m3387Q0389R3207l0340j41516J1179J11595r529R2676l597p5621
3364E79652o756Q5403K6210j05752n5754Q2528q4936n7859M1751N9504l5923j6248
3352E11820r3774O895R4372p9802o505l7818J8470M5304k1816J7809j7132M7575
3340D85398k4435q9313m9168L9669Q1135n7952J02911l4179q0966R79m7193J41163
3328D68049J2764l0165k0157l5503j0426L597Q0386n4563l0668P7527R9141N5004
3316F14986m472r3443Q7486J2206o8873L0717J01061K4174P0000J1985L4423j9171
3304H01079L0079P7486J7736R133K6461L2913Q2199J62848J02779r9280r1445
3293A151988m4732j21847o9351J4899J7718q1313j04602M8297n924l3017M9925
$$ plain form
3376 464055 494596 451209 531598 624805 594465 452949 464128 575723 566194 658870 655273 579652
3364 579652 572896 658299 684509 578757 523003 605531 520595 462736 504487 563991 528068 511820
3352 511820 418046 424941 519313 439511 433006 395188 413658 458962 437146 454955 437823 485398
3340 485398 460963 371650 322482 362151 443286 385334 488245 454066 373100 374079 326886 468049
3328 468049 480813 450648 430491 394988 384562 388159 468545 413982 383314 460841 559982 614986
3316 614986 610514 517071 604557 616763 547890 578607 679668 703842 773842 785827 820250 801079
3304 801079 831158 908644 926380 935513 961974 994887 1077086 1239934 1342713 1243433 1151988
3293 1151988 1107256 985409 916058 930957 948675 867362 762760 811057 805133 772116 822041
3282H22041l8207J37369R0188J2996O0320l3670J2912J53030J06374J08088k4848
3271A406593k4634O3825J49846J21410J55841J17343O9153J83718k7047o8475
3261B147573j52873j24416j20018m9900L764J62230M1704J52282K27911L96876
3251B685133L86901K67407N2260k54316l97555l91859k46978k77415m2382n6464
3241A724732p817M712O6398L55m0109j20778J55551J10011J8282N4971n814j548
3229A958946J5565p7999O695J41984O0952J84830L25660K42038M87154O99817
3219D045642P08656P19914M4187o40647q65415r32044o08885l24182l05631j71654
3209A669941k39292j19538n442p7888o878m4614r5137k7036J3940L3463r1946
$$ plain form
3282 822041 783834 921203 1011391 1024387 1084707 1051037 1063949 1216979 1323353 1431441 1406593
3271 1406593 1381959 1445784 1595630 1717040 1872881 1990224 2059377 2243095 2216048 2147573
3261 2147573 1994700 1870284 1750266 1700366 1704130 1866360 1908064 2060346 2288257 2685133
3251 2685133 3072034 3339441 3391701 3137385 2739830 2347971 2100993 1823578 1781196 1724732
3241 1724732 1716915 1721627 1788025 1788380 1748271 1627493 1783044 1893055 1911337 1966308 1960494 1958946
3229 1958946 1974511 1896512 1903207 2045191 2106143 2290973 2616633 2858671 3345825 4045642
3219 4045642 4754298 5474212 5518399 4877752 4012337 3080293 2471408 2147226 1841595 1669941
3209 1669941 1430649 1311111 1305669 1227781 1220903 1176289 1081152 1054116 1068056 1101519 1009573
3198A009573K0098J12762P1223n4618L0655Q8373J19221J64662K20945K88171
3188B071065J79824L18097K36784j49964l75306l83638m53755k33146j40186j30282
3178I39493j434o2737o0556o7191n8551l5455r9673l7593k8846m7451L0589m4929
3166D25666j57086m8981L2953J32226M956o8954p6462O9178M7757j3821o0911
3155B86521l2974M1972j7654j9982L6172J3668N111M1339j10227J3236J6712m2383
3143B31511Q2465p4608l9936q86J0346R4168n4804O421pp6459j2097l6454L0215
3130A59875L6223n3242o6675o4137K0058O1006R5264l7733q8925J1108K1922k0757
3118G3987J7385m266m2590O2229N9421P314j5133n695l2512m4971K6891J9223
$$ plain form
3198 1009573 1029671 1142433 1213656 1159038 1189693 1278066 1397287 1561949 1782894 2071065
3188 2071065 2250889 2568986 2805770 2655806 2280500 1896862 1443107 1209961 1069775 939493
3178 939493 938059 875322 814766 747575 689024 653569 553896 516303 487457 440006 470595 425666
3166 425666 268580 219599 252552 384778 389734 320780 244318 313496 361253 347432 286521
3155 286521 253547 295519 277865 257883 294055 307723 312834 354173 243946 257182 273894 231511
3143 231511 313976 239368 199432 198546 208892 303060 248256 254677 254670 178211 166114 129660 159875
3130 159875 196098 142856 76181 12044 32102 93108 188372 150639 61714 72822 94744 73987
3118 73987 91372 87106 44516 106745 166166 173480 158347 152652 120140 75169 102060 121283
3106A21283K6129K0493p6568l3963P8481m958q7010m8135M0403M7421m9751k9109
3094D716n715n1236J18570n0733k4415J8087N7535k7511N6319J1288q99j8319
3082H7687n5419M6492N1378p4617j7178j4471N2967M5012j35141k0168k605L3339
3070b724J4746P5670N073M0948q717L318k0458k6777o5933K3866P7706p1283J3455
3057E8890l8078k1362Q9853R043j08591J9762J7657L6621M482p0498k714L5860
3045C0925O0544q3780l9138L4020m1093m3715R7334R3269l383q4637k7729l3450
3033d0833M8299Q5502O6982P876j45989l7724j0418R2342P5946M4981K0957n3695
3021A54226j01555k6987M4399J1437m0155m7120k3018k4494J4060J04649k2063
$$ plain form
3106 121283 147412 167905 91337 57374 135855 130897 43887 -4248 36155 83576 33825 4716
3094 4716 -999 -52235 66335 15602 -8813 9274 66809 39298 95617 106905 106006 87687
3082 87687 32268 78760 130138 55521 38343 23872 76839 121851 -13290 -33458 -36063 -2724
3070 -2724 12022 87692 92765 133713 124996 128314 107856 81079 15146 39012 116718 45435 58890
3057 58890 20812 -550 89303 98346 -10245 9517 27174 63795 68277 -2221 -4935 30925
3045 30925 91469 7689 -31449 2571 -38522 -82237 15097 108366 104983 20346 -7383 -40833
3033 -40833 7466 92968 159950 167826 21837 -15887 -26305 66037 141983 186964 207921 154226
3021 154226 52671 25684 70083 81520 41365 -5755 -28773 -53267 -39207 65442 43379
3010D3379o3174n1338j9970J13657J6118k6308l3668K4592q9639O4635M5187M9120
2998G2591l9286o702N3817o490o2025R1790N031o8854o986J3366p8188J018j5601
2985d6519l7023O4597j1396N7411K8534o6325P6311j488L591O7922m1421r7166
2973b972P2596J9998k3830k222k0928j2785O384p7539o0524L1076L5287P9148
2961D3689n6137P9223n0900M605M4464Q8429P047Q9599o8302j02417j4328R647
2949G4619o3024J01673O3917J9011j10211j36K7034K8397L2028o6344r0811k0284
2937d131R2326m7383p612l4693O052n0747M1869N2579M2250q4961J2382O2796
2925H0727k3996N299k2192Q6116N3548j02167o9557Q0099O245R920m9252k5141
$$ plain form
3010 43379 -19795 -71133 -91103 22554 38672 12364 -21304 3288 -86351 -21716 23471 72591
2998 72591 33305 26603 80420 73930 11905 103695 108726 39872 32886 46252 -31936 -30918 -46519
2985 -46519 -83542 -18945 -30341 27070 55604 -10721 65590 64102 67693 135615 94194 -2972
2973 -2972 69624 89622 65792 63570 42642 29857 36241 -41298 -101822 -70746 -35459 43689
2961 43689 -12448 66775 15875 20480 64944 153373 160420 250019 181717 79300 64972 74619
2949 74619 11595 113268 177185 196196 85985 85849 112883 141280 173308 106964 16153 -4131
2937 -4131 88195 40812 33200 -1493 4559 -46188 -4319 48260 90510 5549 17931 80727
2925 80727 56731 62030 39838 125954 179502 77335 7778 87877 94122 104042 54790 29649
2913B9649J169l4758M3873L1063K7940r081k3931O2138K6851r2830K756j8088
2901D6751K573n739J6864J14255o8145j9385j1209o1631l6762L9236R7073j19308
2889e427j17025R1905R055m4482l616O3159J18917k7725j33865l4836P2243J31932
2877A20235M7288o0585q2240r1794J33903j46l2750J9447o791n8694M1173M6271
2865G5317l7459K9914p1003j7566P9685m0753n736j24081K5718N0508N0639M5349
2853F0532O5246L6998j26030l7840L3204m4525L3064M6912k1187k7118j42l1234
2841a2120j5791m709r5874j555O8577J11464k9722m0308j9401J9414L5246P0793
2829H6014l5452m3048J4213j5229j08477J04007k1713j7539Q0794r3004j0379
$$ plain form
2913 29649 30818 -3940 39933 70996 98936 89855 65924 128062 154913 62083 64839 46751
2901 46751 49324 43585 60449 174704 106559 87174 75965 14334 -22428 16808 113881 -5427
2889 -5427 -122452 -30547 -21492 -65974 -69590 -6431 112486 84761 -49104 -83940 -11697 120235
2877 120235 167523 106938 24698 -67096 66807 66661 33911 53358 46567 -12127 29046 75317
2865 75317 37858 67772 -3231 -20797 58888 18135 12399 -111682 -85964 -35456 15183 60532
2853 60532 125778 162776 36746 -1094 32110 -12415 20649 67561 46374 19256 19114 -12120
2841 -12120 -27911 -32620 -128494 -130049 -61472 49992 20270 -20038 -39439 -20025 15221 86014
2829 86014 50562 7514 21727 6498 -101979 2028 -19685 -37224 43570 -49434 -59813
2818e9813N2842q3986j1509R3742P1990q4932j28000R3947L6850k6592M5909M2919
2806D3367j18890l7316J16712k9863r812L6227o2544m3375N842J9511M5599M0442
2794E900q3385k9075j0805O5323P9282o1811m8185m0300O0744K7458Q2214q4950
2782c7590q187K1823K7893J7337o825P3811j8986r6579j0490R3680m8355L6993
2770D4525M8604m5023p8411M0742K0310q9473O7455P8770j02711l2988k4515L6425
2758c6290L7727O301K6509j0704M6643n4892j49191P1847J1315K8624M034P296
2746a0781k9118J3713l4382J7697M0104J9336p629o0206J67357N4116j25324p7254
2734c2371J6581m6025O3931O2907N707p2524j00063L3740o47N9271m5699l5436
$$ plain form
2818 -59813 -6971 -90957 -102466 -8724 63266 -21666 -149666 -55719 -18869 -45461 448 43367
2806 43367 -75523 -112839 3873 -25990 -35802 425 -62119 -105494 -99652 -80141 -34542 5900
2794 5900 -77485 -106560 -117365 -52042 27240 -34571 -82756 -123056 -62312 -34854 47360 -37590
2782 -37590 -45777 -23954 3939 21276 14451 88262 69276 -27303 -37793 55887 7532 44525
2770 44525 93129 48106 -30305 10437 30747 -58726 8729 87499 -15212 -48200 -72715 -36290
2758 -36290 1437 7738 34247 23543 70186 15294 -133897 -62050 -50735 -22111 -18077 -10781
2746 -10781 -39899 -26186 -60568 -42871 -2767 16569 8940 -51266 116091 170207 44883 -32371
2734 -32371 -15790 -61815 2116 65023 70730 -1794 -101857 -68117 -68764 -9493 -55192 -90628
2722i0628J4998K8106j735N020L6837m7224L8400k8134j12690K7469j5375O0055
2710h4901N2109l3373L0958M2905l8783M8268P651r628L1753l6107Q4743k9589
2698F6006r8043p9221o333M416M5793K2471l0398M650O7743K9166o7475m4446
2686h5671o613K5501L612Q587l2812L0584m6327o5186P5341J08908j8405J3926
2674A1445N3989j25637r6783Q1351J59658j7518J5215o6410Q7362j4909m0176
2663D7587q7180l3543O0703q726j14136K5775k210J2987L0447l9514M957m1172
2651a44025M6758N5990L969L4095n313l3370j7269q504N8562k9058k4571k3697
2639h6433M5404o8057K6738O5499k8841J0820M7239r841R35k9259N7869L0671
$$ plain form
2722 -90628 -75630 -47524 -49259 -44239 -7402 -54626 -16226 -44360 -157050 -129581 -144956 -84901
2710 -84901 -32792 -66165 -35207 7698 -31085 17183 24834 15206 46959 10852 95595 66006
2698 66006 -32037 -111258 -117591 -113175 -67382 -44911 -75309 -70659 -2916 26250 -41225 -85671
2686 -85671 -92284 -66783 -63171 -54584 -87396 -56812 -103139 -168325 -92984 15924 -2481 11445
2674 11445 65434 -60203 -156986 -75635 84023 66505 81720 15310 102672 87763 47587
2663 47587 -39593 -73136 -12433 -21159 -135295 -109520 -111730 -98743 -68296 -107810 -102853 -144025
2651 -144025 -97267 -41277 -37308 -3213 -8526 -41896 -59165 -67669 -9107 -38165 -62736 -86433
2639 -86433 -41029 -109086 -82348 -16849 -45690 -34870 12369 2528 3463 -25796 32073 62744
2627F2744n066q9987k9800N0971M2021m1421J1278R7128K302n7263q0980O0376
2615B2303R1811q388l8112q012j9971K0329r7696J3163K9510J2802q8806m8153
2603a19220K7988j0384L2390N8900k6031j5197R8125P1350j3925o6525k6436L0047
2591D1082o3052m4286R0716L0049m6709l022K0180Q1065k25330j5369J17136M740
2579a2800j2452k5481L5576j6864M0163q0556j3516j9949Q1601q5361o0668J02434
2567f7873Q3900o2116j2525M0129K0869K9992K5421p3655q6963j8619L7279K0919
2555f3242R3771l5720k7129J0147Q3335p617j7193K7216j38504P6641N7687o5914
2543f522p4506J00669k2094L0794J6706l9344L5910n6390j1122j9255K3137o908
$$ plain form
2627 62744 57678 -32309 -62109 -11138 30883 -10538 740 97868 100170 42907 -38073 22303
2615 22303 114114 105726 67614 59602 39631 59960 -37736 -24573 4937 17739 -71067 -119220
2603 -119220 -91232 -101616 -69226 -10326 -36357 -51554 46571 117921 103996 37471 11035 41082
2591 41082 -21970 -66256 24460 54509 7800 4778 24958 106023 -119307 -134676 -17540 -12800
2579 -12800 -25252 -50733 -15157 -32021 8142 -72414 -85930 -105879 -24278 -109639 -170307 -67873
2567 -67873 16027 -46089 -58614 -18485 2384 32376 57797 -15858 -102821 -121440 -84161 -63242
2555 -63242 30529 -5191 -32320 -22173 61162 53545 36352 63568 -74936 1705 59392 -6522
2543 -6522 -81028 19641 -2453 28341 45047 5703 41613 -14777 -25899 -45154 -22017 -28925
2531b8925m8036j4991M8604J1686K9318k1784m9434L1467l1884r1992P1350P6915
2519a7706Q061m0794M9392L8582r9339j4611N9329J04240l9817O546l3171m9552
2507b8840M4527n9570q2732k2301N6940o997J4748R2238l3596J318Q922R6444
2495H1101k1359j08358L629j6675O3481Q4266L1583o3088j1981k2401J2478p5811
2483d3135K598L2144k0043K3379J03057o0850n3310r450o0564j0898l3796J03532
2471b7336J36383l0677j22979j5799O0741K1017p6360n6907J0978M8719k9216
2460h1436N6941o1743R003l051l8626O2454l8956l2462j6095R3882Q4980p5070
2448d0179J24269m5045N738m4783j0097M6417J9467k3083n6890J8668J0705K8105
$$ plain form
2531 -28925 -76961 -91952 -43348 -31662 -2344 -24128 -73562 -42095 -73979 -165971 -94621 -17706
2519 -17706 -9645 -50439 -1047 37535 -61804 -76415 -17086 87154 47337 53883 20712 -28840
2507 -28840 15687 -43883 -126615 -148916 -91976 -98973 -84225 8013 -25583 -24265 -15343 81101
2495 81101 59742 -48616 -44987 -61662 1819 86085 117668 54580 42599 20198 32676 -43135
2483 -43135 -40537 -8393 -28436 -5057 98000 37150 -16160 -25610 -86174 -97072 -130868 -27336
2471 -27336 109047 78370 -44609 -60408 333 21350 -55010 -111917 -100939 -52220 -81436
2460 -81436 -24495 -86238 -77235 -80286 -118912 -56458 -95414 -127876 -143971 -50089 34891 -40179
2448 -40179 84090 39045 44783 0 -10097 36320 55787 32704 -24186 -5518 5187 33292
2436C3292Q1153q975K1862j7877j49441L2768j7166L8727j0211n1997O8202l546
2424A6791L1371j2142k3808o8188O6548N4291j02418r856N3333L9318k7646m085
2412A3509M9525q0074j3379P7162M105Q5999p0578j15871n0357Q6303J20110l6150
2400G0304j4294m3881q729j7022M5528J1090N0806O3759o8595n7001j6642K6107
2388D1430K8741o3522n6691M1083l3675Q3091O0416R121r4265M0522L0357P0862
2376A57470q2767O982J2393k7518M9798R7954p7622Q884J0776M549r0161p2979
2364b241l5345R5525N3425n5903P2187n0730j6451J2163Q1380m9068l1501n2767
2352B0674M1559L9767K8477P324L2703l7021n5360m2016L5128l8253m3645K8878
$$ plain form
2436 33292 114445 105470 127332 109455 -39986 -7218 -24384 14343 4132 -47865 20337 16791
2424 16791 48162 36020 12212 -55976 10572 64863 -37555 -47411 5922 45240 17594 13509
2412 13509 63034 -17040 -30419 46743 50848 136847 66269 -49602 -99959 -13656 106454 70304
2400 70304 56010 12129 3400 -13622 31906 42996 93802 157561 88966 31965 15323 41430
2388 41430 70171 6649 -50042 -8959 -42634 40457 100873 109994 15729 56251 86608 157470
2376 157470 74703 81685 94078 66560 116358 214312 136690 145574 156350 160899 70738 -2241
2364 -2241 -37586 57939 111364 55461 127648 76918 60467 72630 154010 104942 73441 20674
2352 20674 62233 102000 130477 137801 170504 133483 78123 36107 71235 32982 -10663 18215
2340A8215N9232J9391n323m0943J4239P1231R620p0662l1499L8362J9605m878
2328I6590K8210M6157n4085K316k5137k5684L6236k4420Q304K5865q4392L1660
2316F1620L1406Q915r769J2435M8645J3929m1753j8634r9337R985J8581k8761
2304G262j4352M0402L5760N4993j3507k2209L3239L9502K870n4981Q6145q7526
2292A07598l1418O8609l4043j0755j9595m1302m5788O6155o054j33227J70603
2281I0783M1189J2494J2870L75M2597m8058j13203O4164J3501r784q3033K1197
2269D5092R9355j9625j9805l6277Q4360N2399j803J6044k8397k5383P7472j08926
2257A34506j19870o1638R5062j950k4066J29157k3552J2489m3889Q854J05590
$$ plain form
2340 18215 77447 96838 91515 50572 64811 136042 145662 75000 43501 81863 101468 96590
2328 96590 124800 170957 116872 119188 94051 68367 104603 80183 88487 114352 29960 61620
2316 61620 93026 101941 92172 104607 153252 167181 125428 106794 7457 17442 36023 7262
2304 7262 -7090 33312 69072 124065 110558 88349 121588 161090 163960 108979 195124 107598
2292 107598 76180 144789 110746 99991 80396 39094 -6694 59461 53407 -79820 90783
2281 90783 131972 144466 157336 157711 200308 152250 39047 103211 116712 106928 23895 45092
2269 45092 144447 124822 105017 68740 153100 205499 203696 219740 191343 165960 243432 134506
2257 134506 14636 -47002 48060 46110 22044 151201 127649 140138 96249 105103 210693
2246B10693o88K1399n2311k3459L7243j0765o1382L3668J9124l3779L2934J9573
2234A92250R067m3217J8553K0305k5124r5325J01172M0270l77K9364k7040L6083
2222B55981r4655m3900O2097N6585Q634O0170j6279M5914j6077j3304k4662J22126
2210D02630n808j31542j8632P2665Q9382K6839k2542r1295k9159q613Q4705l2422
2198C36208L7386N2562p195K8104q516R7218k1837j22516J47990Q4474Q2755m7577
2186F59056r7948R6726K7800J07795n3651M1684R5817l7279l646l4470M7116o108
2174H42892M9150J4849o352O5870L3395R9170L9472m2602o8040j1811K1476O0601
2162A098070R6184j7674R3533m1813O4634N9447O89P562J28351P3108K6187K3476
$$ plain form
2246 210693 210005 231404 179093 155634 192877 182112 120730 154398 173522 139743 172677 192250
2234 192250 201317 158100 176653 196958 171834 76509 177681 217951 217574 246938 219898 255981
2222 255981 161326 117426 179523 236108 244742 304912 288633 334547 318470 305166 280504 402630
2210 402630 396822 265280 246648 319313 408695 435534 412992 321697 292538 283925 368630 336208
2198 336208 373594 426156 418961 447065 438549 535767 513930 391414 539404 623878 706633 659056
2186 659056 561108 657834 685634 793429 739778 781462 877279 840000 836354 801884 849000 842892
2174 842892 892042 906891 900539 966409 999804 1098974 1138446 1095844 1027804 1015993 1037469 1098070
2162 1098070 1194254 1176580 1270113 1228300 1292934 1352381 1353070 1360632 1488983 1562091 1588278 1611754
2150A611754J78276M0510l5581L9747J1195J18806P8790M5275J33734Q6822J97514
2139B506842J05922J9937P8499K702J44347R7548J84876K08192J54359J57058
2129C660282J16043K26668J85994K24514K02520K20170K85946M07368M17296M15588
2119F362389M61769O26402M80812L25654L98475O33962R10415J136461J279447
2110A2615786J708989K297754K735880L504431M725792O054200P568001N856419
2102D7067252l025730p925107q701643o546229l978057k827205j991045j557013
2094A0515223j247704r60660p06816p07317l15912j87369k63982m55276n34722
2085E135465n98142l78023l50305k76496k19431k08860k60290j13976j27210O1309
$$ plain form
2150 1611754 1790030 1830540 1794959 1834706 1845901 1964707 2043497 2088772 2222506 2309328 2506842
2139 2506842 2612764 2632701 2711200 2713902 2858249 2955797 3140673 3348865 3503224 3660282
2129 3660282 3776325 4002993 4188987 4413501 4616021 4836191 5122137 5529505 5946801 6362389
2119 6362389 6824158 7450560 7931372 8257026 8655501 9289463 10199878 11336339 12615786
2110 12615786 14324775 16622529 19358409 22862840 27588632 33642832 41210833 47067252
2102 47067252 44041522 36116415 27414772 20868543 16890486 14063281 12072236 10515223
2094 10515223 9267519 8306859 7600043 6892726 6576814 6389445 6125463 5670187 5135465
2085 5135465 4537323 4159300 3808995 3532499 3313068 3104208 2843918 2729942 2602732 2664041
2075B664041j19497k20997r1982Q9565l6972q4118r7342o9221j08403j53871j19805
2064A651398p1390m6427o5055j35302N7538k4791n8509p0118n5288M7973q4423
2053A145606m786K2869j8859j7796q5841L793q2128j9073n824k1112K4326k9731
2041I11444p0308M2106j19391L9834M2669m9491r9116L7966r7400M7443l0367
2030F55389n7657J9345j35718L9387L0697M8398K7088l9012m4374n6394o0307
2019D26842N5185p7857Q9045j15901K1527L9945j1796l8267k1710k0023k7240
2008C19750l0112l3254J06528j0423m498j7349q0900M8005J04077j32330m8682
1997B20812N8754Q2074N4807M3303q4396q2091p9579j2239J39543l5939n334q2744
$$ plain form
2075 2664041 2544544 2323547 2231565 2321130 2284158 2200040 2102698 2033477 1925074 1771203 1651398
2064 1651398 1580008 1533581 1468526 1333224 1390762 1365971 1307462 1237344 1182056 1230029 1145606
2053 1145606 1140820 1163689 1144830 1127034 1041193 1044986 962858 943785 937961 916849 941175 911444
2041 911444 841136 883242 763851 803685 846354 796863 697747 735713 638313 685756 655389
2030 655389 597732 617077 481359 520746 551443 599841 626929 587917 543543 487149 426842
2019 426842 482027 404170 493215 377314 398841 438786 426990 388723 367013 346990 319750
2008 319750 289638 256384 362912 352489 347991 330642 249742 297747 401824 269494 220812
1997 220812 279566 361640 416447 459750 375354 293263 213684 201445 340988 305049 299715 216971
1985B16971k1393L7571k0097n0294N85O0874j4558k2763l7760K532M6623l6720
1973A61571L9033p726M6443o2555m4765R6272j22706J567K6490K9546Q068o9273
1961A01965j0661N3808j2366r277L3761l6599k4619J6955J8171M8116K1420l9077
1949A61597M203K7335o6884M5563j5955l0871J8793P717l8469m4355j3432o617
1937D8625n1367L1570j7856m9632P4935r982L747P503j378l8726M160N2679J6529
1924G0807R20j6980l1455P2114J4709K5156m0806l0127J01008l1736M0426p9689
1912I4347j20261P9324k670P675o524O6935r1879J8626j4967J5389N7041M936
1900A07972K7741J6444p0040k4834N0917l2661j7408o2425m2385P3456L8317l4607
$$ plain form
1985 216971 195578 233149 213052 162758 163343 224217 209659 186896 149136 151668 198291 161571
1973 161571 200604 192878 239321 176766 132001 228273 105567 107134 133624 163170 171238 101965
1961 101965 91304 145112 132746 123469 157230 120631 96012 112967 131138 179254 200674 161597
1949 161597 165800 193135 126251 171814 155859 124988 143781 151498 113029 68674 55242 48625
1937 48625 -2742 28828 10972 -38660 36275 26293 30040 37543 36165 -2561 1599 54278 70807
1924 70807 71727 54747 23292 95406 110115 135271 94465 64338 165346 133610 174036 94347
1912 94347 -25914 53410 50740 58415 51891 118826 26947 45573 30606 45995 103036 107972
1900 107972 135713 152157 82117 57283 108200 75539 58131 -4294 -46679 26777 65094 30487
1888C0487m261p6540K5509O0893n2803N2657M623k3387M841k8689Q8512P3814
1876A55656p6336m1404J2474K3628l9151l8049j9465r682Q4453N6994o9656q576
1864C0886k3791k30091J49743K8537L1813P0717k5098M5918l4498r6661j4436
1853f6961j0593K7257L9959K4771Q9124j23914j4839K8027O0405M955k7807N3993
1841H4377M0534r0754L6969P6032K8604J7373M0848l2693q145P5914j35248j3454
1829A20357l2396l2196m6753j3205Q2902j5498J8480q103j0136o321q9612O7276
1817C4795K7799p9267l651j0578j8686J6084P667J1886M0126L8720O674n1338
1805B0231K2656J4412n1762k6709k2071L0474N7842M4314m4033m7707N0786j02305
$$ plain form
1888 30487 26226 -50314 -24805 36088 -16715 35942 40565 17178 22019 -6670 81842 155656
1876 155656 79320 37916 50390 74018 34867 -3182 -22647 -32329 52124 109118 39462 30886
1864 30886 7095 -222996 -73253 -44716 -12903 57814 32716 78634 44136 -52525 -66961
1853 -66961 -77554 -50297 -10338 14433 103557 -20357 -35196 -7169 53236 58191 30384 84377
1841 84377 124911 34157 71126 147158 175762 193135 233983 201290 193145 269059 133811 120357
1829 120357 87961 55765 9012 -4193 78709 63211 81691 73588 63452 57131 -32481 34795
1817 34795 62594 -16673 -20324 -30902 -49588 -33504 -25837 -13951 26175 64895 71569 20231
1805 20231 42887 57299 5537 -21172 -43243 -12769 45073 89387 45354 -2353 48433 -53872
1793e3872n6652N0738J04244o976q1685L6926K66l9569K9296K4010M5405N7522
1781A09653n6380m6508j4774L8034j4681K0126j38513k1347N6309K8334j3131
1770e2878q571J6175Q1216K5727q888o4366p7789P3213O2300m0515m5434O3589
1758B3779K8410L9638o6867k2519j0858j0490K2949j0736K2969P9952j37288j52483
1746a93544J83165l0023p3371j407N8729O5538k7014o3233Q4844n4465O8294N8441
1734G5954q2867L3201J4653l527j9331J18084l6377k0265j11326m5324O8340k7811
1722c6596L4786j8199k9869O8265M9861o3636N544l7605m1461l539J6640M9264
1710f545J20761o5709j78966m3311M5034J69665L9245m6048j4295L884q902Q4724
$$ plain form
1793 -53872 -110524 -59786 44458 37482 -44203 -7277 -7011 -46580 -17284 6726 52131 109653
1781 109653 53273 6765 -8009 30025 15344 35470 -103043 -124390 -68081 -39747 -52878
1770 -52878 -61449 -45274 35942 61669 52781 -11585 -89374 -16161 46139 5624 -39810 23779
1758 23779 52189 91827 24960 2441 -8417 -18907 4042 -6694 16275 96227 -41061 -193544
1746 -193544 -10379 -40402 -113773 -115180 -56451 9087 -17927 -81160 3684 -50781 17513 75954
1734 75954 -6913 26288 40941 37414 18083 136167 99790 79525 -31801 -77125 -8785 -36596
1722 -36596 -1810 -20009 -49878 18387 68248 4612 10156 -27449 -68910 -72449 -55809 -6545
1710 -6545 114216 48507 -130459 -173770 -128736 40929 80174 34126 19831 23715 14813 99537
1698I9537j3873n0247m3971N363J6714K8369p3689j799J37912o1489n4423j44606
1686a56202J030Q1093J7754j8609j3930J34078l3615J5773l9795j7563k5103j944
1674e7033k3478q474R3958j5467k6868N1438o350J318m0521N901O5628L1427j30206
1661e8727M206p0250N9161N4038M5887J0131k0005n4483M9215K8630j5043k9161
1649C599k9816j5284L223M942n0332n973J5340J8783J515j2209L6065R2393L8484
1636A00730j7114j17655O0362j8228L3736o4539O8389q9033m4779O2787k0571
1625d5915l9601N0608K7851N0345j27284P0910M3342j09482k7276M0798j55k7879
1613i3738M8783J5488k3017k04P0804n7255L753l3824j0743M5665L5373k0316
$$ plain form
1698 99537 85664 35417 -8554 -3191 13523 41892 -31797 -33596 104316 42827 -11596 -156202
1686 -156202 -155172 -74079 -56325 -74934 -88864 45214 11599 27372 -12423 -29986 -55089 -57033
1674 -57033 -80511 -88985 4973 -10494 -37362 14076 7726 9044 -31477 -25576 40052 71479 -58727
1661 -58727 -54521 -124771 -65610 -11572 34315 44446 24441 -30042 19173 47803 32760 3599
1649 3599 -26217 -41501 -38278 -33336 -83668 -89641 -74301 -55518 -54003 -66212 -30147 62246 100730
1636 100730 83616 -34039 26323 8095 41831 -22708 45681 -43352 -88131 -25344 -45915
1625 -45915 -85516 -34908 -7057 43288 -83996 -13086 30256 -79226 -106502 -65704 -65859 -93738
1613 -93738 -44955 -29467 -52484 -52688 18116 -39139 -35386 -69210 -79953 -34288 1085 -19231
1601a9231J19615j60318l5232P051l6036N9106R0291N3331j23993j8797K6561
1590c7652n83N9787L3944M5241j2283o6250k8107J2424n7038n592l801l1235L2264
1577e8881n6500P7610O8725N4553j49230K2607j566J08507K9342j8681j1452p2373
1565g339o543J03222m7746J486k658o8299L5747k2345k108n8140K8391O3422Q5519
1552A02609n9569p0010P2867o8408j0842k9420p734M8940Q0477M9817J1673k6588
1540I3812o1815L298m3920m6484K407k9862J60J51537j17984m9842r647N3946
1528e4394m5271J9822L5447N5742j5435n2682J05493K0528m8129j0208o2198L6194
1516a5091K8591j15107l6928R8087P8168r1393J6174O08K0173l079K816j78p3548
$$ plain form
1601 -19231 100384 -59934 -95166 -88115 -124151 -65045 25246 78577 -45416 -64213 -37652
1590 -37652 -38235 21552 55496 100737 88454 22204 -5903 6521 -50517 -56109 -59910 -91145 -58881
1577 -58881 -115381 -37771 30954 85507 -63723 -41116 -42682 65825 95167 76486 65034 -7339
1565 -7339 -13882 89340 41594 43080 40422 -27877 7870 -14475 -16583 -74723 -46332 17090 102609
1552 102609 43040 -26970 45897 -22511 -33353 -62773 -70507 -21567 58910 108727 120400 93812
1540 93812 31997 35295 -8625 -55109 -52702 -82564 -82404 69133 -48851 -98693 -108340 -54394
1528 -54394 -99665 -79843 -44396 11346 -4089 -56771 48722 69250 21121 10913 -51285 -15091
1516 -15091 13500 -101607 -138535 -40448 37720 -53673 -37499 -36891 -16718 -19797 -16981 -17159 -90707
1503i0707m8774N9279l7391m794M5900R3119J8324L0594J6910j04069L0101o0873
1491e2381q1967M0219J7053j516Q3838n8469J4848J3881P4782k2919m2438l3919
1479d8988J8296K8299k4047J13824q6161k9919N5924K7971l1156l9965l8620o71
1467e5213J6810J7465R5348k9266o6550P158N5178k3669o2724j7171K9123j1311
1455d4822J2549j8815k522J36056q1404r3206j406J57554K3060q2226K8171j16784
1443h3795R619L9952m0750n2983n5725l11J47639k6148j2178Q5283j7755O8237
1431F1085O950o4684l6253O8430o567m1284K5154J19605j5189l2582j3984m2444
1419B8237o1741O0279l251l4458O2628l8432J9805l9884k3066p1759P7910k5750
$$ plain form
1503 -90707 -139481 -80202 -117593 -122387 -76487 16632 34956 65550 82460 -21609 8492 -52381
1491 -52381 -134348 -94129 -77076 -78592 5246 -53223 -38375 -24494 50288 27369 -15069 -48988
1479 -48988 -30692 -2393 -26440 87384 1223 -28696 27228 55199 24043 -15922 -54542 -55213
1467 -55213 -38403 -20938 74410 45144 -21406 -14248 40930 17261 -45463 -62634 -33511 -44822
1455 -44822 -32273 -51088 -53610 82446 1042 -92164 -93570 63984 87044 4818 32989 -83795
1443 -83795 -74176 -34224 -74974 -127957 -183682 -183993 -36354 -62502 -74680 10603 -7152 61085
1431 61085 68035 3351 -32902 35528 28961 -12323 12831 132436 117247 84665 70681 28237
1419 28237 -33504 26775 23524 -10934 51694 13262 33067 -6817 -29883 -101642 -23732 -49482
1407d9482r702L8427l0825J0467L3091r2035r549K5185N9074N9805J4148l3120
1395A5484j8250K808M4536m3694M3547j8254m7081k0500L2116n846M198l4925
1383d5861l3224J9684P0207j3987j4594j5530j51878J31197J33624n1211r8465
1372g0038P8948M5661l4845K2962l6072p420L0977m3927Q1688p671K6205q3410
1360C058j04544j2571Q90m7345R0659m7575J7095j2475l6790M2566P0642Q0662
1348D4272o837j06444j9694J6269N5919l9597J45202J06425K2978j24510l4777
1337E9206l7874n0021K3830n1476O3931o3603J06089q0989q7308M0113J09419
1326C1317m229J192O3193r4973j228N638J1974o2658N5181M658l3499j21180J09774
$$ plain form
1407 -49482 -59184 -20757 -51582 -41115 -8024 -100059 -109608 -84423 -25349 34456 48604 15484
1395 15484 -2766 42 44578 884 44431 26177 -20904 -41404 -9288 -15134 -10936 -45861
1383 -45861 -79085 -59401 10806 -3181 -17775 -33305 -185183 -53986 79638 28427 -70038
1372 -70038 8910 54571 19726 42688 6616 -804 30173 -13754 67934 60263 86468 3058
1360 3058 -101486 -114057 -113167 -160512 -69853 -117428 -100333 -112808 -149598 -107032 -36390 44272
1348 44272 37435 -69009 -88703 -72434 -16515 -56112 89090 195515 218493 93983 59206
1337 59206 21332 -28689 -4859 -56335 7596 -56007 50082 -30907 -118215 -78102 31317
1326 31317 27088 28280 91473 -3500 -4728 910 12884 -49774 5407 10065 -23434 -144614 -34840
1313c4840J6554k6161K1356K2278J150k0590P1387k9470m1358k9538P6250m2399
1301a5381M787P3373k2857n9209o915R012q0002R210k4981n4042K3884M7233P6728
1288a9160N3833j6439n0827m4003M676K8429j8203Q3821p251n7916k8038Q0013
1276H935n9775k0409j7384P3643k1388Q0578j2568o6642k9696k314n4573m0289
1264a61882N3770J56759k0995m5403N1533L1344O089K558l0442k1585L7114p5137
1252a6277o0011j3126O5016K5838n8302J6792j00090M5939K8873m999K6935J19263
1240G5851l8389q2885R7311M2972m1174K6853l5936q7556P0901j5155J6702j6497
1228A2998o5193M2394J1247n5457J754L3788K0746J3389L866k7738M3961o4344
$$ plain form
1313 -34840 -18286 -44447 -23091 -813 337 -20253 51134 21664 -19694 -49232 27018 -15381
1301 -15381 -10594 62779 39922 -19287 -26202 -17190 -97192 -87982 -112963 -167005 -143121 -95888 -19160
1288 -19160 34673 18234 -32593 -76596 -71920 -43491 -61694 22127 14876 -43040 -71078 8935
1276 8935 -50840 -71249 -88633 -14990 -36378 44200 31632 -35010 -64706 -67020 -121593 -161882
1264 -161882 -108112 48647 27652 -17751 33782 65126 71215 73773 43331 21746 58860 -16277
1252 -16277 -76288 -89414 -24398 1440 -56862 -40070 -140160 -94221 -65348 -70347 -43412 75851
1240 75851 37462 -45423 51888 94860 53686 80539 44603 -42953 27948 12793 29495 12998
1228 12998 -52195 -9801 1446 -54011 -52257 -18469 2277 15666 19532 -8206 35755 -28589
1216b8589P956L5322J7186k5942P1381J3091m8991j25926p837K7632K2430J13440
1204G1153O322j04097q9215N8322j484r1141N2746j290k1737L0647P9033O2586
1192E1845k6040m4960m480j1011m120K8795j1447M0473k4361j2386j7057J5103
1180a9646J04081K4645n4044p7655J104j4817R6233j0645j36167m1993k9981o93
1168a59578Q4603m5638j2190R5367K1019j8524j4262k5160l5096M1702K2441N1649
1156F333K2437o3301M2233p455n6226J07149l7981l1124J9210k5586l5287Q5149
1144B5551N570j12458K823M9830L1242K6544l8364p9488N6633J16961L1347q9001
1132B7190r8724N8324K4637J2747l9892j24862N9455k1408M9988L9014Q1649o7160
$$ plain form
1216 -28589 -20633 14689 31875 5933 77314 90405 41414 -84512 -92349 -64717 -42287 71153
1204 71153 77475 -26622 -115837 -57515 -58999 -150140 -97394 -98684 -120421 -89774 -10741 51845
1192 51845 25805 -19155 -23635 -34646 -38766 -9971 -21418 19055 -5306 -17692 -34749 -19646
1180 -19646 84435 109080 55036 -22619 -21515 -36332 59901 49256 -86911 -128904 -158885 -159578
1168 -159578 -74975 -120613 -132803 -37436 -16417 -34941 -49203 -74363 -109459 -67757 -45316 6333
1156 6333 28770 -34531 7702 247 -55979 51170 13189 -17935 1275 -24311 -59598 25551
1144 25551 31121 -81337 -78514 -28684 2558 29102 -9262 -88750 -32117 84844 116191 27190
1132 27190 -71534 -13210 11427 24174 -15718 -140580 -81125 -102533 -52545 -13531 68118 958
1120I58M9765k571o7763M1781j7513m2117M9412l072o2547J4915m3464N6526K6816
1107A126M4446J349m4570j8884P416m5418n223J8971L4953J4728m2779M3866J0054
1094B0035k5234l0843k8042R715n8933Q8254R925m525J22813j7547o6933k2680
1082c995k8972j8375N0759j3246j11570Q5158J38737j29963p7016l280P2562M2252
1070C051l4460l4046P1580j8019K0439j3212j38904P8269K5312m9669N4135J8511
1058a7013q168o7260M2562O4884m4788P5675l8122L9074p1779Q6501J3226j28633
1046e3841j9378q908R1319N1654n7328P983l6305M2295j6056l0891M055L1174
1034E773M0352M2893j02551r8982J28099M1388p5143j43816Q4471J31697K1746
$$ plain form
1120 958 50723 48152 -19611 22170 4657 -37460 11952 8880 -53667 -38752 -82216 -25690 1126
1107 1126 45572 46921 2351 -16533 -9117 -54535 -59758 -40787 -5834 8894 -33885 9981 20035
1094 20035 -5199 -36042 -64084 -54369 -113302 -25048 -15123 -19648 103165 85618 18685 -3995
1082 -3995 -32967 -51342 -583 -13829 -125399 -40241 98496 -31467 -108483 -111763 -39201 3051
1070 3051 -31409 -65455 6125 -11894 8545 -4667 -143571 -65302 -39990 -89659 -35524 -17013
1058 -17013 -25181 -92441 -49879 15005 -29783 45892 7770 46844 -24935 61566 74792 -53841
1046 -53841 -73219 -82127 9192 60846 3518 11501 -24804 17491 1435 -29456 -25401 5773
1034 5773 46125 89018 -13533 -112515 15584 56972 -18171 -161987 -77516 54181 75927
1023G5927j2748m9629k5548l5224r725M2070j37762O2009P7727l5959K6878m7953
1011f9937J8187O8339J5209l3617k780q6518N7857J10290j12944m6451N0660K640
999b9065o507N9488K8248l5170K1477k4752L366L2966J8550o4373K0167k4827
987d32J3338J3603l6226M9989k0846L3389k2484j30296k4732k1983J16833J01212
975G1365o6596j2755R3397q856j19580L4204p3824J1917M293K9002l3996O1062
963a0367l2221m201O5907n659P1484q020n4804m2927k8002j05760j4285P6738
951i2117L1125k204q165j1548P607K8811N983o413N1142l4018k4952J27925P365
938H0541k0806k4370j04505K3676m7046K1969J03194M0212q0052P2192k6418m8473
$$ plain form
1023 75927 63179 13550 -11998 -47222 -56947 -14877 -152639 -90630 -12903 -48862 -21984 -69937
1011 -69937 -51750 16589 31798 -1819 -4599 -91117 -33260 77030 -35914 -82365 -31705 -29065
999 -29065 -35572 23916 52164 16994 38471 13719 17085 50051 68601 4228 24395 -432
987 -432 12906 26509 -9717 40272 19426 52815 30331 -99965 -124697 -146680 -29847 71365
975 71365 4769 -7986 85411 76555 -43025 -8821 -82645 -70728 -66435 -37433 -71429 -10367
963 -10367 -42588 -46789 19118 13459 84943 76923 22119 -20808 -48810 -154570 -168855 -92117
951 -92117 -60992 -63196 -71361 -82909 -75302 -46491 -40508 -46921 4221 -29797 -54749 73176 80541
938 80541 59735 35365 -69140 -45464 -92510 -70541 32653 72865 -7187 65005 38587 -9886
926i886o9794Q3694N1576m4141p0083j5316J80609k5125k4428Q01n6896r7808
914i6797n3779j819R8308J6249J4201J3339L8527P4732K1862n9704j01695K6571
902a0005o986o8757M8809Q9975M5178l1203o904q6330R0455q1521K5255o3558
890e5592N095K9700O6855L0353k7833j1398N1972k1355j15735m2028P4612K8546
878A3192m8906J2417M061J4589k4505p6620M7568L0205R6161n379l9271J26896
866A50408q0101k8901j04292N7423P4975K0008k6569m3348k7072O5909l5108M4496
854F7828j1465p2247n8103J05894p8906L8733M1842n6010M4734n1967O8742m0920
$$ plain form
926 -9886 -79680 4014 55590 11449 -58634 -73950 106659 81534 57106 57907 1011 -96797
914 -96797 -150576 -152395 -54087 -37838 -23637 -10298 28229 102961 124823 65119 -36576 -10005
902 -10005 -16991 -85748 -36939 53036 98214 67011 60107 -26223 64232 -17289 7966 -55592
890 -55592 -50497 -20797 46058 76411 48578 37180 89152 67797 -47938 -89966 -15354 13192
878 13192 -35714 -23297 -19236 -4647 -29152 -105772 -58204 -27999 68162 62783 23512 150408
866 150408 70307 41406 -62886 -5463 69512 89520 62951 19603 -7469 58440 23332 67828
854 67828 56363 -15884 -73987 31907 -46999 -8266 33576 -22434 22300 -29667 39075 -1845
$$ [...]
##END NTUPLES=NMR SPECTRUM
##END=
