##TITLE=1H_EC-3274(3)
 CDCl3
 8 sc, 
 30.06.2022
##JCAMPDX= 6.0         $$ Bruker NMR JCAMP-DX V2.0
##DATA TYPE= NMR SPECTRUM
##DATA CLASS= NTUPLES
##ORIGIN= UXNMR, Bruker Analytische Messtechnik GmbH
##OWNER= root
$$ XWIN-NMR		Version 3.5
$$ Thu Jun 30 13:57:33 2022 Russian Standard Time (UT+4h)  she@DPX200
##.OBSERVE FREQUENCY= 200.1313499994
##.OBSERVE NUCLEUS= ^1H
##.ACQUISITION MODE= SIMULTANEOUS
##.ACQUISITION SCHEME= undefined
##.AVERAGES= 8
##.DIGITISER RES= 18
##SPECTROMETER/DATA SYSTEM= spect
##.PULSE SEQUENCE= zg30
##.SOLVENT NAME= CDCl3
##.SHIFT REFERENCE= (INTERNAL, CDCl3, 0, 15.737)
##AUDIT TRAIL= $$ (NUMBER, WHEN, WHO, WHERE, WHAT)
$$ ##TITLE= Audit trail, XWIN-NMR		Version 3.5
$$ ##JCAMPDX= 5.01
$$ ##ORIGIN= Bruker BioSpin GmbH
$$ ##OWNER= she
$$ F:/spectra/data/she/nmr/H-F/1/pdata/1/auditp.txt
$$ ##AUDIT TRAIL=  $$ (NUMBER, WHEN, WHO, WHERE, WHAT)
(   1,<2022-06-30 13:56:17.18 +0400>,<she>,<DPX200>,
      <created by zg, POWCHK disabled, PULCHK disabled
       configuration hash MD5:
       00 E9 B6 7A A2 85 ED C7 34 08 36 98 17 FE 4E 26
       data hash MD5: 16K
       9E 3A 2D EA 57 0B 16 73 F7 9A 50 DE 54 5D CF BE>)
(   2,<2022-06-30 13:56:19.76 +0400>,<she>,<DPX200>,
      <Start of raw data processing
       efp BC_mod = 2 LB = 0.24 FT_mod = 6 PKNL = 1 PHC0 = -18225.49 PHC1 = 46.60069 SI = 16K 
       data hash MD5: 16K
       F4 1D 3B BD 91 AE 99 CF 7F 74 2C 67 D2 47 34 A2>)
(   3,<2022-06-30 13:56:43.70 +0400>,<she>,<DPX200>,
      <pk PHC0 = 184.8609 PHC1 = -35 
       data hash MD5: 16K
       AB F3 40 CD BF 36 EE 96 45 8C FC 22 4E FA 60 5B>)
(   4,<2022-06-30 13:56:47.06 +0400>,<she>,<DPX200>,
      <abs ABSG = 5 
       data hash MD5: 16K
       83 22 84 C9 92 50 6D F4 2D 96 C6 11 B8 8D 0F 69>)
$$ ##END=
$$ 
$$ hash MD5
$$ C5 66 82 06 CC 45 80 0E 72 74 15 44 1F EC D2 DC
##$RELAX= 
##$RELAX= 
##$RELAX= 
##$RELAX= 
##$RELAX= 
##$RELAX= 
$$ Bruker specific parameters
$$ --------------------------
##$DU= <F:/spectra>
##$EXPNO= 1
##$NAME= <H-F>
##$PROCNO= 1
##$TYPE= <nmr>
##$USER= <she>
##$AMP= (0..31)
100 100 100 100 100 100 100 100 100 100 100 100 100 100 100 100 100 100 
100 100 100 100 100 100 100 100 100 100 100 100 100 100 
##$AQSEQ= 0
##$AQ_mod= 1
##$AUNM= <au_zg>
##$AUTOPOS= <>
##$BF1= 200.13
##$BF2= 200.13
##$BF3= 200.13
##$BF4= 200.13
##$BF5= 200.13
##$BF6= 200.13
##$BF7= 200.13
##$BF8= 200.13
##$BYTORDA= 1
##$CFDGTYP= 0
##$CFRGTYP= 5
##$CHEMSTR= <none>
##$CNST= (0..31)
1 1 145 1 1 1 1 1 1 1 1 1 1 1 1 1 1 1 1 1 1 1 1 1 1 1 1 1 1 1 1 1 
##$CPDPRG= <>
##$CPDPRG1= <>
##$CPDPRG2= <>
##$CPDPRG3= <>
##$CPDPRG4= <mlev>
##$CPDPRG5= <mlev>
##$CPDPRG6= <mlev>
##$CPDPRG7= <mlev>
##$CPDPRG8= <mlev>
##$CPDPRGB= <>
##$CPDPRGT= <>
##$D= (0..31)
0 1.2 0 0 0 0 0 0 0 0.06 0 0.03 0 0 0 0 0.0002 0 0 0 0 0 0 0 0 0 0 0 0 
0 0 0 
##$DATE= 1656582976
##$DBL= (0..7)
120 120 120 120 120 120 120 120 
##$DBP= (0..7)
150 150 150 150 150 150 150 150 
##$DBP07= 0
##$DBPNAM0= <>
##$DBPNAM1= <>
##$DBPNAM2= <>
##$DBPNAM3= <>
##$DBPNAM4= <>
$$ [...]
##$SUBNAM2= <"">
##$SUBNAM3= <"">
##$SUBNAM4= <"">
##$SUBNAM5= <"">
##$SUBNAM6= <"">
##$SUBNAM7= <"">
##$SUBNAM8= <"">
##$SUBNAM9= <"">
##$SW= 18.0517283424941
##$SWIBOX= (0..15)
0 0 2 0 0 0 0 0 0 0 0 0 0 0 0 0 
##$SW_h= 3612.71676300578
##$TD= 16384
##$TD0= 1
##$TE= 0
##$TE2= 300
##$TE3= 300
##$TEG= 300
##$TL= (0..7)
0 120 120 120 120 120 120 120 
##$TP= (0..7)
150 150 150 150 150 150 150 150 
##$TP07= 0
##$TPNAME0= <>
##$TPNAME1= <>
##$TPNAME2= <>
##$TPNAME3= <>
##$TPNAME4= <>
##$TPNAME5= <>
##$TPNAME6= <>
##$TPNAME7= <>
##$TPOAL= (0..7)
0.5 0.5 0.5 0.5 0.5 0.5 0.5 0.5 
##$TPOFFS= (0..7)
0 0 0 0 0 0 0 0 
##$TUNHIN= 0
##$TUNHOUT= 0
##$TUNXOUT= 0
##$USERA1= <user>
##$USERA2= <user>
##$USERA3= <user>
##$USERA4= <user>
##$USERA5= <user>
##$V9= 5
##$VALIST= <valist>
##$VCLIST= <CCCCCCCCCCCCCCC>
##$VD= 0
##$VDLIST= <DDDDDDDDDDDDDDD>
##$VPLIST= <PPPPPPPPPPPPPPP>
##$VTLIST= <TTTTTTTTTTTTTTT>
##$WBST= 1024
##$WBSW= 4
##$XGAIN= (0..3)
0 0 0 0 
##$XL= 0
##$YL= 0
##$YMAX_a= 134828
##$YMIN_a= -304010
##$ZGOPTNS= <>
##$ZL1= 120
##$ZL2= 120
##$ZL3= 120
##$ZL4= 120
##$ABSF1= 15.78876
##$ABSF2= -2.263091
##$ABSG= 5
##$ABSL= 3
##$ALPHA= 0
##$AQORDER= 0
##$ASSFAC= 0
##$ASSFACI= 0
##$ASSFACX= 0
##$ASSWID= 0
##$AUNMP= <proc_1d>
##$AZFE= 0.1
##$AZFW= 0.1
##$BCFW= 0
##$BC_mod= 2
##$BYTORDP= 0
##$COROFFS= 0
##$CY= -3
##$DATMOD= 1
##$DC= 0
##$DFILT= <>
##$DTYPP= 0
##$F1P= 0
##$F2P= 0
##$FCOR= 1
##$FTSIZE= 16384
##$FT_mod= 6
##$GAMMA= 0
##$GB= 0
##$INTBC= 1
##$INTSCL= 0
##$ISEN= 128
##$LB= 0.24
##$LEV0= 0
##$LPBIN= 0
##$MAXI= 10000
##$MC2= 0
##$MEAN= 0
##$ME_mod= 0
##$MI= 1.114404
##$NCOEF= 0
##$NC_proc= -7
##$NLEV= 6
##$NOISF1= 3.799351
##$NOISF2= 2.8
##$NSP= 0
##$NTH_PI= 0
##$NZP= 0
##$OFFSET= 15.73697
##$PC= 1
##$PHC0= -18040.63
##$PHC1= 11.60069
##$PH_mod= 1
##$PKNL= yes
##$PPARMOD= 0
##$PSCAL= 0
##$PSIGN= 0
##$REVERSE= no
##$SF= 200.130006917505
##$SI= 16384
##$SIGF1= 3
##$SIGF2= 2
##$SINO= 5.538805
##$SIOLD= 16384
##$SREGLST= <1H.CDCl3>
##$SSB= 0
##$STSI= 16384
##$STSR= 0
##$SW_p= 3612.71676300578
##$SYMM= 0
##$S_DEV= 0
##$TDeff= 16384
##$TDoff= 0
##$TI= <>
##$TILT= no
##$TM1= 0
##$TM2= 0
##$TOPLEV= 0
##$USERP1= <user>
##$USERP2= <user>
##$USERP3= <user>
##$USERP4= <user>
##$USERP5= <user>
##$WDW= 1
##$XDIM= 16384
##$YMAX_p= 408945484
##$YMIN_p= -1225649
$$ End of Bruker specific parameters
$$ ---------------------------------
##NTUPLES= NMR SPECTRUM
##VAR_NAME=  FREQUENCY,     SPECTRUM/REAL,   SPECTRUM/IMAG
##SYMBOL=    X,             R,               I
##VAR_TYPE=  INDEPENDENT,   DEPENDENT,       DEPENDENT
##VAR_FORM=  AFFN,          ASDF,            ASDF
##VAR_DIM=   16384,         16384,           16384
##UNITS=     HZ,            ARBITRARY UNITS, ARBITRARY UNITS
##FACTOR=    0.220516191357247, 1,           1
##FIRST=     3149.43990451677, 0,            0
##LAST=      -463.276858489008, 0,           0
##MIN=       -463.276858489008, -1225649,    0
##MAX=       3149.43990451677, 408945484,    0
$$ Real data points
##PAGE= N=1
##DATA TABLE= (X++(R..R)), XYDATA
$$ [...]
8417C5548621J796437J769088J078477J668429K194366J816582J903665K276115
8409E0051780K526927K795264K471659L152095K126701K110452J833309K458249
8401F9526436L896754M797236N964818P454601P959965N399629N53947l766344
8393A01787042n248847m044573k543716k388384l811701m582635l368431k454454
8385G3344301l593320m269418l488523k569043j592736k101015j424323j837367
8377E2468556j847318q00506q37882O6724P55895N84836J682415J661885J141760
8368E4876365K363722L009574K762574K293938K602954J895344J881307K424130
8360G4109908K945138L836079M666655M916982N192625M541636J079041k899975
$$ y = [35548621, 37345058, 39114146, 40192623, 41861052, 44055418, 45872000, 47775665, 50051780, 52578707, 55373971, 57845630, 60997725, 63124426, 65234878, 67068187, 69526436, 73423190, 78220426, 84185244, 91639845, 99599810, 104999439, 105553386, 101787042, 96538195, 92493622, 89949906, 87561522, 83749821, 79167186, 75798755, 73344301, 69750981, 65481563, 61993040, 59423997, 57831261, 55730246, 54305923, 52468556, 50621238, 49820732, 48982850, 49049574, 49805469, 50390305, 52072720, 53734605, 54876365, 57240087, 60249661, 63012235, 65306173, 67909127, 69804471, 71685778, 74109908, 77055046, 80891125, 85557780, 90474762, 95667387, 100209023, 101288064, 98388089]
8352I8388089n994251n571587m744159m173906m023777m320241n127396m207232
8344F0225540k941074q73804M400O32002J857316K396007K615914J738630o66883
8335F4988048k870785m018497m696477m457899l286627j958193j202137n30687
8327D1966746r0206L9483m23084j526241k476582j622819j183050p62301j094072
8318C2827874q99179o12945n68298Q3206J50982l30955m494L41845L41799O76554
8308C2006389R34307J391154J267781J216691L26284R57638J847390K037400J934992
8299D3920026L31412N57361N00002q32656r91444k541525l681821l008904k706766
8290C1545685j382194n50626q77809j202397r31264r75977j201369r39597k90058
$$ y = [98388089, 92393838, 86822251, 82078092, 77904186, 73880409, 69560168, 64432772, 60225540, 57284466, 56410662, 56415062, 57047064, 58904380, 61300387, 63916301, 65654931, 64988048, 62117263, 58098766, 53402289, 48944390, 45657763, 43699570, 42497433, 41966746, 41876540, 41916023, 41492939, 39966698, 37490116, 35867297, 34684247, 33921946, 32827874, 31928695, 31315750, 30747452, 30830658, 30981640, 30650685, 30646191, 30988036, 31329835, 32006389, 32940696, 34331850, 35599631, 36816322, 37142606, 38100244, 39947634, 41985034, 43920026, 44251438, 44808799, 45308801, 44476145, 43484701, 40943176, 37261355, 34252451, 31545685, 30163491, 29612865, 28735056, 27532659, 26601395, 25625418, 24424049, 23484452, 23194394]
8281B3194394n63781o82867p14758p72075p76277p69715r6043M85236o2107N46134
8271A9788141M13872j9458L50927N33992j17005j49485O8022O68540O54883N36168
8261B2728597J009569P51817N27465m68558j521396k014292j066375j091245m82853
8252A8372729N3888m9619p4746K11520J53953M47306P40091Q80845J866209J245117
8242B3847293J354350K487538K639325K640162J810326p19890j927924k287736
8234B9843444k304367k184228j659765k82400l62469L77125P62025j0894m04347
8225B3774124j109064j608616r94648p06256q9782k08945R334m241L49794R44788
8215B0356488R61696M98175Q08995J398120K000938K463755J201424R95671J92571
$$ y = [23194394, 22630613, 21947746, 21232988, 20460913, 19684636, 18914921, 18818878, 19304114, 19242007, 19788141, 20202013, 20182555, 20533482, 21067474, 20950469, 20800984, 20869006, 21537546, 22192429, 22728597, 23738166, 24489983, 25017448, 24548890, 23027494, 21013202, 19946827, 18855582, 18372729, 18426617, 18376998, 18302252, 18513772, 18667725, 19115031, 19855122, 20735967, 22602176, 23847293, 25201643, 27689181, 30328506, 32968668, 34778994, 34059104, 32131180, 29843444, 27539077, 25354849, 23695084, 23412684, 23050215, 23427340, 24189365, 24178471, 23774124, 22665060, 21056444, 20061796, 19355540, 19265758, 19056813, 19066147, 19061906, 19411700, 20356488, 21318184, 21816359, 22625354, 24023474, 26024412, 28488167, 29689591, 30685262, 30877833]
8206C0877833Q3049J483166K363403L115726M656361M763675O163262P471716
8198F0978191O145500J788155m521030p940511q814435p132222n827416m757666
8190B9918566k908122j179472k62521r00446l08170p144l90837j099865j587468
8181B1274521j323092j344828r68588m34733o76924n39858l84929L18320l39718
8172A5580171M0503L01802p92242j87122M20099K71162N4902O46030P18017L27523
8162A7380845P35809O78518K86321P95578J339541J629198Q66991N21549J005266
8153B5239616K94148M30558K079387K375157L844846M475131N777123P214078
8145E1730044O952567O526931L279087l000716q020330q517602p132951n588806
$$ y = [30877833, 30960882, 32444048, 34807451, 37923177, 42579538, 47343213, 53506475, 60978191, 67123691, 68911846, 64390816, 56450305, 47635870, 40503648, 34676232, 29918566, 27010444, 25830972, 25568451, 24668005, 24359835, 24352691, 23961854, 22861989, 21274521, 19951429, 18606601, 17638013, 17203280, 16526356, 15986498, 15601569, 15919889, 15580171, 15620674, 15922476, 15130234, 14943112, 15363211, 15634373, 15689275, 16335305, 17053322, 17380845, 18116654, 18795172, 19081493, 19877071, 21216612, 22845810, 23712801, 24234350, 25239616, 25533764, 25964322, 28043709, 30418866, 34263712, 38738843, 44515966, 51730044, 58682611, 65209542, 68488629, 65487913, 57467583, 48949981, 41817030, 36228224]
8137C6228224l774255j733239j073676p39992J46483L42542q00026k196696k759092
8128B3640273k030107k239510r74766q90689j454191r9380L1929j70906r4252
8119A5718401m4077N68095P71250O98316J840518J177106L7203q5087p04816p86244
8109A9190665P00400N28977J706397K420020K218544J695993J238912J11436j930549
8100B7880795m088666m168872k840595j994791j230599j295864j044318n86237
8092A0630853q52960n83962L62347j19942n49930o97746j260458m07776p141l93158
8082F120127K92656J36496o41213m96269o65880k07517L67492n58798L04061l00673
8072D350482l12503k24053l64607m66066J66018K00571L9874Q7182l94K72729
$$ y = [36228224, 32453969, 30720730, 29647054, 28907062, 29053545, 29396087, 28596061, 26399365, 23640273, 21610166, 19370656, 18395890, 17505201, 16051010, 15951630, 15983559, 15812653, 15718401, 15674324, 16242419, 17013669, 17711985, 19552503, 20729609, 20766812, 20681725, 19976909, 19190665, 19891065, 20420042, 22126439, 24546459, 26765003, 28460996, 29699908, 29811344, 27880795, 23792129, 19623257, 16782662, 14787871, 13557272, 12261408, 11217090, 10630853, 9777893, 9193931, 9556278, 9436336, 8886406, 8188660, 6928202, 6520426, 6513285, 6120127, 6412783, 6549279, 5908066, 5411797, 4745917, 4538400, 4905892, 4347094, 4651155, 4350482, 4037979, 3813926, 3449319, 2983253, 3149271, 3349842, 3389716, 3476898, 3476504, 3749233]
8062C749233j84610l26680K2124k9389l77715O1598J07673o25291k04076j5364
8052B177503k81995k21297M62380K11759N8482L88165o97501L65781m82577N5063
8042B035763R63089n71434j79656K96267p67232O08058Q1840k15945o2260n60575
8032A627915K2781k1069K13023p9475j07784J80970k69834L80379j06880J06959
8022A946985K04247n32569j54754K58404k05363J43157J83322m6365l67943k14629
8012A214492P0696k85944O74858K23221k13081m67143L90384r6483L21379p09036
8002A123343p8077O55586m73376j08560J9386k10512N59994R0764n51762j68971
7992H57815j95050J3668P26553J6784k09381O70587l28964l35762J35668k39253
$$ y = [3749233, 3564623, 3237943, 3260067, 3230678, 2852963, 2914561, 3022234, 2396943, 2192867, 2177503, 1895508, 1674211, 2136591, 2348350, 2406832, 2794997, 2097496, 2463277, 1980700, 2035763, 2998852, 2427418, 2247762, 2544029, 1776797, 2384855, 2466695, 2250750, 2188490, 1627915, 1650696, 1629627, 1842650, 1763175, 1655391, 1836361, 1566527, 1946906, 1840026, 1946985, 2151232, 1618663, 1463909, 1722313, 1516950, 1660107, 1843429, 1797064, 1429121, 1214492, 1285188, 999244, 1674102, 1897323, 1684242, 1217099, 1607483, 1511000, 1832379, 1123343, 1045266, 1700852, 1227476, 1118916, 1138302, 927790, 1487784, 1578548, 1026786, 857815, 662765, 676433, 1402986, 1419770, 1210389, 1880976, 1552012, 1216250, 1351918, 1112665]
7982A112665Q9487R7574k47294J21101k87302r1411J75392M0439N16879J58355
7972A685885n71771k53675k62475J3322j78470L26720K12975l46905L17973m0076
7962I03503k86329J57663o69q01147N37425J11616l6794J92614J90047K22362
7952A190291j87403q26352N51089r4428m76778K25231L2166q9098L00153L39219
7942I64090k55206j60022j552J19445j25476j57367J26893j242k32171K93021
7932E70413l51000J76926L56173m06911J86861L64623l33996k07418j27664O90154
7922I18161q4306k54129j78081k02542n45171N18309O14921l50571l82579M61311
7912E15323j25483p28292M90831M55488k06507K31845j09844P4163r3203m75791
$$ y = [1112665, 1202152, 1299726, 1052432, 1173533, 886231, 794820, 970212, 1010651, 1527530, 1685885, 1114114, 860439, 597964, 611286, 432816, 759536, 972511, 625606, 943579, 903503, 617174, 774837, 774168, -26979, 510446, 622062, 585268, 777882, 967929, 1190291, 1002888, 176536, 727625, 633197, 156419, 381650, 413816, 324718, 624871, 964090, 708884, 548862, 547310, 666755, 541279, 383912, 510805, 509563, 277392, 570413, 219413, 396339, 752512, 345601, 532462, 897085, 563089, 355671, 228007, 918161, 833855, 579726, 401645, 199103, -346068, 172241, 787162, 436591, 54012, 515323, 389840, -338452, 152379, 607867, 401360, 633205, 523361, 597524, 504321, 28530]
7902B8530Q2520M25964l27927N90130p1680j62961m0403m0153l14361k37342J40335
7891G2652j93656O10955k07210M79k18106P9705l9222J25289L70182j43117m80388
7880b2437L33690j25251j17792N34114L37122k08285n20594k68474P2430l0859
7870a6336L61510J59449L5013m99837L22556L27131l13535k05174J13488K23281
7860E07546J06661l36408j53396L38091q3773k5569r32743L59880L82095l38971
7850a76587j03902J72887L37048L52737k14943l3155n05915M47861M31917R3714
7840H01662l02351n51205j3479J39236l64189M70797M07667J36550R4588p48952
7830G0324j35677j15880K00818j26229J25494N22981r6349k82154J09329j81672
$$ y = [28530, 111050, 537014, 209087, 799217, 727537, 564576, 524173, 484020, 169659, -67683, 72652, -121004, 489951, 282741, 283220, 65114, 144819, 105597, 230886, 601068, 457951, -22437, 311253, 186002, 68210, 602324, 939446, 731161, 210567, -57907, 14523, -16336, 345174, 504623, 539636, 39799, 362355, 689486, 375951, 170777, 284265, 507546, 614207, 277799, 124403, 462494, 378721, 353152, -579591, -219711, 162384, -176587, -280489, -107602, 229446, 582183, 367240, 334085, -171830, 276031, 707948, 801662, 499311, -51894, -65373, 73863, -290326, 180471, 588138, 724688, 819276, 70324, -65353, -181233, 19585, -106644, 18850, 541831, 445482, 163328, 272657, 90985]
7820I0985j70774J58965J03375k64649j0433J3135L4123l04337L73218L25395
7810C49003l51168K9082K81962m12677l497L55213L9864l91343j92048J13379
7800a82230N5816j7223K3539J0025M43009J91497K13087o7832k92636l87121P437
7789b632J3232J86598J24570l75455K86810l2388p9946k30597j78673j87725J11615
7778c64591L32386m32557J98201M57911k17059l23469L25057k60447N30778K14170
7768D60380l92597k19161m89176K04931L51475J34811K93529j18791j89156k51892
7758b15647l43008M45760j32941P4198L24479k22345k2774N3680k95463q5626
7748d19687P33824K57172o8920m47638n96459K97321J69700K60927Q0460R5291
$$ y = [90985, -79789, 79176, 182551, -82098, -92531, -79396, -45273, -349610, 23608, 349003, -2165, 26917, 308879, -103798, -107295, 247918, 287782, -103561, -295609, -182230, -126414, -143637, -120098, -110073, 332936, 524433, 737520, 669688, 377052, -10069, -2632, 10600, 197198, 321768, -53687, 233123, 200735, 120789, -109808, -288481, -476206, -364591, -32205, -464762, -266561, 191350, -25709, -349178, -24121, -284568, 246210, 460380, 67783, -151378, -640554, -435623, -84148, 50663, 344192, 225401, 36245, -215647, -558655, -112895, -245836, -171638, 152841, -69504, -92278, -38598, -334061, -419687, 314137, 571309, 502389, 54751, -541708, -244387, -74687, 186240, 266700, 361991]
7738C61991j273468j69711P25665K18410L32322N2407j63383j51293m90573n8083
7728f15716M44161j36792j95993L09988j68011q0089M20235J62884k66411m3779
7718a69523l14830J66766j88354n4441J82142k26897N64062l2288k21295k92190
7708e86848K04800k4589N50644J67411j48188j32749l22261J6204k15899M0066
7698d51409J9466M12572k06374J76698k27141j33866J48494M5865L74414n77116
7688d18397l6167M22263K65319k11835k90906M2027p9256L37734J06603l24868
7678a87483j2376M34193L78913n56601l13612N74859o45205k61910K03850K23813
7668a61559n2469j51720N98527l10317o76946M55212L98823l66756N4487K64778
$$ y = [361991, -911477, -1081188, -355523, -137113, 195209, 247616, 84233, -67060, -557633, -615716, -171555, -308347, -504340, -194352, -362363, -442452, -22217, 140667, -125744, -169523, -484353, -317587, -505941, -560382, -378240, -605137, -41075, -73363, -294658, -586848, -382048, -406637, 144007, 311418, 163230, 30481, -291780, -275576, -491475, -451409, -431943, -19371, -225745, -49047, -276188, -410054, -261560, -215695, 158719, -418397, -454564, -32301, 233018, 21183, -269723, -227696, -306952, 30782, 137385, -187483, -199859, 234334, 613247, 56646, -256966, 317893, -327312, -589222, -385372, -161559, -214028, -365748, 232779, -77538, -754484, -299272, 99551, -267205, -212718, 52060]
7658E2060j36504m74821K71307j9522p2163M27088L67388j40986k04258j30697
7648f1108l8399j24127L76106M82015m15966J9807k59742n12341j31413L18875
7638c46293J84387J34446N6985l2189J04007O60179m88284m65037r6561M0947
7628b47413M96801o67305Q5383N35388l70490j1790J90735o2697n58784J34100
7618d76072J48436k95995L61218M03400M8785l24619j09828J10202Q2094q51407
7608i03786M54551j05645n6192K87207K26810N441M60306j00124m421p81303l7598
7597e54754P09116m59873J4261k84781L58783k62540K97425K02592l91076K40639
7587a30208K04951k32713k33851j55253K39359K92032J13460l97182L19844j81716
$$ y = [52060, -84444, -559265, -287958, -307480, -379643, 47445, 414833, 273847, 69589, -61108, -99507, -223634, 152472, 634487, 218521, 238328, -21414, -533755, -665168, -346293, -161906, -27460, 29525, -2664, 101343, 761522, 273238, -191799, -288360, -247413, 249388, -417917, -332534, 202854, -167636, -179426, 11309, -51388, -610172, -476072, -327636, -623631, -262413, 140987, 189772, -134847, -244675, -134473, -52379, -903786, -449235, -554880, -611072, -323865, -97055, -91614, 368692, 268568, 264147, -517156, -554754, 154362, -305511, -291250, -576031, -217248, -479788, -182363, 20229, -370847, -130208, 74743, -157970, -391821, -547074, -307715, -15683, 97777, -299405, 20439, -161277]
7577a61277k04127L17888k12739J51258L5020o6390m5737K56343o772Q9749K94367
7566D47583p21513l31649L91150M8836m2094j6637L91918k06021k70032k93340
7556f01799R1631L39865M86441q0180k75272l28856R362K84195q4427J56739p8506
7545h0807J17905J45159j30515R0378J48059l64438K60681n24122k66164N21751
7535h2113j78875j4529P9307k68096K89950k10340n50359L9786J069183K67859
7525D41773k41561m67079M6266K44450m10701N61547J47919j12394k19619j46887
7515a56286o4281n68744K69496P44956k95859k85399m9611J45017k97272J49336
7505d08647O12814J46973j80028k01307j59040k41200N03934j97568m37643N95224
$$ y = [-161277, -365404, -47516, -260255, -108997, -73977, -140367, -186104, 70239, 63467, 153216, 447583, -273930, -605579, -214429, -165593, -207687, -224324, 167594, -38427, -308459, -601799, -510168, -170303, 316138, 235958, -39314, -368170, -358808, -74613, -159040, -2301, -80807, 37098, 182257, 51742, 142120, 290179, -74259, 186422, -337700, -603864, -82113, -260988, -275517, -196210, -464306, -174356, -384696, -935055, -895269, 173914, 441773, 200212, -266867, -220601, 23849, -386852, 174695, 322614, 210220, -9399, -156286, -220567, -789311, -519815, 225141, -70718, -356117, -405728, -260711, -557983, -408647, 204167, 351140, 171112, -30195, -189235, -430435, 73499, -124069, -561712, 33512]
7495C3512K3437l54604j44924J64187L19411l47674P5687N0018j34309r787J34794
7484a90252L74004k07510l47741J04046j75623M18583Q207M88673K26930m40701
7474B58616k26713O0238j85591j20215k20110L16182Q41002o79542R8298n06484
7464c64319J21156J60128O06021L65669n01250j30817p8186k9741m9650J30772
7454B29783J54522O61869m01608j069221L81289O1917j16450N7922J31171l43833
7444b52639J44346M14086j0885m75052J65255M02914n1478n97386j40349N37703
7434A36515n15897K24883K10033j52315K93325j28731k63702m64349K01225O05053
7424A46040L2606j58091l6512J11140j56706r9496k33982L85095J39032Q2568
$$ y = [33512, 56949, -297655, -442579, -278392, 41019, -306655, -230968, -180950, -315259, -325046, -190252, 183752, -23758, -371499, -267453, -443076, -24493, -16286, 472387, 699317, 258616, 31903, 92141, -93450, -213665, -433775, -117593, 723409, 43867, 142165, -364319, -243163, -83035, 522986, 888655, 387405, 256588, 178402, 148661, 99011, 229783, 384305, 1046174, 644566, -424655, -43366, 18551, -97899, -39977, 91194, -252639, -108293, 305793, 294908, -180144, -14889, 388025, 336547, -260839, -401188, 136515, -379382, -154499, 55534, -96781, 196544, 67813, -195889, -660238, -459013, 146040, 178646, 20555, -15957, 95183, -61523, -161019, -395001, -9906, 129126, 211694]
7414B11694j44859j98004n56451J5961M25718P59292k14927l85410Q6640N657
7404E311l21512J55392L81002n52328m16906K68691L44988K67588k30252M58588
7394C60562O9306l46326l81479M451N95067J40693k19907j12139P0465m32510
7384b51817j09179N8289L65772j39128j05360j41137j03663J72504O35899L95568
7374G77748j98086k60196K2222P8602L1135K14074M1811N35025N0539M27813M6387
7363A767074n4622N2593l44952j18824P5331j08538n3244K8807n94190J6856j67235
7352D99056J7792j88477M6870p0514j13886j15210K32283o4773J88880m9550l02398
7341H0073k25210Q7024J64633P7076k77187o0633J17712m17769J52529K20789
$$ y = [211694, 66835, -131169, -687620, -671659, -245941, 513351, 298424, -86986, -346, 5311, -316201, -160809, 220193, -332135, -749041, -480350, -135362, 132226, -98026, 360562, 429868, 83542, -297937, -293486, 301581, 442274, 222367, 110228, 180693, -251817, -360996, -302707, 63065, -76063, -181423, -322560, -426223, -253719, 382180, 777748, 579662, 319466, 341688, 420290, 451425, 665499, 707310, 1242335, 1292874, 1720687, 1767074, 1712452, 1765045, 1420093, 1301269, 1376600, 1268062, 1214818, 1243625, 649435, 666291, 499056, 516848, 328371, 375241, 304727, 190841, 75631, 307914, 243141, 432021, 382471, 80073, -145137, -58113, 106520, 183596, -93591, -154224, -36512, -454281, -301752, -80963]
7331h0963J21504N4010R4762l13292J85373M9883l45722m10988K70132M03333
7321B8032k20653l2661J26632q7169L25503N0289l16926R4987m58072O6747m4689
7310d67980k1190L00074J66702K9833n26922N21739j45916j80595J64495Q3462
7300g6298R7569k70478J47794J35140L04952j76097j06317k93399p970n0265J74343
7289a21026J27368K82972k35587k13978j47194J27341M0528m23871M03181J2720
7279a47546J87835K79432k08316Q4527j08683j92568J56611l2815k86257M8099
7269b19681n06535Q42179l3915Q649j44916m33937K01996k14129m2486O14636
7259G1861L98019k92651J12013k69069m57126k70284R25991l07153k98041K52241
$$ y = [-80963, 40541, 94551, 189313, -123979, 61394, 111277, -234445, -645433, -375301, 28032, -192621, -225282, -98650, -185819, 139684, 189973, -126953, -31966, -490038, -423291, -467980, -489170, -189096, -22394, 7439, -519483, 2256, -143660, -324255, -159760, -76298, 21271, -249207, -101413, 33727, 338679, 162582, 56265, -237134, -245104, -295369, -121026, 6342, 289314, 53727, -160251, -307445, -180104, -139576, -563447, -160266, -147546, 40289, 319721, 111405, 195932, 87249, -105319, 51292, 18477, -267780, -219681, -726216, 115963, 82048, 90697, -54219, -488156, -286160, -500289, -542775, 71861, 469880, 177229, 289242, 20173, -436953, -707237, 218754, -88399, -386440, -134199]
7249a34199L88311j92413n01J5240p65j71727l8702K99779k97788R5980K75230
7238B38445p34139k51248L84941K54579M28403j27034l44261J25581k45339p0100
7228c40172K17602m03347M26944K56884k61812R3090n01445N23215J27201q2095
7218E6065N6982k20693q196N7724M0980o5716m54648O97837K50076p93345J73583
7207b09351l9120m5396M25575l10768M91310o3479l85228L24084k94164j7574
7197a24111L03393J07382j23581k42328k54803l84972P60736K82178j37791l1254
7187A54849j62372l53966j6945K64084n6843M76358k83008j42377L0711j66890
7177b56399q4863K78504J845K40905q6787o92970K88695l85242M29373O06827
$$ y = [-134199, 254112, 61699, 61198, 76438, 75673, -96054, -134756, 165023, -132765, -36785, 238445, -495694, -746942, -362001, -107422, 320981, 193947, -150314, -24733, -270072, -340172, -122570, -525917, -98973, 157911, -103901, -10811, -512256, 10959, 138160, 56065, 113047, -107646, -115842, -58118, -17138, -82854, -537502, 160335, 410411, -382934, -209351, -248471, -293867, 131708, -179060, 312250, 248771, -136457, 187627, -106537, -124111, 179282, 286664, 163083, -79245, -334048, -719020, 41716, 323894, 186103, 154849, -7523, -361489, -378434, -114350, -171193, 305165, 22157, -120220, -89509, -256399, -341262, -62758, -60913, 179992, 93205, -599765, -311070, -696312, -266939, 339888]
7167C39888n4406m82113o8875K65090k22509N74439M2639l54337n8055K34209
7157B15970j10825j56470j88643K75473m18345L24335M1381k6760j08881j31229
7147b83994M83248K60882j98924Q825n58520k61853K53328l2247L09225J94678
7137A74648n96334j53064P33107p6693k85938p4962p4575K41661L15802K87038
7127D90690j33130r7362j03517k24756l96400M42770L05676k73669k21737K12991
7117A556r4864j29511N16316K9840k93483p7314J94002k75375m580J23015k04168
7106b14566M08793J92392j34945q5151l52085J17737N9185J81735M8003K1263
7096B42361j73850k58391M36359m01301k30557N85928m38222K77719M16809m08576
$$ y = [339888, 285482, -196631, -265506, -416, -222925, 351514, 394153, 39816, -18239, 215970, 105145, -51325, -239968, 35505, -382840, -58505, -17124, -43884, -152765, -283994, 199254, 460136, 261212, 270037, -288483, -550336, -297008, -329255, -20030, 174648, -421686, -574750, 158357, 81664, -204274, -279236, -353811, -112150, 203652, 490690, 357560, 260198, 156681, -68075, -464475, -21705, 283971, 10302, -211435, 1556, -93308, -222819, 293497, 323337, 29854, -47460, 146542, -128833, -133413, -10398, -214566, 194227, 386619, 251674, 166523, -185562, -67825, -8640, 173095, 221098, 242361, 68511, -189880, 246479, -154822, -385379, 200549, -237673, 40046, 456855, 48279]
7086D8279N1014Q520J76332k28879j83884J06331k70360k6519L00474O1867O2990
7075A06165j52186R6746R4084m3349r1135M01821J57900j09753k89673l10571
7065a39951K96743M55608j64272m55550M34989j06702l29991l8896J24283N44439
7055F20700K31224k05938k99713K19977O95805M35119N92812j4866J68589J42659
7045B586368k15192m43818n34810L41830m94837q01586M58709J3025l04487j42743
7035D62459r2415k04547m38373k94953O19149J06809q8925k5717n1888N7454K94795
7024C43848N03553n58530j10780j47454l44256L12343K53453L1273P4604j50606
7014B07448n39105j30653k16271N73324k04353K74301n4168l91872j21767J94225
$$ y = [48279, 99293, 107813, 284145, 55266, -128618, -22287, -292647, -319166, -18692, 43175, 106165, -46021, 50725, 144809, 101460, 10325, 412146, 570046, 460293, 170620, -139951, 156792, 612400, 448128, -7422, 427567, 320865, -9126, -48022, 76261, 620700, 851924, 645986, 346273, 566250, 1262055, 1697174, 2289986, 2275120, 2443709, 2586368, 2371176, 1927358, 1392548, 1734378, 1239541, 437955, 896664, 909689, 605202, 462459, 370044, 165497, -272876, -567829, 51320, 158129, 69204, 43487, -8401, 49053, 343848, 847401, 288871, 178091, 30637, -313619, -1276, 252177, 283450, 358054, 207448, -331657, -462310, -678581, -105257, -309610, -35309, -89477, -481349, -603116, -408891]
7004d08891Q3731k8264J904K60734J29050j45560L61902p3755j37048m20522l23626
6993g00345K74731j9278J2478L91558l83356p07814O32233O32149l31046q9101
6983b87791j3405L52035j90632l60728M37164O1269P7488L13634k50206n03358
6973c64530M15132K5267k24362p6738k6514K43498o29951M7512L78460Q4919N15810
6962C88503k31447n61022j42460M42529J67545j49888k34648j17J19220k01628
6952d03413l48628M29007J01078O54235J58951n55946k37371p02186M69837J62033
6942b72403R0435n7024N25388m14557j74406k7179O9793N8327j04666J26476K82701
6931A02885k76865J00901M7540R6650j21237K50114L22943l09562j79487l23978
$$ y = [-408891, -325160, -353424, -351520, -90786, 38264, -107296, 254606, 180851, 43803, -376719, -700345, -425614, -444892, -432414, -40856, -424212, -1132026, -499793, 132356, -198690, -287791, -301196, 50839, -139793, -500521, -63357, -2088, 75400, 389034, 138828, -364530, 50602, 75869, -148493, -225231, -251745, -8247, -638198, -590686, -212226, -127307, 388503, 157056, -403966, -546426, -103897, 63648, -86240, -320888, -321005, -201785, -403413, -752041, -323034, -221956, 432279, 591230, 35284, -202087, -904273, -434436, -272403, -181968, -238992, 286396, -128161, -302567, -329746, -259953, -201626, -306292, -179816, 102885, -173980, -73079, -25539, 71111, -50126, 199988, 522931, 213369, 33882, -290096]
6921b90096k0238K78273l75211J25381M76741J39949n97959j29381J51683J98663
6911d2195j68874M40118k66539m96044L06710K08818N6561J6362J10628l6910
6901A28635l76747l39936O51621Q6535j75438p8493R2024K40235l13918l55235
6891d40717O94385m66647L90597O7947l58733K2185m6254O66058K19971n44773
6881B04019P9630N8804m86682j84644L13178M08657P9490l07829o08092J50169
6871b93300Q0908l52140J002797P4216O884l5942q1944p8556L2521q8853j94616
6860G1975k87190m26870M13362K73319N0897L64929L29718Q6720n13616m55225
6850i1981J77789J60098L86144m03249J21158l3231k039J3340k80124M0274K48635
$$ y = [-290096, -310334, -32061, -407272, -281891, 194850, 334799, -263160, -392541, -240858, -42195, -211069, 229049, -37490, -533534, -226824, -18006, 38555, 54917, 165545, 128635, -248112, -588048, 63573, 150108, -25330, -103823, -11799, 228436, -85482, -440717, 253668, -212979, 177618, 245565, -113168, -90983, -137237, 528821, 748792, 204019, 283649, 342453, -144229, -328873, -15695, 392962, 472452, 164623, -443469, -293300, -212392, -564532, 438265, 512481, 519365, 483423, 401479, 322923, 355444, 266591, 71975, -215215, -642085, -228723, 44596, 95493, 460422, 790140, 876860, 363244, -91981, 85808, 245906, 632050, 228801, 349959, 316728, 314689, 328029, 47905, 88179, 336814]
6839C36814J51995l84254m11772K53214L88226j15776L82885J73174k10302m9253
6829E14951m00198k42997J85030K8930J34446M05437m23981p3494M41435L16883
6819H86442l99091k20012j69147k98698l53258K27138N36621J4434L10121N833
6809E40383p8869l03806K36214M23409P0911q03958k27425j9528J62810L11081
6799C11222n49158l97792K87304Q96680n3091l32921J7877n450J40200N1039l02905
6788F3005J082M25139j93085k0454J32828l78737L7637j609q9986r6128j4762
6777a35070K21132L90194k76890K4933j3821J60023j48612n27421J37314J92996
6767B4778J62279j44805L3948M366Q92409j070656M02467j8011l68646K1033J54997
$$ y = [336814, 488809, 104555, -307217, -54003, 334223, 218447, 601332, 774506, 564204, 514951, 114753, -128244, 56786, 85716, 220162, 625599, 201618, 128124, 569559, 886442, 487351, 267339, 98192, -200506, -553764, -326626, 209995, 224429, 534550, 540383, 461514, 157708, 393922, 817331, 888242, 84284, -143141, -162669, 141, 311222, -237936, -635728, -348424, 548256, 495165, 162244, 180121, 174671, 314871, 365910, 63005, 64087, 489226, 296141, 275687, 408515, 29778, 67415, 65806, -24180, -120308, -135070, 86062, 476256, 199366, 224299, 210478, 370501, 221889, -305532, -168218, 24778, 187057, 42252, 76200, 80566, 972975, -97681, 304786, 286775, -81871, -60838, 94159]
6756I4159N5980l24164N81870L782p4623p8788k37023k59989L16014L15676J93633
6745E86527k78407j05437K70955l36742o8692k2461r963j87415R2753N52487k80372
6734B13233j82583J58489j37203J23887j25477k69120R9201J83220P9608K92813
6724D36068J49607o43066M24443j44104k70821J82317J69748N8363k66275k79587
6714a83307N1530J83263K15609j19385m10023N14019J73655J5579l84755n81484
6704e25299M29625O01632j31904m2123M3647j38666P1213k26643k15110M45859
6694C12231R4047J49849K10409m81370l05367M3594Q44706m80961j34627n9047
6684A93464j03460j49334j58123L05346K57427j10790p3191j29636L02895j08925
$$ y = [94159, 150139, -174025, 407845, 411627, 337004, 258216, 21193, -238796, 77218, 392894, 586527, 308120, 202683, 473638, 136896, 68204, 45743, 35780, -151635, -58882, 493605, 213233, 30650, 189139, 51936, 175823, 50346, -218774, -119573, 63647, 143255, 436068, 585675, -57391, 367052, 222948, -47873, 134444, 304192, 362555, 96280, -183307, -131777, 51486, 267095, 147710, -262313, 251706, 425361, 440940, 56185, -525299, -95674, 505958, 374054, 331931, 375578, 236912, 308125, 81482, -133628, 312231, 406278, 556127, 766536, 285166, -20201, 23393, 868099, 387138, 252511, 193464, 90004, -59330, -217453, 87893, 345320, 234530, 161339, 31703, 334598, 225673]
6674B25673K76320O5518l05236J43073L53367k88265l30582k85788J8306J68740
6664D1126K40071o156k35418k11667N07196M9028M42963k34979k69103Q73481
6654A196542k47396l42948J97847m8920K27104K0592J88248J88037l68779J06026
6644A116353j75781l66783k47521N29796j03836J81211l47303j67019j87924l15486
6634h4293M82795L19045n27016P5370j10591k65133k42383L45026K07035j4773
6624A85082m39661k25398L83016m9996L78677L01233l01062l92484l70018N66115
6614C5504M82599Q8783k15796n7241n82176n7304L84858j10563Q8553O79469n65351
6603A71335q90429O13030l080J02784P9316j92782j03109l7079J88203j12839
$$ y = [225673, 501993, 567511, 262275, 405348, 758715, 470450, 139868, -145920, -127614, 41126, 281197, 275041, 39623, -172044, 335152, 384180, 827143, 592164, 323061, 1196542, 949146, 606198, 804045, 755125, 982229, 1002821, 1191069, 1379106, 1010327, 1116353, 940572, 573789, 326268, 856064, 752228, 933439, 586136, 419117, 231193, -84293, 398502, 717547, 190531, 265901, 155310, -109823, -352206, -7180, 199855, 185082, -254579, -479977, -96961, -146957, 231720, 532953, 231891, -160593, -530611, 35504, 518103, 606886, 391090, 333849, -248327, -305631, 79227, -31336, 57217, 736686, 171335, -719094, -106064, -109144, -6360, 72956, -119826, -222935, -260014, -71811, -184650]
6593a84650k50123P24043M20313m82773l79284k33891j45748K80612L19412k11405
6583a43494n66875L70813L18918k38694l63760J141110n54113M7402K87428m29079
6573a30344j46337M0728M03874j24776k55171k98346j66667k29322P20912K09185
6563B3736k38337m09207L70154l05144K80661M83326j63800m20133M18633J81804
6553B21693P8412n89943J61091N66098j61548j87069J26625j86751K5739l26220
6543b71873l952M45828j28217l29p202J26034l7836n40788P34214P2933N02641
6532H91453k2135o33879l05539k62768K26611L82393k07441n4098L2080m77550
6522d30873K89278k72195L19414j33761r7192K40497J74275m33599M52510M63958
$$ y = [-184650, -434773, 289270, 709583, 226810, -152474, -386365, -532113, -251501, 67911, -143494, -710369, -339556, -20638, -259332, -623092, 518018, -36095, 11307, 298735, -130344, -276681, -235953, 167921, 43145, -212026, -510372, -677039, -906361, -185449, 23736, -214601, -623808, -253654, -558798, -278137, 205189, 41389, -378744, 39889, 221693, 300105, -289838, -128747, 437351, 275803, 88734, 215359, 28608, 54347, -271873, -275825, 170003, 41786, 41457, 34255, 160289, 122453, -418335, 315879, 388812, 891453, 869318, 235439, -70100, -332868, -106257, 276136, 68695, 14597, 46677, -430873, -141595, -413790, -94376, -228137, -325329, -84832, 89443, -344156, 108354, 572312]
6512E72312k8170k68036j05286m48086k6661l241J29776j75645j32510q6089K58626
6501c13010M67239o51569L96018l41922l41294O83201k52325M0438M10132l22324
6491b25416N04121k93294L7912K02240k16185N03420r38121J94914N73602p137
6481C36056l64888M91716l32359l38094K90952J30502M1491j83135m73940L49665
6471e2034l46656J05315P19513r4703n33598K58869O89596o29117J04140P36657
6461I57982p93275M5712k07824l97774L01739J11919K90993L9408l24325p2684
6451d8129j31850L58456K91676j14326j57413J14724k63636N1738n9783R20K18242
6440B60619j86569K50672j51840l13153J72071N72423j98834N7109l26714n59835
$$ y = [572312, 544142, 276106, 170820, -277266, -303927, -307168, -177392, -353037, -485547, -571636, -313010, 154229, -497340, -101322, -443244, -784538, -101337, -353662, -313224, 96908, -225416, 278705, -14589, 23323, 225563, 9378, 512798, -425323, -230409, 343193, 336056, -28832, 462884, 130525, -207569, 83383, 213885, 255376, 72241, -401699, -52034, -398690, -293375, 426138, 331435, -202163, 56706, 746302, 117185, 221325, 957982, 164707, 210419, 2595, -395179, -93440, 18479, 309472, 348880, 24555, -48129, -179979, 178477, 470153, 355827, 198414, 313138, 49502, 101240, 41457, 42377, 260619, 74050, 324722, 172882, -140271, 31800, 604223, 405389, 462498, 135784, -424051]
6430d24051M92846m3559j60963K09908j16961O74232L46492n82689n1221m3366
6420C00668J35993k745o57280J41950j42771k2625J20722K92338L36415m6316
6410D56349l21275J49761p7078j70141K80185J58262n43550J31725L79934l9620
6400D04552k53730l89860L65162L68517j57847K49016R1380N9537l57909m18634
6390c9816K3695K13143K32227L35902l55197J27153J27197m38539k84177O36312
6380E77900k41785K96848K95370l0926m1038L2630P2731N44624o76007j0586m74811
6369C44950K07821N59419k75373n89r0923L67794p7148k75034K10767M03788l91127
6358I84345L21995j15980o9223M66140J98323j00636j1989K54460k8546o23096
$$ y = [-424051, 68795, 25236, -135727, 74181, -42780, 631452, 977944, 395255, 344034, 300668, 436661, 433916, -223364, -81414, -224185, -246810, -126088, 166250, 502665, 456349, 135074, 284835, 207757, 37616, 317801, 476063, -67487, 64238, 444172, 404552, 150822, -239038, 126124, 494641, 336794, 585810, 677190, 736727, 378818, -39816, -16121, 197022, 429249, 765151, 409954, 537107, 664304, 225765, -58412, 577900, 336115, 632963, 928333, 897407, 856369, 888999, 961730, 1506354, 830347, 819761, 344950, 552771, 1112190, 836817, 836228, 745305, 1113099, 1035951, 760917, 971684, 1375472, 984345, 1306340, 1190360, 1121137, 1587277, 1785600, 1684964, 1672975, 1927435, 1898889, 1275793]
6348A275793N01265N24071J54614M98066n87032j15489P7981n48798O34343M40640
6338B855454n358N66450L63354m8452k8926J34632N80711K79688M93188K78877
6328E469618P82313Q38632J367924J007333J766737K081658K805600L142722K545609
6319B1808146K333471K029210J47615m45214j518814k751283k857341k757691
6311A5988099k850187k047473j827232j082829n49774j089140n13647n55787m34839
6302E037191j89047m61047r25279k72123l25884j08481k11421k18635m1911j73569
6292B109794m70855K24514K13333k52845L32842N30714n76345j37942j11731l47003
6282A514476k06388J75544r073k27846K88707j42823k53505l63768N89840M56495
$$ y = [1275793, 1777058, 2301129, 2455743, 2953809, 2366777, 2251288, 2329269, 1780471, 2414814, 2855454, 2850096, 3416546, 3779900, 3731448, 3702522, 3837154, 4417865, 4697553, 5190741, 5469618, 6251931, 7090563, 8458487, 9465820, 11232557, 13314215, 16119815, 19262537, 21808146, 24141617, 26170827, 26318442, 25873228, 24354414, 21603131, 18745790, 15988099, 13137912, 11090439, 9263207, 8180378, 7630604, 6541464, 6027817, 5472030, 5037191, 4848144, 4387097, 3461818, 3189695, 2863811, 2755330, 2543909, 2325274, 2283363, 2109794, 1638939, 1863453, 2076786, 1823941, 2156783, 2687497, 2111152, 1973210, 1861479, 1514476, 1308088, 1483632, 1474559, 1246713, 1535420, 1392597, 1139092, 775324, 1365164, 1821659]
6272A821659k15688m45075l27845K24556j06200j97651M47645l3646j08137N79699
6262A639317j46735j8262J44679m59448J40169M48002j42952J8202M34572j55078
6252A902466K45349Q16255j45159p40722j38158O51752k82028l59614k13082l20767
6242A416292l12828m6783L78187J50912j91230m33383P0651l67346j0020P05943
6232A360395n12700J26416L2727m90422M55654j45488k34309J57563m3549k79959
6222D26328J37756l1490J65758K21161O02411m86125m00614o47825j59365N51920
6212C79915M08423J99164N4160j85055l62627K81300k7370r6849m1170k45682
6202C64209j63623K53598R7314o5756j15678J00448j48932J75309K50679j88069
$$ y = [1821659, 1605971, 1160896, 833051, 1057607, 951407, 753756, 1201401, 1167755, 1059618, 1639317, 1492582, 1474320, 1618999, 1159551, 1299720, 1747722, 1604770, 1622972, 2057544, 1902466, 2147815, 2964070, 2818911, 2078189, 1940031, 2591783, 2309755, 1950141, 1737059, 1416292, 1103464, 1056681, 1434868, 1585780, 1394550, 961167, 1031818, 664472, 654452, 1360395, 847695, 974111, 1006838, 516416, 972070, 826582, 592273, 749836, 706287, 426328, 564084, 532594, 698352, 919513, 1521924, 1035799, 635185, -12640, -172005, 379915, 788338, 987502, 1041662, 856607, 493980, 775280, 747910, 651061, 609891, 364209, 200586, 454184, 551498, 485742, 370064, 470512, 321580, 496889, 747568, 559499]
6192E59499k45103J74458L0117l33389M93865l70269q7374K6775L0237P5703k99742
6181E4777L09535R0475n334j12041o8147n071r6276J09581N75998m07155K11611
6170F57953J53474o69215n52337Q14991J73646l194J22842k45031k22688M24777
6160F55218N4902K34937O1445k20782j26226o25474l67121R05822k9017P5858
6150F19562M57588p87311K256j8907L67625l00192P1333L31100k2906j96786k78420
6139B44942O68207k43185P3638k7853o54426j72176O82900l6136O9900J75207
6129G81018o13942R3656L70294j13339J82601Q0009l63945L66915m12157l03106
6119F8004M30828M9675J24273M99676m17757j38294N063J34524J22266j34810
$$ y = [559499, 314396, 488854, 518971, 185582, 679447, 309178, 221804, 248579, 278816, 354519, 54777, 364312, 454787, 449453, 337412, 269265, 264194, 167918, 277499, 853497, 446342, 657953, 811427, 142212, -410125, 404866, 578512, 575318, 698160, 453129, 230441, 655218, 710120, 945057, 1006502, 785720, 659494, 34020, -333101, 572721, 543704, 619562, 1077150, 289839, 292095, 273188, 640813, 340621, 411954, 743054, 720148, 523362, 244942, 913149, 669964, 743602, 715749, 61323, -110853, 572047, 535911, 605811, 781018, 167076, 260732, 631026, 517687, 700288, 780297, 416352, 783267, 371110, 68004, 498832, 548507, 672780, 1172456, 754699, 616405, 621468, 755992, 878258, 743448]
6109G43448p9719j08050l1874j14016j69247K70871L39920k23879M0319J019L57998
6098A026790Q5284n9856K19400o65240M88542K92654m26663k96696J07953K88090
6088A060258k93355n0775j52589K15311j0841L07277L91095o54851o452N93291
6078A398369n6819j8711J30248j20625p8106j95329j58786J93095K17878j033
6068A310181K33019L70690j73308P141p8419n9707O3868j62002l4112j42150J33570
6057A468771J2888L30598m46624K90189N6205j40112K78006j51497k91631J17806
6047A524599J84247N27068l84404j39059L91395p6049R695K19701N50488K39636
6037C047317K7416J62989k72382k69570O37511j55424O6670k16064n79620k02403
$$ y = [743448, 663729, 555679, 523805, 409789, 240542, 511413, 851333, 627454, 667773, 668792, 1026790, 1112074, 1052218, 1271618, 606378, 1094920, 1387574, 960911, 664215, 772168, 1060258, 766903, 716128, 563539, 778850, 768009, 1075286, 1466381, 811530, 805078, 1398369, 1341550, 1322839, 1453087, 1332462, 1254356, 1059027, 900241, 1093336, 1311214, 1310181, 1543200, 1913890, 1740582, 1747723, 1669304, 1609597, 1673465, 1511463, 1477351, 1335201, 1468771, 1481659, 1812257, 1365633, 1655822, 1712027, 1571915, 1849921, 1698424, 1406793, 1524599, 1708846, 2235914, 1851510, 1712451, 2103846, 2027797, 2037492, 2257193, 2807681, 3047317, 3074733, 3237722, 2965340, 2695770, 3333281, 3177857, 3244527, 3028463, 2448843, 2246440]
6027B246440J15881m04152J86158Q6088L08754k46034k64957L02437L90347J16563
6017B837525K17621k4932j47280K15306j84772O4539L0664K51565k49813K10072
6007C220495J69703N85837K51975M19130N46457n50266k73843L10208n15686j6074
5997D147936J25128J97019j77305p2093Q08513k77023p5139K50740m67282J37757
5987D598251k40068J66919K22848o6645N22155Q39971o4303L66722J95992k41535
5977F300307R69083K09360N91557L86568k74480O3226j19635l09812O39861K6072
5967H482107K54681L848K04906j45912r5359P93664j64269M13556J030767L05616
5957A1083605J026493R05535P78419J356952J359811J216747J576051J202934
$$ y = [2246440, 2362321, 1958169, 2144327, 2230415, 2539169, 2293135, 2028178, 2330615, 2720962, 2837525, 3055146, 3030214, 2882934, 3098240, 2913468, 2978007, 3008671, 3260236, 3010423, 3220495, 3390198, 3976035, 4228010, 4647140, 5193597, 4643331, 4369488, 4679696, 4164010, 4147936, 4273064, 4470083, 4292778, 4220685, 5029198, 4752175, 4677036, 4927776, 4460494, 4598251, 4358183, 4525102, 4747950, 4681305, 5203460, 6043431, 5979128, 6345850, 6541842, 6300307, 7269390, 7478750, 8070307, 8456875, 8182395, 8245621, 8125986, 7816174, 8456035, 8482107, 8736788, 8740636, 8945542, 8799630, 8704271, 9497935, 9333666, 9747222, 10777989, 11083605, 12110098, 13015633, 13794052, 15151004, 16510815, 17727562, 19303613, 20506547]
5949B0506547J018311M88186m02834l16600R08369M73921J485547O74648k40229
5940B4595866n80147L5078J070956J159493J620101J874631K406954K778590M036514
5931C8998036N291021N540398O343101P184225M671317K024964k426062m767730
5923F2859270n049844m315108l187387j091374L68178Q01485l02203j972343l454828
5914D4655846l407413k869068j758734j003675j031735j375923r06358r70721
5906C1332219q40017j362171k014210j635762k104330j072250j003795n16424
5898B0783260K07766M40463J5339M13035N57786J097994M24714J305646J755082
5889B7001085K000409K634949L088738L416932K074182J33320j303670k170359
$$ y = [20506547, 21524858, 22013044, 21610210, 21293610, 22201979, 22675900, 24161447, 24836095, 24595866, 24015719, 24050797, 25121753, 26281246, 27901347, 29775978, 32182932, 34961522, 38998036, 44289057, 49829455, 56172556, 63356781, 68028098, 70053062, 67627000, 62859270, 57809426, 53494318, 50306931, 49215557, 49583735, 50385220, 50083017, 48110674, 44655846, 41248433, 38379365, 36620631, 35616956, 34585221, 33209298, 32302940, 31332219, 30492202, 29130031, 27115821, 25480059, 23375729, 22303479, 21299684, 20783260, 20991026, 21431489, 21446828, 21859863, 22417649, 23515643, 23940357, 25246003, 27001085, 29001494, 31636443, 34725181, 38142113, 40216295, 40349615, 39045945, 36875586]
5881C6875586j953549o02690N7646O55213J635321J913276K225581J570993j659794
5872D0717583l887333m388154l571630k542853k066384j593602o44432j298891
5864B0724304l52473j84321p80658N6170l58303R2410N88205Q59870J375484P64347
5854B2785035k5942J012204O06679K61170L0771q217M31642R34568J926413K250044
5844C0204367K378360K998671K576173J47244l542400n120272l691632k813074
5836B3137437k251797j788515o83297j052537o45444l48173m31990o92429l73784
5827A4869471j96599p6487l12678k53402N32109L44317k40259k35457l8632M15957
5817A4808340K94936N56114J002612J285651R40229Q43082Q33147O07576k0743
$$ y = [36875586, 34922037, 34319347, 34376993, 35032206, 36667527, 38580803, 40806384, 42377377, 40717583, 36830250, 32442096, 28870466, 26327613, 24261229, 22667627, 22023195, 20724304, 20371831, 20187510, 19406852, 19463022, 19104719, 19197129, 19785334, 20645204, 22020688, 22785035, 22759093, 23771297, 24377976, 24639146, 24669917, 24661700, 25093342, 26027910, 27954323, 30204367, 32582727, 35581398, 38157571, 38304815, 34762415, 29642143, 25950511, 23137437, 20885640, 19097125, 18413828, 17361291, 16715847, 16367674, 15935684, 15243255, 14869471, 14672872, 14596385, 14283707, 14030305, 14562414, 14906731, 14666472, 14431015, 14392383, 14808340, 15103276, 15659390, 16662002, 17947653, 18887882, 19730964, 20564111, 21171687, 21150944]
5808B1150944j477952j695347j567117j197915q14955n81182o22670r3941o03804
5799A2496061k25995m33863J89583j94153l6884L1518K5092N98632m96310j44300
5789A1809381J39743K34115m98516j20547k92570K10094j13712m39667O30393
5780A1558714J01456k51073j89208j00018j60291K7640k90984K53268m48510j84658
5770A0316336J86239k00157m5706J13186K98827J79663j72587J35769P91818l69381
5760A1234007M31578K02027k44990k24774J41188J23819J97140l14484l17268
5751A1228243M59533K91451O37936K36936k03359K44339R28437N69800O55157
5742A5048473N34778J270084J349770J037305J234498K010213K732788K408170
$$ y = [21150944, 19672992, 17977645, 16410528, 15212613, 14397658, 13816476, 13193806, 13099865, 12496061, 12270066, 11836203, 12025786, 11831633, 11794749, 11826267, 11851359, 12449991, 11953681, 11809381, 11949124, 12183239, 11684723, 11564176, 11271606, 11481700, 11367988, 10928321, 11558714, 11660170, 11409097, 11219889, 11119871, 10959580, 10987220, 10696236, 10949504, 10500994, 10316336, 10502575, 10302418, 10256712, 10369898, 10668725, 10848388, 10675801, 10811570, 11603388, 11234007, 11665585, 11867612, 11622622, 11397848, 11539036, 11662855, 11859995, 11545511, 11228243, 11687776, 11979227, 12617163, 12854099, 12650740, 12895079, 13823516, 14393316, 15048473, 15583251, 16853335, 18203105, 19240410, 20474908, 22485121, 25217909, 27626079]
5734B7626079K040117P75921M63364q76528k002499k619162k400559k664675j789002
5725A8553056j310281r83926l92314r50879n56180r80259n17181l98649o09260
5716A1854127n11207l79267m40063P177j71357p84855J42404L9738k69676M59280
5706I946301m20967n91466L54941j83694k85832K26458k1507k27952n5873J60609
5696H901018o28003r0125M64966K47673k76072q11227o69942L26235M78945J38577
5686H082045M07284j88451n28967j13153N48711N85072j61460j6438l9333j93773
5676H381537l01756M3422L62530K06793l52183K315K76812k24157l37441M73525
5666H531397M8067P8884O37711J21905j46143M25857m8115l43504o6703N0456
$$ y = [27626079, 29666196, 30442117, 30905481, 30028953, 28026454, 25407292, 23006733, 20342058, 18553056, 17242775, 16258849, 15866535, 14915656, 14359476, 13379217, 12862036, 12463387, 11854127, 11342920, 10963653, 10523590, 10530767, 10359410, 9574555, 9716959, 9756697, 9487021, 9946301, 9525334, 8933868, 9288809, 9105115, 8819283, 9045741, 9024234, 8796282, 8740409, 8901018, 8273015, 8182890, 8647856, 8895529, 8619457, 7808230, 7138288, 7464523, 7943468, 8082045, 8489329, 8300878, 7771911, 7658758, 8207469, 8792541, 8631081, 8614643, 8575310, 8381537, 8079781, 8123203, 8485733, 8692526, 8340343, 8342658, 8619470, 8395313, 8057872, 8531397, 8579464, 8658348, 9296059, 9417964, 9271821, 9697678, 9649563, 9306059, 9239356, 9289812]
5656I289812L17507O34196J32984j2450k03358j15902L69086N19702r9886p516
5646A0824175j86481k24922Q59153O49150Q93089N107l64852P3975j46581J34788
5636A2516601L14189M50207L83740M23958O45356M98158N08035N2645M99338N08810
5626A6801037J90143K65600L21392M16670N36026K11228O57209P59959M9421M38990
5616B0647675N59974O75293P35024N05973Q99218M56993K80593J060233J046488
5607B6867464J027432P44889R33981P17632J304885J632162J171632J730350J204334
5598C7334761J864639J247091J798150K310482K353584K993743L020199L243020
5590E6165669L388856L200754L547767L988203M448526L994327M030648N183812
$$ y = [9289812, 9607319, 10241515, 10374499, 10362049, 10158691, 10042789, 10411875, 10931577, 10831691, 10824175, 10637694, 10412772, 11271925, 11921075, 12814164, 12819271, 12454419, 12528394, 12381813, 12516601, 12830790, 13280997, 13664737, 14088695, 14734051, 15232209, 15740244, 15792889, 16292227, 16801037, 16991180, 17256780, 17578172, 17994842, 18530868, 18742096, 19399305, 20159264, 20208685, 20647675, 21207649, 21882942, 22617966, 23123939, 24023157, 24480150, 24760743, 25820976, 26867464, 27894896, 28639785, 29573766, 30291398, 31596283, 33228445, 34400077, 36130427, 37334761, 39199400, 40446491, 42244641, 44555123, 46908707, 49902450, 52922649, 56165669, 59554525, 62755279, 66303046, 70291249, 74739775, 78734102, 82764750, 87948562]
5582H7948562O618140Q526711Q221813L111873l191974o886386n496046l233987
5574I5618706j530443J81038J364547K498499L590311M159466N430177N581832
5566A16894133M904682N090712O216819Q949569J1587435J3546892J5853816J9543727
5558B02587785K4205603L0794944L5760433M0206830M3293552L0361215J735122
5551D08945484k0139218k5308065k4423507k5659148k4398551j4464436n276727
5544B69275832j0825476k2244793k7215038k4149508j7763733j4344206j1593930
5537A41139148r963260p405711o885090o356923n082700m360624l453134k214907
5529I5416799j619473k121237l011681k769820j654953j195627o83002j085783
$$ y = [87948562, 94566702, 103093413, 111315226, 114427099, 111235125, 104348739, 98852693, 95618706, 94088263, 94269301, 95633848, 98132347, 101722658, 105882124, 111312301, 116894133, 121798815, 126889527, 133106346, 142055915, 153643350, 167190242, 183044058, 202587785, 226793388, 257588332, 293348765, 333555595, 376849147, 407210362, 408945484, 388806266, 363498201, 339074694, 313415546, 289016995, 274552559, 269275832, 258450356, 236205563, 208990525, 184841017, 167077284, 152733078, 141139148, 131175888, 123770177, 116885087, 110528164, 105445464, 101084840, 97631706, 95416799, 93797326, 91676089, 88664408, 85894588, 84239635, 83044008, 82361006, 81275223]
5521H1275223j138966p65345m30474L76009M54869K89292J353067J908771K605991
5512H5928437L794776M558989M796007P686726R189927Q117797K138657m025378
5504A22185938n355980k977772k079650k249342l041741m65526K362448N370934
5496A13749309Q625995J1932413J4693594J8383976K6325696K7212582O195358
5489B27118923k2405971l5263576k9905771k1123457j4371217r613646p454838
5482H6980447m426957k436461j906067q51156j13831Q90268J047244K621501M200011
5473H6004999N446484P525683R095709M602878n885275j3044388j3518791j0007194
5465G0220105p456191m991089m421230l383306k120244j851776j689631j103545
$$ y = [81275223, 80136257, 79370912, 78940438, 79316447, 79771316, 80060608, 81413675, 83322446, 85928437, 89723213, 94282202, 99078209, 106764935, 115954862, 124072659, 126211316, 122185938, 116829958, 113852186, 111772536, 109523194, 106481453, 106015927, 108378375, 113749309, 122375304, 134307717, 149001311, 167385287, 193710983, 220923565, 227118923, 204712952, 169449376, 139543605, 118420148, 104048931, 94435285, 86980447, 82553490, 80117029, 78210962, 77359806, 77245975, 78136243, 79183487, 81804988, 86004999, 91451483, 98977166, 108072875, 112675753, 106790478, 93746090, 80227299, 70220105, 62763914, 57772825, 53351595, 49968289, 47848045, 45996269, 44306638, 43203093]
5457D3203093j450728j042530j472683j152921n38063j08412r9032N62783Q66619
5448C8768126J695751J978163K508042L772844M864565N369041O879683P860815
5440G3697030R610561J1184826L652562p171338j3136838j2790797q634388o743904
5432D9667714n356931l145303k311731j551213j440979q03859k75395J37338J25729
5423C5045370K09048J77115J18428O78908K80175p34763j427558k031261j152374
5414C1163088k32621n48722O80732J647734J382869K478870L000067K350043N78964
5405D2501024l787197m960878m552297l597018k559141k278393j316977j539319
5397A7909804j038287p81419q38945l85839q09991l99587m97145o72695l92414
$$ y = [43203093, 41752365, 40709835, 39237152, 38084231, 37546168, 37437756, 37338724, 37901507, 38768126, 40463877, 42442040, 44950082, 48722926, 53587491, 58956532, 65836215, 73697030, 83307591, 94492417, 98144979, 90973641, 77836803, 65046006, 56411618, 49667714, 44310783, 41165480, 38853749, 37302536, 35861557, 35057698, 34782303, 34919641, 35045370, 35254418, 35431533, 35549961, 36228869, 36509044, 35774281, 34346723, 32315462, 31163088, 30930467, 30381745, 31062477, 32710211, 34093080, 36571950, 39572017, 41922060, 42501024, 38713827, 33752949, 29200652, 25603634, 23044493, 20766100, 19449123, 17909804, 16871517, 16090098, 15251153, 14865314, 14055323, 13655736, 13158591, 12485896, 12093482]
5388A2093482q13350p67033P75724K99239n64403n21324L5381p11577m24099K66246
5378I668286m6504k9900j99560l98523n2013m8582j38991K19997o56763r0517
5368H226930J25117p04842k03280N07454q1574k13002K65754J5466N5266j92598
5358G800691l34921l46721K09179L09888L48750k39686p44223j74716m77468L41726
5348F692499j84569N11257O24412k44073p43205k88204n7218M11674j18925l78570
5338F225078J16134n29549J15555K62496K29263L01325k17148j86204o67644J10418
5328E759724O96164j90956j4017M5891m1981n32449l37580q7266K61655J64571
5318E723756L88796k88323J93296k18488j8988r5233r4878N46191L81049M84851
$$ y = [12093482, 11280132, 10513099, 11288823, 11588062, 11023659, 10502335, 10537716, 9826139, 9402040, 9668286, 9621782, 9591882, 9392322, 8993799, 8941786, 8893204, 8754213, 8974210, 8317447, 8226930, 8352047, 7647205, 7443925, 7951379, 7869805, 7656803, 7922557, 7938023, 7993289, 7800691, 7465770, 7119049, 7328228, 7638116, 7986866, 7747180, 7002957, 6828241, 6350773, 6692499, 6507930, 7019187, 7643599, 7399526, 6656321, 6368117, 6310899, 6722573, 6603648, 6225078, 6341212, 5811663, 5927218, 6189714, 6418977, 6720302, 6503154, 6316950, 5649306, 5759724, 6455888, 6264932, 6250915, 6296806, 6254825, 5722376, 5384796, 5297530, 5559185, 5723756, 6112552, 5824229, 6017525, 5799037, 5780049, 5684816, 5589938, 6136129, 6517178, 7002029]
5308G002029n1750n37413o2082n7374R5496L61713p887j43722r53871N05130q2132
5297F068137j05182j51268L49302M66336k65993o10250L44292l09272k33294K54643
5287E807451M89670J87090k19006J68384M8661k70431k40271P0839O93677J06520
5277F842584k71501j59996n30029k37283N37073K73401J60307J96611l39397L0311
5267F502081m24686L30882L99491R2222j5595r6192m28816K99220L77228J17814
5257G153649K97188N91505l85949K88245m65702j30754O11019K3301k47086J39894
5247G875310L2153P87567m2390j61640M60477o91653J83714P24784M6629j24489
5237I090462P75797P48028J48238k00652L12375J033394j58378l497N93391k02727
$$ y = [7002029, 6950279, 6412866, 6350784, 6293410, 6388906, 6750619, 6742732, 6599010, 5645139, 6150269, 6068137, 5962955, 5811687, 6160989, 6627325, 6361332, 5751082, 6095374, 5786102, 5552808, 5807451, 6297121, 6484211, 6265205, 6433589, 6482250, 6211819, 5971548, 6042387, 6736064, 6842584, 6571083, 6411087, 5881058, 5643775, 6180848, 6454249, 6614556, 6811167, 6471770, 6502081, 6077395, 6408277, 6807768, 6899990, 6884395, 6788203, 6359387, 6658607, 7035835, 7153649, 7450837, 8042342, 7656393, 7944638, 7478936, 7348182, 7959201, 7982502, 7735416, 7875310, 7907463, 8695030, 8652640, 8491000, 8951477, 8259824, 8443538, 9168322, 9214951, 9090462, 9866259, 10614287, 10762525, 10561873, 10874248, 11907642, 11749264, 11745767, 12339158, 12136431]
5227A2136431L82904N43686Q96398l5947j23744m24185J14985Q0529M05982K01573
5217A4178612M35307k00415l07883P18410L18180K73661N69735L21168l5076N34884
5207A6806583Q66691L79915J57896N45147O01730N47313J055770P90777J171441
5198B2923263J305507J388730J515307J333669J767220K498360K292570L335569
5190C8360195M431242M455051N977748O880622Q689942R457192J0318695J0457918
5182I9028605R504343Q538947M948136Q44453j429798m827867q502628j0400059
5174I7704132j1147824j0287708r175488q476264o860010n203447m457962l744968
5166C8350461k853669k812299k682711k570535j932535j666833j580498j621315
$$ y = [12136431, 12519335, 13063021, 13959419, 13923472, 13799728, 13375543, 13490528, 13571057, 13977039, 14178612, 14613919, 14413504, 14105621, 14824031, 15142211, 15415872, 15985607, 16306775, 16271699, 16806583, 17673274, 18053189, 18211085, 18756232, 19357962, 19905275, 20961045, 21751822, 22923263, 24228770, 25617500, 27132807, 28466476, 30233696, 32732056, 35024626, 38360195, 42791437, 47246488, 53224236, 60104858, 68794800, 78251992, 88570687, 99028605, 108532948, 117071895, 122020031, 122864484, 121434686, 116606819, 108104191, 97704132, 86556308, 76268600, 67093112, 58616848, 51756838, 46553391, 42095429, 38350461, 35496792, 32684493, 30001782, 27431247, 25498712, 23831879, 22251381, 20630066]
5158B0630066r66059r30782r51686q34614p84543m06162j77261m83682m40028
5149A4655249o11406k73804n76647O8315m86689r29669m31967l77440P8753m32725
5139A0681970k08147n47537o34523m57908J70884l61753m73315K08647q5521k43718
5129H049079k22744P9469M15248k33011o88263k24521m6739O66966K94890k93474
5119G796900j69307o30213k68371M7292j39565J13905k12548J27351R3828o75240
5109F084032J65995J72397l86026P73161m09189o01507m28588j13887K71161m45360
5099E082189J85061L01247o57337m22830L73972J33532M83066l05680n41941l35240
5089D296039J40389K88271L3884k16034J45755j37066M9027m9992K06050L38274
$$ y = [20630066, 19664007, 18733225, 17781539, 16946925, 16162382, 15756220, 15578959, 15095277, 14655249, 14043843, 13770039, 13193392, 13261707, 12775018, 11845349, 11413382, 11035942, 11114695, 10681970, 10473823, 9926286, 9291763, 8833855, 9004739, 8642986, 8169671, 8378318, 8292797, 8049079, 7826335, 7905804, 8321052, 8088041, 7399778, 7175257, 7128518, 7795484, 8090374, 7796900, 7627593, 6997380, 6729009, 6776301, 6636736, 6750641, 6538093, 6665444, 6759272, 6084032, 6250027, 6422424, 6036398, 6809559, 6400370, 5798863, 5370275, 5256388, 5527549, 5082189, 5267250, 5568497, 4911160, 4488330, 4862302, 4995834, 5478900, 5173220, 4631279, 4296039, 4436428, 4724699, 4758583, 4542549, 4688304, 4551238, 4600265, 4550273, 4756323, 5094597]
5079E094597N4145o01131n77842K33162O7019J93992J65795R5869m73628m25090
5069C826888K59985q23703J07076R36837P56281K32576n40016o67591J04401k97308
5059C895426K59071Q17419l3970m06887n26123K586j55631K89205r7091M97551
5049D541556j5515n83126o4541n550Q9739k49871K64433L61994j96444J68526
5039D311201j40069l69689L80416J64159J01326m1083k75615L72794m2948m60185
5029D000307L19401R5178j70038O8854j16442K09529J61337j27735Q8518j69345
5019D359564m2275M78816J60181J5954m7231j99152J75226q9419K32497K31700
5009E275861K5107j91550r8937K16405l50624R582N050R9864K03398L4273r39417
$$ y = [5094597, 5148742, 4547611, 3969769, 4202931, 4269950, 4463942, 4629737, 4725606, 4251978, 3826888, 4086873, 3263170, 3370246, 4307083, 5063364, 5295940, 4755924, 4088333, 4192734, 3895426, 4154497, 4971916, 4937946, 4531059, 4004936, 4007522, 3851891, 4141096, 4044005, 4541556, 4526041, 3942915, 3878374, 3872824, 3962563, 3712692, 3977125, 4339119, 4142675, 4311201, 4171132, 3801443, 4181859, 4346018, 4447344, 4406261, 4130646, 4503440, 4460492, 4000307, 4319708, 4414886, 4244848, 4313702, 4197260, 4406789, 4568126, 4440391, 4528909, 4359564, 4317289, 4796105, 4956286, 4972240, 4925009, 4725857, 4901083, 4811664, 5044161, 5275861, 5300968, 5109418, 5010481, 5226886, 4876262, 4885844, 4890894, 4990758, 5194156, 5228429, 4289012]
4998D289012l10954J0337l38739L71847l36096P1713p3124Q6247M06829o07458
4988C569614r3626J75123L4558j94977L30142K4676K95066k24852J12611k06608
4978C821727l2002O09861n40662l17191J19150J74580J74514j15686m13175K11786
4968C692902k19038O47918o94l69185J70160J22418k25533Q5818J98079J8985
4958D121830j57572K82495Q1703j04242Q0774n0254J74318k16031m6012M52695
4948D619704M32035p7843p9135j24231m6347J77412N09807J5754k46281k00248
4938D980627j46919o4529k73741m20663K75744l35003j80868K61078K24816l2401
4928D288141j11536J3293j17060P357k22449K15576m36110J59295J86510L46646
$$ y = [4289012, 3978058, 3988395, 3649656, 4021503, 3685407, 3757120, 3683996, 3770243, 4177072, 3569614, 3475988, 3651111, 3685669, 3490692, 3820834, 3845510, 4140576, 3915724, 4028335, 3821727, 3789725, 4399586, 3858924, 3541733, 3660883, 3835463, 4009977, 3894291, 3481116, 3692902, 3473864, 4121782, 4121088, 3751903, 3922063, 4044481, 3818948, 3904766, 4102845, 4121830, 3964258, 4246753, 4328456, 4224214, 4304988, 4254734, 4429052, 4213021, 4167009, 4619704, 5051739, 4973896, 4894761, 4770530, 4724183, 4901595, 5411402, 5427156, 5180875, 4980627, 4833708, 4769179, 4495438, 4074775, 4350519, 4015516, 3834648, 4095726, 4320542, 4288141, 4176605, 4189898, 4072838, 4080195, 3857746, 4073322, 3637212, 3796507, 3983017, 4329663]
4918D329663l4078k98227k25896K97051J84102l91718k39742J67173J33705M87418
4908D409451J31798k46649K55377o20618L31259j86131L5261L35677k41261P3394
4898D277558M862J20034O625k1819p1008o21893J14148M84804j66369o7009J07882
4887D167815k01155j21868L8686J47034J46608M69330j61463r276l81295k79512
4877C814904L01712M42199j79275k15829J65724L10481k54192o35204l4512J92107
4867C908115n31308O2271J13981K21049R6172l05657J14782M2935j03993m9206
4857C569141k25551K85651L96628q5574k3048j57484L0295m38921N13295R2957
4847C957389l61554M46129K6961k38727O27835l1571k94507l84271n1774K62612
$$ y = [4329663, 4295585, 3997358, 3771462, 4068513, 4252615, 3860897, 3621155, 3788328, 3922033, 4409451, 4541249, 4294600, 4549977, 3929359, 4260618, 4074487, 4109748, 4445425, 4204164, 4277558, 4282420, 4402454, 4409079, 4387260, 4316252, 3694359, 3808507, 4293311, 4126942, 4059933, 4167815, 3966660, 3844792, 3883478, 4030512, 4177120, 4646450, 4484987, 4475711, 4094416, 3814904, 4116616, 4558815, 4379540, 4163711, 4329435, 4639916, 4385724, 3750520, 3716008, 3908115, 3376807, 3439078, 3553059, 3774108, 3870280, 3564623, 3679405, 3722340, 3618347, 3569141, 3343590, 3629241, 4025869, 3940295, 3917247, 3759763, 3790058, 3351137, 3864432, 3957389, 3595835, 4041964, 4068925, 3830198, 4458033, 4426462, 4131955, 3747684, 3695910, 3958522]
4837C958522m02989M51499O67359m24683k92633J08804K04723J332j57942M17003
4827D530995l91138n27892P48281j37744k2195M30748j70706R2956J48559k18594
4817D483270J04870l20451O34185q6926m15837j62863L44418J62337J57917K06957
4807E107877k66151j20507J43310k65702j33344p4958M19581m77618l60499J62710
4797D134699J39409K48868j80702o8953m49284K01708l23918L30696l6758m78120
4787C517645J82333r8080l26131N18980l58568K42376L89817k22885K14833l70632
4777C689688k24504J91492N5890N3602O7500M84763o2579k46987n7051l40819
4767C610995K4644k0147K21672l19048J8505M85762J44563k38527p74j54128j60778
$$ y = [3958522, 3555533, 4007032, 4674391, 4249708, 3957075, 4065879, 4270602, 4271934, 4113992, 4530995, 4139857, 3611965, 4360246, 4222502, 4200307, 4631055, 4460349, 4553305, 4701864, 4483270, 4588140, 4267689, 4901874, 4814948, 4399111, 4236248, 4580666, 4743003, 4900920, 5107877, 4841726, 4721219, 4864529, 4598827, 4465483, 4390525, 4810106, 4332488, 3971989, 4134699, 4274108, 4522976, 4342274, 4273321, 3824037, 4025745, 3701827, 4032523, 3995765, 3517645, 3699978, 3601898, 3275767, 3794747, 3436179, 3678555, 4068372, 3845487, 4060320, 3689688, 3465184, 3656676, 3712566, 3766168, 3833668, 4318431, 4255852, 4008865, 3951814, 3610995, 3635639, 3615492, 3837164, 3518116, 3536621, 4022383, 4166946, 3928419, 3927645, 3773517, 3612739]
4756C612739q1857M15263M39753j20641q3309N2250J7760j03188R90352k45652
4746D893470p16304j96902J02038L5718j22346j83508K09537j01511J00667M06145
4736D427004j47588K8408o6060k53963o7522R7802n3828K99679j81700M9298j97994
4725C933536p9377J03698k04723J20917L33597n0316k61710m2296j7359J21070
4715C957037n2318n48301L16894j32000L24439L27056p36679p9573L90481M84498
4705D251534k00518p6445J01543K29191j23521M08197l5738O1588M24988l09052
4695D731767p92692m4450m4287n8964K12319R535j06247n43038j34412M04844
4685C634375l19263N91575L03971Q8439j50372J77521J65832k03138l69286m3001
$$ y = [3612739, 3530882, 3946145, 4385898, 4265257, 4181948, 4234198, 4251958, 4148770, 5139122, 4893470, 4177166, 3980264, 4082302, 4118020, 3995674, 3812166, 4021703, 3920192, 4020859, 4427004, 4279416, 4307824, 4241764, 3987801, 3920279, 4018081, 3964253, 4263932, 4082232, 4131530, 3933536, 3854159, 3957857, 3753134, 3874051, 4207648, 4157332, 3895622, 3853326, 3835967, 3957037, 3904719, 3356418, 3673312, 3541312, 3865751, 4192807, 3456128, 3376555, 3767036, 4251534, 4051016, 3974571, 4076114, 4305305, 4181784, 4589981, 4554243, 4615831, 5040819, 4731767, 3939075, 3894625, 3850338, 3791374, 4003693, 4013228, 3906981, 3363943, 3229531, 3634375, 3315112, 3906687, 4210658, 4299097, 4148725, 4326246, 4492078, 4288940, 3919654, 3876653]
4675C876653M55950K57280r026J03863n08565J43655J69336m26080J01084k81713
4665C882437K80112L00112l24079k79439K89327l7234M16479j44484j14317j51033
4655D117881k76037j39643K34094O595K1675M86787p30888k26136P78889j69208
4645D104009j24001K85912N0278K04139k43461j24262L96724J43o53181k05310
4635C690990M72574P630R0619J84411N77066l78063m73871N53388k37759l66315
4625D120670L67511L65811J07534l70654J67203J63361n43341j58135M67005j91289
4615D495676j9527m7386K64937J50250L05457r9717k46976J71046J06994m60845
4605D619909j05601j7779K88418O63625J5166o1543l3067j24196l59486K29122
$$ y = [3876653, 4332603, 4589883, 4580857, 4684720, 4176155, 4319810, 4489146, 4063066, 4164150, 3882437, 4162549, 4462661, 4138582, 3859143, 4148470, 4111236, 4527715, 4383231, 4268914, 4117881, 3841844, 3702201, 3936295, 3942890, 3964565, 4451352, 3720464, 3494328, 4273217, 4104009, 3980008, 4265920, 4316198, 4520337, 4276876, 4152614, 4549338, 4549481, 3896300, 3690990, 4163564, 4171194, 4261813, 4446224, 5023290, 4645227, 4171356, 4724744, 4486985, 4120670, 4488181, 4853992, 4961526, 4590872, 4758075, 4921436, 4378095, 4219960, 4686965, 4495676, 4476149, 4428763, 4693700, 4843950, 5149407, 5049690, 4802714, 4973760, 5080754, 4619909, 4514308, 4496529, 4784947, 5448572, 5463738, 5402195, 5369128, 5244932, 4885446, 5114568]
4595E114568m9736Q8084L07188o1881J041360n53179m54134J31632j42187O3912
4585E485627J68374N79020K3680l47668k58815L2249k23493O6635L65069K5853
4575E916531m2336J38808k83168j49603k94491M20987O94478k40713p23716j89879
4565E246898K69008L35286J72448M13859K70498j74391q4008J47271o20452p1198
4555E905219L14689M21452l9211N3856N19542k48503k02061L5690p616O9807k76288
4544F546576O8442M87130j90774J0568J77137M8105n5325L07652L20621j87296
4534G532836N8408K20101j20092j039K85483M13280K38340r5399O59886L98641
4524I590445m69443K61914R61198K35288q1492M34684M12023L61782O17093M17627
$$ y = [5114568, 5064832, 5152916, 5460104, 5398223, 6439583, 5886404, 5432270, 5563902, 5421715, 5485627, 5654001, 6233021, 6256701, 5909033, 5650218, 5682467, 5458974, 5525609, 5890678, 5916531, 5874195, 6013003, 5729835, 5580232, 5285741, 5706728, 6401206, 6160493, 5436777, 5246898, 5515906, 5851192, 6023640, 6437499, 6707997, 6533606, 6449598, 6596869, 5976417, 5905219, 6219908, 6641360, 6602149, 6656005, 7175547, 6927044, 6724983, 6760673, 6753057, 6822864, 6546576, 6615018, 7102148, 6911374, 6921942, 7099079, 7147184, 7091859, 7399511, 7720132, 7532836, 7591244, 7811345, 7691253, 7690214, 7975697, 8388977, 8627317, 8531918, 9191804, 9590445, 9121002, 9382916, 10344114, 10579402, 10497910, 10932594, 11344617, 11706399, 12323492, 12741119]
4514A2741119N23757J040645L31883N88415R62552J034932K346502K109294K686099
4505B4365198K355218K795729K544186O16148k274000l303226l309369k205260
4497B1584624k233259k105969o75086r97941m26621o41367p30395l45875l57089
4488A3071022p68373p53845p88334K65370q2521o93800n5049j00999L11197j73562
4478A0231106k6973L49168j61537j43598K16831L76062o45512M1168Q39007n39667
4468A0536055q3260P41655M93628M90360L13600N68829J96852J44274l99436l14293
4458A2688264o71931r40051J13749K0761l42090M75627j01192o5816J90454l48151
4448A1019624M2551L27541J73893O80041P7282o45634J41152L08997M16605K61113
$$ y = [12741119, 13264876, 14305521, 14637404, 15225819, 16188371, 17223303, 19569805, 21679099, 24365198, 26720416, 29516145, 32060331, 32676479, 30402479, 27099253, 23789884, 21584624, 19351365, 17245396, 16570310, 15572369, 15145748, 14504381, 13773986, 13428111, 13071022, 12302649, 11548804, 10760470, 11025840, 10943319, 10249519, 10194470, 10093471, 10404668, 10231106, 10204133, 10553301, 10391764, 10248166, 10464997, 10841059, 10195547, 10236715, 11075722, 10536055, 10452795, 11194450, 11688078, 12178438, 12492038, 13060867, 13257719, 13401993, 13002557, 12688264, 12016333, 11076282, 11190031, 11210792, 10868702, 11344329, 11243137, 11177321, 11367775, 11019624, 11062175, 11389716, 11563609, 12243650, 12320932, 11675298, 11816450, 12125447, 12542052, 12803165]
4438A2803165Q1109K36533R7359k3906K98660o6111L6829J82246j27417P63708
4428A4282175M06328O56445P78282r4015M30301N97560Q31324J002523P60462
4419A9651385J727554K024582J969103K530970L066180L727431M390675M627720
4411D3715600M242385K354646p84848l773439n952307n111039m163179l463272
4403B7064547k076084j733929j293324j112622j199727p29716j024326n67603
4395A7327216O5980m22285m54083k83279l70140j38472J64313m307l3447o0218
4385A5791278j682J92586K40314Q02011Q09804N22145J495232J179128J330517
4376B2361333K35780j080912j291094j161703n53052q99005q48325j15647k95984
$$ y = [12803165, 12884274, 13120807, 13218166, 13194260, 13492920, 13426809, 13463638, 13645884, 13518467, 14282175, 14688503, 15344948, 16123230, 16029215, 16459516, 17057076, 17888400, 18890923, 19651385, 21378939, 23403521, 25372624, 27903594, 30969774, 34697205, 39087880, 43715600, 47957985, 50312631, 49527783, 45754344, 39802037, 34690998, 30527819, 27064547, 24988463, 23254534, 21961210, 20848588, 19648861, 18919145, 17894819, 17327216, 17393196, 16970911, 16516828, 16233549, 15863409, 15724937, 15889250, 15884943, 15851496, 15791278, 15789596, 15982182, 16222496, 17024507, 17834311, 18356456, 19851688, 21030816, 22361333, 22597113, 21516201, 20225107, 19063404, 18510352, 17611347, 16763022, 16647375, 16351391]
4367A6351391L72813M35977l24029O33237l41391k62265R45567J54394O57063
4358A8622757O27100J42523J076005P29085N57429L04088o63632p13514p64425
4349A9917416p33450M31558J11867k07963J62976M15120M99282N19757O90421
4340B1806984R35845P38046O87076J365139J672071M1209m23892l7332r01312
4331B5883834j34256Q95K79211O07493N82412M0089j48627M58636J019751O76754
4321B9266192Q92825R58555J155977J620901J203362J379912J650054J925141
4313D0052919K723742K963533L476163M946606N553364P398281Q706780R208864
4305H5030252J1779568J4354550J5417945J5763641J1444418M083034m399909
$$ y = [16351391, 16724204, 17160181, 16836152, 17469389, 17127998, 16865733, 17811300, 17965694, 18622757, 19249857, 19392380, 20468385, 21197470, 21754899, 22058987, 21395355, 20681841, 19917416, 19183966, 19615524, 19727391, 19519428, 19682404, 20097524, 20596806, 21116563, 21806984, 22742829, 23480875, 24167951, 25533090, 27205161, 27246370, 26822478, 26785146, 25883834, 25749578, 25750473, 26029684, 26637177, 27219589, 27259678, 27111051, 27569687, 28589438, 29266192, 30159017, 31117572, 32273549, 33894450, 35097812, 36477724, 38127778, 40052919, 42776661, 45740194, 49216357, 54162963, 59716327, 67114608, 75821388, 85030252, 96809820, 111164370, 126582315, 142345956, 153790374, 157873408, 153473499]
4298A53473499j0759333j2557457j2307305j0576064r111497r223089q776061
4291H0162693p544760n991505n329942l858760k734032k840391k497962j259036
4283D8106305j465195j069587n48543k97624L09578Q37930J079532J990797K057371
4274E1000564K710121L332645L750147N199102O865330Q408727R681486J0279280
4266A01227402O633890O9504q014372j2081072j1424951j0069892p754475n955679
4258E2630355m938929l065023k925556k202185j626348j428426j880968j999259
4250C2563661j360571q98605p36681J53460q21836K5938l83069K11869K63432
4241B9017598l31092N1719j55196O91815L57330J9841r2516N07287K39171J75265
$$ y = [153473499, 142714166, 130156709, 117849404, 107273340, 98161843, 88938754, 80162693, 72617933, 66626428, 61296486, 57437726, 54703694, 51863303, 49365341, 48106305, 46641110, 45571523, 45022980, 44725356, 45034934, 45872864, 46952396, 48943193, 51000564, 53710685, 57043330, 60793477, 65992579, 72857909, 81266636, 90948122, 101227402, 107861292, 107930796, 99916424, 87835352, 76410401, 66340509, 58586034, 52630355, 47691426, 44626403, 41700847, 39498662, 37872314, 36443888, 34562920, 32563661, 31203090, 30304485, 29567804, 29721264, 28899428, 28925366, 28542297, 28754166, 29017598, 28686506, 28738225, 28583029, 29274844, 29632174, 29652015, 29559499, 30066786, 30305957, 30481222]
4231C0481222k71369o77459j272733j372675j630767j418734o31911o02686j99103
4222B2403785K10737q3480R5564L28661M30682P15878l0129L5080K91123q47502
4212B3550399j185940k02866j385598j162815j059319j574935n24853m64598j93641
4203A5795834o58353p64897l47464J17486j54241p0202m98480o10400m58068m47734
4193A1903481K09422k92639M51419N71189n50727Q8562J88627j15254J3841j44966
4183A2322955j30439K25063o8745M87486n1047q59453k8048J34951j78753j79129
4173A1674841j43487n05380r7505R4132J21535K85346n11763K79223O72655J02041
4163A1971638Q9336K16479J98462J38149L43957K5428L59993L15211L38388N54615
$$ y = [30481222, 30209853, 29532394, 28259661, 26886986, 25256219, 23837485, 23205574, 22602888, 22403785, 22614522, 22531042, 22626606, 22955267, 23385949, 24101827, 24071698, 24106778, 24397901, 23550399, 22364459, 22161593, 20775995, 19613180, 18553861, 16978926, 16454073, 15989475, 15795834, 15137481, 14372584, 14025120, 14142606, 13988365, 13918163, 13419683, 12809283, 12351215, 11903481, 12112903, 11820264, 12271683, 12842872, 12292145, 12380707, 12569334, 12454080, 12467921, 12322955, 12192516, 12417579, 12348834, 12836320, 12785273, 11925820, 11897772, 12032723, 11853970, 11674841, 11531354, 11025974, 10928469, 11022601, 11144136, 11429482, 10917719, 11196942, 11869597, 11971638, 12060974, 12277453, 12475915, 12614064, 12958021, 12983449, 13343442, 13658653, 13997041, 14551656]
4153A4551656L13714R0572L27177L31413N03016L13870L59708R10416R35430J032050
4143A9669022J157823L11364j090629r17564j176067q35050j123337P868l06950
4134A5696480j26281J22156m4582k23292m46559j63010K70787m4601k53354K57256
4124A5045000k93984Q59107j22773k33K84376L25491K12126j03077L83625O80033
4114A7269691k72983M38488Q09192Q9405P43324J068008L0206Q5149K24976P00367
4104B1185823R23908P65217R21915K09727Q95783K81011P26236J168108Q41132
4095B7918860J365824J148797O96400J674108J843843Q47177J454102J435305
4087C8384416K244073K634079K740699L522655M040398N236852P126592Q210626
$$ y = [14551656, 14865370, 14955942, 15283119, 15614532, 16117548, 16431418, 16791126, 17701542, 18636972, 19669022, 20826845, 21138209, 20047580, 19130016, 17953949, 17118899, 15995562, 16003430, 15696480, 15570199, 15692355, 15647773, 15424481, 14977922, 14814912, 15085699, 15041098, 14787744, 15045000, 14751016, 15610123, 15487350, 15487117, 15771493, 16096984, 16309110, 16206033, 16589658, 17269691, 16996708, 17435196, 18244388, 18333793, 19077117, 20145125, 20175331, 20260480, 20485456, 21185823, 22109731, 22874948, 23796863, 24006590, 24902373, 25183384, 25909620, 27077728, 27918860, 29284684, 30433481, 31129881, 32803989, 34647832, 35495009, 36949111, 38384416, 40628489, 43262568, 46003267, 49525922, 53566320, 58803172, 65929764, 74140390]
4079G4140390J0186170J2777646J5175147J8151228J9097743J8974989J6979343
4072A85482656J4231445Q241552l101664j2888338j8290893j9433070k0736835
4065A33504853j9648236j5897223j2122599r905629p647360o162186o177787m320939
4057E1622894l615764l677847l307254k800352j582744j558904k950675j931660
4049C0197694j115811n82082m70757j108313n06693j174019j003844n54062j326056
4040B2356057p96183l85912m69174o69868r09407q10903l01949o84295l95331
4031A6933035p38391m26124n52175l89780n19125m15847n30571n2165Q4719l23666
4021A3069910j91471o66073p05467K41985R2528q3558K61020j61513k79256n87841
$$ y = [74140390, 84326560, 97104206, 112279353, 130430581, 149528324, 168503313, 185482656, 199714101, 207955653, 204853989, 191965651, 173674758, 154241688, 133504853, 113856617, 97959394, 85836795, 75931166, 68283806, 62121620, 55943833, 51622894, 48007130, 44329283, 41022029, 38221677, 36638933, 35080029, 32129354, 30197694, 29081883, 28499801, 28029044, 26920731, 26414038, 25240019, 24236175, 23682113, 22356057, 21559874, 21173962, 20704788, 20034920, 19125513, 18314610, 18012661, 17328366, 16933035, 16194644, 15768520, 15216345, 14826565, 14307440, 13891593, 13361022, 13308857, 13393576, 13069910, 12878439, 12212366, 11506899, 11748884, 11841412, 11757854, 12018874, 11857361, 11578105, 10990264]
4011A0990264l52715j58961J54228O12049J11317j82516p63181l78495k48835
4002I783155m73129k6186j80855L3142j88038r0486q02012k73687j38077O8308
3992G712135M38615k7996k20187L05545J3971j06615J56659l07456n7347J26629
3982H033953p84059k36048K14465K79644K56521k70920M4253j0915p07611J80012
3972F999295M07754Q097j47716J44710J43373p49780k61620L94481K01093o15898
3962F523789j9804M14232k65683n41246J66563L37660O9652L68802q3387j38693
3952F831885l68891l7874L71402N8701p62851K65258L16688q52255r7388m1470
3942E683205K603l4941l0855J60445M31835p73359j41287K63054n7116R6903j9873
$$ y = [10990264, 10637549, 10478588, 10632816, 11244865, 11356182, 11173666, 10410485, 10031990, 9783155, 9310026, 9283840, 9102985, 9136127, 8948089, 8857603, 8055591, 7781904, 7643827, 7712135, 8150750, 8122754, 7902567, 8208112, 8222083, 8115468, 8272127, 7964671, 7907324, 8033953, 7249894, 7013846, 7228311, 7507955, 7764476, 7493556, 7537809, 7526894, 6819283, 6999295, 7407049, 7415146, 7267430, 7412140, 7555513, 6805733, 6544113, 6938594, 7139687, 6523789, 6503985, 6918217, 6652534, 6111288, 6277851, 6615511, 6685163, 7053965, 6970578, 6831885, 6462994, 6425120, 6796522, 6855223, 6092372, 6357630, 6674318, 5822063, 5724675, 5683205, 5685808, 5650867, 5620012, 5780457, 6212292, 5438933, 5297646, 5560700, 5503584, 5600487, 5580614]
3931E580614J93130n21976n2770J91437K82659l48090M0915K45909J63739l81953
3921E393614m08866L26770L22410j89863l35084M21146m19516L63349M633Q9166
3911E567759o5631j72288M15493l78489l60383L65909m6488J97082j27560R4032
3901E489436O02315k36200n13803j86679k63029N06533M65912L7517j12592K41791
3891F031201J71753J06115m85882K33541P42226k07977N23305m0500j37404j65251
3881F771127P21868l28712m67710N38408O36176L04442J52090j21564L82677K52116
3871H840918M32301M77686k95195L78365K84568p01388o21798j17208M73966l67592
3861H784623m8849J72869J96424Q113M42837l58666l42867p2690K92137M0846
$$ y = [5580614, 5773744, 5251768, 5198998, 5390435, 5673094, 5325004, 5365919, 5611828, 5775567, 5393614, 4984748, 5311518, 5633928, 5444065, 5108981, 5530127, 5110611, 5473960, 5478593, 5567759, 5502128, 5329840, 5745333, 5366844, 5006461, 5372370, 5325882, 5522964, 5395404, 5489436, 6091751, 5855551, 5341748, 5155069, 4892040, 5398573, 5864485, 5902002, 5789410, 6031201, 6202954, 6309069, 5823187, 6056728, 6798954, 6590977, 7114282, 7073782, 6936378, 6771127, 7492995, 7164283, 6696573, 7234981, 7871157, 8175599, 8327689, 8206125, 8588802, 8840918, 9273219, 9750905, 9455710, 9834075, 10118643, 9417255, 8795457, 8678249, 9152215, 8784623, 8735774, 8908643, 9105067, 9113180, 9556017, 9197351, 8854484, 8781794, 9073931, 9114777]
3851I114777k28213L02442j98839O11334r8460J91384L50059K84318K98488O394
3841A0633684J19900K02550J56629N19242J28582P58506M46871M38341P74710
3832A4179015J43827r1549K09689P61103R94828P57296O74658N63541M25598Q40911
3822A9458917J572767J679292J970635K461681L781649L780736M608608N981872
3814D5296157P628350R260769J1425280J2411650R412243L567653r67653o825213
3806I1209236j2268471j3617589j1441392q580181o515333m485022l376876k858058
3798B8066314j626655j796520k101095j545477j681948j003069j711933j507732
3790A5091885n77764l32674o87410m72400l10524l05154j89236m71610o04122
$$ y = [9114777, 8886564, 9189006, 8990167, 9601501, 9503041, 9694425, 10044484, 10328802, 10627290, 10633684, 10753584, 10956134, 11112763, 11632005, 11760587, 12519093, 12965964, 13404305, 14179015, 14322842, 14231293, 14440982, 15202085, 16196913, 16954209, 17628867, 18192408, 18618006, 19458917, 21031684, 22710976, 24681611, 27143292, 30924941, 34705677, 39314285, 45296157, 52924507, 62185276, 73610556, 86022206, 95434449, 99002102, 98034449, 91209236, 78940765, 65323176, 53881784, 45301603, 38786270, 34301248, 30924372, 28066314, 26439659, 24643139, 22542044, 20996567, 19314619, 18311550, 16599617, 15091885, 14514121, 14181447, 13494037, 13021637, 12711113, 12405959, 12216723, 11745113, 11140991]
3781A1140991k3552J57659j78062m06301K32704k26771n87390m46485m689j95187
3771I462917k16444m76169p55194l06388J78103p6018L6502j37022m41343K1189
3761G290133L22592Q0887m92219r9279M9265k86341j56417J22195j47651l62827
3751F320338J00552N3412L6296l78450J95675j8082j71536k13831P0869j69935
3741E825308M3000L14896J44823j83114l22322m94530l7317R11781K26755l09792
3731F119488m9261K26612k71221m53457P8857j17608k21495q0453l745j45021
3721E082696k7229k91512k69133m5368k79567K0898M43270p936k95399J36397
3711D467117j25956P7846o1214j00005N3967r4700q0242L32719r1201L59121j72387
$$ y = [11140991, 11117439, 11275098, 11097036, 10690735, 10923439, 10696668, 10109278, 9662793, 9658104, 9462917, 9246473, 8770304, 8015110, 7708722, 7886825, 7810807, 7847309, 7710287, 7268944, 7290133, 7612725, 7693612, 7201393, 7102114, 7151379, 6865038, 6708621, 6830816, 6683165, 6320338, 6420890, 6474302, 6510598, 6132148, 6327823, 6309741, 6138205, 5924374, 5995243, 5825308, 5868308, 6183204, 6328027, 6144913, 5822591, 5328061, 5290744, 6202525, 6429280, 6119488, 6070227, 6296839, 6025618, 5572161, 5651018, 5533410, 5311915, 5231462, 5227717, 5082696, 5055467, 4763955, 4494822, 4449454, 4169887, 4190785, 4634055, 4626119, 4330720, 4467117, 4341161, 4419007, 4357793, 4257788, 4311755, 4217055, 4136813, 4469532, 4378331, 4737452, 4565065]
3700D565065n0210o14286K15647L38580m06751N7993J72763q5566K42444J14462
3690D550141O8195k28501J64363N07202j76439N17140J75340J26338J71800K75278
3680F150857j15845K14418Q94583N13699m843O42903K94217m0954M66922O6282
3670I082239n06383q71522p42003l91824J0262j095504K00308l77876n42220L92732
3660E158209m32421j81804o82103k69849J88091l47588L6596L45064l9817m47144
3650C327234K5918l8075m3112n9348L62290J65916j43357o45133n71614N8297
3640B439016O11229P0625L66389l68057r07869J98777k46174M01185O28843J19259
3630C313223k56563P1410J64184Q2843m53162k25372J45061J03756l36530M54595
$$ y = [4565065, 4514855, 3900569, 4116216, 4454796, 4048045, 4106038, 4278801, 4193235, 4435679, 4550141, 4618336, 4389835, 4554198, 5061400, 4884961, 5402101, 5577441, 5703779, 5875579, 6150857, 6035012, 6249430, 7144013, 7657712, 7652869, 8295772, 8589989, 8549035, 9015957, 9082239, 8575856, 7704334, 6962331, 6570507, 6580769, 5485265, 5685573, 5307697, 4765477, 5158209, 4725788, 4543984, 3861881, 3592032, 3780123, 3432535, 3469131, 3814195, 3774378, 3327234, 3353152, 3315077, 3271965, 3212617, 3574907, 3740823, 3597466, 2952333, 2380719, 2439016, 3050245, 3120870, 3487259, 3119202, 2211333, 2410110, 2163936, 2565121, 3193964, 3313223, 3056660, 3128070, 3292254, 3375097, 2921935, 2696563, 2841624, 2945380, 2608850, 3063445]
3620C063445o7445m7381j16568K93275K20219j53998k69007m9921m38754J66266
3610B600131K99627j79581K26291J33361K67813R8580j68804k38657J51280K65364
3600C455405K89448l64943K68346l95457r14405M9341K67182J52505J11901K9288
3590B948611j037j81840N7045J8351r954J38965J84608l81486l18946N76373L80829
3579C411519L15662p12741j39120M20834j18226J71541L30201k2195k3210l70179
3569C264086J94206j65330J88404K87327K20187l41097q41210N81350M24106o569
3559C805460L69277j57054m2556K62790J14173J52831l80116K9486J47642J84073
3549D486006K20631j10554j49658N28973o3681j10819k59045J74866L53130n11963
$$ y = [3063445, 2996000, 2948619, 2832051, 3125326, 3345545, 3191547, 2922540, 2872619, 2433865, 2600131, 2899758, 2720177, 2946468, 3079829, 3347642, 3446222, 3277418, 3038761, 3190041, 3455405, 3744853, 3379910, 3648256, 3252799, 2338394, 2387735, 2654917, 2807422, 2919323, 2948611, 2947574, 2765734, 2822779, 2841130, 2831176, 2970141, 3154749, 2773263, 2454317, 3030690, 3411519, 3727181, 3014440, 2875320, 3296154, 3177928, 3349469, 3679670, 3657475, 3634265, 3264086, 3458292, 3292962, 3481366, 3768693, 3988880, 3647783, 2806573, 3387923, 3812029, 3805460, 4174737, 4017683, 3975127, 4237917, 4352090, 4504921, 4124805, 4154291, 4301933, 4486006, 4706637, 4596083, 4446425, 4975398, 4911717, 4800898, 4541853, 4716719, 5069849, 4557886]
3539D557886l69212J11561l10145R491N98079k69168K0578K10700j87677m33746
3529C938347O51622K661J84191O3356j06281M60023J21850J9837m07416j50182
3519D778008K88178m20539m3665K21530l3157K82964j42006l85866K35433L30632
3509E111512o6333j47878r13494K55460N57178k01954P1734Q84465o61466j46573
3499D742651M18547J05851M08978K66430j68776P23798j17031J7218K06544l16741
3489F287469J17298M3349m08565K11419K30226p28523L81628M74040l28749j14741
3479F164851L40621K57423m01456J95251L80145l20893m07675L52188p6638k66430
3469F217387K60698L42301j59762m96971N70027K56896k37711N82692K7175j57770
$$ y = [4557886, 4188674, 4300235, 3990090, 3999581, 4597660, 4328492, 4349070, 4559770, 4372093, 3938347, 4589969, 4592630, 4776821, 4840177, 4733896, 5193919, 5315769, 5335606, 4928190, 4778008, 5066186, 4645647, 4601982, 4823512, 4790355, 5073319, 4931313, 4545447, 4780880, 5111512, 5045179, 4897301, 3983807, 4239267, 4796445, 4594491, 4666225, 5550690, 4889224, 4742651, 5161198, 5267049, 5676027, 5942457, 5773681, 6497479, 6380448, 6397666, 6604210, 6287469, 6404767, 6448116, 6039551, 6250970, 6481196, 5752673, 6134301, 6608341, 6279592, 6164851, 6505472, 6762895, 6361439, 6556690, 6936835, 6615942, 6208267, 6560455, 6483817, 6217387, 6478085, 6820386, 6660624, 6163653, 6733680, 6990576, 6752865, 7335557, 7362732, 7204962]
3459G204962R24330P19051R2633n7174k90429J7702m16508R4692Q8420l23203
3449H054476p4938J59857m62693m07647O25301Q0059k85256o72005O11613K91176
3439G919943K79371k18889L87159j02079R9212P27596n5345O8542L17776l97452
3429I025834n87110n74444n17365q8645l63366J00626M94506K06111l91300m5100
3419G259747Q2240n49324K34420L98019O25742Q18729J80314o8113J193374k44
3409A0174904j54055l19287k05142o3488q07933q1899K88017l6814K93335N57611
3399I645249o82152L69109l30497j54991R13484L94872N09730k40033n841O85212
3389A1104142j372l06335O00487k87017K38790M5196M06237N27484O73847M92876
$$ y = [7204962, 8129292, 8848343, 8940976, 8883802, 8593373, 8611075, 8194567, 8289259, 8377679, 8054476, 7979538, 8139395, 7676702, 7269055, 7894356, 7974415, 7689159, 7017154, 7628767, 7919943, 8199314, 7980425, 8367584, 8265505, 8364717, 9092313, 9036968, 9105510, 9423286, 9025834, 8438724, 7864280, 7346915, 7258270, 6894904, 6995530, 7490036, 7696147, 7304847, 7259747, 7341987, 6792663, 7027083, 7425102, 8050844, 8869573, 9049887, 8981774, 10175148, 10174904, 10020849, 9701562, 9496420, 9432932, 8624999, 8543100, 8831117, 8794303, 9087638, 9645249, 8963097, 9332206, 9001709, 8846718, 9760202, 10155074, 10664804, 10424771, 10418930, 11104142, 11102770, 10796435, 11396922, 11109905, 11348695, 11393891, 11800128, 12327612, 13001459, 13494335]
3379A3494335N57504L22780m31086m54790j097057m20506o87207j4143J07400
3370A1377230p07476l80508j56515k9716M40617k94423k23107k72856Q7814k26668
3360I614392k40135k50702N02970L59593L94434L42011j57487J09519N55519Q38466
3350A2068580K33444K58651R54446L03795J0027n03957o46417o73308n41822J17885
3340A1581324j11167J25338j4473K2773j39605j16108k35572K98794J08570M30112
3330A1949986J55298k16872P87057k5984j37630O24975N17012N50508P04808K28284
3320A5137442M79362L71144J065503Q66803P55194M9820N70385P76495R95309
3311B1067457M32996R80597J297123R98877J673867J377563K713096K652777J430417
$$ y = [13494335, 14051839, 14374619, 13943533, 13488743, 12391686, 11971180, 11283973, 11269830, 11377230, 10669754, 10289246, 10132731, 10103015, 10543632, 10249209, 10026102, 9753246, 9841060, 9614392, 9374257, 9123555, 9626525, 9986118, 10380552, 10722563, 10565076, 10674595, 11230114, 12068580, 12302024, 12560675, 13515121, 13818916, 13828943, 13324986, 12678569, 12005261, 11463439, 11581324, 11470157, 11595495, 11581022, 11603795, 11464190, 11348082, 11112510, 11411304, 11519874, 11949986, 12105284, 11888412, 12675469, 12649485, 12511855, 13136830, 13653842, 14204350, 14909158, 15137442, 15616804, 15987948, 17053451, 17920254, 18675448, 18725268, 19295653, 20072148, 21067457, 21500453, 22481050, 23778173, 24777050, 26450917, 27828480, 30541576, 33194353, 34624770]
3302C4624770J550417J822319K264976L660203M477445N808463N541851J861797
3294F1612241n28736J34269j161881l793782m998020m614659l398047k527703
3286D0723682j329394j049697o14093R91806l36515L41888K33021O29757J497595
3277D1088050J342660K500189K628955L116502L886006M181678L148664K729520
3269F4622224L364183M069392M997256P651146J0478520J0356669O478473M36753
3261A12454616j372312j518606n900447r843802j0719119p664985n312565l547422
3253F6575358j874239n60187P10738J381029L433167M283860M003436N987477
3245H3940639P579648R445385J3351870J2286885L049695p881177j2589928j1131320
$$ y = [34624770, 36175187, 37997506, 40262482, 43922685, 48400130, 54208593, 59750444, 61612241, 61083505, 61217774, 60055893, 56262111, 51264091, 46649432, 43251385, 40723682, 39394288, 38344591, 37730498, 38722304, 38385789, 38727677, 38960698, 39590455, 41088050, 42430710, 44930899, 47559854, 50676356, 54562362, 58744040, 61892704, 64622224, 67986407, 72055799, 77053055, 84704201, 95182721, 105539390, 112017863, 112454616, 111082304, 109563698, 103663251, 93819449, 83100330, 75435345, 70122780, 66575358, 64701119, 64140932, 64851670, 66232699, 69665866, 73949726, 77953162, 83940639, 91520287, 100965672, 114317542, 126604427, 129654122, 121772945, 109183017, 98051697]
3237I8051697o894072m746208k124074k20797K121254L329189K118036n16624
3229I1118401k165794k092837j571968m230342n761959m464301l252929j545464
3221F6032807m94982Q07651L021543M156950N655782P864412R328729J1281240
3213A07654132J3879999J8041829K3303175J9120527k925380k3304679k7895865
3206A27873738k0712455j4815189j1177412q527788o091165l890205l711898k655067
3198E6292559k963257l066908k580890k356416k392449j313985p37372r83357
3190C9897925n52380K29168J088712J546299J958757K181154L984498N148795
3182E5482928N744942O921540Q328955J1377438P661908l014981j1408804j3631467
$$ y = [98051697, 91157625, 86411417, 84287343, 84066546, 86187800, 89516989, 91635025, 91118401, 88952607, 86859770, 85287802, 81057460, 75295501, 70831200, 67578271, 66032807, 65537825, 66345476, 69367019, 73523969, 79179751, 87044163, 96372892, 107654132, 121534131, 139575960, 162879135, 181999662, 179074282, 155769603, 127873738, 107161283, 92346094, 81168682, 72640894, 66549729, 62659524, 58947626, 56292559, 53329302, 50262394, 47681504, 45325088, 42932639, 41618654, 40881282, 39897925, 39345545, 39574713, 40663425, 42209724, 44168481, 46349635, 50334133, 55482928, 61227870, 68149410, 76478365, 87855803, 95517711, 92502730, 81093926, 67462459]
3174F7462459j0079124p083159n732824m094413k622032j616667j268286j798882
3166C3167072j481849j860400k408670j569501j269175j369419q55849j406667
3158B0945542j227053l87466q62699n65459j63901l45816k75992l04279k52016
3149A6560861k93253j028668l756Q00774K54795l99046j43998j73382n79880J3823
3139A5008270k62088J06556k68503m32592K18561q74033m45705J9526n09841n1475
3129A2508676n5347l36393l67173m26573l48962q8300l69635j18454J86800l27866
3119A0256773m79860O69936p2273n69511o0459O26133M56863N24297L22496l40085
3109A1334310o68711q41163Q8551J12692j35033k03085n0188m75254l86787L3681
$$ y = [67462459, 57383335, 50300176, 44567352, 40472939, 37850907, 36234240, 34965954, 33167072, 31685223, 29824823, 27416153, 25846652, 24577477, 23208058, 22352209, 20945542, 19718489, 19331023, 18468324, 17902865, 17738964, 17393148, 17117156, 16812877, 16560861, 16267608, 15238940, 15235184, 16035958, 16290753, 15891707, 15747709, 15574327, 14994447, 15008270, 14746182, 14852738, 14584235, 14151643, 14370204, 13496171, 13050466, 13069992, 12560151, 12508676, 12453329, 12116936, 11749763, 11323190, 10974228, 10885928, 10516293, 10397839, 10584639, 10256773, 9776913, 10446849, 10374576, 9805065, 9744606, 10370739, 10827602, 11351899, 11674395, 11334310, 10665599, 9824436, 9912987, 10025679, 9890646, 9687561, 9637373, 9162119, 8775332, 8809013]
3099H809013m23447n01912K24264q9473n71301l69456J59434j28422k19393j27364
3089F761943L46560j22631k81243J20618n59088l44655K12485J88877Q10156J74008
3079G307030k09618L9460j00052k06575J77991L34176J11082r5441l62595l61565
3069F633893l11437j95387n45821L83759K2595k02480K32851p39076o64148k21538
3059D393211n7756q2213p7739k0479K63214k3368J58740m0918m4313J0140o38530
3048C839989k98876K22411L45972M00710K82749n40872N09104J81988m22736j60443
3038D359996J90933m9227k39502K6421L26942K27841o0743M7789j70680o12967
3028D046803q5143K18655k80305l36448K26421l8560n23579l97286P9890K73044
$$ y = [8809013, 8385566, 7883654, 8107918, 8018445, 7447144, 7077688, 7237122, 7108700, 6889307, 6761943, 7108503, 6985872, 6704629, 6825247, 6266159, 5921504, 6133989, 6322866, 7133022, 7307030, 7097412, 7136872, 7036820, 6830245, 7008236, 7342412, 7453494, 7358053, 6995458, 6633893, 6322456, 6127069, 5581248, 5965007, 5987602, 5785122, 6017973, 5278897, 4614749, 4393211, 4335455, 4253242, 4175503, 4155024, 4418238, 4394870, 4553610, 4512692, 4468379, 4478519, 3839989, 3541113, 3763524, 4109496, 4510206, 4792955, 4252083, 4761187, 4943175, 4520439, 4359996, 4550929, 4501702, 4262200, 4288621, 4615563, 4843404, 4782661, 4830450, 4659770, 4046803, 3961660, 4180315, 3900010, 3563562, 3789983, 3751423, 3227844, 2830558, 2910448, 3183492]
3018C183492L7051L01975n0185K83790m45764k21858R390k44331K91381K9693
3008C174634J19318M12169m24946J76945K29130l88660K85475J15965l8054j18356
2998C543620M3935l03714k64860k44046L48171J94362l51795k2529k25519j56105
2988B561520j9547j95170J83571K05359k22124j2263j01966J79228J4717J4448
2978B607773k02553l5199L95695L3896O20234N8320n58849L27840l95349k69434
2968B582374L31779L74523J97991n34639L01370k65946N421R6984m397M0970p5751
2957C050679K07892o4185K48763J69476n41637m29419m62904P28580K15267n78333
2947B544179L17425J38519k01075r8508j70995j68886K04451Q30918r4748n33287
$$ y = [3183492, 3220543, 3522518, 3472333, 3756123, 3310359, 3088501, 3097891, 2853560, 3144941, 3174634, 3293952, 3706121, 3281175, 3458120, 3687250, 3298590, 3584065, 3700030, 3661976, 3543620, 3587555, 3283841, 3018981, 2774935, 3123106, 3317468, 2965673, 2943144, 2717625, 2561520, 2541973, 2346803, 2530374, 2735733, 2513609, 2501346, 2399380, 2578608, 2593325, 2607773, 2405220, 2370021, 2765716, 2799612, 3419846, 3478166, 2919317, 3247157, 2851808, 2582374, 2914153, 3288676, 3486667, 2952028, 3253398, 2987452, 2992873, 3089857, 3085460, 3126430, 3050679, 3258571, 3194386, 3443149, 3612625, 3070988, 2641569, 2178665, 2907245, 3122512, 2544179, 2861604, 3000123, 2799048, 2700540, 2529545, 2360659, 2565110, 3396028, 3301280, 2767993]
2937B767993L05826k5733J77210k13989m9981l23625K57249J51231O73143n11606
2927C207718k99019M72431O9583j70799J78424K51133l90921m82914M76788k35687
2917C076737l77855R2034K09516l45301l36079L55495N13065J45492m07995m0706
2907B884403O41958m12401o7296R0824k61655L89173m34457J1578N34465K03501
2897C580093J15782r7597m02438L79919l14402K03533l13239m94554L47461K96550
2887C301108o32386p7560J33503M03155l31088J41099N9702m17977K94311K30963
2877C104830J23271j57971K09862q1172n29492k03900L29031K31152J54238J8022
2867C197871m48333l30675k38554p232L43389j53726k18178K1787n0302J57747
$$ y = [2767993, 3073819, 3048086, 3225296, 3011307, 2961326, 2637701, 2894950, 3046181, 3719324, 3207718, 2908699, 3381130, 3450713, 3279914, 3458338, 3709471, 3318550, 2835636, 3312424, 3076737, 2698882, 2790916, 3000432, 2655131, 2319052, 2674547, 3187612, 3333104, 2925109, 2884403, 3526361, 3113960, 3046664, 3137488, 2875833, 3265006, 2830549, 2842127, 3376592, 3580093, 3695875, 3598278, 3195840, 3575759, 3261357, 3464890, 3151651, 2657097, 3004558, 3301108, 2668722, 2591162, 2724665, 3127820, 2796732, 2937831, 2997533, 2579556, 2873867, 3104830, 3228101, 3070130, 3279992, 3198820, 2669328, 2465428, 2794459, 3025611, 3179849, 3197871, 2749538, 2418863, 2180309, 2173077, 2516466, 2362740, 2144562, 2166349, 2116047, 2273794]
2857B273794J07438k09658K95841j52327o35052J34570L82243K96558n85408J63240
2847B071239J05445l25660J67818m07704n37388J76874J63184L69310l09396l09036
2837A164686K94083m08434n6418Q08084P4793l62354l72772J40207K77947m78651
2827A081171M80357o990n69959L7522J30561R0089l12074k52303J35136L54117
2817A167627J05812j78959k93409L6063k96900L91137m819k27829L67913j14265
2807I52371N6792l28426j2706j6782K78838l23675M44504k67791j37035M76079
2797A122169j54920J4265k54042m68873K30095J23129R1760J77924P9450J51163
2787A112120p65559L72979L14736m39720J11501j41685j74638O46018k74694m5394
$$ y = [2273794, 2381232, 2171574, 2467415, 2315088, 1680036, 1814606, 2196849, 2493407, 1907999, 2071239, 2176684, 1851024, 2018842, 1611138, 1073750, 1250624, 1413808, 1783118, 1473722, 1164686, 1458769, 1050335, 993917, 1802001, 1876794, 1514440, 1141668, 1281875, 1559822, 1081171, 1561528, 1554538, 984579, 1022101, 1152662, 1242751, 930677, 678374, 813510, 1167627, 1273439, 1094480, 801071, 837134, 540234, 931371, 926552, 698723, 1066636, 952371, 1009163, 680737, 668031, 651249, 930087, 606412, 1050916, 783125, 646090, 1122169, 967249, 981514, 727472, 258599, 488694, 611823, 703583, 881507, 960957, 1112120, 346561, 719540, 1034276, 594556, 706057, 564372, 389734, 1035752, 761058, 715664]
2777G15664j19215k10427N68825j88610n29843M53073L1379k47988N7209k72759
$$ y = [715664, 596449, 386022, 954847, 766237, 236394, 689467, 720846, 472858, 530067, 257308]
$$ [...]
##END NTUPLES=NMR SPECTRUM
##END=
