##TITLE=1H_EC-3273
 CDCl3
 8 sc, 
 11.05.2022
##JCAMPDX= 6.0         $$ Bruker NMR JCAMP-DX V2.0
##DATA TYPE= NMR SPECTRUM
##DATA CLASS= NTUPLES
##ORIGIN= UXNMR, Bruker Analytische Messtechnik GmbH
##OWNER= root
$$ XWIN-NMR		Version 3.5
$$ Wed May 11 11:30:38 2022 Russian Standard Time (UT+4h)  she@DPX200
##.OBSERVE FREQUENCY= 200.1313499996
##.OBSERVE NUCLEUS= ^1H
##.ACQUISITION MODE= SIMULTANEOUS
##.ACQUISITION SCHEME= undefined
##.AVERAGES= 8
##.DIGITISER RES= 18
##SPECTROMETER/DATA SYSTEM= spect
##.PULSE SEQUENCE= zg30
##.SOLVENT NAME= CDCl3
##.SHIFT REFERENCE= (INTERNAL, CDCl3, 0, 15.7248)
##AUDIT TRAIL= $$ (NUMBER, WHEN, WHO, WHERE, WHAT)
$$ ##TITLE= Audit trail, XWIN-NMR		Version 3.5
$$ ##JCAMPDX= 5.01
$$ ##ORIGIN= Bruker BioSpin GmbH
$$ ##OWNER= she
$$ F:/spectra/data/she/nmr/H-F/1/pdata/1/auditp.txt
$$ ##AUDIT TRAIL=  $$ (NUMBER, WHEN, WHO, WHERE, WHAT)
(   1,<2022-05-11 11:29:37.84 +0400>,<she>,<DPX200>,
      <created by zg, POWCHK disabled, PULCHK disabled
       configuration hash MD5:
       00 E9 B6 7A A2 85 ED C7 34 08 36 98 17 FE 4E 26
       data hash MD5: 16K
       11 A3 33 7E D1 6E CE C6 07 C7 53 EE F3 04 2E 42>)
(   2,<2022-05-11 11:29:40.25 +0400>,<she>,<DPX200>,
      <Start of raw data processing
       efp BC_mod = 2 LB = 0.24 FT_mod = 6 PKNL = 1 PHC0 = -18026.11 PHC1 = 7.80075 SI = 16K 
       data hash MD5: 16K
       AF D4 09 6B 24 78 38 78 CB F4 09 E4 47 F7 4E AD>)
(   3,<2022-05-11 11:29:53.90 +0400>,<she>,<DPX200>,
      <pk PHC0 = -2.162207 PHC1 = 2.4 
       data hash MD5: 16K
       78 B1 D7 02 49 B5 DF 40 20 0B 82 BD FD 41 F8 56>)
(   4,<2022-05-11 11:29:57.06 +0400>,<she>,<DPX200>,
      <abs ABSG = 5 
       data hash MD5: 16K
       35 98 A7 AD 97 B2 50 91 5F 75 B2 03 C4 87 41 14>)
$$ ##END=
$$ 
$$ hash MD5
$$ F1 D3 9C 0F A2 63 43 E5 E4 3D 2A 59 3C DC F0 21
##$RELAX= 
##$RELAX= 
##$RELAX= 
##$RELAX= 
##$RELAX= 
##$RELAX= 
$$ Bruker specific parameters
$$ --------------------------
##$DU= <F:/spectra>
##$EXPNO= 1
##$NAME= <H-F>
##$PROCNO= 1
##$TYPE= <nmr>
##$USER= <she>
##$AMP= (0..31)
100 100 100 100 100 100 100 100 100 100 100 100 100 100 100 100 100 100 
100 100 100 100 100 100 100 100 100 100 100 100 100 100 
##$AQSEQ= 0
##$AQ_mod= 1
##$AUNM= <au_zg>
##$AUTOPOS= <>
##$BF1= 200.13
##$BF2= 200.13
##$BF3= 200.13
##$BF4= 200.13
##$BF5= 200.13
##$BF6= 200.13
##$BF7= 200.13
##$BF8= 200.13
##$BYTORDA= 1
##$CFDGTYP= 0
##$CFRGTYP= 5
##$CHEMSTR= <none>
##$CNST= (0..31)
1 1 145 1 1 1 1 1 1 1 1 1 1 1 1 1 1 1 1 1 1 1 1 1 1 1 1 1 1 1 1 1 
##$CPDPRG= <>
##$CPDPRG1= <>
##$CPDPRG2= <>
##$CPDPRG3= <>
##$CPDPRG4= <mlev>
##$CPDPRG5= <mlev>
##$CPDPRG6= <mlev>
##$CPDPRG7= <mlev>
##$CPDPRG8= <mlev>
##$CPDPRGB= <>
##$CPDPRGT= <>
##$D= (0..31)
0 1.2 0 0 0 0 0 0 0 0.06 0 0.03 0 0 0 0 0.0002 0 0 0 0 0 0 0 0 0 0 0 0 
0 0 0 
##$DATE= 1652254177
##$DBL= (0..7)
120 120 120 120 120 120 120 120 
##$DBP= (0..7)
150 150 150 150 150 150 150 150 
##$DBP07= 0
##$DBPNAM0= <>
##$DBPNAM1= <>
##$DBPNAM2= <>
##$DBPNAM3= <>
##$DBPNAM4= <>
$$ [...]
##$SUBNAM2= <"">
##$SUBNAM3= <"">
##$SUBNAM4= <"">
##$SUBNAM5= <"">
##$SUBNAM6= <"">
##$SUBNAM7= <"">
##$SUBNAM8= <"">
##$SUBNAM9= <"">
##$SW= 18.0517283424761
##$SWIBOX= (0..15)
0 0 2 0 0 0 0 0 0 0 0 0 0 0 0 0 
##$SW_h= 3612.71676300578
##$TD= 16384
##$TD0= 1
##$TE= 0
##$TE2= 300
##$TE3= 300
##$TEG= 300
##$TL= (0..7)
0 120 120 120 120 120 120 120 
##$TP= (0..7)
150 150 150 150 150 150 150 150 
##$TP07= 0
##$TPNAME0= <>
##$TPNAME1= <>
##$TPNAME2= <>
##$TPNAME3= <>
##$TPNAME4= <>
##$TPNAME5= <>
##$TPNAME6= <>
##$TPNAME7= <>
##$TPOAL= (0..7)
0.5 0.5 0.5 0.5 0.5 0.5 0.5 0.5 
##$TPOFFS= (0..7)
0 0 0 0 0 0 0 0 
##$TUNHIN= 0
##$TUNHOUT= 0
##$TUNXOUT= 0
##$USERA1= <user>
##$USERA2= <user>
##$USERA3= <user>
##$USERA4= <user>
##$USERA5= <user>
##$V9= 5
##$VALIST= <valist>
##$VCLIST= <CCCCCCCCCCCCCCC>
##$VD= 0
##$VDLIST= <DDDDDDDDDDDDDDD>
##$VPLIST= <PPPPPPPPPPPPPPP>
##$VTLIST= <TTTTTTTTTTTTTTT>
##$WBST= 1024
##$WBSW= 4
##$XGAIN= (0..3)
0 0 0 0 
##$XL= 0
##$YL= 0
##$YMAX_a= 215000
##$YMIN_a= -306872
##$ZGOPTNS= <>
##$ZL1= 120
##$ZL2= 120
##$ZL3= 120
##$ZL4= 120
##$ABSF1= 15.71603
##$ABSF2= -2.335819
##$ABSG= 5
##$ABSL= 3
##$ALPHA= 0
##$AQORDER= 0
##$ASSFAC= 0
##$ASSFACI= 0
##$ASSFACX= 0
##$ASSWID= 0
##$AUNMP= <proc_1d>
##$AZFE= 0.1
##$AZFW= 0.1
##$BCFW= 0
##$BC_mod= 2
##$BYTORDP= 0
##$COROFFS= 0
##$CY= -3
##$DATMOD= 1
##$DC= 0
##$DFILT= <>
##$DTYPP= 0
##$F1P= 0
##$F2P= 0
##$FCOR= 1
##$FTSIZE= 16384
##$FT_mod= 6
##$GAMMA= 0
##$GB= 0
##$INTBC= 1
##$INTSCL= 0
##$ISEN= 128
##$LB= 0.24
##$LEV0= 0
##$LPBIN= 0
##$MAXI= 10000
##$MC2= 0
##$MEAN= 0
##$ME_mod= 0
##$MI= 1.114404
##$NCOEF= 0
##$NC_proc= -7
##$NLEV= 6
##$NOISF1= 3.799351
##$NOISF2= 2.8
##$NSP= 0
##$NTH_PI= 0
##$NZP= 0
##$OFFSET= 15.72485
##$PC= 1
##$PHC0= -18028.27
##$PHC1= 10.20075
##$PH_mod= 1
##$PKNL= yes
##$PPARMOD= 0
##$PSCAL= 0
##$PSIGN= 0
##$REVERSE= no
##$SF= 200.130009342025
##$SI= 16384
##$SIGF1= 3
##$SIGF2= 2
##$SINO= 5.538805
##$SIOLD= 16384
##$SREGLST= <1H.CDCl3>
##$SSB= 0
##$STSI= 16384
##$STSR= 0
##$SW_p= 3612.71676300578
##$SYMM= 0
##$S_DEV= 0
##$TDeff= 16384
##$TDoff= 0
##$TI= <>
##$TILT= no
##$TM1= 0
##$TM2= 0
##$TOPLEV= 0
##$USERP1= <user>
##$USERP2= <user>
##$USERP3= <user>
##$USERP4= <user>
##$USERP5= <user>
##$WDW= 1
##$XDIM= 16384
##$YMAX_p= 298779108
##$YMIN_p= -9735288
$$ End of Bruker specific parameters
$$ ---------------------------------
##NTUPLES= NMR SPECTRUM
##VAR_NAME=  FREQUENCY,     SPECTRUM/REAL,   SPECTRUM/IMAG
##SYMBOL=    X,             R,               I
##VAR_TYPE=  INDEPENDENT,   DEPENDENT,       DEPENDENT
##VAR_FORM=  AFFN,          ASDF,            ASDF
##VAR_DIM=   16384,         16384,           16384
##UNITS=     HZ,            ARBITRARY UNITS, ARBITRARY UNITS
##FACTOR=    0.220516191357247, 1,           1
##FIRST=     3147.01431754861, 0,            0
##LAST=      -465.702445457174, 0,           0
##MIN=       -465.702445457174, -9735288,    0
##MAX=       3147.01431754861, 298779108,    0
$$ Real data points
##PAGE= N=1
##DATA TABLE= (X++(R..R)), XYDATA
$$ [...]
$$ plain form
6333 670168 695858 350362 423353 780460 449677 541701 486419 1062391 797365 217326
6323 217326 291273 339933 104700 207201 254329 -10378 341138 526455 870869 595109
6313 595109 840282 494043 409744 53834 455521 -43991 -27288 512405 502868 565707 447896
6302 447896 685569 208520 408905 243602 491869 447432 971332 980858 1085224 1543871
6292 1543871 1410890 1239208 811994 729482 312437 566584 487765 1087059 994527 872271
6282 872271 996460 960496 836003 882118 1407127 1458748 1021571 1348410 1376023 843848
6272 843848 655772 1157943 556635 730643 369074 330456 233887 408992 335425 548260
6262 548260 311021 383560 282124 215048 376498 210425 281008 270999 120641 76058 273912
$$ packed form
6333F70168K5690l45496P2991L57107l30783R2024n5282N75972k65026n80039
6323B17326P3947M8660k35233J02501M7128k64707L51516J85317L44414k75760
6313E95109K45173l46239q4299l55910M01687m99512J6703N39693r537O2839j17811
6302D47896K37673m77049K00385j65303K48267m4437N23900R526J04366M58647
6292A543871j32981j71682m27214q2512m17045K54147p8819N99294r2532j22256
6282H72271J24189l5964j24493M6115N25009N1621m37177L26839K7613n32175
6272H43848j88076N02171o01308J74008l61569l8618r6569J75105p3567K12835
6262E48260k37239P2539j01436o7076J61450j66073P0583j0009j50358m4583J97854
$$ plain form
6251 273912 402079 630932 300620 849238 830629 641090 249971 528134 314291 428532
6241 428532 207506 693204 471174 525600 465664 466253 618414 566745 125586 -167112 334757
6230 334757 224849 -20889 -111730 -119390 -179641 -340520 -15022 -38796 87370 293499 223838
6219 223838 -229924 -73885 227928 348161 224471 554607 331031 131660 -42835 134268
6209 134268 117887 197868 364954 467288 509988 585747 685276 338431 423525 576173 601926
6198 601926 714461 542941 621816 757445 794264 688212 507928 568976 793560 501357
6188 501357 670691 463111 477869 844805 930062 1046016 1215753 1060003 1052164 876051
6178 876051 551805 956818 1064873 796490 673203 1007187 1015320 1198379 1174915 1535322
$$ packed form
6251B73912J28167K28853l30312N48618j8609j89539l91119K78163k13843J14241
6241D28532k21026M85698k22030N4426n9936N89J52161n1669m41159k92698N01869
6230C34757j09908k45738r0841p660o0251j60879L25498k3774J26166K06129o9661
6219B23838m53762J56039L01813J20233j23690L30136k23576j99371j74495J77103
6209A34268j6381P9981J67086J02334M2700P5759R9529l46845Q5094J52648K5753
6198F01926J12535j71520P8875J35629L6819j06052j80284O1048K24584k92203
6188E01357J69334k07580J4758L66936Q5257J15954J69737j55750p839j76113
6178H76051l24246M05013J08055k68383j23287L33984Q133J83059k3464L60407
$$ plain form
6168 1535322 1500476 1493677 1480320 1540244 1613222 1884252 1635778 1715619 1704350 1404260 1150583
6157 1150583 842790 885630 1443600 1133633 1239397 1258071 1537686 1226719 1613992 1150282
6147 1150282 1130642 1086999 1394219 1243447 1085128 1617463 1578184 1000870 861048 1144253
6137 1144253 1009155 1276313 1134205 1110712 765195 906876 876221 1061921 814957 1342456
6127 1342456 1852990 1539911 1539611 1416305 1859350 1617685 1633167 1743981 1536024 1591729
6117 1591729 1929538 1661204 1824144 2106975 2035518 2058470 2101004 2108366 2281003 2542980
6107 2542980 2642907 2915614 2968460 3244625 3312908 3461466 3523513 3549407 3331531 3157669
6097 3157669 3235859 3180140 3219200 3135666 3375881 3188172 3089831 3601214 3743793 3591836
$$ packed form
6168A535322l4846o799j3357N9924P2978K71030k48474P9841j1269l00090k53677
6157A150583l07793M2840N57970l09967J05764J8674K79615l10967L87273m63710
6147A150282j9640m3643L07220j50772j58319N32335l9279n77314j39822K83205
6137A144253j35098K67158j42108k3493l45517J41681l0655J85700k46964N27499
6127A342456N10534l13079l00j23306M43045k41665J5482J10814k07957N5705
6117A591729L37809k68334J62940K82831p1457K2952M2534P362J72637K61977
6107B542980R9927K72707N2846K76165O8283J48558O2047K5894k17876j73862
6097C157669P8190n5719L9060q3534K40215j87709r8341N11383J42579j51957
$$ plain form
6087 3591836 3650077 4440332 4065562 4493679 4957434 5718684 5615946 6473989 6978705 7708782
6077 7708782 7998705 8374494 8699088 8569025 8185016 7616027 7036820 6716947 6364136 5958229
6067 5958229 5712939 5284600 5016725 5198011 5529694 5643775 5649496 6033092 6192853 6353917
6057 6353917 6976281 7600382 8207508 8827216 9685706 10271951 11525027 12183915 12718725
6048 12718725 13050010 12992496 11888542 10744031 10014597 8782017 7872672 6961774 6585600
6039 6585600 6114245 6034105 5623627 5426933 5798363 5558832 5828227 5741856 5989019 6069966
6029 6069966 6500668 6894507 7232027 7621641 8156510 8473576 8996649 9294566 9367257 8928529
6019 8928529 8493728 8076431 7208102 6508673 5922309 5379759 5126611 4655065 4310989 3943774
$$ packed form
6087C591836N8241P90255l74770M28117M63755P61250j02738Q58043N04716P30077
6077G708782K89923L75789L24594j30063l84009n68989n79207l19873l52811m05907
6067E958229k45290m28339k67875J81286L31683J14081N721L83596J59761J61064
6057F353917O22364O24101O07126O19708Q58490N86245J253076O58888N34810
6048A2718725L31285n7514j103954j144511p29434j232580r09345r10898l76174
6039F585600m71355q0140m10478j96694L71430k39531K69395q6371K47163Q0947
6029F069966M30702L93839L37520L89614N34869L17066N23073K97917P2691m38728
6019H928529m34801m17297q68329o99429n86364n42550k53148m71546l44076l67215
$$ plain form
6009 3943774 3890743 3710223 3813907 3417705 3019013 3149557 3185804 3165237 3056407 2926323
5999 2926323 3106907 2975708 3062320 3235092 3406239 3719024 3719425 3217726 3160798 3199908 2884316
5988 2884316 2838905 2705509 2650487 2756163 2166960 1895360 1678163 2104998 2001289 2033091
5978 2033091 1837430 1757013 1502735 1682201 1766896 1633268 1730923 1577237 1595646 1392972
5968 1392972 1621826 1580708 1956312 1773829 1841082 1709709 1676229 1312034 1495409 1279906
5958 1279906 1372739 1373027 1802170 1537395 1416700 1563875 1607085 1332737 1555918 1665503
5948 1665503 1328367 1763297 1854636 1450008 1546069 1463955 1296378 1332129 1662268 1527501
5938 1527501 1543092 1336514 1320655 962838 1064986 1575523 1456411 1842968 1807177 1717164
$$ packed form
6009C943774n3031j80520J03684l96202l98692J30544L6247k0567j08830j30084
5999B926323J80584j31199Q6612J72772J71147L12785M01n01699n6928L9110l15592
5988B884316m5411j33396n5022J05676n89203k71600k17197M26835j03709L1802
5978B033091j95661q0417k54278J79466Q4695j33628R7655j53686J8409k02674
5968A392972K28854m1118L75604j82483O7253j31373l3480l64195J83375k15503
5958A279906R2833K88M29143k64775j20695J47175M3210k74348K23181J09585
5948A665503l37136M34930R1339m04628R6061q2114j67577L5751L30139j34767
5938A527501J5591k06578j5859l57817J02148N10537j19112L86557l5791r0013
$$ plain form
5928 1717164 1562836 1604034 1188899 1533885 1422768 1618981 1977782 2058284 2068310 2054322
5918 2054322 1976613 1646602 1431860 1438167 1769730 1840717 1607888 1898094 1819831 1854156 1826059
5907 1826059 1830252 1736580 1843419 2303796 2616607 2581413 2526094 2932873 2673576 2610666 2690441
5896 2690441 2842312 2744620 2960627 3273992 3246754 3064913 3389161 3341985 3485527 3837007
5886 3837007 4150616 4210151 4346244 4215409 4454015 4956929 5158348 5437777 5648369 5703494
5876 5703494 5583081 5532708 5778149 6338433 6333388 6249042 6264644 6218840 6118129 6119061 6396051
5865 6396051 6405828 6093047 6236347 6067383 5503065 5070517 4827672 4648362 4434443 4622909
5855 4622909 4477515 4046507 3614772 3794200 3712913 3712877 3784003 3613034 3712168 3263789 3050488
$$ packed form
5928A717164j54328M1198m15135L44986j11117J96213L58801Q0502J0026j3988
5918B054322p7709l30011k14742O307L31563P0987k32829K90206p8263L4325k8097
5907A826059M193r3672J06839M60377L12811l5194n5319M06779k59297o2910P9775
5896B690441J51871r7692K16007L13365k7238j81841L24248m7176J43542L51480
5886C837007L13609N9535J36093j30835K38606N02914K01419K79429K10592N5125
5876E703494j20413n0373K45441N60284n045q4346J5602m5804j00711R32K76990
5865F396051R777l12781J43300j68964n64318m32548k42845j79310k13919J88466
5855D622909j45394m31008m31735J79428q1287l6P1126j70969R9134m48379k13301
$$ plain form
5844 3050488 3215765 3260498 3059480 3160664 3018696 2942546 2327377 2392599 2808804 2678162
5834 2678162 2664750 2839563 2916214 2665629 2948004 2810557 2759271 2829418 3076214 2984036
5824 2984036 2803473 2903933 2848597 3314248 3449580 3582010 3396566 3463493 3458386 3573422
5814 3573422 3885630 3908495 4278698 4858869 4976299 5260327 5422706 5209761 4489286 3740332
5804 3740332 3326341 3122383 3105726 2973376 2741875 2673465 2923679 2735496 2306612 2608651
5794 2608651 2565954 2558526 2716981 2991436 3265435 2833748 2713434 2776512 2560335 2499657
5784 2499657 2664390 2700896 2365477 2197157 1891678 2064979 1894819 2178914 2090967 2009139
5774 2009139 2039644 2060533 2072144 2028285 1841699 1954628 2191499 2060583 2339135 2056785
$$ packed form
5844C050488J65277M4733k01018J01184j41968p6150o15169O5222M16205j30642
5834B678162j3412J74813P6651k50585K82375j37447n1286P0147K46796r2178
5824B984036j80563J00460n5336M65651J35332J32430j85444O6927n107J15036
5814C573422L12208K2865L70203N80171J17430K84028J62379k12945p20475p48954
5804C740332m13991k03958j6657j32350k31501o8410K50214j88183m28884L02039
5794B608651m2697p428J58455K74455K73999m31687j20314O3078k16177o0678
5784B499657J64733L6506l35419j68320l05479J73301j70160K84095q7947q1828
5774B009139L0505K0889J1611m3859j86586J12929K36871j30916K78552k82350
$$ plain form
5764 2056785 2266847 2229676 1907732 2179398 2158570 2336777 1848460 2038779 1862379 1870752
5754 1870752 1841956 1836994 2347916 2119223 2282383 1935825 1971481 1737948 1973576 2058184
5744 2058184 2231519 1994556 1950798 2041538 1872827 1918727 1985540 1657404 1534523 1692985
5734 1692985 1579152 1480512 1662029 1945817 2098707 1818990 1628955 1496962 1953737 1899971
5724 1899971 1869547 1896839 2071660 1720705 1557466 1685426 1537019 1709435 1836503 1895221
5714 1895221 1596101 1590327 1528444 1420364 1346272 1299187 1257114 1509744 1650222 1399291 1645711
5703 1645711 1663403 1633266 1413019 1428771 1149930 1280431 1558440 1855460 1925624 1842878
5693 1842878 2113828 1777181 1582959 1434255 1626645 1687830 1743548 1619489 1422157 1783240
$$ packed form
5764B056785K10062l7171l21944K71666k0828J78207m88317J90319j76400Q373
5754A870752k8796m962N10922k28693J63160l46558L5656k33533K35628Q4608
5744B058184J73335k36963m3758R0740j68711M5900O6813l28136j22881J58462
5734A692985j13833r8640J81517K83788J52890k79717j90035j31993M56775n3766
5724A899971l0424K7292J74821l50955j63239J27960j48407J72416J27068N8718
5714A895221k99120n774o1883j08080p4092m7085m2073K52630J40478k50931K46420
5703A645711J7692l0137k20247J5752k78841J30501K78009K97020P0164q2746
5693A842878K70950l36647j94222j48704J92390O1185N5718j24059j97332L61083
$$ plain form
5683 1783240 1825846 1923385 1660726 2044161 2271352 1953915 1944434 2188310 2071139 1846936
5673 1846936 2040231 1517474 1558133 1433910 1557112 1518710 2014989 2194872 2375982 2396296
5663 2396296 2226362 2058695 2466774 3039579 2787197 2978435 3058869 2622165 2561762 2583132
5653 2583132 2185894 2358835 2640171 2543203 2462874 2545450 2358339 2905658 2705132 2651815
5643 2651815 2395892 2619172 2592975 2606253 2655669 2785841 2870445 2893476 2607266 2690106 2664691
5632 2664691 2459851 2571498 2802390 2947815 2966721 3091280 2878262 2279588 2233416 2944668
5622 2944668 3226326 3236619 3101197 2951704 2736123 3094842 2943241 3139814 3094512 3099869
5612 3099869 2995464 2877111 2557767 2806649 2968696 3228545 3496658 3728312 3591985 3185876
$$ packed form
5683A783240M2606R7539k62659L83435K27191l17437r481K43876j17171k24203
5673A846936J93295n22757M0659j24223J23202l8402M96279J79883J81110K0314
5663B396296j69934j67667M08079N72805k52382J91238Q0434m36704o0403K1370
5653B583132l97238J72941K81336r6968q0329Q2576j87111N47319k00526n3317
5643B651815k55923K23280k6197J3278M9416J30172Q4604K3031k86210Q2840k5415
5632B664691k04840J11647K30892J45425J8906J24559k13018n98674m6172P11252
5622B944668K81658J0293j35422j49493k15581L58719j51601J96573m5302N357
5612C099869j04405j18353l19344K48882J62047K59849K68113K31654j36327m06109
$$ plain form
5602 3185876 3444087 3670342 3537019 3584490 3578984 3761899 3389911 3496150 3642067 3817896
5592 3817896 3641676 3960185 4009220 3888607 3596984 4160056 3996618 3993045 4285119 4731112
5582 4731112 4590336 4686023 5147050 5221091 5446140 5613685 5887012 5597306 6178410 6474626
5572 6474626 6706343 6643450 6709428 7001690 6777166 6898712 7499028 8028511 8430022 9484505
5562 9484505 10000187 10764409 11380496 11478733 10499300 9620475 9526044 9375868 9449378 9741207
5552 9741207 10222630 9956920 10454162 10614277 11150637 11236376 12460831 13320971 13723574 14387617
5542 14387617 15014290 15296737 15010424 14970066 15368310 15310332 15487414 16190342 16767536 17205964
5532 17205964 17824360 18802194 19088662 19942998 20612796 22294719 23558491 25401947 27127210
$$ packed form
5602C185876K58211K26255j33323M7471n506J82915l71988J06239J45917J75829
5592C817896j76220L18509M9035j20613k91623N63072j63438l573K92074M45993
5582D731112j40776R5687M61027P4041K25049J67545K73327k89706N81104K96216
5572F474626K31717o2893O5978K92262k24524J21546O00316N29483M01511J054483
5562I484505N15682P64222O16087R8237r79433q78825r4431j50176P3510K91829
5552I741207M81423k65710M97242J60115N36360Q5739J224455Q60140M02603O64043
5542A4387617O26673K82447k86313m0358L98244n7978J77082P02928N77194M38428
5532A7205964O18396R77834K86468Q54336O69798J681923J263772J843456J725263
$$ plain form
5523 27127210 28313234 29361135 30978024 32228138 33912196 36133010 37539010 38462878
5515 38462878 37578623 36400145 34399073 33542477 32911409 32966170 32339504 32658146 32623452
5506 32623452 32666886 32474186 32417119 32753744 32777500 33011058 33458128 33610355 33763456 33998448
5496 33998448 33907915 33473534 33291557 33541665 33794464 33909332 34298731 34238897 34657576 34347328
5486 34347328 34586748 34390935 35054572 35013742 35153240 35272875 35326534 34698353 34504755 34992590
5476 34992590 35364550 36191709 36925758 37862973 37685440 38280848 39281337 40608450 41510759
5467 41510759 43346298 45086611 46943467 48602664 51144961 53641025 56236611 58926751
5459 58926751 62021234 65517328 69731873 74461003 79671575 85358977 91830146 98458902
$$ packed form
5523B7127210J186024J047901J616889J250114J684058K220814J406000R23868
5515C8462878q84255j178478k001072q56596o31068N4761o26666L18642l4694
5506C2623452M3434j92700n7067L36625K3756K33558M47070J52227J53101K34992
5496C3998448r0533m34381j81977K50108K52799J14868L89399n9834M18679l10248
5486C4347328K39420j95813O63637m0830J39498J19635N3659o28181j93598M87835
5476C4992590L71960Q27159P34049R37215j77533N95408J000489J327113R02309
5467D1510759J835539J740313J856856J659197K542297K496064K595586K690140
5459E8926751L094483L496094M214545M729130N210572N687402O471169O628756
$$ plain form
5451 98458902 104567765 110304816 116140894 121533015 126840394 131766163 134077995 133346936
5443 133346936 129671001 123091748 115379567 106916616 98559066 90021219 81572408 73339144
5435 73339144 65595672 58512725 53320382 48747709 44112833 40766466 37998908 35400636
5427 35400636 32831674 30953118 29211748 28206936 27209435 25650651 24849415 24260292 23807776
5418 23807776 22874649 22836207 22582099 22056919 21856884 21791204 21200940 20705435 20298088 19931991
5408 19931991 19401435 18940751 18888533 18690365 18439972 18202592 18482887 18487745 18419990 18426719
5398 18426719 18481968 18588909 18194031 17711355 17763614 17088522 16660974 16547273 16560414 16311626
5388 16311626 16204347 15893875 15576232 15595058 15309261 15278982 15181361 15572601 15289083 15356938
$$ packed form
5451I8458902O108863N737051N836078N392121N307379M925769K311832p31059
5443A33346936l675935o579253p712181q462951q357550q537847q448811q233264
5435G3339144p743472p082947n192343m572673m634876l346367k767558k598272
5427C5400636k568962j878556j741370j004812r97501j558784q01236n89123m52516
5418B3807776r33127l8442k54108n25180k00035o5680n90264m95505m07347l66097
5408A9931991n30556m60684n2218j98168k50393k37380K80295M858o7755O729
5398A8426719N5249J06941l94878m82676N2259o75092m27548j13701J3141k48788
5388A6311626j07279l10472l17643J8826k85797l0279r7621L91240k83518O7855
$$ plain form
5378 15356938 15267031 15596178 15457514 15896132 15920340 16035529 16167148 16103635 15858449 15876954
5368 15876954 15904885 16124510 16056779 16021550 15898995 15478588 15177744 15037079 15299431 15023270
5358 15023270 15363237 15616767 15711907 15352855 15588404 15802772 16025042 16002355 16554369 16995515
5348 16995515 17667557 18005562 18147235 18120795 18775397 19076736 19383163 20150587 20944934 21789095
5338 21789095 22510552 23515195 24541026 26200864 27575846 29858691 32176094 35153368
5330 35153368 38551213 42808952 47562142 53102514 60320818 68065151 78015813 88095422
5322 88095422 94967423 92909352 83781154 70726060 59440604 51099723 45776810 41662882
5314 41662882 38455915 36610087 35680937 34868572 34502984 35013850 35438643 36188976 37778571
$$ packed form
5378A5356938q9907L29147j38664M38618K4208J15189J31619o3513k45186J8505
5368A5876954K7931K19625o7731l5229j22555m20407l00844j40665K62352k76161
5358A5023270L39967K53530R5140l59052K35549K14368K22270k2687N52014M41146
5348A6995515O72042L38005J41673k6440O54602L01339L06427P67424P94347Q44161
5338B1789095P21457J004643J025831J659838J374982K282845K317403K977274
5330C5153368L397845M257739M753190N540372P218304P744333R950662J0079609
5322H8095422O872001k058071r128198j3055094j1285456q340881n322913m113928
5314D1662882l206967j845828r29150q12365l65588N10866M24793P50333J589595
$$ plain form
5305 37778571 39910711 42620594 45763249 49983596 55094129 59621871 62691653 62931965
5297 62931965 61107224 59558795 58296525 54331313 48436853 41636349 35876909 31456273
5289 31456273 28514264 26277381 24177044 21964524 20616004 19554831 18418167 17632974
5281 17632974 17208770 16447265 15433039 15094668 14647203 14089053 14044678 14683991 13888726
5272 13888726 13688124 13610487 13404271 12945060 12728021 12583991 12252959 11686990 11625562 11559967
5262 11559967 11292077 11246986 10904534 11090472 10905609 10708258 10749041 10887729 11118408 11314095
5252 11314095 11379630 11428387 11415454 11454707 11757739 12267763 12505124 13101510 13140116 12729455
5242 12729455 12646394 12427843 12689512 12655693 12944090 13385298 13382511 13767386 14593700 15033101
$$ packed form
5305C7778571K132140K709883L142655M220347N110533M527742L069782K40312
5297F2931965j824741j548429j262270l965212n894460o800504n759440m420636
5289C1456273k942009k236883k100337k212520j348520j061173j136664p85193
5281A7632974m24204p61505j014226l38371m47465n58150m4375O39313p95265
5272A3888726k00602p7637k06216m59211k17039j44030l31032n65969o1428o5595
5262A1559967k67890m5091l42452J85938j84863j97351M0783J38688K30679J95687
5252A1314095O5535M8757j2933L9253L03032N10024K37361N96386L8606m10661
5242A2729455q3061k18551K61669l3819K88397M41208k787L84875Q26314M39401
$$ plain form
5232 15033101 15540510 16885887 17736713 18678357 19723156 21441128 21870103 22306711 22591189
5223 22591189 22816992 21989086 21624565 21025761 20134356 19467537 19216906 18501484 17866412
5214 17866412 16920573 16931562 16457230 16263604 16691640 16871710 16969277 17535754 18348694 18933796
5204 18933796 19836178 20762855 22356396 23298290 25076043 26829088 28034304 28611885 29388724
5195 29388724 28684857 28467956 28240936 28356379 28524120 28630629 29271756 29531114 28984191
5186 28984191 28051029 26103885 23887217 22280051 20657813 19393212 18357222 17914142
5178 17914142 17442055 17574300 17277514 17550326 17183748 17429186 17884836 18236589 18828654
5169 18828654 19442229 19705244 20166136 20180573 20335416 20371730 20560178 21185612 21687620 21533906
$$ packed form
5232A5033101N07409J345377Q50826R41644J044799J717972M28975M36608K84478
5223B2591189K25803q27906l64521n98804q91405o66819k50631p15422o35072
5214A7866412r45839J0989m74332j93626M28036J80070R7567N66477Q12940N85102
5204A8933796R02382R26677J593541R41894J777753J753045J205216N77581P76839
5195B9388724p03867k16901k27020J15443J67741J06509O41127K59358n46923
5186B8984191r33162j947144k216668j607166j622238j264601j035990m43080
5178A7914142m72087J32245k96786K72812l66578K45438M55650L51753N92065
5169A8828654O13575K63015M60892J4437J54843L6314J88448O25434N02008j53714
$$ plain form
5159 21533906 21778719 21479127 20060833 18757598 17656995 16246326 14897259 14358453 13885645
5150 13885645 13264190 13005796 13045597 12452117 12690119 12466178 12445687 11980746 12003817 11599072
5140 11599072 11745164 11443377 11453455 10800935 10912613 10963974 10808207 10667740 10770753 11104993
5130 11104993 11008771 11046267 11271367 11439027 11475138 12176862 12335121 12616494 13248142 13887159
5120 13887159 14411578 14610427 14701141 14804841 14547069 14310003 13603141 12873779 12271178 12060657
5110 12060657 11286870 11030841 11121676 10961709 10906449 10751157 11023485 10898051 10602699 10289422
5100 10289422 10132462 9800225 9403484 9394628 9438202 9282068 9007002 9203567 9377369 9009512
5090 9009512 9141181 9622118 9393049 9143124 9653002 9626139 9543789 9184148 9238383 9179834
$$ packed form
5159B1533906K44813k99592j418294j303235j100603j410669j349067n38806m72808
5150A3885645o21455k58394L9801n93480K38002k23941k0491m64941K3071m04745
5140A1599072J46092l01787J0078o52520J11678N1361j55767j40467J03013L34240
5130A1104993r6222L7496K25100J67660L6111P01724J58259K81373O31648O39017
5120A3887159N24419J98849R0714J03700k57772k37066p06862p29362o02601k10521
5110A2060657p73787k56029R0835j59967n5260j55292K72328j25434k95352l13277
5100A0289422j56960l32237l96741q856M3574j56134k75066J96565J73802l67857
5090I009512J31669M80937k29069k49925N09878k6863q2350l59641N4235n8549
$$ plain form
5080 9179834 9378323 9373026 9359888 9443781 9737683 9377536 9505370 9945173 9897414 9855139 9894840
5069 9894840 9638442 9895598 9544877 9613062 10062259 10007322 10150147 10233522 10443367 10506367
5059 10506367 10548132 10348962 10239090 9827578 9670445 9793541 9565452 9449963 9387858 9454914
5049 9454914 9280777 8941158 8945337 8747831 8539337 8208991 8664706 8795374 8652215 8795129
5039 8795129 9128261 8772314 8561895 8740421 9174899 9111525 9239553 9105971 8856150 8887065
5029 8887065 9127331 8936997 9075404 9119614 8679894 8642414 8751692 8339355 8434181 8417604
5019 8417604 8549931 8426859 8293538 8287891 8407689 8260351 8643318 8462092 8515689 8647467
5009 8647467 8775165 8761855 8976683 8769193 9177334 9335989 8964938 8888171 8736588 8790791
$$ packed form
5080I179834J98489n297j3138Q3893K93902l60147J27834M39803m7759m2275L9701
5069I894840k56398K57156l50721O8185M49197n4937J42825Q3375K09845O3000
5059A0506367M1765j99170j09872m11512j57133J23096k28089j15489o2105O7056
5049I454914j74137l39619M179j97506k08494l30346M55715J30668j43159J42914
5039H795129L33132l55947k10419J78526M34478o3374J28028j33582k49821L0915
5029H887065K40266j90334J38407M4210m39720l7480J09278m12337R4826j6577
5019H417604J32327j23072j33321n647J19798j47338L82967j81226N3597J31778
5009H647467J27698j3310K14828k07490M08141J58655l71051p6767j51583N4203
$$ plain form
4999 8790791 8872503 8833135 9223556 9276445 9255766 9275876 9648359 9460967 9842294 10092332
4989 10092332 10092710 10146268 10033506 10223113 9884009 10009158 9900785 10540009 10259952 10661735
4979 10661735 10776560 10729128 10616250 10806006 11193382 11166439 11287448 12015630 12187883 12241939
4969 12241939 12639069 13067712 13543487 13980579 14294577 14956473 15946053 16960379 18029014
4960 18029014 18886628 20349308 22102591 23185340 24189198 24717144 24285166 24104151 23365821
4951 23365821 22607682 22311856 22130724 21953815 21840979 21293678 21058329 21009745 20292875 19805535
4941 19805535 19801609 19990600 20089604 20394313 20853309 21664881 22052549 23476361 24483431 25764408
4931 25764408 27344326 29288885 30040851 30458234 30414532 30290863 29702576 29179290 29188354 28800754
$$ packed form
4999H790791Q1712l9368L90421N2889k0679K0110L72483j87392L81327K50038
4989A0092332L78N3558j12762J89607l39104J25149j08373O39224k80057M01783
4979A0661735J14825m7432j12878J89756L87376k6943J21009P28182J72253N4056
4969A2241939L97130M28643M75775M37092L13998O61896R89580J014326J068635
4960A8029014Q57614J462680J753283J082749J003858N27946m31978j81015p38330
4951B3365821p58139k95826j81132j76909j12836n47301k35349m8584p16870m87340
4941A9805535l926J88991R9004L04709M58996Q11572L87668J423812J007070J280977
4931B5764408J579918J944559P51966M17383m3702j23669n88287n23286R064l87600
$$ plain form
4921 28800754 28133430 28105180 27809210 27426478 26860837 26301548 24712443 23178640 21696107
4912 21696107 20648173 19761144 19005413 18429982 17909699 17326943 17173508 17091097 17419242
4903 17419242 17753869 17912522 18460345 18469272 18582916 18589091 18987378 18924603 19351363 19250327
4893 19250327 19254909 19503075 19734602 19522662 18687272 17485917 16385434 15231527 14336258
4884 14336258 13502259 12919801 12475153 12271984 11634386 11385209 10963546 10805670 10594950
4875 10594950 10463325 10278664 10315877 9855701 9524606 9601808 9126944 9062152 8999297 8876296
4865 8876296 8761619 8938093 8934624 8771140 8760760 8880055 8877861 8633081 8654733 8718197 8585122
4854 8585122 8539557 8783054 8622659 8431277 8262819 8460731 8404843 8011645 8237702 8244787
$$ packed form
4921B8800754o67324k8250k95970l82732n65641n59289j589105j533803j482533
4912B1696107j047934q87029p55731n75431n20283n82756j53435q2411L28145
4903A7419242L34627J58653N47823Q927J13644O175L98287o2775M26760j01036
4893A9250327M582K48166K31527k11940q35390j201355j100483j153907q95269
4884A4336258q33999n82458m44648k03169o37598k49177m21663j57876k10720
4875A0594950j31625j84661L7213m60176l31095P7202m74864o4792o2855j23001
4865H876296j14677J76474l469j63484j0380J19295k194k44780K1652O3464j33075
4854H585122m5565K43497j60395j91382j68458J97912n5888l93198K26057P085
$$ plain form
4844 8244787 7894337 7655267 7809014 7918882 7873679 7859929 7890764 7747675 7494152 7791795
4834 7791795 7939516 7876842 7851460 8215548 8006879 7920568 8152054 8273470 7935842 8203258
4824 8203258 7893937 7684766 7724076 8002479 7792951 7792603 7756110 7789141 7505985 7863118 8064587
4813 8064587 8038231 7966758 8388917 8401554 8308552 8340496 8662055 8813759 8304492 8508658
4803 8508658 8444470 8601340 8370592 8532002 8281723 8021715 8194599 8566008 8444807 8534629
4793 8534629 8988468 9031541 8549788 8738269 8880614 9053946 8984381 9103731 9340014 9101527
4783 9101527 9205851 9483583 9274027 9400981 9768380 9989967 9786429 9985421 10030296 9889065
4773 9889065 9710596 9974363 9748414 9463243 9839576 10101590 9845513 9738515 9723807 10159227
$$ packed form
4844H244787l50450k39070J53747J09868m5203j3750L0835j43089k53523K97643
4834G791795J47721o2674k5382L64088k08669q6311K31486J21416l37628K67416
4824H203258l09321k09171L9310K78403k09528l48l6493L3031k83156L57133K01469
4813H064587k6356p1473M22159J2637r3002L1944L21559J51704n09267K04166
4803H508658o4188J56870k30748J61410k50279k60008J72884L71409j21201Q9822
4793H534629M53839M3073m81753J88481J42345J73332o9565J19350K36283k38487
4783I101527J04324K77732k09556J26954L67399K21587k03538J98992M4875j41231
4773I889065j78469K63767k25949k85171L76333K62014k56077j06998j4708M35420
$$ plain form
4763 10159227 9991056 9814735 10117112 10338992 10484301 10576846 10912139 10562573 10937594 11201773
4753 11201773 10937589 11007145 11389435 11742437 11486250 11514314 11685021 11722426 12117281 12679198
4743 12679198 12544933 12865890 13228293 13530118 13326576 13491193 14067579 14384304 14556295
4734 14556295 14845268 15399186 15785046 16046066 16377977 16971621 17403159 17276234 17983179
4725 17983179 17996959 17966956 18377246 18943060 18808430 19374713 19821526 20139072 20384234 21098635
4715 21098635 21520697 22147553 23042580 23956930 24751624 25838194 26946506 27413565 28860223
4706 28860223 30247109 31746778 33588390 35809160 37410382 38412636 38123912 37249247
4698 37249247 36240996 35825650 35495082 35673805 35338418 35591118 36160315 37066107 37950765
$$ packed form
4763A0159227j68171j76321L02377K21880J45309R2545L35293l49566L75021K64179
4753A1201773k64184O9556L82290L53002k56187K8064J70707L7405L94855N61917
4743A2679198j34265L20957L62403L01825k03542J64617N76386L16725J71991
4734A4556295K88973N53918L85860K61020L31911N93644M31538j26925P06945
4725A7983179J3780l0003M10290N65814j34630N66283M46813L17546K45162P14401
4715B1098635M22062O26856Q95027R14350P94694J086570J108312M67059J446658
4706B8860223J386886J499669J841612K220770J601222J002254k88724q74665
4698C7249247j008251m15346l30568J78723l35387K52700N69197R05792Q84658
$$ plain form
4689 37950765 39334784 40699912 41833525 43123139 45114153 47244308 49159885 50848420
4681 50848420 50998159 50488355 49994130 49948577 49824516 50705533 51555931 52723212 53917968
4672 53917968 55383590 56881551 58304249 60552311 62628686 65246368 67724737 71556763
4664 71556763 75813827 80472708 85405466 91574863 98475685 106264756 115688316 126626369
4656 126626369 139197380 154305846 170885355 188111024 204690801 220292270 234230343
4649 234230343 246452204 256854516 264335380 267412302 264696053 254965741 240396563 223793867
4641 223793867 207591255 191667997 177065712 163184237 150666630 139166656 129311088
4634 129311088 121572145 114977480 109820350 105712815 102432152 99517465 97209426 93633780
$$ packed form
4689C7950765J384019J365128J133613J289614J991014K130155J915577J688535
4681E0848420J49739n09804m94225m5553j24061Q81017Q50398J167281J194756
4672E3917968J465622J497961J422698K248062K076375K617682K478369L832026
4664G1556763M257064M658881M932758O169397O900822P789071R423560J0938053
4656A26626369J2571011J5108466J6579509J7225669J6579777J5601469J3938073
4649B34230343J2221861J0402312P480864L076922k716249r730312j4569178j6602696
4641B23793867j6202612j5923258j4602285j3881475j2517607j1499974r855568
4634A29311088p738943o594665n157130m107535l280663k914687k308039l575646
$$ plain form
4626 93633780 87777899 81088600 75109554 70060105 65919274 62569205 60062302 57947238
4618 57947238 55896945 54130561 52971339 51678602 50551202 49253097 47872337 46285848
4610 46285848 44868603 43658875 42449366 41301127 40031392 38875715 37766244 36715492
4602 36715492 35800981 34799606 33855465 33300184 32554866 31512019 30759351 29915688 29374830
4593 29374830 28864814 28204009 27280212 26969597 26154308 25567672 25064305 24162490 23879110
4584 23879110 23729621 23080658 22430868 21771705 21085545 20665976 20458113 20220387 19933355
4575 19933355 19223280 19109891 18238221 17638424 17430940 17334167 16988475 17288019 17349761 17137344
4565 17137344 17026595 17014160 16946463 16833641 16410043 16401469 16440880 16163734 15737178 15871316
$$ packed form
4626I3633780n855881o689299n979046n049449m140831l350069k506903k115064
4618E7947238k050293j766384j159222j292737j127400j298105j380760j586489
4610D6285848j417245j209728j209509j148239j269735j155677j109471j050752
4602C6715492r14511j001375r44141n55281p45318j042847p52668q43663n40858
4593B9374830n10016o60805r23797l10615q15289n86636n03367r01815k83380
4584B3879110j49489o48963o49790o59163o86160m19569k07863k37726k87032
4575A9933355p10075j13389q71670n99797k07484r6773l45692K99544O1742k12417
4565A7137344j10749j2435o7697j12822m23598q574L9411k77146m26556J34138
$$ plain form
4555 15871316 15778370 15444945 15209176 15106158 14796766 14717325 14821120 15119093 15036714 15428630
4545 15428630 15776009 15849486 15466242 15560185 15858520 15824004 15907457 15952741 16013231 16058774 16289763
4534 16289763 16537980 17019469 17130232 18473538 19385681 20013366 21078297 22418300 23879859
4525 23879859 25465991 27058681 29494950 32412127 34634416 35799364 35260542 32948852
4517 32948852 30093901 27086320 24828999 23176554 21922376 21039736 20305135 19593521 19483379
4508 19483379 19103418 19130957 19244727 19025296 19051248 19231166 19432057 19320493 20070631 20656647
4498 20656647 21188910 21459156 22162307 23313231 24040860 25465434 26815955 28255019 29667925
4489 29667925 31623944 33876613 36638249 38755807 39719431 38478841 35975409 33164219
$$ packed form
4555A5871316r2946l33425k35769j03018l09392p9441J03795K97973q2379L91916
4545A5428630L47379P3477l83244R3943K98335l4516Q3453M5284O0490M5543K30989
4534A6289763K48217M81489J10763J343306R12143O27685J064931J340003J461559
4525B3879859J586132J592690K436269K917177K222289J164948n38822k311690
4517C2948852k854951l007581k257321j652445j254178q82640p34601p11614j10142
4508A9483379l79961K7539J13770k19431K5952J79918K00891j11564P50138N86016
4498B0656647N32263K70246P03151J150924P27629J424574J350521J439064J412906
4489B9667925J956019K252669K761636K117558R63624j240590k503432k811190
$$ plain form
4481 33164219 31184260 29484825 28567551 28114168 27812131 27681350 28000186 28539431 28912652
4472 28912652 29509752 30452310 31611735 33136768 34257306 36118777 38068572 39688835
4464 39688835 39873371 39308742 37689456 37010408 36875546 36832146 37454635 38286552 39158871
4455 39158871 39982712 41282535 42373342 43903456 45536469 47413578 48915017 51448390
4447 51448390 54179814 57146083 60686293 65056391 70051629 75831075 82621317 90308758
4439 90308758 99086502 109865644 122181243 137046320 154307961 174846919 198753237
4432 198753237 227351642 257837083 281703596 286320577 264692294 225190238 184644043
4425 184644043 152642788 128352790 110544852 97092457 87264875 79615761 73631145
$$ packed form
4481C3164219j979959j699435r17274m53383l02037j30781L18836N39245L73221
4472B8912652N97100R42558J159425J525033J120538J861471J949795J620263
4464C9688835J84536n64629j619286o79048j34862m3400O22489Q31917Q72319
4455C9158871Q23841J299823J090807J530114J633013J877109J501439K533373
4447E1448390K731424K966269L540210M370098M995238N779446O790242P687441
4439I0308758Q777744J0779142J2315599J4865077J7261641K0538958K3906318
4432A98753237K8598405L0485441K3866513M616981k1628283l9502056m0546195
4425A84644043l2001255k4289998j7807938j3452395r827582p649114n984616
$$ plain form
4418 73631145 68260815 63755170 59237308 55534647 52422675 49395450 46663629 44422956
4410 44422956 42811115 41394836 40308648 39193725 38579731 37918511 37624556 37537567 37139551
4401 37139551 36391323 36042306 35637829 34397070 33222678 32577530 32022869 30919721 29477814
4392 29477814 28065459 26616430 25074721 23936734 22770872 21601964 20829897 20377643
4384 20377643 19864781 19056542 18294854 17968767 17500135 16692803 15896481 15546388 15440902
4375 15440902 14824493 14821717 14050864 13616276 13521693 13596397 12754305 12705485 12358367 12337153
4365 12337153 11944157 11576560 11189677 11133067 11045209 10602716 10357028 10400188 10484684 10154220
4355 10154220 9982092 9855052 9822482 9597961 9732403 10032996 9851080 9418130 9307230 9188404
$$ packed form
4418G3631145n370330m505645m517862l702661l111972l027225k731821k240673
4410D4422956j611841j416279j086188j114923o13994o61220k93955q6989l98016
4401C7139551p48228l49017m04477j240759j174392o45148n54661j103148j441907
4392B9477814j412355j449029j541709j137987j165862j168908p72067m52254
4384B0377643n12862q08239p61688l26087m68632q07332p96322l50093j05486
4375A5440902o16409k776p70853m34588r4583P4704q42092m8820l47118k1214
4365A2337153l92996l67597l86883n6610q7858m42493k45688M3160Q4496l30464
4355A0154220j72128j27040l2570k24521J34442L00593j81916m32950j10900j18826
$$ plain form
4345 9188404 8889650 8676911 9211436 8937803 8765289 8768636 9014230 8867581 8607861 9087206
4335 9087206 8998069 8686751 8537304 8849973 8656128 8655895 8558428 8961380 8718045 8723708 8932122
4324 8932122 9134736 9057738 9355441 9556151 9506071 9432807 9251121 9509774 9415511 9341966
4314 9341966 9144670 9219718 9284539 9131080 8900755 9114085 9563736 9475276 9748262 10070567
4304 10070567 9836737 9727241 9753838 10393035 10489850 10921585 11622282 12046998 12495024 13647687
4294 13647687 14448926 15397176 16318545 17751420 18137534 18759110 18947960 18797480 17863279
4285 17863279 16961478 15697831 14185831 13199951 12680526 11821568 11170394 10933206 10812570
4276 10812570 10576247 10651873 10259135 9802305 9536527 9402180 9016677 8272978 8406333 8781382
$$ packed form
4345I188404k98754k12739N34525k73633j72514L347K45594j46649k59720M79345
4335I087206q9137l11318j49447L12669j93845k33r7467M02952k43335N663K08414
4324H932122K02614p6998K97703K00710n0080p3264j81686K58653r4263p3545
4314I341966j97296P5048O4821j53459k30325K13330M49651q8460K72986L22305
4304A0070567k33830j09496K6597O39197R6815M31735P00697M24716M48026J152663
4294A3647687Q01239R48250R21369J432875L86114O21576J88850j50480r34201
4285A7863279r01801j263647j512000r85880n19425q58958o51174k37188j20636
4276A0812570k36323P5626l92738m56830k65778j34347l85503p43699J33355L75049
$$ plain form
4266 8781382 8568209 8460532 8297329 8350997 8396962 8678346 8613477 8609611 8470651 8580104
4256 8580104 8421604 8200944 7859155 8117697 7528066 7250368 7193229 7232929 7110838 7260171
4246 7260171 7681359 7076974 6977789 7200918 7199451 6946731 7089855 6945389 6865603 6698740
4236 6698740 6768804 6563745 6655734 6949705 7169985 6627560 7314925 7636024 7796004 7586916
4226 7586916 7886362 7595710 6888166 6350480 6596065 6359261 5925205 6118141 6236025 5837651
4216 5837651 5874090 5682354 5585958 5577589 5443509 5376570 5712251 5676809 5429550 5305905 5747518
4205 5747518 5773539 5602507 5489712 5448808 4910364 4711387 4825721 4847616 4796251 4944377
4195 4944377 5264740 5432174 5139168 5300387 5738907 6200883 6034744 5942850 6350840 6090231
$$ packed form
4266H781382k13173j07677j63203N3668M5965K81384o4869l866j38960J09453
4256H580104j58500k20660l41789K58542n89631k77698n7139L9700j22091J49333
4246G260171M21188o04385r9185K23129j467k52720J43124j44466p9786j66863
4236F698740P0064k05059R1989K93971K20280n42425O87365L21099J59980k09088
4226G586916K99446k90652p07544n37686K45585k36804m34056J92936J17884l98374
4216E837651L6439j91736r6396q369j34080o6939L35681l5442k47259j23645M41613
4205E747518K6021j71032j12795m0904n38444j98977J14334K1895n1365J48126
4195D944377L20363J67434k93006J61219M38520M61976j66139r1894M07990k60609
$$ plain form
4185 6090231 5682857 5487737 5529131 5350848 5206335 4871774 4604169 4322009 3966212 4277409
4175 4277409 4703488 4427520 4266592 4594419 4777707 4338694 4657053 5309455 4844445 4647585
4165 4647585 5022639 5059850 5075748 5127867 4966303 4746072 4741901 4702316 4956054 4185659 4557845
4154 4557845 4848859 4737881 4770426 4889304 4785911 4803550 4870388 4746328 4358656 4017476
4144 4017476 4610474 4382910 4176579 4839225 4954893 4431963 4453148 4886803 4474855 4515035
4134 4515035 5018010 5628228 5378383 5234030 5573295 5530530 5751699 6246264 6288573 6179622
4124 6179622 6172308 6420458 6053476 5437116 5719951 5662646 5290068 5475037 5832735 5582006
4114 5582006 5597047 5459731 5482775 5438719 5363763 5880123 5992291 5839863 6380497 6460312
$$ packed form
4185F090231m07374j95120M1394j78283j44513l34561k67605k82160l55797L11197
4175D277409M26079k75968j60928L27827J83288m39013L18359O52402m65010j96860
4165D647585L75054L7211J5898N2119j61564k20231m171l9585K53738p70395L72186
4154D557845K91014j10978L2545J18878j03393J7639O6838j24060l87672l41180
4144D017476N92998k27564k06331O62646J15668n22930K1185M33655m11948M0180
4134D515035N02975O10218k49845j44353L39265m2765K21169M94565M2309j08951
4124F179622p314K48150l66982o16360K82835n7305l72578J84969L57698k50729
4114E582006J5041j37316K3044m4056p4956N16360J12168j52428N40634P9815
$$ plain form
4104 6460312 6172221 6127888 6076886 6300386 6294683 6495940 6559463 6934093 7249391 7554216
4094 7554216 7526609 7961479 8339059 8698683 9041118 9825154 10412769 11226391 12054478 13671391
4084 13671391 14737708 16045532 18222130 21077014 23312931 23460215 21235056 17317740
4076 17317740 14637995 12948109 12078163 11633276 10809436 10345839 10193419 9930912 9400340
4067 9400340 9661424 9787469 9811094 10248630 10427359 10964073 10529369 10808883 10634320 10825889
4057 10825889 10971389 11464686 11636708 11971650 11991455 12108240 12271974 12696198 12789021 13095640
4047 13095640 13226392 13427796 13597358 13922285 14486627 15126417 15371870 15783029 16442364
4038 16442364 16934006 17156850 17891804 18384291 18917514 19745103 20738232 21446864 21973778
$$ packed form
4104F460312k88091m4333n1002K23500n703K01257O3523L74630L15298L04825
4094G554216k7607M34870L77580L59624L42435P84036N87615Q13622Q28087J616913
4084A3671391J066317J307824K176598K854884K235917J47284k225159l917316
4076A7317740k679745j689886q69946m44887q23840m63597j52420k62507n30572
4067I400340K61084J26045K3625M37536J78729N36714m34704K79514j74563J91569
4057A0825889J45500M93297J72022L34942J9805J16785J63734M24224R2823L06619
4047A3095640J30752K01404J69562L24927N64342O39790K45453M11159O59335
4038A6442364M91642K22844P34954M92487N33223Q27589R93129P08632N26914
$$ plain form
4029 21973778 23430317 24436614 25260999 26460180 28157557 29099092 30418407 31749175
4021 31749175 33305634 35250460 37217956 39336920 41435720 43674023 45647447 47637737
4013 47637737 49708200 52256026 54604770 57103889 59467218 61920077 64922085 67589946
4005 67589946 70582015 73152207 76151366 78985233 81464071 83637262 86052171 88538243
3997 88538243 90973822 93198643 95048415 97020922 98303672 100044533 101642321 102930579
3989 102930579 104168400 105543281 106547218 107264497 107965727 108425495 108533770 107772913 107123827
3980 107123827 106197224 105502958 104063036 102922528 101803479 100460440 98529823 96737097
3972 96737097 94697594 92576362 90323620 87944961 85320867 82551768 79476698 76754004
$$ packed form
4029B1973778J456539J006297Q24385J199181J697377R41535J319315J330768
4021C1749175J556459J944826J967496K118964K098800K238303J973424J990290
4013D7637737K070463K547826K348744K499119K363329K452859L002008K667861
4005F7589946K992069K570192K999159K833867K478838K173191K414909K486072
3997H8538243K435579K224821J849772J972507J282750J740861J597788J288258
3989A02930579J237821J374881J003937P17279P01230M59768J08275p60857o49086
3980A07123827r26603o94266j439922j140508j119049j343039j930617j792726
3972I6737097k039503k121232k252742k378659k624094k769099l075070k722694
$$ plain form
3964 76754004 74000215 71352678 68996057 66293998 63180339 60514492 57775386 55199363
3956 55199363 52699031 50784646 48028447 45451197 43260861 41270526 39017445 36917151
3948 36917151 35280805 33129651 31420270 29700212 28320052 26664793 25291939 24006744
3940 24006744 22818637 22014056 20762389 19501167 18724000 17559570 16686617 15911892 15162613
3931 15162613 14337979 13963660 13546612 13359843 12722849 12410300 11787858 11361248 10771033
3922 10771033 10805732 10513131 10413190 10028049 10034209 10017018 9503581 8821700 8467583 8179568
3912 8179568 8073968 7827470 7895544 7816231 7733966 7488139 7651827 7247190 6798891 6882953
3902 6882953 7083153 6701968 6561447 6850709 6690997 6328256 6492758 6614337 6379407 6158456
$$ packed form
3964G6754004k753789k647537k356621k702059l113659k665847k739106k576023
3956E5199363k500332j914385k756199k577250k190336j990335k253081k100294
3948C6917151j636346k151154j709381j720058j380160j655259j372854j285195
3940B4006744j188107q04581j251667j261222p77167j164430q72953p74725p49279
3931A5162613q24634l74319m17048j86769o36994l12549o22442m26610n90215
3922A0771033L4699k92601r9941l85141O160j7191n13437o81881l54117k88015
3912H179568j05600k46498O8074p9313q2265k45827J63688m04637m48299Q4062
3902F882953K00200l81185j40521K89262j59712l62741J64502J21579k34930k20951
$$ plain form
3892 6158456 5931528 5840644 5442463 5678135 5688953 5916626 5593706 5695541 5620906 5577198
3882 5577198 5383919 5517185 5262554 5467429 5303258 5366315 4982327 5248771 5397672 5651649
3872 5651649 5745080 5424755 5096610 5028866 4929497 4916279 5096939 5018792 5079911 5612871 5571560
3861 5571560 5375114 5468771 5403548 5413531 5126431 5421730 5432854 5573164 5898592 5649027
3851 5649027 5100650 5353845 5351175 5106209 5347330 5532931 5329051 5262574 5264171 5258846 4961249
3840 4961249 4918406 5127389 4945139 4822420 4844259 4791724 4880694 4800926 5024428 4989573 4550300
3829 4550300 4471513 4415260 4514733 4585356 4799786 4744135 4673165 4687424 4753738 4421896 3998143
3818 3998143 3829977 4074815 4218766 4128087 4216140 3961762 3925218 3818905 3864334 3907212
$$ packed form
3892F158456k26928r0884l98181K35672J0818K27673l22920J01835p4635m3708
3882E577198j93279J33266k54631K04875j64171O3057l83988K66444J48901K53977
3872E651649R3431l20325l28145o7744r9369j3218J80660p8147O1119N32960m1311
3861E571560j96446R3657o5223R983k87100K95299J1124J40310L25428k49565
3851E649027n48377K53195k670k44966K41121J85601k03880o6477J597n325k97597
3840D961249m2843K08983j82250j22719K1839n2535Q8970p9768K23502l4855m39273
3829D550300p8787n6253R9473P0623K14430n5651p0970J4259O6314l31842m23753
3818C998143j68166K44838J43951r0679Q8053k54378l6544j06313M5429M2878
$$ plain form
3808 3907212 3897377 3985518 3742246 3545369 4044674 4144960 3959021 3951658 3840893 3767761 3936553
3797 3936553 3853218 3883736 4118812 3929019 3905252 3881207 3908063 3956952 3767925 4020860 3913277
3786 3913277 3628306 3901475 4259125 3908244 3873012 3851611 4185606 4378276 4536618 4832018
3776 4832018 5019390 4633419 4777658 5026408 5059547 4999241 5032832 5154677 4971643 4941346
3766 4941346 5195303 5270887 5211111 5649042 5173858 5185494 5356089 5347328 5239919 5301645 5472028
3755 5472028 5791594 5616273 5350797 5698902 5462051 5579834 5565766 5705822 5749711 5637695
3745 5637695 5610574 5668419 5990132 5752513 6301098 6033159 6072005 5891156 5992310 6230976
3735 6230976 6221657 6151572 6261908 6412957 6426110 6653225 6833103 6909189 7307529 7053169
$$ packed form
3808C907212r835Q8141k43272j96877M99305J00286j85939p363j10765p3132J68792
3797C936553q3335L0518K35076j89793k3767k4045K6856M8889j89027K52935j07583
3786C913277k84971K73169L57650l50881l5232k1401L33995J92670J58342K95400
3776D832018J87372l85971J44239K48750L3139o0306L3591J21845j83034l0297
3766D941346K53957P5584n9776M37931m75184J1636J70595q761j07409O1726J70383
3755E472028L19566j75321k65476L48105k36851J17783j4068J40056M3889j12016
3745E637695k7121N7845L21713k37619N48585k67939L8846j80849J01154K38666
3735F230976r319p0085J10336J51049J3153K27115J79878P6086L98340k54360
$$ plain form
3725 7053169 7561617 7282403 7793292 7919767 8247966 8339891 8215946 8043950 8178752 8131933
3715 8131933 8141961 9011217 9159712 9307757 9210443 9788728 9984269 9867517 10141313 11228877
3705 11228877 11042176 11065805 11320020 11792710 11918376 12046981 12392969 12682259 12791563 13175263
3695 13175263 13397738 13763098 14009851 14860223 15215905 16011105 16255028 16906029 17346606
3686 17346606 18063087 18586792 19471742 20443718 21248576 21641741 22426566 23514681 24470343
3677 24470343 25396855 26565581 27438770 28516469 29384555 30237303 31140496 32135976 32990558
3668 32990558 34422482 35450494 36295349 37370317 38468236 39394404 40205589 41526497 42521444
3659 42521444 43725571 44373051 45673655 46356815 47137593 47627019 48174872 48647112 48934553
$$ packed form
3725G053169N08448k79214N10889J26475L28199R1925j23945j71996J34802m6819
3715H131933J0028Q69256J48495J48045r7314N78285J95541j16752K73796J087564
3705A1228877j86701K3629K54215M72690J25666J28605L45988K89290J09304L83700
3695A3175263K22475L65360K46753Q50372L55682P95200K43923O51001M40577
3686A7346606P16481N23705Q84950R71976Q04858L93165P84825J088115R55662
3677B4470343R26512J168726Q73189J077699Q68086Q52748R03193R95480Q54582
3668C2990558J431924J028012Q44855J074968J097919R26168Q11185J320908R94947
3659D2521444J204127O47480J300604O83160P80778M89426N47853M72240K87441
$$ plain form
3650 48934553 49673556 50129410 50228608 50842921 51583706 52253442 52734394 53510587 53903229 54566267
3640 54566267 54984564 55669884 56037216 56799752 57519784 58402302 59258681 60457659 61573017
3631 61573017 62784203 64243675 66170131 68264901 70545441 72995829 75582656 78011114
3623 78011114 80865276 84084341 87354139 90099206 92974746 95979875 99357048 102227199
3615 102227199 105730145 108913350 112123045 115608711 118947704 122368524 125953136 129517996
3607 129517996 132893292 135951591 139094833 142271901 145271086 147899809 150698332 152847840
3599 152847840 154849431 156986648 159364864 162236962 164844725 167709259 170756102 173535992
3591 173535992 176003248 179170750 182127271 184906906 187449525 190616938 193471351 195802964
$$ packed form
3650D8934553P39003M55854R9198O14313P40785O69736M80952P76193L92642O63038
3640E4566267M18297O85320L67332P62536P20032Q82518Q56379J198978J115358
3631F1573017J211186J459472J926456K094770K280540K450388K586827K428458
3623G8011114K854162L219065L269798K745067K875540L005129L377173K870151
3615A02227199L502946L183205L209695L485666L338993L420820L584612L564860
3607A29517996L375296L058299L143242L177068K999185K628723K798523K149508
3599A52847840K001591K137217K378216K872098K607763K864534L046843K779890
3591A73535992K467256L167502K956521K779635K542619L167413K854413K331613
$$ plain form
3583 195802964 198426562 201879853 204872630 208952988 213323714 218147614 223067283 228863402
3575 228863402 234769313 240960087 247697381 255271647 262846470 269815284 276969693 283563902
3567 283563902 288792864 293236047 296248818 298329628 298779108 298039868 296207895 293458040
3559 293458040 290762624 288102133 284625294 281163034 277570356 273503160 268518219 263312590
3551 263312590 256507178 248475719 239108327 229444844 219072306 208238428 197726379 187825040
3543 187825040 177879554 168521031 160102582 153281864 146713568 140680812 135661532 130911124
3535 130911124 126544425 122105066 118501215 114576101 111173489 107517977 104350129 100920604
3527 100920604 97937686 95320431 93059622 90875267 89253468 87587599 86182000 84260686
$$ packed form
3583A95802964K623598L453291K992777M080358M370726M823900M919669N796119
3575B28863402N905911O190774O737294P574266P574823O968814P154409O594209
3567B83563902N228962M443183L012771K080810M49480p39240j831973k749855
3559B93458040k695416k660491l476839l462260l592678m067196m984941n205629
3551B63312590o805412q031459r367392r663483j0372538j0833878j0512049r901339
3543A87825040r945486r358523q418449o820718o568296o032756n019280m750408
3535A30911124m366699m439359l603851l925114l402612l655512l167848l429525
3527A00920604k982918k617255k260809k184355j621799j665869j405599j921314
$$ plain form
3519 84260686 83148966 81597805 80292700 78112997 76761641 75356177 73671708 71723965
3511 71723965 70536938 69470918 68110987 67118517 66992694 66508311 66186319 66131094 65879891
3502 65879891 65997510 66520330 67065297 67345274 68332162 69038958 70360903 71815242 74042390
3493 74042390 75908547 78451795 81320168 84828574 88657570 93275107 97997965 103458530
3485 103458530 108819953 114117924 118471227 122303350 124895416 126100008 126441347 126286804
3477 126286804 125175274 123527506 122410676 120960067 119587375 118578622 117573881 116448814
3469 116448814 114870926 112898098 110382773 106545730 101859327 96323497 90294617 83375941
3461 83375941 76641617 70403935 64416083 59169819 54619994 50014063 45728298 42691522
$$ packed form
3519H4260686j111720j551161j305105k179703j351356j405464j684469j947743
3511G1723965j187027j066020j359931r92470j25823m84383l21992n5225k51203
3502F5879891J17619N22820N44967K79977R86888P06796J321945J454339K227148
3493G4042390J866157K543248K868373L508406L828996M617537M722858N460565
3485A03458530N361423N297971M353303L832123K592066J204592L41339j54543
3477A26286804j111530j647768j116830j450609j372692j008753j004741j125067
3469A16448814j577888j972828k515325l837043m686403n535830o028880o918676
3461H3375941o734324o237682n987852n246264m549825m605931m285765l036776
$$ plain form
3453 42691522 40075364 37597697 35720459 33818875 31796303 29822206 28665310 27012103
3445 27012103 25829786 24897403 23908503 22334519 21454239 20653745 19914465 19542665 19301240
3436 19301240 18814524 18238915 17720495 17102754 16281555 15593094 15547629 15780697 15050874 14354629
3426 14354629 14128722 13982851 12894847 12688634 12611516 12033937 11803597 11751470 11472856 11087514
3416 11087514 10677735 10606836 10847763 10412890 10146764 9736745 9728540 9650920 9332686 9016033
3406 9016033 9177065 8963838 8742020 8430767 8467688 8427593 8210005 8085445 8138120 7398145
3396 7398145 7155412 6909588 6841466 7047878 7475469 7439984 7021809 6694247 6811850 6348073
3386 6348073 6162508 5968252 6192571 5756970 6356958 6157151 6436525 6265823 6038866 5634517
$$ packed form
3453D2691522k616158k477667j877238j901584k022572j974097j156896j653207
3445B7012103j182317r32383r88900j573984q80280q00494p39280l71800k41425
3436A9301240m86716n75609n18420o17741q21199o88461m5465K33068p29823o96245
3426A4354629k25907j45871j088004k06213p7118n77579k30340n2127k78614l85342
3416A1087514m09779p0899K40927m34873k66126m10019q205p7620l18234l16653
3406I016033J61032k13227k21818l11253L6921m0095k17588j24560N2675p39975
3396G398145k42733k45824o8122K06412M27591l5485m18175l27562J17603m63777
3386F348073j85565j94256K24319m35601N99988j99807K79374j70702k26957m04349
$$ plain form
3376 5634517 5139912 5105057 4972823 5148630 5288988 5663274 5446136 5333760 5150959 5337736
3366 5337736 4803905 4835650 5012066 5278604 4855931 4931026 4894133 4768803 4759147 4760306 4587676
3355 4587676 4371084 4260780 4486939 4591450 4872400 4833816 4959440 4750341 4606142 4322739
3345 4322739 4150223 4648232 4747123 4469199 4540739 4735889 4740881 4318682 4310452 4678997 4362000
3334 4362000 4077324 4378003 4727362 4499633 4573321 4669500 4493738 4349432 4320174 4804764
3324 4804764 4601834 4297349 4357667 4824886 4759454 4510900 4732129 4972397 4972360 4968250 5083826
3313 5083826 4863501 4682931 4383065 4855715 4811539 4886035 4875349 4756913 4585397 4646581
3303 4646581 4702374 4632621 4796850 4821117 4990846 4751375 5085087 5392747 5207014 5228278
$$ packed form
3376E634517m94605l4855j32234J75807J40358L74286k17138j12376j82801J86777
3366E337736n33831L1745J76416K66538m22673P5095l6893j25330r656J159j72630
3355D587676k16592j10304K26159J04511K80950l8584J25624k09099j44199k83403
3345D322739j72516M98009R8891k77924P1540J95150M992m22199q230L68545l16997
3334D362000k84676L00679L49359k27729P3688R6179j75762j44306k9258M84590
3324D804764k02930l04485O0318M67219o5432k48554K21229K40268l7m110J15576
3313E083826k20325j80570k99866M72650m4176P4496j0686j18436j71516O1184
3303D646581N5793o9753J64229K4267J69729k39471L33712L07660j85733K1264
$$ plain form
3293 5228278 5303098 5513959 5382345 5505403 5631144 5533968 5583565 5574108 5632877 6049655 6279319
3282 6279319 6214686 6420661 6356534 6535233 6324778 6400783 6211327 6653895 6831015 6893435
3272 6893435 6606629 6669403 6769156 6759854 7205731 7406097 7591432 7697768 7975242 8101801
3262 8101801 7684119 7869045 8292160 8384459 8889154 9269132 9144393 8931858 9483081 9898221
3252 9898221 9988741 10167633 10425939 10592579 10267385 10399097 10150401 9406151 9373495 8696830
3242 8696830 8764591 8146659 8138642 7474037 7442260 6857633 6665443 6368444 6181290 5744073
3232 5744073 5387388 5330356 5099077 4610204 4471873 4595371 4532518 4615078 4191033 4610843
3222 4610843 4484047 4488272 4242256 4694847 4901815 5032654 4856005 4950397 4793072 4503232
$$ packed form
3293E228278P4820K10861j31614J23058J25741r7176M9597r457N8769M16778K29664
3282F279319o4633K05975o4127J78699k10455P6005j89456M42568J77120O2420
3272F893435k86806O2774R9753r302M45877K00366J85335J06336K77474J26559
3262H101801m17682J84926M23115R2299N04695L79978j24739k12535N51223M15140
3252I898221R0520J78892K58306J66640l25194J31712k48696p44250l2656o76665
3242H696830O7761o17932q017o64605l1777n84627j92190k96999j87154m37217
3232E744073l56685n7032k31279m88873j38331J23498o2853Q2560m24045M19810
3222D610843j26796M225k46016M52591K06968J30839j76649R4392j57325k89840
$$ plain form
3212 4503232 4036284 4101104 3716265 3951926 3610319 3575747 3169499 3210603 3244679 3284093
3202 3284093 3225760 3152513 3061883 2936333 3082386 2735536 3069976 3119799 2600127 2571197
3192 2571197 2991146 3036885 3143750 2913991 3242071 3120638 3045755 3337472 3217470 3082917
3182 3082917 3421425 3532066 3078119 2503879 2550207 2289441 2202425 1749618 2220423 2474978
3172 2474978 2350834 2488871 2129111 2157441 2103929 1987477 2110721 2041612 1755506 1850492
3162 1850492 1853312 1791125 1924848 1610339 1608063 1418790 1199512 1555716 1330020 1152563
3152 1152563 1529415 1674919 1556422 1471650 1274688 1023450 844068 849566 1102866 1081868
3142 1081868 1330556 1653357 1728523 1367655 1245201 1059413 1073791 761283 627519 851606
$$ packed form
3212D503232m66948O4820l84839K35661l41607l4572m06248M1104L4076L9414
3202C284093n8333p3247r0630j25550J46053l46850L34440M9823n19672k8930
3192B571197M19949M5739J06865k29759L28080j21433p4883K91717j20002j34553
3182C082917L38508J10641m53947n74240M6328k60766q7016m52807M70805K54555
3172B474978j24144J38037l59760K8330n3512j16452J23244o9109k86106R4986
3162A850492K820o2187J33723l14509k276j89273k19278L56204k25696j77457
3152A152563L76852J45504j18497q4772j96962k51238j79382N498K53300k0998
3142A081868K48688L22801P5166l60868j22454j85788J4378l12508j33764K24087
$$ plain form
3132 851606 966870 1084165 958297 836963 1004340 680868 451719 538638 729409 927513
3122 927513 1117353 1327704 1356565 1529299 1475979 1866632 1697682 1682949 1630362 1042434
3112 1042434 1489055 1105765 1180407 890657 1090622 795334 973392 1104353 1192674 1137801
3102 1137801 1028307 1223509 851895 834422 1218610 1501965 799412 888885 712831 818946
3092 818946 777012 983029 903205 859078 1044401 1063992 972300 1212354 1070837 1066876 1186383
3081 1186383 1057193 960298 1056828 952630 1047695 869782 612399 1031048 1120517 684913
3071 684913 996095 1313457 1318752 866930 1018147 1057977 1112723 819067 1411365 1080092
3061 1080092 1139406 974935 971824 591248 265174 493907 523400 835995 702263 1223836
$$ packed form
3132H51606J15264J17295j25868j21334J67377l23472k29149Q6919J90771J98104
3122I27513J89840K10351K8861J72734n3320L90653j68950j4733n2587n87928
3112A042434M46621l83290P4642k89750J99965k95288J78058J30961Q8321n4873
3102A137801j09494J95202l71614j7473L84188K83355p02553Q9473j76054J06115
3092H18946m1934K06017p9824m4127J85323J9591r1692K40054j41517l961J19507
3081A186383j29190r6895R6530j04198R5065j77913k57383M18649Q9469m35604
3071F84913L11182L17362N295m51822J51217L9830N4746k93656N92298l31273
3061A080092N9314j64471l111l80576l26074K28733K9493L12595j33732N21573
$$ plain form
3051 1223836 1127177 808981 766191 574719 648890 723751 754981 883313 925465 1099150 697193
3040 697193 760491 825135 785925 723827 905869 1027173 432152 671083 589849 616342 458943
3029 458943 510217 826070 726456 814368 902185 1208695 1029421 824792 983162 1133289
3019 1133289 910291 974801 1379570 1545144 1407361 2023660 1829467 1376653 1303293 1643403
3009 1643403 1940513 1747426 1859568 1880170 1542478 1304762 1591183 1630803 1535887 1955012
2999 1955012 1723363 2030506 1729823 1518516 2004989 1910320 1780687 1475771 1750990 1642635
2989 1642635 1494847 1805900 2047803 2229675 1831211 2245943 1769371 1880322 2104929 1988947
2979 1988947 2160289 2185544 2434281 2638974 2788210 2417522 2463834 2511646 2719655 2381059
$$ packed form
3051A223836r6659l18196m2790j91472P4171P4861L1230J28332M2152J73685m01957
3040F97193O3298O4644l9210o2098J82042J21304n95021K38931q1234K6493j57399
3029D58943N1274L15853r9614Q7912Q7817L06510j79274k04629J58370J50127
3019A133289k22998O4510M04769J65574j37783O16299j94193m52814p3360L40110
3009A643403K97110j93087J12142K0602l37692k37716K86421L9620r4916M19125
2999A955012k31649L07143l00683k11307M86473r4669j29633l04916K75219j08355
2989A642635j47788L11053K41903J81872l98464M14732m76572J10951K24607j15982
2979A988947J71342K5255K48737K04693J49236l70688M6312M7812K08009l38596
$$ plain form
2969 2381059 2300215 2302844 2383704 1825573 1729044 1952332 2139501 2143118 1699921 2059836 1751823
2958 1751823 1914894 1932488 2217988 1743216 1976875 1791494 1900744 1999329 2194796 2415727
2948 2415727 2538770 1976282 2047504 2198494 2458475 2347079 2783315 3234130 2872305 2630865
2938 2630865 2951358 2806029 2520974 2690591 2743640 2417759 2287947 2467068 2493379 2249525
2928 2249525 2311295 2470226 2460364 2143527 1869636 2145517 2033363 2342493 2502382 2880648
2918 2880648 2742272 3185651 2942573 2616611 2543280 2786250 2900981 3031515 3022630 3059104
2908 3059104 2749444 2800324 2373689 2533404 2466720 2597198 2541751 2420044 2482736 2676689
2898 2676689 2341360 2005393 2145717 2252358 2183210 2431492 2356672 2252286 2093708 2337440
$$ packed form
2969B381059q0844K629Q0860n58131r6529K23288J87169L617m43197L59915l08013
2958A751823J63071J7594K85500m74772K33659j85381J09250R8585J95467K20931
2948B415727J23043n62488P1222J50990K59981j11396M36236M50815l61825k41440
2938B630865L20493j45329k85055J69617N3049l25881j29812J79121K6311k43854
2928B249525O1770J58931r862l16837k73891K75881j12154L09130J59889L78266
2918B880648j38376M43379k43078l25962p3331K42970J14731J30534q885L6474
2908C059104l09660N0880m26635J59715o6684J30478n5447j21707O2692J93953
2898B676689l35329l35967J40324J06641o9148K48282p4820j04386j58578K43732
$$ plain form
2888 2337440 2188462 2225303 2459237 2449950 2135753 2036603 2120205 2145727 2233031 2181650 2397831
2877 2397831 2369706 2174969 2087169 1986717 1598794 1751699 1771083 1540488 1582678 1660865
2867 1660865 1399559 1355300 1512124 989656 1310470 1296697 1186365 832208 943946 946603
2857 946603 1133408 1297112 1469092 1363600 1311085 1460091 1046220 1152979 1047749 819157
2847 819157 941595 1364444 1271643 1232957 926003 990763 1114883 978380 850631 830233
2837 830233 1000806 738215 523132 922088 909494 794937 740057 896031 716024 950281
2827 950281 852833 635319 607357 221649 316974 526295 681273 587070 637106 640617 172344
2816 172344 383142 441391 553600 402337 715660 412175 466002 249741 469932 396254
$$ packed form
2888B337440j48978L6841K33934r287l14197r9150Q3602K5522Q7304n1381K16181
2877B397831k8125j94737q7800j00452l87923J52905J9384k30595M2190P8187
2867A660865k61306m4259J56824n22468L20814j3773j10332l54157J11738K657
2857I46603J86805J63704J71980j05492n2515J49006m13871J06759j05230k28592
2847H19157J22438M22849r2801l8686l06954O4760J24120j36503j27749k0398
2837H30233J70573k62591k15083L98956j2594j14557n4880J55974j80007K34257
2827I50281r7448k17514k7962l85708R5325K09321J54978r4203N0036L511m68273
2816A72344K10798N8249J12209j51263L13323l03485N3827k16261K20191p3678
$$ plain form
2806 396254 654124 379899 391976 218140 158498 191860 379390 360079 207206 575015
2796 575015 504759 817074 814748 1126909 1150884 1019187 505443 467209 143704 141906 223331
2785 223331 196504 480225 497136 339964 317441 367751 455476 430021 89740 217633 329805
2774 329805 358215 414262 251983 654304 814667 492283 353033 407635 133181 -96475
2764 -96475 225602 304513 -109277 -49070 433053 453783 252914 304433 -8947 -212668 208689
2753 208689 216474 22528 429622 477605 125667 107535 -22325 -109042 261707 346691 480296
2742 480296 545210 526721 361998 498463 411781 512786 479283 773688 280417 286094 394922
2731 394922 -32138 199924 678594 423845 203408 956777 480109 400766 818634 1021608
$$ packed form
2806C96254K57870k74225J2077j73836n9642L3362J87530j9311j52873L67809
2796E75015p0256L12315k326L12161K3975j31697n13744l8234l23505j798Q1425
2785B23331k6827K83721J6911j57172k2523N0310Q7725k5455l40281J27893J12172
2774C29805K8410N6047j62279M02321J60363l22384j39250N4602k74454k29656
2764i6475L22077P8911m13790O0207M82123K0730k00869N1519l13380k03721M21357
2753B08689P785j93946M07094M7983l51938j8132j29860q6717L70749Q4984J33605
2742D80296O4914j8489j64723J36465q6682J01005l3503K94405m93271N677J08828
2731C94922m27060K32062M78670k54749k20437P53369m76668p9343M17868K02974
$$ plain form
2721 1021608 437209 405555 564417 628163 466747 843913 278580 490760 116489 314220
2711 314220 185454 101735 -104871 231283 355949 30633 77809 -25666 112491 51681
2701 51681 328294 69690 300324 393561 432435 94903 293407 -374975 -340507 -111858
2691 -111858 -18658 -524980 -276456 256267 -109448 -226287 74193 79378 52357 116614 233793
2680 233793 159775 369674 315795 798635 385277 66567 313654 536962 291381 583681
2670 583681 516764 299588 62966 30658 517778 308608 488135 516583 150377 -401889
2660 -401889 31301 -129207 84430 -43800 80043 96921 1298 133320 154431 340940
2650 340940 421941 320466 -77221 240947 326108 518554 473775 342978 539637 1045412
$$ packed form
2721A021608n84399l1654J58862O3746j61416L77166n65333K12180l74271J97731
2711C14220j28766q3719k06606L36154J24666l25316M7176j03475J38157o0810
2701E1681K76613k58604K30634R3237L8874l37532J98504o68382L4468K28649
2691a11858R3200n06322K48524N32723l65715j16839L00480N185k7021O4257J17179
2680B33793p4018K09899n3879M82840m13358l18710K47087K23308k45581K92300
2670E83681o6917k17176k36622l2308M87120k09170J79527K8448l66206n52266
2660d01889M33190j60508K13637j28230J23843J6878r5623J32022K1111J86509
2650C40940Q1001j01475l97687L18168Q5161J92446m4779j30797J96659N05775
$$ plain form
2640 1045412 579829 312093 147536 294355 175049 168442 118077 163732 -344227 554
2630 554 230428 95453 147331 298160 111629 148824 57461 -89804 166987 215020 314506
2619 314506 419863 631762 573865 681555 841636 842695 546350 659649 509975 565231
2609 565231 972157 695370 606367 853053 460411 429055 626945 813025 654743 677136
2599 677136 714114 1272238 1152104 1395678 1028052 1345047 715128 471314 548516 859981
2589 859981 390940 956316 1096439 506995 190315 654620 469835 100219 391574 849259
2579 849259 685378 673312 1079141 940645 663762 383005 446514 428854 30243 424441
2569 424441 404924 330055 426736 334515 519725 178105 449295 545038 708769 270442 649570
$$ packed form
2640A045412m65583k67736j64557J46819j19306o607n0365M5655n07959L44781
2630E54K29874j34975N1878J50829j86531L7195r1363j47265K56791M8033R9486
2619C14506J05357K11899n7897J07690J60081J059k96345J13299j49674N5256
2609E65231M06926k76787q9003K46686l92642l1356J97890J86080j58282K2393
2599F77136L6978N58124j20134K43574l67626L16995o29919k43814P7202L11465
2589H59981m69041N65376J40123n89444l16680M64305j84785l69616K91355M57685
2579H49259j63881j2066M05829j38496k76883k80757O3509j7660l98611L94198
2569D24441j9517p4869R6681r2221J85210l41620K71190R5743J63731m38327L79128
$$ plain form
2558 649570 632454 690107 607407 866524 514147 609162 535136 687697 641994 588705 283344
2547 283344 -60783 104158 106578 403474 302311 419475 395284 481255 420072 346611 156107
2536 156107 284688 351494 218688 229122 310830 436932 568486 305609 200958 602778
2526 602778 336593 246908 167137 500018 212713 206485 417401 102226 414827 321058 452360
2515 452360 253892 285135 282171 324214 420549 361862 456722 279212 309133 124546 300495
2504 300495 202366 305285 18397 430643 245166 464184 50539 370674 49234 -27362
2494 -27362 174791 146882 119976 -173053 113036 126588 -543379 -610381 -129764 -530494 -544198
2483 -544198 -301856 -1756 -275077 102371 48228 147571 -474738 -112765 -368167 -302015
$$ packed form
2558F49570j7116N7653q2700K59117l52377R5015p4026J52561m5703n3289l05361
2547B83344l44127J64941K420K96896j01163J17164k4191Q5971o1183p3461j90504
2536A56107J28581O6806j32806J0434Q1708J26102J31554k62877j04651M01820
2526F02778k66185q9685p9771L32881k87305o228K10916l15175L12601r3769J31302
2515D52360j98468L1243k964M2043R6335n8687R4860j77510K9921j84587J75949
2504C00495r8129J02919k86888M12246j85477K19018m13645L20135l21440p6596
2494b7362K02153k7909k6906k93029K86089J3552o69967o7002M80617m00730j3704
2483e44198K42342L00100k73321L77448n4143R9343o22309L61973k55402O6152
$$ plain form
2473 -302015 -114589 320607 430203 360876 235119 376803 230473 275984 190012 193233 220557
2462 220557 383293 274102 249650 73376 -518767 -227040 -531298 -347886 -535124 -793943
2452 -793943 -631589 -244530 -289226 -232212 114641 179227 -166878 -330132 -494397 -452206
2442 -452206 -502049 -45849 -39546 276680 51173 63024 166146 -124428 -172173 146560 164539
2431 164539 -216978 -252680 -12949 -308403 23537 51391 -42463 -59405 171527 172189 -286285
2420 -286285 -287578 -127976 -303381 -113272 -132783 -203743 -157886 169004 -12862 -29951 238822
2409 238822 16270 203970 -80227 -474611 -135367 213101 -125862 -339677 -258663 -711640
2399 -711640 -839915 -534904 -521701 -363696 -248819 357503 237272 143393 -398526 -413208
$$ packed form
2473c02015J87426M35196J09596o9327j25757J41684j46330M5511q5972L221K7324
2462B20557J62736j09191k4452j76274n92143K91727l04258J83412j87238k58819
2452g93943J62354L87059m4696N7014L46853O4586l46105j63254j64265M2191
2442d52206m9843M56200O303L16226k25507J1851J03122k90574m7745L18733J7979
2431A64539l81517l5702K39731k95454L31940K7854r3854j6942K30932O62m58474
2420b86285j293J59602j75405J90109j9511p0960M5857L26890j81866j7089K68773
2409B38822k22552J87700k84197l94384L39244L48468l38963k13815Q1014m52977
2399g11640j28275L05011J3203J58005J14877O06322j20231r3879n41919j4682
$$ plain form
2389 -413208 -538004 -454262 -107330 340227 295957 140690 12768 222597 185804 451020
2379 451020 468552 775521 845326 752682 616714 690849 696718 532742 627049 312627 -38299
2368 -38299 72713 91157 -143548 -633038 70978 -137270 -318411 -137179 -253009 -357856
2358 -357856 -303130 118891 213722 95441 118941 -94305 -168327 69194 -64504 -46763 -132336
2347 -132336 -221209 -10308 -232716 -421303 -58380 75866 -127300 -404004 -251157 -251379
2337 -251379 -265962 -247407 -89427 -47410 -122337 -128347 149243 -178512 -213570 10420 231776
2326 231776 -19082 219027 269876 189954 149228 -109935 -45 77205 241363 405125
2316 405125 250035 264523 -32047 -32344 -22219 -20602 139067 268766 182344 351784 455335
$$ packed form
2389d13208j24796Q3742L46932M47557m4270j55267j27922K09829l6793K65216
2379D51020J7532L06969O9805r2644j35968P4135N869j63976R4307l14422l50926
2368c8299J11012J8444k34705m89490P04016k08248j81141J81232j15830j04847
2358c57856N4726M22021R4831j18281K3500k13246p4022K37521j33698J7741q5573
2347a32336q8873K10901k22408j88587L62923J34246k03166k76704J52847k22
2337b51379j4583J8555J57980M2017p4927o010K77590l27755l5058K23990K21356
2326B31776k50858K38109N0849p9922m0726k59163J09890P7250J64158J63762
2316D05125j55090J4488k96570k97J0125J617J59669J29699q6422J69440J03551
$$ plain form
2305 455335 188278 365874 493292 41390 -16864 178455 233337 90456 250431 826942
2295 826942 291393 -54220 516942 572060 150392 -235299 202464 68368 219224 216434
2285 216434 816887 304899 148582 298271 48725 -322886 11521 430392 134410 392908
2275 392908 437195 719291 291502 166138 372714 344476 341022 237619 318954 236813 453774
2264 453774 192498 567725 468305 314438 283247 -21794 -37605 164100 188567 278809 429320
2253 429320 124837 -324153 -87600 509184 209309 193367 140359 42103 -137191 160471
2243 160471 138867 192172 173267 91967 -131786 -254895 -474253 335309 553268 651785 358638
2232 358638 662973 646495 616271 714051 783975 974617 530906 298021 45325 353687
$$ packed form
2305D55335k67057J77596J27418m51902n8254J95319N4882j42881J59975N76511
2295H26942n35549l45613N71162N5118m21668l85691M37763j34096J50856k790
2285B16434O00453n11988j56317J49689k49546l71611L34407M18871k95982K58498
2275C92908M4287K82096m27789j25364K06576k8238l454j03403Q1335q2141K16961
2264D53774k61276L75227r9420j53867l1191l05041j5811K01705K4467R0242J50511
2253D29320l04483m48990K36553N96784k99875j5942n3008r8256j79294K97662
2243A60471k1604N3305j8905q1300k23753j23109k19358Q09562K17959R8517k93147
2232C58638L04335j6478l0224R7780O9924J90642m43711k32885k52696L08362
$$ plain form
2222 353687 487868 469509 603582 527544 476930 411014 643597 447668 612201 602056 942402
2211 942402 1025748 911301 474105 705155 847527 684922 630835 677299 631949 590265 748425
2200 748425 587104 1116188 1127715 1173809 995694 1137142 1065735 880396 1218083 1294019
2190 1294019 1125929 1311075 1801611 1741689 1754911 1923864 2026429 1847167 2067630 2071756
2180 2071756 1826513 1879456 2159071 2129939 2122502 2205747 2315724 2432969 2527177 2470319 2474967
2169 2474967 2536889 2909810 2779653 2936704 2614094 2961408 3080768 2803083 3302670 3826444
2159 3826444 3879841 3781187 4161029 4124218 4330239 4267039 4761647 4621882 4634486 5068131
2149 5068131 5172335 5096011 5548526 5659234 6231473 6374983 6600376 6848744 7255695 7605154
$$ packed form
2222C53687J34181j8359J34073p6038n0614o5916K32583j95929J64533j0145L40346
2211I42402Q3346j14447m37196K31050J42372j62605n4087M6464m5350m1684J58160
2200G48425j61321N29084J1527M6094j78115J41448p1407j85339L37687P5936
2190A294019j68090J85146M90536n9922J3222J68953J02565j79262K20463M126
2180B071756k45243N2943K79615k9132p437Q3245J09977J17245R4208n6858M648
2169B474967O1922L72921j30157J57051l22610L47314J19360k77685M99587N23774
2159C826444N3397r8654L79842l6811K06021o3200M94608j39765J2604M33645
2149E068131J04204p6324M52515J10708N72239J43510K25393K48368M06951L49459
$$ plain form
2139 7605154 8274991 8558562 9175549 9353637 9848896 10600773 11176706 11717064 12534965 13590589
2129 13590589 15030767 16362092 17799236 19386715 20562425 21749004 24064024 26803742
2121 26803742 30116932 33993491 38793842 45054235 51964378 59998461 70166604 84889497
2113 84889497 102040654 112114751 106533674 83229160 60526143 47234450 38370031
2106 38370031 32421451 27631417 24144171 21541673 19814790 18634675 17359598 16312727
2098 16312727 15769952 14871778 13477634 11860699 10888232 10330672 9497361 8805567 8186906
2089 8186906 7343979 7359665 7267605 6923292 6449687 6613794 5822378 5471666 5058677 5162949
2079 5162949 4678810 4699537 4354219 3884957 3723034 3558076 3361509 3178800 3387948 3006166
$$ packed form
2139G605154O69837K83571O16987J78088M95259P51877N75933N40358Q17901J055624
2129A3590589J440178J331325J437144J587479J175710J186579K315020K739718
2121B6803742L313190L876559M800351O260393O910143Q034083J0168143J4722893
2113H4889497J7151157J0074097n581077k3304514k2703017j3291693q864419
2106C8370031n948580m790034l487246k602498j726883j180115j275077j046871
2098A6312727n42775q98174j394144j616935r72467n57560q33311o91794o18661
2089H186906q42927J5686r2060l44313m73605J64107p91416l50712m12989J04272
2079E162949m84139K0727l45318m69262j61923j64958j96567j82709K09148l81782
$$ plain form
2069 3006166 3206494 2955508 2607308 2674716 2507404 2523415 2608212 2900464 2532326 2419577
2059 2419577 2035688 1955210 1405361 1724363 1788820 1623385 1993000 1844634 1618717 1382832
2049 1382832 1372064 1468543 1399798 1341855 1855196 1673477 1421501 1372663 1313775 1573781 1894596
2038 1894596 1451259 1348336 1449500 1614664 1365405 1100588 1420768 1682917 1573712 1528208
2028 1528208 1422619 1078298 1397541 1298786 1206305 1175040 1362201 1374721 947366 908947
2018 908947 1011906 1041950 1069849 1245568 834728 538230 745253 710480 668986 233724
2008 233724 698032 412556 601712 423156 822926 566478 853816 818567 293505 291117
1998 291117 353719 668979 587343 677207 461604 760470 261219 215810 219016 716422 519300
$$ packed form
2069C006166K00328k50986l48200O7408j67312J6011Q4797K92252l68138j12749
2059B419577l83889q0478n49849L19002O4457j65435L69615j48366k25917k35885
2049A382832j0768R6479o8745n7943N13341j81719k51976m8838n8888K60006L20815
2038A894596m43337j02923J01164J65164k49259k64817L20180K62149j09205m5504
2028A528208j05589l44321L19243r8755r2481l1265J87161J2520m27355l8419
2018I08947J02959L0044K7899J75719m10840k96498K07023l4773m1494m35262
2008B33724M64308k85476J89156j78556L99770k56448K87338l5249n25062k388
1998B91117O2602L15260q1636Q9864k15603K98866m99251m5409L206M97406j97122
$$ plain form
1987 519300 633889 420303 484027 280296 663341 258321 109847 334067 562412 316011
1977 316011 517376 286113 276598 288017 184832 -367976 -261124 -51452 281169 279975 918567
1966 918567 636174 405998 303355 -9957 -127424 -127421 348451 153312 165168 4047 264372
1955 264372 118041 -4904 -340439 -419595 -607148 -462700 -265764 38144 325074 814107
1945 814107 582265 340497 141490 -516 -506309 -235539 -56357 72242 37381 581912
1935 581912 285202 122374 283515 60367 294086 278039 341681 -9910 507840 311283
1925 311283 214985 84878 230554 189352 -431954 -55913 -522559 -24137 -158199 163870
1915 163870 209028 386089 -9360 11436 204083 -9159 256641 302740 325664 369624 285735
$$ packed form
1987E19300J14589k13586O3724k03731L83045m05020j48474K24220K28345k46401
1977C16011K01365k31263r515J1419j03185n52808J06852K09672L32621j194O38592
1966I18567k82393k30176j02643l13312j17467LM75872j95139J1856j61121K60325
1955B64372j46331j22945l35535p9156j87553J44448J96936L03908K86930M89033
1945H14107k31842k41768j99007j42006n05793K70770J79182J28599l4861N44531
1935E81912k96710j62828J61141k23148K33719j6047O3642l51591N17750j96557
1925C11283r6298j30107J45676m1202o21306L76041m66646M98422j34062L22069
1915A63870M5158J77061l95449K0796J92647k13242K65800M6099K2924M3960q3889
$$ plain form
1904 285735 462719 492709 169583 467180 634904 424669 247523 660367 442878 -49487
1894 -49487 -179483 -11485 -100329 -438506 118520 -94822 -378655 -435838 95309 64577
1884 64577 28130 227937 241241 156130 -47721 545467 490700 483319 219429 475160 -111050
1873 -111050 -95287 -493024 -142650 -214771 227360 195917 118390 321725 426036 388998 192621
1862 192621 512808 423776 195064 246559 69586 303458 335712 296493 498337 445993 159034
1851 159034 421860 417297 227274 483969 930842 680859 591270 691500 848550 376575
1841 376575 634275 817219 490226 323973 241267 -117352 -318331 271659 41182 132437
1831 132437 108930 -35374 -131951 11860 -161483 276735 279705 301214 -109993 -187003 -365035
$$ packed form
1904B85735J76984K9990l23126K97597J67724k10235j77146M12844k17489m92365
1894d9487j29996J67998q8844l38177N57026k13342k83833n7183N31147l0732
1884F4577l6447J99807J3304q5111k03851N93188n4767p381k63890K55731n86210
1873a11050J5763l97737L50374p2121M42131l1443p7527K03335J04311l7038j96377
1862A92621L20187q9032k28712N1495j76973K33872L2254l9219K01844n2344k86959
1851A59034K62826m563j90023K56695M46873k49983q9589J00230J57050m71975
1841C76575K57700J82944l26993j66253q2706l58619k00979N89990k30477R1255
1831A32437k3507j44304r6577J43811j73343M38218K970K1509m11207p7010j78032
$$ plain form
1820 -365035 -188167 -308812 -42910 241048 166469 9338 -163542 -168349 78557 -333663
1810 -333663 -148111 -49739 -493 -277052 152685 155024 341421 95637 -6010 118590
1800 118590 475445 368491 348378 601732 584807 508303 453844 224654 -27102 386150
1790 386150 66316 449429 400634 345677 369315 335470 253193 -201118 -258266 -147110 173426
1779 173426 68253 -43690 -88350 68234 -188960 -250450 -73978 -139608 -61798 348127
1769 348127 510668 128921 83855 204326 235763 -174412 -2581 -16232 -448806 -250895
1759 -250895 25019 -128979 -85258 -74536 -100207 -441479 -187010 -198440 70107 -52926
1749 -52926 341210 192007 227846 142099 -139633 109960 282124 -1075 190858 272299
$$ packed form
1820c65035J76868j20645K65902K83958p4579j57131j72880m807K46906m12220
1810c33663J85552R8372M9246k76559M29737K339J86397k45784j01647J24600
1800A18590L56855j06954k0113K53354j6925p6504n4459k29190k51756M13252
1790C86150l19834L83113m8795n4957K3638l3845q2277m54311n7148J11156L20536
1779A73426j05173j11943m4660J56584k57194o1490J76472o5630P7810M09925
1769C48127J62541l81747m5066J20471L1437m10175J71831j3651m32574J97911
1759b50895K75914j53998M3721J0722k5671l41272K54469j1430K68547j23033
1749e2926L94136j49203L5839q5747k81732K49593J72164k83199J91933Q1441
$$ plain form
1739 272299 -78779 -298743 118500 -110371 -245319 -119361 -6636 -516350 -430616 -216901
1729 -216901 -633439 -411449 -213172 -86888 357471 288326 -65414 -9725 29284 68156
1719 68156 -292102 31463 170163 291575 -77236 -141909 -52714 -35212 -15376 -272949 280124
1708 280124 -31075 -229888 97403 144612 -134343 161656 550371 342926 381770 558835
1698 558835 102926 106388 161938 318907 470570 568803 -92140 -49132 502105 275683 -12175
1687 -12175 233294 671508 224109 318691 84884 -109213 -156633 429462 213769 470164
1677 470164 302699 -20791 80196 -179092 -313435 -152325 289587 -117760 208029 17461
1667 17461 -53217 -379942 -309016 -270124 -243042 8611 -122227 117024 206500 457008 -67893
$$ packed form
1739B72299l51078k19964M17243k28871j34948J25958J12725n09714Q5734K13715
1729b16901m16538K21990J98277J26284M44359o9145l53740N5689L9009L8872
1719F8156l60258L23565J38700J21412l68811o4673Q9195J7502J9836k57573N53073
1708B80124l11199j98813L27291M7209k78955K95999L88715k07445L8844J77065
1698E58835m55909L462N5550J56969J51663R8233o60943M3008N51237k26422k87858
1687a2175K45469M38214m47399R4582k33807j94097m7420N86095k15693K56395
1677D70164j67465l23490J00987k59288j34343J61110M41912m07347L25789j90568
1667A7461p0678l26725P0926L8892K7082K51653j30838K39251Q9476K50508n24901
$$ plain form
1656 -67893 126137 421521 355674 194765 221109 114106 146049 46322 83147 -100651 -279699
1645 -279699 67368 -58971 -482131 -21181 391573 409357 180426 48409 210655 79039
1635 79039 -343114 -171452 -274749 -54860 15735 -251903 -537789 -347745 -578323 -445916
1625 -445916 -425266 -291782 123339 -116143 -165764 -157008 -374200 -86881 28763 -123303
1615 -123303 -162586 161243 70652 -64054 -357276 -14425 135828 -97806 -33154 -51657
1605 -51657 69060 227959 121332 -54176 39557 166580 63054 -375413 -221845 -176057
1595 -176057 -262721 -45321 46833 -177210 -137491 88608 -23989 34165 66747 -221832 -211101
1584 -211101 -209883 125795 -92360 442140 422301 109910 -499290 -473351 -550116 -457580 -96744
$$ packed form
1656f7893J94030K95384o5847j60909K6344j07003L1943r9727L6825j83798j79048
1645b79699L47067j26339m23160M60950M12754J7784k28931j32017J62246j31616
1635G9039m22153J71662j03297K19889P0595k67638k85886J90044k30578J32407
1625d45916K0650J33484M15121k39482m9621Q756k17192K87319J15644j52066
1615a23303l9283L23829r0591j34706k93222L42851J50253k33634O4652j8503
1605e1657J20717J58899j06627j75508R3733J27023j03526m38467J53568M5788
1595a76057q6664K17400R2154k24043L9719K26099j12597N8154L2582k88579J0731
1584b11101J218L35678k18155N34500j9839l12391o09200K5939p6765R2536L60836
$$ plain form
1573 -96744 -71671 -158132 19296 -98213 -243416 -426990 -499856 -211752 -92906 13976
1563 13976 -131961 113193 -172183 -305990 -188519 -144333 -124809 -22895 -12939 -624205 -102873
1552 -102873 140892 -10657 -147010 176831 141837 -339190 -12165 31887 -149557 -168086
1542 -168086 -62257 -437455 -355066 -231032 -350002 -308760 -455647 5647 -200716 -276753
1532 -276753 -277740 -276829 -597104 -784692 -296886 -151648 -62821 -134618 84489 -336464 -337766
1521 -337766 -277157 -420314 -393795 -22448 136765 -38376 36715 -555780 -305034 -460042
1511 -460042 -203932 -271045 -145105 -37970 -61753 -37431 -188866 -309995 -370305 25291
1501 25291 -26736 -73910 270318 409884 414106 236159 254341 127186 209386 145875 216716
$$ packed form
1573i6744K5073q6461J77428j17509j45203j83574p2866K88104J18846J06882
1563A3976j45937K45154k85376j33807J17471M4186J9524J01914R956o11266N21332
1552a02873K43765j51549j36353L23841l4994m81027L27025M4052j81444j8529
1542a68086J05829l75198Q2389J24034j18970M1242j46887M61294k06363p6037
1532b76753r87R11l20275j87588M87806J45238Q8827p1797K19107m20953j302
1521c37766O0609j43157K6519L71347J59213j75141P5091n92495K50746j55008
1511d60042K56110o7113J25940J07135k3783K4322j51435j21129o0310L95596
1501B5291n2027m7174L44228J39566M222j77947J8182j27155Q2200o3511P0841
$$ plain form
1490 216716 -113144 -215209 -34208 -371417 -539908 -451500 -21966 -285113 -153213 91050
1480 91050 -127765 -456979 -71700 -91542 -356059 -192296 303715 133359 5412 -50388
1470 -50388 -80697 -220024 -297385 -16299 281184 -348716 -269105 90692 -958 -445358 -89997
1459 -89997 -147814 -207608 -710869 -354668 -365432 -531670 17184 216889 52393 -72020
1449 -72020 200641 -135489 233578 354947 730644 581486 145641 150658 91745 -418325
1439 -418325 -363022 -75250 -236636 -160707 142714 345143 47859 29671 295956 275737
1429 275737 1822 249865 292213 136179 -76293 93136 642884 445210 230861 98981
1419 98981 -164835 19726 395454 367883 -5992 53834 7035 137856 -238349 11786
$$ packed form
1490B16716l29860j02065J81001l37209j68491Q8408M29534k63147J31900K44263
1480I1050k18815l29214L85279j9842k64517J63763M96011j70356j27947n5800
1470e0388l0309j39327p7361K81086K97483o29900P9611L59797r1650m44400L55361
1459h9997n7817n9794n03261L56201j0764j66238N48854J99705j64496j24413
1449g2020K72661l36130L69067J21369L75697j49158m35845N017n8913n10070
1439d18325N5303K87772j61386P5929L03421K02429k97284j8188K66285k0219
1429B75737k73915K48043M2348j56034k12472J69429N49748j97674k14349j31880
1419I8981k63816J84561L75728k7571l73875N9826m6799J30821l76205K50135
$$ plain form
1409 11786 84193 -247139 -337132 118509 72499 -95320 -21091 53057 194613 -93300 396113
1398 396113 506740 380737 446220 657930 347318 194368 338991 493959 501722 145049
1388 145049 54361 125956 52728 -114529 -211441 -237169 -170111 -137554 -157586 166485 344784
1377 344784 145765 -65163 -264780 184050 222257 259984 271310 132344 14612 -134183
1367 -134183 -88019 -60569 276974 46557 13180 -42918 142462 31921 -9425 -350378 -389943
1356 -389943 -613850 -458657 -442851 -212425 81075 373621 161476 479759 115585 327037
1346 327037 148932 186370 236455 97813 -55519 158725 -252756 -454474 135330 238324
1336 238324 -34845 -448155 -117477 -74604 -192076 -368491 201993 61286 -82580 -68586
$$ packed form
1409A1786P2407l31332q9993M55641m6010j67819P4229P4148J41556k87913M89413
1398C96113J10627j26003O5483K11710l10612j52950J44623J54968P763l56673
1388A45049r0688P1595p3228j67257r6912k5728O7058L2557k0032L24071J78299
1377C44784j99019k10928j99617M48830L8207L7727J1326j38966j17732j48795
1367a34183M6164K7450L37543k30417l3377n6098J85380j10541m1346l40953l9565
1356c89943k23907J55193J5806K30426K93500K92546k12145L18283l64174K11452
1346C27037j78105L7438N0085j38642j53332K14244m11481k01718N89804J02994
1336B38324k73169m13310L30678M2873j17472j76415N70484j40707j43866J3994
$$ plain form
1326 -68586 -192759 -311922 -450081 -182505 -377269 -414443 -191557 -52008 -486255 -335049
1316 -335049 122762 -54369 -29526 85697 35040 -130024 -152749 -225672 -243745 -462228 -333757
1305 -333757 -672095 -523573 -600999 -389942 -296250 -224884 -415230 -316740 -71830 -446151
1295 -446151 -499399 -74086 156978 345121 345192 349164 -198895 -245060 -353074 -616891 -564026
1284 -564026 -238270 145525 177205 -125627 84312 180452 -222279 -230184 94070 -379741
1274 -379741 -321206 -164815 -211288 -640205 -157279 44391 -431738 -511359 -252565 -584927
1264 -584927 -635156 -172492 -546443 -660193 -482129 -166152 -278704 -175628 -273064 118954
1254 118954 6220 248844 308263 240980 209591 121809 185161 -145621 -118579 344399 482103
$$ packed form
1326f8586j24173j19163j38159K67576j94764l7174K22886J39549m34247J51206
1316c35049M57811j77131K4843J15223n0657j65064k2725p2923j8073k18483J28471
1305c33757l38338J48522p7426K11057R3692P1366j90346R8490K44910l74321
1295d46151n3248M25313K31064J88143P1L972n48059m6165j08014k63817N2865
1284e64026L25756L83795L1680l02832K09939R6140m02731p905L24254m73811
1274c79741N8535J56391m6473m28917M82926K01670m76129p9621K58794l32362
1264e84927n0229M62664l73951j13750J78064L15977j12552J03076r7436L92018
1254A18954j12734K42624N9419o7283l1389q7782O3352l30782K7042M62978J37704
$$ plain form
1243 482103 162950 384432 232532 -502614 -134031 -144697 -523382 -28824 251090 124320
1233 124320 -40085 160454 -39608 -288456 -473739 -303094 -242341 -179013 -238558 -404041
1223 -404041 -169109 -60147 -24756 272105 345150 -289737 -245939 -62126 -179577 -358769
1213 -358769 -14018 35646 -409137 -450039 -157400 -87613 -221294 107108 176043 24004
1203 24004 -520278 -289117 214130 -61548 104556 457494 331865 -98053 -433716 -579747
1193 -579747 -781347 -730418 -248900 -247211 -601836 -437526 -154803 -268907 -218290 -496597
1183 -496597 -235306 -391110 -257888 -503615 -266848 -170726 35891 60344 177874 97665
1173 97665 -68795 -480408 -418845 -264554 -230252 -61043 -136077 139329 313106 475952
$$ packed form
1243D82103l19153K21482j51900p35146L68583j0666l78685M94558K79914j26770
1233A24320j64405K00539k00062k48848j85283J70645O0753O3328n9545j65483
1223d04041K34932J08962L5391K96861P3045o34887M3798J83813j17451j79192
1213c58769L44751M9664m44783m0902K92639O9787j33681L28402O8935j52039
1203B4004n44282K31161N03247k75678J66104L52938j25629m29918l35663j46031
1193e79747k01600N0929M81518J689l54625J64310K82723j14104N0617k78307
1183d96597K61291j55804J33222k45727K36767R6122K06617K4453J17530q0209
1173I7665j66460m11613O1563J54291L4302J69209p5034K75406J73777J62846
$$ plain form
1163 475952 419294 44499 -26807 190931 272304 -84347 287044 568997 -25623 -215712
1153 -215712 -222502 -46189 -315175 318470 201600 67807 -161981 -98804 -399832 -194611
1143 -194611 24347 55757 521555 222998 -116178 -483589 -334568 -735084 -412535 -83553
1133 -83553 -84822 -204911 -87387 180863 171591 218666 -106774 93272 -191905 284066 -159602
1122 -159602 115345 -35410 -52063 -50346 -86170 -418045 -129771 189693 -298482 -134929
1112 -134929 -248872 -62228 -258237 13212 31911 33226 72545 -8151 -651190 -564895 -456406
1101 -456406 -382119 -452959 -391572 -420996 -147962 -509803 -501200 -186101 -337720 -47218 -34736
1090 -34736 -236254 -6081 247036 128584 77237 70809 205635 -122630 -308403 -227181 -235422
$$ packed form
1163D75952n6658l74795p1306K17738Q1373l56651L71391K81953n94620j90089
1153b15712o790J76313k68986O33645j16870j33793k29788O3177l01028K05221
1143a94611K18958L1410M65798k98557l39176l67411J49021m00516L22549L28982
1133h3553j269j20089J17524K68250r272M7075l25440K00046k85177M75971m43668
1122a59602K74947j50755j6653J717l5824l31875K88274L19464m88175J63553
1112a34929j13943J86644j96009K71449J8699J315L9319q0696o43039Q6295J08489
1101d56406P4287p0840O1387k9424K73034l61841Q603L15099j51619K90502J2482
1090c4736k01518K30173K53117j18452n1347o428J34826l28265j85773Q1222q241
$$ plain form
1079 -235422 -76941 412867 120365 132721 -121273 -138079 -322692 -284772 -95685 400206
1069 400206 -73232 -133233 -331541 43551 59237 -133726 162523 246486 285019 89663
1059 89663 297121 -75125 200500 103650 225739 -95637 -24411 -268525 -234063 -253624 -144071
1048 -144071 166070 155538 328500 365160 350358 60336 -7696 171444 209602 -45368 134255
1037 134255 581958 -31 -20543 221313 238488 -189196 240698 461735 -118413 -516101
1027 -516101 -14727 64712 -212820 64155 382403 142029 -254247 -256751 -356055 -474492
1017 -474492 -501790 -119967 -10688 -36163 364730 277923 357520 179533 254008 -102456 -161929
1006 -161929 26102 140516 129771 189318 415327 249817 259152 220271 -27890 -370688 -395325
$$ packed form
1079b35422J58481M89808k92502J2356k53994j6806j84613L7920J89087M95891
1069D00206m73438o0001j98308L75092J5686j92963K96249Q3963L8533j95356
1059H9663K07458l72246K75625r6850J22089l21376P1226k44114L4462j9561J09553
1048a44071L10141j0532J72962L6660j4802k90022o8032J79140L8158k54970J79623
1037A34255M47703n81989k0512K41856J7175m27684M29894K21037n80148l97688
1027e16101N01374P9439k77532K76975L18248k40374l96276k504r9304j18437
1017d74492k7298L81823J09279k5475M00893q6807P9597j77987P4475l56464n9473
1006a61929J88031J14414j0745N9547K26009j65510R335l8881k48161l42798k4637
$$ plain form
995 -395325 -399446 -78782 -413064 284576 -83533 81332 -193284 -95638 -295422 -116252
985 -116252 -190453 -111015 -334141 -132086 -107816 -167805 -103011 -39974 89203 -205340 -17053
974 -17053 -310203 -237166 -444763 191184 -137074 13964 102102 249278 -130401 -161190 -7986
963 -7986 -413673 -294625 -696006 -558693 -213146 55641 158136 290315 275296 -35494
953 -35494 182525 -102092 55077 -63143 189144 316197 226363 407644 244492 137433
943 137433 205637 -135060 -507604 -251066 -436401 -308856 -157500 -220455 -582773 -201942
933 -201942 -262243 -149509 -236657 -3487 -113071 -77507 212646 222712 -59697 37127 346076
922 346076 497653 284222 -211019 19906 -392206 -200544 -182033 212391 -413169 18440
$$ packed form
995c95325m121L20664l34282O97640l68109J64865k74616R7646j99784J79170
985a16252p4201P9438k23126K02055K4270n9989O4794O3037J29177k94543J88287
974a7053k93150P3037k07597O35947l28258J51038Q8138J47176l79679l0789J53204
963g986m05687J19048m01381J37313L45547K68787J02495J32179j5019l10790
953c5494K18019k84617J57169j18220K52287J27053q9834J81281j63152j07059
943A37433O8204l40697l72544K56538j85335J27545J51356o2955l62318L80831
933b01942o0301J12734q7148K33170j09584L5564K90153J0066k82409R6824L08949
922C46076J51577k13431m95241K30925m12112J91662J8511L94424o25560M31609
$$ plain form
912 18440 122194 174111 -243049 60477 337283 4668 -119678 -124944 -262775 -409706 -171472
901 -171472 -139871 -34704 137531 175667 186822 80108 -148321 -339767 -440725 -205949
891 -205949 24709 -98115 15184 286647 25310 -278192 -237484 -326858 -692985 -588185
881 -588185 -466022 -90919 -296108 472002 539079 205138 -42578 144649 -242184 -234725
871 -234725 -517336 -341476 -268038 -332202 -99797 -260815 -248053 15464 -126119 -538338
861 -538338 -454552 -254119 -105951 92126 152816 411550 -55931 246477 -33225 -27019 9921
850 9921 -306504 -275454 -115815 -194817 -53430 267114 80770 130636 39149 69284 -103994
839 -103994 -28975 -71013 -49076 -351048 -274358 -334145 5197 40801 -137333 -337975 -128913
$$ packed form
912A8440J03754N1917m17160L03526K76806l32615j24346n266j37831j46931K38234
901a71472L1601J05167J72235L8136J1155j06714k28429j91446j00958K34776
891b05949K30658j22824J13299K71463k61337l03502M0708q9374l66127J04800
881e88185J22163L75103k05189P68110O7077l33941k47716J87227l86833P459
871b34725k82611J75860P3438o4164K32405j61018J2762K63517j41583m12219
861e38338Q3786K00433J48168J98077O0690K58734m67481L02408k79702O206L6940
850I921l16425L1050J59639p9002J41387L20544j86344M9866r1487L0135j73278
839a03994P5019m2038K1937l01972P6690n9787L39342L5604j78134k00642K09062
$$ plain form
828 -128913 -440195 -398659 -278263 -66661 -441332 -107544 -91913 63139 -156662 -340893
818 -340893 -469167 -364368 -402959 -731489 -571286 14894 196244 -140633 132811 -64608
808 -64608 -145543 324931 169584 122183 -11803 160153 -95771 32015 -94828 -96156 -453747
797 -453747 -209872 -391609 -767920 -643943 -499957 -221156 -372650 -309161 -394584 -303157
787 -303157 -620449 141726 -262107 -390747 74812 388425 -180035 86957 20220 179212
777 179212 305282 438765 -24485 16122 300256 251872 -369413 106553 237946 -29592
767 -29592 -132161 -196498 -199608 -75726 68084 93574 70180 -121394 -159165 -56574 -419055
756 -419055 -150903 143821 347737 121011 177277 399292 -136507 -140978 128253 -51361
$$ packed form
828a28913l11282M1536J20396K11602l74671L33788J5631J55052k19801j84231
818c40893j28274J04799l8591l28530J60203N86180J81350l36877K73444j97419
808f4608q0935M70474j55347m7401j33986J71956k55924J27786j26843j328l57591
797d53747K43875j81737l76311J23977J43986K78801j51494O3489q5423R1427
787c03157l17292P62175m03833j28640M65559L13613n68460K66992o6737J58992
777A79212J26070J33483m63250M0607K84134m8384o21285M75966J31393k67538
767b9592j02569o4337l110J23882J43810K5490k3394j91574l7771J02591l62481
756d19055K68152K94724K03916k26726N6266K22015n35799m471K69231j79614
$$ plain form
746 -51361 -39124 226978 124130 -35291 260865 227336 75870 153381 -175034 -331971 -549501
735 -549501 -143101 -190164 -158064 163806 347549 -196624 128545 85279 48718 -163449 -329249
724 -329249 -256249 -59367 -321441 406411 702684 336858 64291 222948 -138523 -347703
714 -347703 -401293 -43522 -213943 104820 361686 14105 186731 408273 186124 252304
704 252304 337511 -94620 -13012 505825 450192 340046 349463 447047 240272 180893 315270
693 315270 -63403 49837 -148193 115062 40241 -848 -252017 318417 150294 -203349
683 -203349 -146177 -74253 -312423 -537184 -99585 -270105 -295124 34950 143340 -223768
673 -223768 -219918 -24789 -199951 45878 -221558 -370912 -80198 -131462 -141770 -9156 235151
$$ packed form
746e1361J2237K66102j02848j59421K96156l3529j51466P7511l28415j56937k17530
735e49501M06400m7063L2100L21870J83743n44173L25169m3266l6561k12167j65800
724c29249P3000J96882k62074P27852K96273l65826k72567J58657l61471k09180
714c47703n3590L57771j70421L18763K56866l47581J72626K21542k22149O6180
704B52304Q5207m32131Q1608N18837n5633j10146R417R7584k06775n9379J34377
693C15270l78673J13240j98030K63255p4821m1089k51169N70434j68123l53643
683b03349N7172P1924k38170k24761M37599j70520k5019L30074J08390l67108
673b23768L850J95129j75162K45829k67436j49354K90714n1264j0308J32614K44307
$$ plain form
662 235151 -74036 -267740 -55813 -23091 2090 -47376 267874 281383 178627 -163092 -60466
651 -60466 112783 189358 163880 337743 526365 69346 -15418 24196 -236640 -134854 25925
640 25925 203881 70353 -82990 78660 32319 -29956 -352423 -392067 -442795 -455251 -637953
629 -637953 -371196 -185827 -379784 -226392 70031 -149896 -179690 164793 162783 92884 10695
618 10695 43103 -117257 116265 199166 106369 -97860 159580 58618 -285207 -419674 -361708
607 -361708 -520358 -390668 -345708 -123117 157235 258368 319330 61772 -197889 -64344
597 -64344 -125184 -478021 -363828 -79506 -102274 5593 232862 213135 -82381 -231658 -185523
586 -185523 -547067 -457064 112673 218359 -129636 331687 236105 210423 -119350 -58480 -28342
$$ packed form
662B35151l09187j93704K11927L2722K5181m9466L15250J3509j02756l41719J02626
651f0466J73249P6575k5478J73863J88622m57019q4764L9614k60836J01786J60779
640B5925J77956j33528j53343J61650m6341o2275l22467l9644n0728j2456j82702
629f37953K66757J85369j93957J53392K96423k19927k9794L44483k010o9899q2189
618A0695L2408j60360K33522Q2901r2797k04229K57440j00962l43825j34467N7966
607c61708j58650J29690M4960K22591K80352J01133O0962k57558k59661J33545
597f4344o0840l52837J14193K84322k2768J07867K27269j9727k95516j49277M6135
586a85523l61544R0003N69737J05686l47995M61323r5582k5682l29773O0870L0138
$$ [...]
##END NTUPLES=NMR SPECTRUM
##END=
