##TITLE=1H_EC-3273(4)
 CDCl3
 8 sc, 
 12.05.2022
##JCAMPDX= 6.0         $$ Bruker NMR JCAMP-DX V2.0
##DATA TYPE= NMR SPECTRUM
##DATA CLASS= NTUPLES
##ORIGIN= UXNMR, Bruker Analytische Messtechnik GmbH
##OWNER= root
$$ XWIN-NMR		Version 3.5
$$ Thu May 12 11:09:29 2022 Russian Standard Time (UT+4h)  she@DPX200
##.OBSERVE FREQUENCY= 200.1313499996
##.OBSERVE NUCLEUS= ^1H
##.ACQUISITION MODE= SIMULTANEOUS
##.ACQUISITION SCHEME= undefined
##.AVERAGES= 8
##.DIGITISER RES= 18
##SPECTROMETER/DATA SYSTEM= spect
##.PULSE SEQUENCE= zg30
##.SOLVENT NAME= Pyr
##.SHIFT REFERENCE= (INTERNAL, Pyr, 0, 15.7293)
##AUDIT TRAIL= $$ (NUMBER, WHEN, WHO, WHERE, WHAT)
$$ ##TITLE= Audit trail, XWIN-NMR		Version 3.5
$$ ##JCAMPDX= 5.01
$$ ##ORIGIN= Bruker BioSpin GmbH
$$ ##OWNER= she
$$ F:/spectra/data/she/nmr/H-F/1/pdata/1/auditp.txt
$$ ##AUDIT TRAIL=  $$ (NUMBER, WHEN, WHO, WHERE, WHAT)
(   1,<2022-05-12 11:08:28.67 +0400>,<she>,<DPX200>,
      <created by zg, POWCHK disabled, PULCHK disabled
       configuration hash MD5:
       00 E9 B6 7A A2 85 ED C7 34 08 36 98 17 FE 4E 26
       data hash MD5: 16K
       5A 13 7D A9 C8 BE 55 21 F9 D2 0F C9 FF B7 B0 80>)
(   2,<2022-05-12 11:08:30.76 +0400>,<she>,<DPX200>,
      <Start of raw data processing
       efp BC_mod = 2 LB = 0.24 FT_mod = 6 PKNL = 1 PHC0 = -17672.26 PHC1 = 15.00075 SI = 16K 
       data hash MD5: 16K
       91 1D 01 F0 D2 E6 62 6F 57 9E 40 61 0B C0 D7 BA>)
(   3,<2022-05-12 11:08:43.79 +0400>,<she>,<DPX200>,
      <pk PHC0 = -0.4680655 PHC1 = 1 
       data hash MD5: 16K
       34 60 22 73 9A AB 6B 0D 73 17 02 78 05 BD 02 B9>)
(   4,<2022-05-12 11:08:46.93 +0400>,<she>,<DPX200>,
      <abs ABSG = 5 
       data hash MD5: 16K
       63 F5 A3 18 38 93 5F 37 60 9F 86 7B DC B7 F6 AC>)
$$ ##END=
$$ 
$$ hash MD5
$$ 1C 91 21 EF 63 CA 1F 00 4B F9 02 66 B4 5B 4C 2E
##$RELAX= 
##$RELAX= 
##$RELAX= 
##$RELAX= 
##$RELAX= 
##$RELAX= 
$$ Bruker specific parameters
$$ --------------------------
##$DU= <F:/spectra>
##$EXPNO= 1
##$NAME= <H-F>
##$PROCNO= 1
##$TYPE= <nmr>
##$USER= <she>
##$AMP= (0..31)
100 100 100 100 100 100 100 100 100 100 100 100 100 100 100 100 100 100 
100 100 100 100 100 100 100 100 100 100 100 100 100 100 
##$AQSEQ= 0
##$AQ_mod= 1
##$AUNM= <au_zg>
##$AUTOPOS= <>
##$BF1= 200.13
##$BF2= 200.13
##$BF3= 200.13
##$BF4= 200.13
##$BF5= 200.13
##$BF6= 200.13
##$BF7= 200.13
##$BF8= 200.13
##$BYTORDA= 1
##$CFDGTYP= 0
##$CFRGTYP= 5
##$CHEMSTR= <none>
##$CNST= (0..31)
1 1 145 1 1 1 1 1 1 1 1 1 1 1 1 1 1 1 1 1 1 1 1 1 1 1 1 1 1 1 1 1 
##$CPDPRG= <>
##$CPDPRG1= <>
##$CPDPRG2= <>
##$CPDPRG3= <>
##$CPDPRG4= <mlev>
##$CPDPRG5= <mlev>
##$CPDPRG6= <mlev>
##$CPDPRG7= <mlev>
##$CPDPRG8= <mlev>
##$CPDPRGB= <>
##$CPDPRGT= <>
##$D= (0..31)
0 1.2 0 0 0 0 0 0 0 0.06 0 0.03 0 0 0 0 0.0002 0 0 0 0 0 0 0 0 0 0 0 0 
0 0 0 
##$DATE= 1652339308
##$DBL= (0..7)
120 120 120 120 120 120 120 120 
##$DBP= (0..7)
150 150 150 150 150 150 150 150 
##$DBP07= 0
##$DBPNAM0= <>
##$DBPNAM1= <>
##$DBPNAM2= <>
##$DBPNAM3= <>
##$DBPNAM4= <>
$$ [...]
##$SUBNAM2= <"">
##$SUBNAM3= <"">
##$SUBNAM4= <"">
##$SUBNAM5= <"">
##$SUBNAM6= <"">
##$SUBNAM7= <"">
##$SUBNAM8= <"">
##$SUBNAM9= <"">
##$SW= 18.0517283424761
##$SWIBOX= (0..15)
0 0 2 0 0 0 0 0 0 0 0 0 0 0 0 0 
##$SW_h= 3612.71676300578
##$TD= 16384
##$TD0= 1
##$TE= 0
##$TE2= 300
##$TE3= 300
##$TEG= 300
##$TL= (0..7)
0 120 120 120 120 120 120 120 
##$TP= (0..7)
150 150 150 150 150 150 150 150 
##$TP07= 0
##$TPNAME0= <>
##$TPNAME1= <>
##$TPNAME2= <>
##$TPNAME3= <>
##$TPNAME4= <>
##$TPNAME5= <>
##$TPNAME6= <>
##$TPNAME7= <>
##$TPOAL= (0..7)
0.5 0.5 0.5 0.5 0.5 0.5 0.5 0.5 
##$TPOFFS= (0..7)
0 0 0 0 0 0 0 0 
##$TUNHIN= 0
##$TUNHOUT= 0
##$TUNXOUT= 0
##$USERA1= <user>
##$USERA2= <user>
##$USERA3= <user>
##$USERA4= <user>
##$USERA5= <user>
##$V9= 5
##$VALIST= <valist>
##$VCLIST= <CCCCCCCCCCCCCCC>
##$VD= 0
##$VDLIST= <DDDDDDDDDDDDDDD>
##$VPLIST= <PPPPPPPPPPPPPPP>
##$VTLIST= <TTTTTTTTTTTTTTT>
##$WBST= 1024
##$WBSW= 4
##$XGAIN= (0..3)
0 0 0 0 
##$XL= 0
##$YL= 0
##$YMAX_a= 283053
##$YMIN_a= -415514
##$ZGOPTNS= <>
##$ZL1= 120
##$ZL2= 120
##$ZL3= 120
##$ZL4= 120
##$ABSF1= 15.72816
##$ABSF2= -2.323689
##$ABSG= 5
##$ABSL= 3
##$ALPHA= 0
##$AQORDER= 0
##$ASSFAC= 0
##$ASSFACI= 0
##$ASSFACX= 0
##$ASSWID= 0
##$AUNMP= <proc_1d>
##$AZFE= 0.1
##$AZFW= 0.1
##$BCFW= 0
##$BC_mod= 2
##$BYTORDP= 0
##$COROFFS= 0
##$CY= -3
##$DATMOD= 1
##$DC= 0
##$DFILT= <>
##$DTYPP= 0
##$F1P= 0
##$F2P= 0
##$FCOR= 1
##$FTSIZE= 16384
##$FT_mod= 6
##$GAMMA= 0
##$GB= 0
##$INTBC= 1
##$INTSCL= 0
##$ISEN= 128
##$LB= 0.24
##$LEV0= 0
##$LPBIN= 0
##$MAXI= 10000
##$MC2= 0
##$MEAN= 0
##$ME_mod= 0
##$MI= 1.114404
##$NCOEF= 0
##$NC_proc= -7
##$NLEV= 6
##$NOISF1= 3.799351
##$NOISF2= 2.8
##$NSP= 0
##$NTH_PI= 0
##$NZP= 0
##$OFFSET= 15.72926
##$PC= 1
##$PHC0= -17672.73
##$PHC1= 16.00075
##$PH_mod= 1
##$PKNL= yes
##$PPARMOD= 0
##$PSCAL= 0
##$PSIGN= 0
##$REVERSE= no
##$SF= 200.130008461684
##$SI= 16384
##$SIGF1= 3
##$SIGF2= 2
##$SINO= 5.538805
##$SIOLD= 16384
##$SREGLST= <1H.CDCl3>
##$SSB= 0
##$STSI= 16384
##$STSR= 0
##$SW_p= 3612.71676300578
##$SYMM= 0
##$S_DEV= 0
##$TDeff= 16384
##$TDoff= 0
##$TI= <>
##$TILT= no
##$TM1= 0
##$TM2= 0
##$TOPLEV= 0
##$USERP1= <user>
##$USERP2= <user>
##$USERP3= <user>
##$USERP4= <user>
##$USERP5= <user>
##$WDW= 1
##$XDIM= 16384
##$YMAX_p= 475394904
##$YMIN_p= -967366
$$ End of Bruker specific parameters
$$ ---------------------------------
##NTUPLES= NMR SPECTRUM
##VAR_NAME=  FREQUENCY,     SPECTRUM/REAL,   SPECTRUM/IMAG
##SYMBOL=    X,             R,               I
##VAR_TYPE=  INDEPENDENT,   DEPENDENT,       DEPENDENT
##VAR_FORM=  AFFN,          ASDF,            ASDF
##VAR_DIM=   16384,         16384,           16384
##UNITS=     HZ,            ARBITRARY UNITS, ARBITRARY UNITS
##FACTOR=    0.220516191357247, 1,           1
##FIRST=     3147.89702588206, 0,            0
##LAST=      -464.819737123722, 0,           0
##MIN=       -464.819737123722, -967366,     0
##MAX=       3147.89702588206, 475394904,    0
$$ Real data points
##PAGE= N=1
##DATA TABLE= (X++(R..R)), XYDATA
$$ [...]
6276A756601O13179K05156j15540K22421l849J69502j06336n90729P9135k20321
$$ 1756601 2369780 2574936 2459396 2681817 2677968 2847470 2741134 2150405 2229540 2009219
6266B009219L1748N1454L7690K13989L1030j32075k24056m64745n32862k42866
$$ 2009219 2040967 2092421 2130111 2344100 2375130 2243055 2018999 1554254 1021392 778526
6256G78526K86167K07668J77142L34714P2538l3026k35413P0439K15776j37750
$$ 778526 1064693 1272361 1449503 1784217 1856755 1823729 1588316 1658755 1874531 1736781
6246A736781J84123P4224m10898J54888L47792Q1020j4968o6969j41984n5174
$$ 1736781 1920904 1995128 1584230 1739118 2086910 2167930 2152962 2085993 1944009 1888835
6236A888835k36551m0587M72734N0326J33531J05994j67009L62619l8580p7882
$$ 1888835 1652284 1611697 2084431 2134757 2268288 2374282 2207273 2569892 2531312 2453430
6226B453430j39254j29598J20953k08149l21112q0987O3664Q0614q5515J95881
$$ 2453430 2314176 2184578 2305531 2097382 1776270 1695283 1758947 1839561 1754046 1949927
6216A949927J01592k99965l0395R8262J64757p1880k53850K34272O5665J14201
$$ 1949927 2051519 1751554 1721159 1819421 1984178 1912298 1658448 1892720 1958385 2072586
6206B072586q3249l92106J95262j50188l2348k29205m04752J66659M21120J913
$$ 2072586 1989337 1597231 1792493 1642305 1609957 1380752 976000 1142659 1563779 1565692
6196A565692J73521N1848J1623o6449n2829J12239Q0363R7977N6117k7876j86259
$$ 1565692 1739213 1791061 1802684 1736235 1683406 1795645 1876008 1973985 2030102 2002226 1815967
6185A815967L26606j59823k19429k48600k5461O7696p4835J57211L10927k1985
$$ 1815967 2142573 1982750 1763321 1514721 1489260 1556956 1482121 1639332 1950259 1928274
6175A928274R4159J28464j62550P8444l20108q1028K75886j8455L35093N4236
$$ 1928274 2022433 2150897 1988347 2066791 1746683 1665655 1941541 1923086 2258179 2312415
6165B312415L50359L75127j45667K79470K15005J40723j63473j63113k97587m94517
$$ 2312415 2662774 3037901 2892234 3171704 3386709 3527432 3363959 3200846 2903259 2408742
6155B408742l28877j24188J83507q9719N8235Q8779L3326M6383K71725M66815
$$ 2408742 2079865 1955677 2139184 2049465 2107700 2196479 2229805 2276188 2547913 3014728
6145C014728q19K34756n8826j73772l93971j91702o8769l779j44986p1097l60623
$$ 3014728 3013909 3248665 3189839 3016067 2622096 2430394 2361625 2357846 2212860 2141763 1781140
6134A781140k56270J29096R8479R3869r207l36022M0819j59168P3961L69996j01674
$$ 1781140 1524870 1653966 1752445 1846314 1837107 1501085 1541904 1382736 1456697 1826693 1725019
6123A725019L66120J15155M7828j01811l15082j61408k61086j93360K1026J25900
$$ 1725019 2091139 2206294 2254122 2152311 1837229 1675821 1414735 1221375 1242401 1368301
6113A368301O8861K27912m168J0726L36290l29993n6054N8736J92645K04903M1573
$$ 1368301 1437162 1665074 1660906 1671632 2007922 1677929 1621875 1680611 1873256 2078159 2119732
6102B119732k5687Q9294l07469j97171Q272N9009M7189p1973k50767J58987M9710
$$ 2119732 2094045 2183339 1875870 1678699 1686971 1745980 1793169 1721196 1470429 1629416 1679126
6091A679126J4766K01494p400L29J05355q9899r020k5105k90350L22035k30838
$$ 1679126 1693892 1895386 1887986 1888315 1993670 1903771 1894751 1869646 1579296 1901331 1670493
6080A670493O1494k39646k17114M03094K63121R0316L31179q3691k11568L38726
$$ 1670493 1731987 1492341 1275227 1678321 1941442 2031758 2362937 2279246 2067678 2406404
6070B406404r3435m0201J96021L27494K99832j85181J0767j26212j10732j73806
$$ 2406404 2312969 2272768 2468789 2796283 3096115 2910934 2921701 2795489 2684757 2510951
6060B510951j52164r9226n7480O0780j08038K28972P3952J10769l92611Q961k97654
$$ 2510951 2358787 2259561 2202081 2262861 2154823 2383795 2457747 2568516 2175905 2184866 1887212
6049A887212R8823J32795K21046K40610L93119J54295L74212K64076K76395L24709
$$ 1887212 1986035 2118830 2339876 2580486 2973605 3127900 3502112 3766188 4042583 4367292
6039D367292m5724K14375K18153j62708J4433m09626m08977m89315o92003k14240
$$ 4367292 4321568 4535943 4754096 4591388 4605821 4196195 3787218 3297903 2605900 2391660
6029B391660k67814J15834J251R0721K5945L73001k05075K30079k40981J03349
$$ 2391660 2123846 2239680 2240931 2331652 2357597 2730598 2525523 2755602 2514621 2617970
6019B617970J85305p2498J93089j40263k4917r1272Q6516M59008K77390p691k60785
$$ 2617970 2803275 2730777 2923866 2783603 2758686 2667414 2753930 3212938 3490328 3482637 3221852
6008C221852k31168q6175O5964m6785r4605k45367J8459J44792k85996j05949
$$ 3221852 2990684 2904509 2970473 2923688 2829083 2583716 2602175 2746967 2460971 2355022
5998B355022p4803J75064M8176k44165m43289R9004l19119R0396K40516q2189
$$ 2355022 2280219 2455283 2503459 2259294 1816005 1915009 1595890 1686286 1926802 1844613
5988A844613K38582n6483j06154K37269J67029M31819M64098k9666j60136l44655
$$ 1844613 2083195 2026712 1920558 2157827 2324856 2756675 3220773 3191107 3030971 2686316
5978B686316N914o7450m75412r2058k02951k16286O6970j73581J68021J49638
$$ 2686316 2692230 2624780 2149368 2057310 1854359 1638073 1705043 1531462 1699483 1849121
5968A849121J70947N5133J29362r6303j01244j87302K45030L19101p8050n3694
$$ 1849121 2020068 2075201 2204563 2108260 2007016 1819714 2064744 2383845 2305795 2252101
5958B252101M1152j41439J14741J84757K18695L7988K91329L10451K6509j30343
$$ 2252101 2293253 2151814 2266555 2451312 2670007 2707995 2999324 3309775 3336284 3205941
5948C205941n1596m55253j09881q8242j87335k90274J3354J1473L7544q164q6417
$$ 3205941 3154345 2699092 2589211 2500969 2313634 2023360 2036714 2048187 2085731 2077567 1991150
5937A991150j2422J87955K26162J54686J30883R9284j0273k44220l56420k13025
$$ 1991150 1978728 2166683 2392845 2547531 2678414 2777698 2767425 2523205 2166785 1953760
5927A953760J93324K64354J8239K16114L90677k16958N7878j43039K03205K2643
$$ 1953760 2147084 2411438 2429677 2645791 3036468 2819510 2877388 2734349 2937554 2960197
5917B960197L67782o0068J31054J7901N3299j68148j98055j24302Q689k08616
$$ 2960197 3327979 3267911 3398965 3416866 3470165 3302017 3103962 2979660 2988349 2779733
5907B779733k09741L27039k60173J05641l0o2082J74817Q2412N5215K49540L72609
$$ 2779733 2569992 2897031 2636858 2742499 2742469 2680387 2855204 2937616 2992831 3242371 3614980
5896C614980L29115K28905J05847R4754J10558j04443j6435J6244L80322K08833
$$ 3614980 3944095 4173000 4278847 4373601 4484159 4379716 4363281 4379525 4759847 4968680
5886D968680L8944L9588K3107K7037Q0428R2078j16278K14268J32895J8733K59493
$$ 4968680 5007624 5047212 5070319 5097356 5177784 5269862 5153584 5367852 5500747 5519480 5778973
5875E778973J54371J78812L53795L24673L00884L62991L63551O06849N35620Q05904
$$ 5778973 5933344 6112156 6465951 6790624 7091508 7454499 7818050 8424899 8960519 9766423
5865I766423O43184J68714L98174J43574O04346K88119N28322J55896J81938l61570
$$ 9766423 10409607 10578321 10976495 11120069 11724415 12012534 12540856 12696752 12878690 12517120
5855A2517120k00670m81097l76418j73447l36862m36585m20516l42947n98579
$$ 12517120 12316450 11835353 11458935 11285488 10948626 10512041 10091525 9748578 9149999
5846I149999J22879L485k88457r9405o42225j70927q8532J30164j8436N3119l4629
$$ 9149999 9272878 9276363 8987906 8888501 8246276 8075349 7986817 8116981 8098545 8151664 8117035
5835H117035m8937j40170n830L83938J79342K48158J48229L33949P7944K60805
$$ 8117035 8068098 7927928 7922098 8306036 8485378 8733536 8881765 9215714 9293658 9554463
5825I554463J61537L69303J43959K59586N0048j92210M34854M85960O45640Q97394
$$ 9554463 9716000 10085303 10229262 10488848 10538896 10346686 10781540 11267500 11913140 12810534
5815A2810534J118442J526979J384022J647525K098850K722383K961533L596491
$$ 12810534 13928976 15455955 16839977 18487502 20586352 23308735 26270268 29866759
5807B9866759M753175O885210Q185013O968702J935579m770768q647519q811148
$$ 29866759 34619934 41505144 49690157 56658859 58594438 53823670 45176151 36365003
5799C6365003o884327m404067k773294k035725j568741j315168p01978j02027
$$ 36365003 29480676 25076609 22303315 20267590 18698849 17383681 16681703 16579676
5791A6579676r6304p0074K27640J78930J41145l2865N32160M38921M13082m76864
$$ 16579676 16483372 16413298 16640938 16819868 16961013 16928148 17460308 17899229 18312311 17835447
5781A7835447j192101j162926j109149r53928r35453p35610r69618p06420p28904
$$ 17835447 16643346 15480420 14371271 13417343 12481890 11746280 10776662 10070242 9341338
5772I341338k75992o16755m44899l10920j73441k88540j22564l33975k80852k88004
$$ 9341338 9065346 8448591 8003692 7692772 7519331 7230791 7108227 6774252 6493400 6205396
5762F205396k61041l52849l53130j5905j03101k90754K4726j26355m7199j09372
$$ 6205396 5944355 5591506 5238376 5222471 5119370 4828616 4853342 4726987 4679788 4570416
5752D570416N5673j0026L18002k28762o4723j44002K74737n1384j86445M8438
$$ 4570416 4626089 4616063 4934065 4705303 4640580 4496578 4771315 4719931 4533486 4581924
5742D581924k81359k5365k44742k75262k33111K3214R785j37002n22082j67247
$$ 4581924 4300565 4275200 4030458 3755196 3522085 3545299 3555084 3418082 2896000 2728753
5732B728753K8179r3286Q3009j10420K35671J10698j9226J98433j8579K59764
$$ 2728753 2756932 2663646 2746655 2636235 2871906 2982604 2963378 3161811 3143232 3402996
5722C402996j50189k14891l04199P2113J79378m6738q882k04757J31046R3456
$$ 3402996 3252807 3037916 2733717 2805830 2985208 2938470 2929588 2724831 2855877 2949333
5712B949333j3508P3176K34491K00569O6649J83212k33048q2914J70095k25180
$$ 2949333 2935825 3009001 3243492 3444061 3510710 3693922 3460874 3377960 3548055 3322875
5702C322875k34624J6347q5124K49276k26886J240J82224j08406k66722J12169
$$ 3322875 3088251 3104598 3019474 3268750 3041864 3043104 3225328 3116922 2850200 2962369
5692B962369J43964K32613j14563j85533j17310n1633j5505K44714o9134J00412
$$ 2962369 3106333 3338946 3224383 3038850 2921540 2869907 2854402 3099116 3029982 3130394
5682C130394l4564j8713k24938K48777k04856K61803R0803L01422J96869j38219
$$ 3130394 3095830 3077117 2852179 3100956 2896100 3157903 3248706 3550128 3746997 3608778
5672C608778M05617j94240l25409j07141M9467j06855p4087j56783K65254L68458
$$ 3608778 4014395 3820155 3494746 3387605 3437072 3330217 3256130 3099347 3364601 3733059
5662C733059J34848L30564K63998k8970N7450j19963k12792k0104j93353L6367
$$ 3733059 3867907 4198471 4462469 4433499 4490949 4370986 4158194 4138090 3944737 3981104
5652C981104N2816k438J39885Q1930k45889j88561q3680j65715J3804J19541M24497
$$ 3981104 4033920 4031482 4171367 4253297 4007408 3818847 3735167 3569452 3583256 3702797 4127294
5641D127294K00462J4822J48491J31859K85659J32542J31003k49068m1229j9774
$$ 4127294 4327756 4342578 4491069 4622928 4908587 5041129 5172132 4923064 4881835 4862061
5631D862061M7318k4918K14294J72149M6547o6780P644J31712j14227J48236J26481
$$ 4862061 4909379 4884461 5098755 5270904 5317451 5250671 5258315 5390027 5275800 5424036 5550517
5620E550517L13301j67082L7008k95713P1475K04531K66265J44633J80437p5651
$$ 5550517 5863818 5696736 5733744 5438031 5509506 5714037 5980302 6124935 6305372 6229721
5610F229721K51682J86323N02849L46385Q4959L87642j53665O1888M810K01868
$$ 6229721 6481403 6667726 7170575 7516960 7601919 7989561 7835896 7897784 7902594 8104462
5600H104462J33094N6115M96439K08559L9061N418K04354M36593M10174P5540
$$ 8104462 8237556 8293671 8790110 8998669 9037730 9043148 9247502 9684095 10094269 10169809
5590A0169809J27909J65175L99367O77728O19452O67825L30231Q4473O56833J85952
$$ 10169809 10297718 10462893 10862260 11539988 12159440 12827265 13157496 13241969 13898802 14084754
5580A4084754P11573O52344Q35204J013037J087492Q72192J259007R96832J254932
$$ 14084754 14796327 15448671 16283875 17296912 18384404 19256596 20515603 21512435 22767367
5571B2767367J071862R00160N09448M12817J123997J895947K210334K769333K853639
$$ 22767367 23839229 24739389 25248837 25661654 26785651 28681598 30891932 33661265 36514904
5562C6514904L257399M448406M983259O408524Q246500J1093782J3399827J2676942
$$ 36514904 39772303 44220709 49203968 55612492 63858992 74952774 88352601 101029543
5554A01029543N059387n345085j3183980j3383036r906422o233003m063722l033332
$$ 101029543 106088930 100743845 87559865 74176829 64270407 58037404 53973682 50940350
5546E0940350k075986j974053j780365j547194j454345q73822m63400j22735Q75967
$$ 50940350 48864364 46890311 45109946 43562752 42108407 41234585 40771185 40648450 41524417
5537D1524417R63116J417391J490763J375074J583892J921324K263912L236841
$$ 41524417 42487533 43904924 45395687 46770761 48354653 50275977 52539889 55776730
5529E5776730L189542K976391J837468m51880j893382l024190k448573r21607
$$ 55776730 58966272 61942663 63780131 63328251 61434869 58410679 55962106 55040499
5521E5040499p26353k57132o6036J95918O27051L45861O54282J164112J698620
$$ 55040499 54314146 54057014 53990978 54186896 54813947 55159808 55814090 56978202 58676822
5512E8676822K110766K121973J717788J510956J30195r61285j592163k208534
$$ 58676822 60787588 62909561 64627349 66138305 66268500 65307215 63715052 61506518
5504F1506518k242544j810791j669103r75316o49684J01077M23121R63179R49153
$$ 61506518 59263974 57453183 55784080 54808764 54159080 54260157 54683278 55646457 56595610
5495E6595610J205188J687538J828589K273034J597953n60178k283278l593835
$$ 56595610 57800798 59488336 61316925 63589959 65187912 64627734 62344456 58750621
5487E8750621l102995j960467k137179k239255j939807j655059j067756p92381
$$ 58750621 55647626 53687159 51549980 49310725 47370918 45715859 44648103 43855722
5479D3855722n12260P7380J96400K08911O84422R40031R65598J301280J638654
$$ 43855722 43343462 43420842 43617242 43826153 44510575 45450606 46416204 47717484 49356138
5470D9356138J810589K066703J758648K605237K364774K907880L241633M274490
$$ 49356138 51166727 53233430 54992078 57597315 59962089 62869969 66111602 70386092
5462G0386092O178769P863885Q414311O642375J575680l124739m243898k114469
$$ 70386092 76564861 84428746 92843057 99485432 101061112 97936373 93692475 91578006
5454I1578006J286625L622150N371226O708061P193068P385068P636465P188101
$$ 91578006 92864631 96486781 101858007 108566068 115759136 123144204 130780669 137968770
5446A37968770P414236O932047O723509N938897L547129o15696m248655o913316
$$ 137968770 145383006 152315053 159038562 164977459 168524588 167908892 163660237 156746921
5438A56746921q336609q902663q662964p932788p109535o624620n352699l849520
$$ 156746921 148410312 139507649 130844685 122911897 115802362 109177742 103825043 99975523
5430I9975523j739535M39845J530374n52113n939167j0354504j1075863q440264
$$ 99975523 98235988 98675833 100206207 99654094 93714927 83360423 72284560 63844296
5422F3844296o175162m621352l761775l110905k669704k314127j867513j645267
$$ 63844296 57669134 53047782 49286007 46175102 43505398 41191271 39323758 37678491
5414C7678491j364484j216568p25145o11072m87745p09604m73452m71188m70707
$$ 37678491 36314007 35097439 34372294 33761222 33273477 32563873 32090421 31619233 31148526
5405C1148526j26769K92337J93690O80343O62788J304635J310980K001811K117995
$$ 31148526 31021757 31314094 31507784 32188127 32850915 34155550 35466530 37468341 39586336
5396C9586336J958519M41316j687648l241493l140743k475038k055115j440390
$$ 39586336 41544855 41986171 40298523 37057030 33916287 31441249 29386134 27945744
5388B7945744j047439o19250q27435j103169q40583o56422q74877j060991o12348
$$ 27945744 26898305 26279055 25451620 24348451 23507868 22851446 21976569 20915578 20303230
5379B0303230m3574k42202K1665j71883j33414l17j62529J494J66686j58975K21286
$$ 20303230 20259656 20017454 20039119 19867236 19733822 19733505 19570976 19572470 19739156 19580181 19801467
5368A9801467L50355N91694N23576K66739N32694K88413k13230l27161q1709n3272
$$ 19801467 20151822 20743516 21267092 21533831 22066525 22354938 22141708 21814547 21732838 21679566
5358B1679566j60252n09679J71890k72954l17659j76861j05931O7772P7265j51103
$$ 21679566 21519314 21009635 21181525 20908571 20590912 20414051 20308120 20375892 20453157 20302054
5348B0302054M56879K08322K01042N25133J54167N16961L84671L49165P48644
$$ 20302054 20758933 20967255 21168297 21693430 21847597 22364558 22749229 23098394 23847038
5339B3847038Q26795L78653P31562L64645Q14830K86569N21702O20598J173921
$$ 23847038 24673833 25052486 25784048 26148693 26963523 27250092 27771794 28392392 29566313
5330B9566313J537783J536393J725006K322814K860364L209760L957219M397717
$$ 29566313 31104096 32640489 34365495 36688309 39548673 42758433 46715652 51113369
5322E1113369N227267O200416P266885R039859J0344927J2611374J5250393J5081324
$$ 51113369 56340636 62541052 69807937 78847796 89192723 101804097 117054490 132135814
5314A32135814J0409826P76014j0494675j6520928j6926281j3374354r435617
$$ 132135814 142545640 143321654 132826979 116306051 99379770 86005416 76569799
5307G6569799o991755n122210l494420k305684j609601q61084N2155N78014J634518
$$ 76569799 69578044 64455834 60961414 58655730 57046129 56185045 56237200 56815214 58449732
5298E8449732K258032K947485M235179N066802O427996Q023112Q341256O628352
$$ 58449732 60707764 63655249 67890428 72957230 79385226 87408338 95749594 102377946
5290A02377946L023757o2997j985206l213896o357318r820212j1004274r683822
$$ 102377946 105401703 105338706 103353500 100139604 93782286 83962074 72957800 63273978
5282F3273978p734098n857153m188157l672769l139814k442267j868670j339260
$$ 63273978 55539880 49682727 45494570 41821801 38681987 36239720 34371050 33031790
5274C3031790j094848j128168m49758m52887n96952l72360j19194l49526o46500
$$ 33031790 31936942 30808774 30359016 29906129 29309177 28936817 28817623 28468097 27821597
5265B7821597m33529p1460n5796p3796n38933r19013n00023m40820p1756k56371
$$ 27821597 27388068 27316608 27260812 27187016 26648083 25729070 25229047 24788227 24716471 24460100
5255B4460100j8256K1754k38121m35966k89618k50787j84329J16981M13815N25454
$$ 24460100 24441844 24463598 24225477 23789511 23499893 23249106 23064777 23181758 23595573 24121027
5245B4121027M81068R76290J034819J528349K049840K838482K650385J064002
$$ 24121027 24602095 25578385 26613204 28141553 30191393 33029875 35680260 36744262
5237C6744262r46302k061143k002837j469454q37226j79628l39306K3254K52796
$$ 36744262 35797960 33736817 31733980 30264526 29427300 29247672 28908366 28931620 29184416
5228B9184416R07352O24028P58206P04448Q87663R89673J469942J928195K419746
$$ 29184416 30091768 30715796 31474002 32178450 33066113 34055786 35525728 37453923 39873669
5219C9873669K768675L765384L853987M753676O386453Q535025J0472510J2842190
$$ 39873669 42642344 46407728 50261715 55015391 61401844 69936869 80409379 93251569
5211I3251569J6751264K2339574K5876007J7890889k793431k3620290l2979252
$$ 93251569 110002833 132342407 158218414 176109303 173315872 149695582 116716330
5204A16716330k6436057j6847407j1597776q034683o383257m903516l863599l326248
$$ 116716330 90280273 73432866 61835090 53800407 47417150 42513634 38650035 35323787
5196C5323787l190842k570212j923686j561679j372206r74545j112264q05734
$$ 35323787 32132945 29562733 27639047 26077368 24705162 23730617 22618353 21812619
5188B1812619p88735p51219n05777n41581n90879n57335o29479l28782l35528
$$ 21812619 21023884 20272665 19766888 19225307 18634428 18077093 17447614 17118832 16783304
5179A6783304l40709l79928k62773o60739n80018n87039k37694j01164J53045
$$ 16783304 16442595 16062667 15799894 15139155 14559137 13972098 13734404 13633240 13786285
5170A3786285j67456k74664j5981r6098K1068k53506k16184J87076m81407q7438
$$ 13786285 13618829 13344165 13328184 13232086 13253154 12999648 12783464 12970540 12489133 12401695
5160A2401695m0575j8432k7497k07984k94229j82425l58905j45429j58922l6372
$$ 12401695 12361120 12342688 12315191 12107207 11812978 11630553 11271648 11126219 10967297 10930925
5150A0930925q5146J65638k7104k38895P9058o7251J55728k5089K54148J48872
$$ 10930925 10845779 11011417 10984313 10745418 10824476 10757225 10912953 10887864 11142012 11290884
5140A1290884J23719J42690j89224k55916M3663j77960M911K22987k20439n7155
$$ 11290884 11414603 11557293 11368069 11112153 11155816 10977856 10982767 11205754 10985315 10928160
5130A0928160K9986J79540K64984K47490J98260J95743L74932J84475O38684Q27120
$$ 10928160 10958146 11137686 11402670 11650160 11848420 12044163 12419095 12603570 13242254 14069374
5120A4069374O38777J031605O86770L93674K27871N90387Q54678J217755R86740
$$ 14069374 14708151 15739756 16426526 16820200 17048071 17638458 18493136 19710891 20697631
5111B0697631P65303K64142k13315n38289j083209o10528p05687o41690o32069
$$ 20697631 21462934 21727076 21513761 20975472 19892263 19281735 18576048 17934358 17302289
5102A7302289n27448o3689l8250L1610N6580j75055k85844m67882o78887m32713
$$ 17302289 16774841 16711152 16672902 16704512 16761092 16586037 16300193 15832311 15153424 14720711
5092A4720711o4653l93775m70699p43041j65206j83797p9070P3964K63716K11235
$$ 14720711 14656058 14262283 13791584 13048543 12883337 12699540 12620470 12694434 12958150 13169385
5082A3169385J47478j24113k46528k68960j17654K57664j67730j98552J20829
$$ 13169385 13316863 13192750 12946222 12677262 12559608 12817272 12649542 12450990 12571819
5073A2571819m1342k2061K51373k30137J400k92829k59020j03185J14661L66267
$$ 12571819 12530477 12508416 12759789 12529652 12531052 12238223 11979203 11876018 11990679 12356946
5063A2356946k47498N0313J71074j2724K6276J52773J70520K24713Q64J36800
$$ 12356946 12109448 12159761 12330835 12318111 12344387 12497160 12667680 12892393 12893257 13030057
5053A3030057K32328M1275L00285J81848j4105M40200K5051N9716J18870J05982
$$ 13030057 13262385 13303660 13603945 13785793 13771688 14211888 14236939 14296655 14415525 14521507
5043A4521507J97378K90440K61097J06265L76074L66847P1371k69421N6267j52033
$$ 14521507 14718885 15009325 15270422 15376687 15752761 16119608 16190979 15921558 15977825 15825792
5033A5825792J09926k66927J0210M30507K34487K47901J37590O3079J22389J31686
$$ 15825792 15935718 15668791 15679001 16109508 16343995 16591896 16729486 16792565 16914954 17046640
5023A7046640Q6833K64677O7437j49857K80972J30569K25194J39281p3527L50916
$$ 17046640 17133473 17398150 17465587 17315730 17596702 17727271 17952465 18091746 18018219 18369135
5013A8369135J27104M66232J29846J38833M71571K90145N4265J12721M3951L61271
$$ 18369135 18496239 18962471 19092317 19231150 19702721 19992866 20047131 20159852 20203803 20565074
5003B0565074J99607J93011j87348j64804J92954K621J2381J21865J42556k8302
$$ 20565074 20764681 20957692 20770344 20605540 20798494 20801115 20813496 20935361 21077917 21049615
4993B1049615O2531k3054M76501j13519Q6618K7397K0478K20138j16012P00R3223
$$ 21049615 21112146 21089092 21565593 21452074 21538692 21566089 21586567 21806705 21690693 21691393 21784616
4982B1784616J63368J96426L5754K63321L43907M02009M09040Q67262L80336M55149
$$ 21784616 21947984 22144410 22180164 22443485 22787392 23189401 23598441 24465703 24846039 25301188
4972B5301188M84137J93127Q92169J01265Q4114k29052J09568j2761J45920J73899
$$ 25301188 25785325 25978452 26870621 26971886 27056000 26826948 26936516 26923755 27069675 27243574
4962B7243574J08715K21178q1958K34313K74142L80283P42756N11093M50220K40434
$$ 27243574 27352289 27573467 27491509 27725822 27999964 28380247 29123003 29634096 30084316 30324750
4952C0324750J27383M62088J72866J09962K75012K89250K97439L02150P1813N47282
$$ 30324750 30452133 30914221 31087087 31197049 31472061 31761311 32058750 32360900 32432713 32979995
4942C2979995O03345L91721M04796N43140N47213O62361N33017Q20644M71237
$$ 32979995 33583340 33975061 34379857 34922997 35470210 36132571 36665588 37486232 37957469
4933C7957469L59134M57412M46614N44175M43034N16320L12504M57443k17199
$$ 37957469 38316603 38774015 39220629 39764804 40207838 40724158 41036662 41494105 41276906
4924D1276906L92108N34037M07780N11320K61668N44609N22224K29579J15660
$$ 41276906 41669014 42203051 42610831 43122151 43383819 43928428 44450652 44680231 44795891
4915D4795891P38621L18554K17963L84953L61809M54489N5471K65093N99021K11624
$$ 44795891 45534512 45853066 46071029 46455982 46817791 47272280 47327751 47592844 48191865 48403489
4905D8403489P9329K35052L39488J79362J04981L03205N28510J36253J27788J43971
$$ 48403489 48482818 48717870 49057358 49236720 49341701 49644906 50173416 50309669 50437457 50581428
4895E0581428m6411j20511j63462k9874o15420k47822j80757K63374l1989l16623
$$ 50581428 50535017 50414506 50251044 50221170 49605750 49357928 49177171 49440545 49408556 49091933
4885D9091933l76751n35938m91648n62276n86298j16929l02159m25972k80954
$$ 49091933 48715182 48179244 47687596 47125320 46539022 46422093 46119934 45693962 45413008
4876D5413008l87612j92627m72095n77069l89597l79474o65578m47728n69761
$$ 45413008 45025396 44832769 44360674 43783605 43394008 43014534 42348956 41901228 41331467
4867D1331467n88434m81983o88898l83819j44724p50216n18045n42811l72184
$$ 41331467 40743033 40261050 39572152 39188333 39043609 38293393 37775348 37232537 36860353
4858C6860353p45419o28729m93417k87923m80089l3877l58051n39836p22520o31760
$$ 36860353 36114934 35486205 34992788 34704865 34224776 34190899 33832848 33293012 32570492 31938732
4848C1938732n62929l78661n03595k97074l83859l65178m72704m74253k70066
$$ 31938732 31375803 30997142 30493547 30196473 29812614 29447436 28974732 28500479 28230413
4839B8230413l20533m27859q09285j4836m43338l43838o20998j3803k03664l41630
$$ 28230413 27909880 27482021 26672736 26657900 26214562 25870724 25249726 25235923 25032259 24690629
4829B4690629n62499n16457l90049n63492l62396l47065n79259j94815m26756
$$ 24690629 24128130 23611673 23221624 22658132 22295736 21948671 21369412 21174597 20747841
4820B0747841j22183N6224j77453k3851l31505j91388k29464m14364j03687J51832
$$ 20747841 20625658 20681882 20504429 20480578 20149073 19957685 19728221 19313857 19210170 19362002
4810A9362002k29754l09528m50624m34442L01338L1468M1725k87330l01310N7062
$$ 19362002 19132248 18822720 18372096 17937654 18238992 18270460 18312185 18024855 17723545 17780607
4800A7780607l69839l47612q5946K17421L9888j27782k22571m4964Q866q5791
$$ 17780607 17410768 17063156 16977210 17194631 17234519 17106737 16884166 16839202 16848068 16762277
4790A6762277O6597J1539k5690J08102l25190j05192p0425q7661M4336j97278
$$ 16762277 16828874 16840413 16814723 16922825 16597635 16492443 16422018 16334357 16378693 16181415
4780A6181415k20752l30356j73490o4867J20833j42740K12654j59381O6320o9840
$$ 16181415 15960663 15630307 15456817 15391950 15512783 15370043 15582697 15423316 15489636 15419796
4770A5419796L33498L91254p4121o1098l11513p3444k40232j55783o0618k6201
$$ 15419796 15753294 16144548 16070427 16009329 15697816 15624372 15384140 15228357 15167739 15141538
4760A5141538j27681j75463k28778J46856L53884K61407J38871j90008K16540
$$ 15141538 15013857 14838394 14609616 14756472 15110356 15371763 15510634 15320626 15537166
4751A5537166J13616k1656K00618J38682J25723J41941P1091P982L44981J24988
$$ 15537166 15650782 15629126 15829744 15968426 16094149 16236090 16307181 16315163 16660144 16785132
4741A6785132M34423j82627J22113M49M55425J34580M20483M66432L98082L98793
$$ 16785132 17219555 17036928 17159041 17159490 17614915 17749495 18169978 18636410 19034492 19433285
4731A9433285K86158K62532L15454O80967N92768N79877J50058M25314K90375
$$ 19433285 19719443 19981975 20297429 20978396 21571164 22151041 22301099 22726413 23016788
4722B3016788M36573N36276P78224M77114J090952P95225R82155J366417J978885
$$ 23016788 23453361 23989637 24767861 25244975 26335927 27131152 28113307 29479724 31458609
4713C1458609K196949J794323J788965K287014K164079J622096J499066p8823
$$ 31458609 33655558 35449881 37238846 39525860 41689939 43312035 44811101 44732278
4705D4732278j441781k189126j517331n67709m41984J54676J15713P20434Q80966
$$ 44732278 43290497 41101371 39584040 39016331 38574347 38729023 38844736 39565170 40446136
4696D0446136P43860J324312J717529K331062K137959K022676J686670J461840
$$ 40446136 41189996 42514308 44231837 46562899 48700858 50723534 52410204 53872044
4688E3872044L803j559416k309027j633343j429242p15694m15644l0409R7717
$$ 53872044 53875847 52316431 50007404 48374061 46944819 46229125 45813481 45783072 45880789
4679D5880789L77498P57302O41759R57182R30704J067366R47402J299195J530402
$$ 45880789 46258287 47015589 47657348 48614530 49545234 50612600 51560002 52859197 54389599
4670E4389599J853719J895829K281688K056999K234720K167173K933245K965909
$$ 54389599 56243318 58139147 60420835 62477834 64712554 66879727 69812972 72778881
4662G2778881L422501M313411M467665N094287O245327O957297P758005Q492443
$$ 72778881 76201382 80514793 84982458 90076745 96322072 103279369 111037374 119529817
4654A19529817Q914647R672801Q629997P289331O713980Q133181J0944541J4192192
$$ 119529817 128444464 138117265 146747262 154036593 160750573 168883754 179828295 194020487
4646A94020487J6688352J7716441J7235898J6148472J4938237J3018260J1712654
$$ 194020487 210708839 228425280 245661178 261809650 276747887 289766147 301478801
4639C01478801R172647O073075J602505m039558r374724j4259674j8551442k0822709
$$ 301478801 310651448 316724523 318327028 314287470 304912746 290653072 272101630 251278921
4631B51278921k0610410j9908849j7857825j6476399j4858604j2976926j1445893
$$ 251278921 230668511 210759662 192901837 176425438 161566834 148589908 137144015
4624A37144015r700141p922653o916889o023633n218405m974474m801661m217267
$$ 137144015 127443874 119521221 112604332 106580699 101362294 96387820 91586159 87368892
4616H7368892l667021l175802k407949k194699j797049j787280j839179j668077
$$ 87368892 83701871 80526069 78118120 75923421 74126372 72339092 70499913 68831836
4608F8831836j725366j442293j230910j314773j343008j102792j349048j123620
$$ 68831836 67106470 65664177 64433267 63118494 61775486 60672694 59323646 58200026
4600E8200026j254064r18984j285380j401227j179696j424205j311649j470540
$$ 58200026 56945962 56026978 54741598 53340371 52160675 50736470 49424821 47954281
4592D7954281j145849j300880j155090j590399j352751q51839j079080p79503
$$ 47954281 46808432 45507552 44352462 42762063 41409312 40557473 39478393 38698890
4584C8698890q83603p26818o49174j329497j034600r00866o55641n24045p05147
$$ 38698890 37815287 37088469 36439295 35109798 34075198 33174332 32518691 31994646 31289499
4575C1289499q06749o94338q63801q20279o51796n62586n29286p84502m45691
$$ 31289499 30482750 29788412 28924611 28104332 27452536 26889950 26360664 25576162 25130471
4566B5130471l08269l78958k53687j67760l9873l33789j25436j16185m63463m50948
$$ 25130471 24822202 24443244 24189557 24021797 23981924 23648135 23522699 23406514 22943051 22492103
4556B2492103q9454J05741j93197j92024r3476L92810k6910J10025K10871J95878
$$ 22492103 22402649 22508390 22315193 22123169 22029693 22422503 22395593 22505618 22716489 22912367
4546B2912367N34771J94255M35976P38477M49236Q56035P37495J115987J612812
$$ 22912367 23447138 23641393 24077369 24815846 25265082 26121117 26858612 27974599 29587411
4537B9587411J705376K226425K582726K917001L313015L308542L050414K325473
$$ 29587411 31292787 33519212 36101938 39018939 42331954 45640496 48690910 51016383
4529E1016383N12040j477114l928207m950121m281614l040140k326277j969435
$$ 51016383 51528423 50051309 46123102 41172981 36891367 33851227 31524950 29555515
4521B9555515j926022j097982p49636n39142o85672n66586l04520k88396k66329
$$ 29555515 27629493 26531511 25781875 25242733 24557061 23990475 23685955 23397559 23131230
4512B3131230J33055L60319J18385M53040M92949O00623R82356Q21008J276480
$$ 23131230 23264285 23624604 23742989 24196029 24688978 25289601 26271957 27092965 28369445
4503B8369445J149910J327234J991712J972207K828226K806140L148355L303076
$$ 28369445 29519355 30846589 32838301 34810508 37638734 40444874 43593229 46896305
4495D6896305K729773J665598k18633k820112m295373l810754l056575j575967
$$ 46896305 49626078 51291676 51073043 48252931 43957558 40146804 37090229 35514262
4487C5514262j279941j054112n63170l81139K81915M74944O03244R13553J763100
$$ 35514262 34234321 33180209 32617039 32235900 32517815 32992759 33596003 34509556 36272656
4478C6272656J601451J913779J783375J381417L77839j399277k684307k725279
$$ 36272656 37874107 39787886 41571261 42952678 43330517 41931240 39246933 36521654
4470C6521654j855825j364022q27402o29561m177j63379J46453K72657K27043
$$ 36521654 34665829 33301807 32474405 31844844 31840667 31677288 31823741 32096398 32323441
4461C2323441K95756L94113L29361L72078O52972P24245J244034J056691J496103
$$ 32323441 32619197 33013310 33342671 33714749 34367721 35091966 36336000 37392691 38888794
4452C8888794J256340J858577J769222K027733K396535K554287K886347L535389
$$ 38888794 40145134 42003711 43772933 45800666 48197201 50751488 53637835 57173224
4444E7173224L932587M299374M893636N136055N975720N905336N307391M517835
$$ 57173224 61105811 65405185 70298821 75434876 81410596 87315932 92623323 97141158
4436I7141158M862335O395299Q423237J0907824J3618168J6647336K0591949K5022571
$$ 97141158 102003493 108398792 116822029 127729853 141348021 157995357 178587306 203609877
4428B03609877L0769700L6360265L6208669K2814522l932114l0485406m2953673
$$ 203609877 234379577 270739842 306948511 329763033 325830919 295345513 252391840
4421B52391840m1083841l3268389k5445748j9553631j5607960j2204597j0312158
$$ 252391840 211307999 178039610 152593862 133040231 117432271 105227674 94915516
4414I4915516q035092o654515n956684m996602m359072l408085l069490k731239
$$ 94915516 86880424 80225909 74269225 69272623 64913551 61505466 58435976 55704737
4406E5704737k212434j875382j546033r76856j003822n74346l79495j14840k58333
$$ 55704737 53492303 51616921 50070888 49094032 48090210 47515864 47136369 47021529 46763196
4397D6763196o2573m52677p62516j525673j660586j288737j315923j083213j044152
$$ 46763196 46700623 46247946 45485430 43959757 42299171 41010434 39694511 38611298 37567146
4388C7567146j073091r94028j200246j756596j464167j405792j516393j554138
$$ 37567146 36494055 35500027 34299781 32543185 31079018 29673226 28156833 26602695
4380B6602695j529350r28698j123146n75183p13447q10514o83122r10478n59547
$$ 26602695 25073345 24144647 23021501 22446318 21732871 20922357 20239235 19328757 18769210
4371A8769210m06487l88413n02024l46414m37805m2126j91652m23606n93427l94595
$$ 18769210 18362723 17974310 17472286 17125872 16688067 16645941 16454289 16030683 15437256 15042661
4361A5042661m65148n60238m20197k71879l45523j49085k53784j09695J67740
$$ 15042661 14577513 14017275 13597078 13325199 12979676 12830591 12576807 12467112 12634852
4352A2634852j06868q0265k63100k35823m24440n67990q0905J10621m16762k85202
$$ 12634852 12527984 12447719 12184619 11948796 11524356 10956366 10875461 10986082 10569320 10284118
4342A0284118j24431j26694j18928j55950L05376j11426j18338m8589J80557j37883
$$ 10284118 10159687 10032993 9914065 9758115 10063491 9952065 9833727 9785138 9965695 9827812
4332I827812Q8029P5601L09724k7591J14266k6288J14468m1565j81817r1331k00621
$$ 9827812 9915841 9991442 10301166 10273575 10387841 10361553 10476021 10434456 10252639 10161308 9960687
4321I960687j27500j13867J45099J66188K76083M1953k46023o6070R3923J15178
$$ 9960687 9833187 9719320 9864419 10030607 10306690 10348643 10102620 10036550 10130473 10245651
4311A0245651M9629J99768J00362j27449l74640l7277R4748M7808L62377J63329
$$ 10245651 10295280 10495048 10595410 10467961 10093321 10056044 10150792 10198600 10560977 10724306
4301A0724306K8105K21110M83964L88822O01464L12179P55888M75385M48781K95172
$$ 10724306 10752411 10973521 11457485 11846307 12447771 12759950 13515838 13991223 14440004 14735176
4291A4735176K62143L52852M47041Q77941O75137Q88886J346991J502828J815702
$$ 14735176 14997319 15350171 15797212 16675153 17350290 18239176 19586167 21088995 22904697
4282B2904697K023497J518313J212466J330j152814j778947j851281j869000j696681
$$ 22904697 24928194 26446507 27658973 27660303 26507489 24728542 22877261 21008261 19311580
4273A9311580j512849r84765m20598p00709m38436l03065q973P2236j03022j9832
$$ 19311580 17798731 16813966 16393368 15692659 15254223 14951158 14942185 15014421 14911399 14891567
4263A4891567r6597j94441J53515j49803k7323k38300m41685k50272m76911r3588
$$ 14891567 14794970 14600529 14754044 14604241 14576918 14338618 13896933 13646661 13169750 13076162
4253A3076162p0377l47363j91320k83832l77428n39179k47359l52666l21784p53286
$$ 13076162 13005785 12658422 12467102 12183270 11805842 11266663 11019304 10666638 10344854 9591568
4243I591568k23460l50853j01564k92955j64513k13233j97098j87806j65956J85241
$$ 9591568 9368108 9017255 8915691 8622736 8458223 8244990 8047892 7860086 7694130 7879371
4233G879371j36223K8252J35263k34659j38244j30950r7869N7432r0257o6930
$$ 7879371 7743148 7771400 7906663 7672004 7533760 7402810 7304941 7362373 7272116 7205186
4223G205186n572o2061j92553j72266j62036l38010l6935j80708k5777R1475k36679
$$ 7205186 7199614 7137553 6945000 6772734 6610698 6272688 6235753 6055045 6029268 6120743 5884064
4212E884064k027p180k45805J273r7485l8933j77208j15895J16119k40782J20883
$$ 5884064 5882037 5874857 5629052 5630325 5532840 5493907 5316699 5200804 5316923 5076141 5197024
4201E197024K2599J1157k52622m144k54491O7052j71233j94510p7120L43125M8571
$$ 5197024 5219623 5230780 4978158 4974014 4719523 4786575 4615342 4420832 4343712 4686837 4735408
4190D735408K8011J90829Q929k21394o373K14699J79756k428r4477r1510m562
$$ 4735408 4763419 4954248 4963177 4741783 4735410 4950109 5129865 5127437 5032960 4941450 4936888
4179D936888j45362k8527k9749K01602j52110k30952m84722o5269q1193p0101
$$ 4936888 4791526 4762999 4733250 4934852 4782742 4551790 4067068 4001799 3920606 3850505
4169C850505K55375r1545J34065L1711J94610j13647L7976m9351k32696j74070
$$ 3850505 4105880 4014335 4148400 4180111 4374721 4261074 4299050 4249699 4017003 3842933
4159C842933O5429J407K92898j79032J70446J6736o9591J03853k16863j66870
$$ 3842933 3908362 3909769 4202667 4023635 4194081 4210817 4141226 4245079 4028216 3861346
4149C861346K49505j8330k6222O3602Q4762K71907j11527J67547k4939K33357
$$ 3861346 4110851 4092521 4066299 4129901 4214663 4486570 4375043 4542590 4517651 4751008
4139D751008j25089q4912l7473J07051j12497J74569j30709r0386K21846n2267
$$ 4751008 4625919 4541007 4503534 4610585 4498088 4672657 4541948 4451562 4673408 4621141
4129D621141M58184o68l1012J07964k02445L93509L72498J09963R7250k03228
$$ 4621141 5079325 5078657 5047645 5155609 4953164 5346673 5719171 5829134 5926384 5723156
4119E723156l45387j05163k38179m9598k387j92832m1263m9551K38114o4828J79970
$$ 5723156 5377769 5272606 5034427 4984829 4982442 4789610 4748347 4698796 4936910 4872082 5052052
4108E052052j60374K50741j98857Q1656k02222j05430O9966M4529J11602j64532
$$ 5052052 4891678 5142419 4943562 5025218 4822996 4717566 4787532 4832061 4943663 4779131
4098D779131n4667L25138K13699J92928J32605p7448J21153k28609K35557m7241
$$ 4779131 4724464 5049602 5263301 5456229 5588834 5511386 5632539 5403930 5639487 5592246
4088E592246k9897K14423J15986P866j5543j25046L18256J31330K77390m1637
$$ 5592246 5562349 5776772 5892758 5900624 5885081 5760035 6078291 6209621 6487011 6445374
4078F445374J52350J33602L85326K75448K80950L72503o4755k99989j77498J15991
$$ 6445374 6597724 6731326 7116652 7392100 7673050 8045553 7980798 7680809 7503311 7619302
4068G619302J59223K20760J71927K01384M3275Q9918J26771K15349K32140Q0659
$$ 7619302 7778525 7999285 8171212 8372596 8415871 8505789 8632560 8847909 9080049 9160708
4058I160708L42931j7675J32438J14438J36731P19865J60027J42507J43754L01846
$$ 9160708 9503639 9485964 9618402 9732840 9869571 10589436 10749463 10891970 11035724 11337570
4048A1337570L46518L21681L33688L83955K34358M88363N65257M90296P25851
$$ 11337570 11684088 12005769 12339457 12723412 12957770 13446133 14011390 14501686 15227537
4039A5227537P73231O28498M67108M84163P39738P50507Q00253O87893J117819
$$ 15227537 16000768 16629266 17096374 17580537 18320275 19070782 19871035 20558928 21676747
4030B1676747R79656J071142J273650J450305J705856J709858J464011J513318
$$ 21676747 22656403 23727545 25001195 26451500 28157356 29867214 31331225 32844543
4022C2844543J579545J902217J966314K167391K178513K059157K649678K342784
$$ 32844543 34424088 36326305 38292619 40460010 42638523 44697680 47347358 49690142
4014D9690142K854621K824351K713049K771632K663271K998419L004881K950712
$$ 49690142 52544763 55369114 58082163 60853795 63517066 66515485 69520366 72471078
4006G2471078L524383L479014L381941L272314L263960L307773L086596K991560
$$ 72471078 75995461 79474475 82856416 86128730 89392690 92700463 95787059 98778619
3998I8778619K867504K799652K672482K591605K236625K089104J864779K114581
$$ 98778619 101646123 104445775 107118257 109709862 111946487 114035591 115900370 118014951
3990A18014951J732718J538113J398473J772980J428372J146644L17672M7642
$$ 118014951 119747669 121285782 122684255 124457235 125885607 127032251 127349923 127397565
3982A27397565l69892j006689j107489j199857j407111j411173j698725j641415
$$ 127397565 127027673 126020984 124913495 123713638 122306527 120895354 119196629 117555214
3974A17555214j578719k009733k246041k359451k554922l400576l281399l248740
$$ 117555214 115976495 113966762 111720721 109361270 106806348 103405772 100124373 96875633
3966I6875633l659333l413221l510404l443027k977519l237223k902749l143140
$$ 96875633 93216300 89803079 86292675 82849648 79872129 76634906 73732157 70589017
3958G0589017k668683k502440k965239l171294k817456k897870k544338k624801
$$ 70589017 67920334 65417894 62452655 59281361 56463905 53566035 51021697 48396896
3950D8396896k469308k492890k496808k125407k111204k000634j786057j513888
$$ 48396896 45927588 43434698 40937890 38812483 36701279 34700645 32914588 31400700
3942C1400700j445373j685028j047892j029337j188048j119083j357334p81734
$$ 31400700 29955327 28270299 27222407 26193070 25005022 23885939 22528605 21746871
3934B1746871j333550j304877q92259n32703n60254o53706q34475m11894n37847
$$ 21746871 20413321 19108444 18216185 17683482 17123228 16469522 15635047 15223153 14685306
3925A4685306m45842l07891k10114j79728o75142n26184l27705k32389o52346
$$ 14685306 14239464 13931573 13721459 13541731 12866589 12340405 12012700 11780311 11127965
3916A1127965k20107k91957l20603n16159m09137m11640j18430o8265M028q3033
$$ 11127965 10907858 10615901 10295298 9779139 9370002 8958362 8839932 8771667 8775695 8692662
3906H692662l49783j7751M8047j43111j09122m49434M4957k73324j75591J901
$$ 8692662 8342879 8325128 8373175 8230064 8120942 7671508 7716465 7443141 7267550 7269451
3896G269451m6101J57870k45456j27560k20712k82640J01912r514K51030J46275
$$ 7269451 7223350 7381220 7135764 7008204 6787492 6504852 6606764 6597250 6848280 6994555
3886F994555k53298k49006L47040K25713P0858k68373q1174k63120j49561n0498
$$ 6994555 6741257 6492251 6839291 7065004 7135862 6867489 6786315 6523195 6373634 6323136
3876F323136k6866K00802L08398m974l9671O4696j39961R8298K07691J99612O1891
$$ 6323136 6296270 6497072 6805470 6800496 6760825 6825521 6685560 6783858 6991549 7191161 7253052
3865G253052R697O5962K05120j38017L06322p9515k78113k05669M5728j77528
$$ 7253052 7262749 7328711 7533831 7395814 7702136 7622621 7344508 7138839 7184567 7007039
3855G007039j24939k17762L76178p7093j13826n89156P1541m5119j42219j63868
$$ 7007039 6882100 6664338 7040516 6963423 6849597 6260441 6331982 6286863 6144644 5980776
3845E980776j82079j52138j09794j92926q0317L64490J3894j98656l54007P291
$$ 5980776 5798697 5646559 5536765 5343839 5263522 5628012 5641906 5443250 5089243 5096534
3835E096534P5816j35785k3381Q6956q9209j28778j88005k34762m0485j20053
$$ 5096534 5172350 5036565 5013184 5100140 5010931 4882153 4694148 4459386 4418901 4298848
3825D298848k31618J03826l48193l74070p9434J86419R3648P6032L8704J65988
$$ 4298848 4067230 4171056 3822863 3448793 3369359 3555778 3649426 3725458 3764162 3930150
3815C930150l04083k21964m4885j63679J82192K2756r2114m00634j14819P2439
$$ 3930150 3626067 3404103 3359218 3195539 3377731 3400487 3308373 2907739 2792920 2865359
3805B865359J42252J08576M847j95210M3124j49776R3616j74620K43852L00665
$$ 2865359 3007611 3116187 3121034 2925824 2968948 2819172 2912788 2738168 2982020 3282685
3795C282685o3927k42381j71933L6706J80742o0662p4798p328l57858j30074Q9271
$$ 3282685 3218758 2976377 2804444 2841150 3021892 2961230 2886432 2879104 2521246 2391172 2480443
3784B480443P1272J62881L1690r8183L22690j50551k21053l1551J19156K67546
$$ 2480443 2551715 2714596 2746286 2648103 2970793 2820242 2599189 2567638 2686794 2954340
3774B954340K29653o9892o1780J14948j43900J73870O9667k48959n2753N6437
$$ 2954340 3183993 3114101 3052321 3167269 3023369 3197239 3266906 3017947 2965194 3021631
3764C021631Q284j0491K45303n7798L2420j80717l6318J1825J10717J73520J50889
$$ 3021631 3029915 3019424 3264727 3206929 3239349 3058632 3022314 3034139 3144856 3318376 3469265
3753C469265K10657J15713Q3510M2622M24667K51814M1527l839N7934J93182n3288
$$ 3469265 3679922 3795635 3879145 3921767 4346434 4598248 4639775 4635936 4693870 4887052 4833764
3742D833764K51470K40624J79062N7388K05484N4542J22115J63742L48362r846
$$ 4833764 5085234 5325858 5504920 5562308 5767792 5822334 5944449 6108191 6456553 6446707
3732F446707K95804k05093L059Q4976K50023K80332K36555J48685J81466L0093
$$ 6446707 6742511 6537418 6540477 6625453 6875476 7155808 7392363 7541048 7722514 7752607
3722G752607j5897J99505L9159J44065m4686J02174J73792L47793M20574K64488
$$ 7752607 7736710 7936215 7975374 8119439 8074753 8176927 8350719 8698512 9119086 9383574
3712I383574P1319m6260K83059M91247L20682K8880K26809J58708K53398J066
$$ 9383574 9454893 9408633 9691692 10182939 10503621 10532501 10759310 10918018 11171416 11172482
3702A1172482M20437N78693L05179L25234L99316K95046L79205L73135N83568
$$ 11172482 11592919 12171612 12476791 12802025 13201341 13496387 13875592 14248727 14832295
3693A4832295L45494J60537N17312M81636J095500P94979N10822O09261N03490
$$ 14832295 15177789 15338326 15855638 16337274 17432774 18227753 18738575 19347836 19851326
3684A9851326O57139P62395Q06252R24415J023435J104922Q30264J108555J364099
$$ 19851326 20508465 21270860 22077112 23001527 24024962 25129884 25960148 27068703 28432802
3675B8432802J733479J138896J465205J376639J677234J341882J536610J107870
$$ 28432802 30166281 31305177 32770382 34147021 35824255 37166137 38702747 39810617
3667C9810617J571351J567558J450500J126730J319765J564008J447176J660649
$$ 39810617 41381968 42949526 44400026 45526756 46846521 48410529 49857705 51518354
3659E1518354J472493J573828J372179J358836J231370J549590J431422J148180
$$ 51518354 52990847 54564675 55936854 57295690 58527060 60076650 61508072 62656252
3651F2656252N91200R73340R53243O42417N44821P93325N12615O70651N60525
$$ 62656252 63247452 64220792 65174035 65816452 66361273 67154598 67667213 68337864 68898389
3642F8898389O42212R62449J031309Q92577N95486P84300J068826J172084J133205
$$ 68898389 69540601 70503050 71534359 72426936 73022422 73806722 74875548 76047632 77180837
3633G7180837J285528J091071J120209J019207J573707J821074K074734K520507
$$ 77180837 78466365 79557436 80677645 81696852 83270559 85091633 87166367 89686874
3625H9686874K885843L160719L469172L572291M079097M367118M761835N005143
$$ 89686874 92572717 95733436 99202608 102774899 106853996 111221114 115982949 120988092
3617A20988092N195998N105320N410148N382295N554615N340673N673054N364418
$$ 120988092 126184090 131289410 136699558 142081853 147636468 152977141 158650195 164014613
3609A64014613N173396N595680N814974O193750O036075O280362O173567O086269
$$ 164014613 169188009 174783689 180598663 186792413 192828488 199108850 205282417 211368686
3601B11368686N898799O306797O175564O336612O059606O411086P078821P392964
$$ 211368686 217267485 223574282 229749846 236086458 242146064 248557150 255635971 263028935
3593B63028935Q402674R480597J0478594J1269225J2510421J3221944J3976562
$$ 263028935 271431609 280912206 291390800 302660025 315170446 328392390 342368952
3586C42368952J4734845J5576487J5593986J5232524J4342001J3120075J1937439
$$ 342368952 357103797 372680284 388274270 403506794 417848795 430968870 442906309
3579D42906309J0000067Q424253O021167M580291K461484J001333n54715j641958
$$ 442906309 452906376 461330629 467351796 471932087 474393571 475394904 474840189 473198231
3571D73198231k337517l594852m530452n645671p059355q601764j0340882j2717346
$$ 473198231 470860714 467265862 462735410 457089739 450030384 441428620 431087738 418370392
3563D18370392j4970033j6928240j8194439j9108760j9059251j9053832j8673658
$$ 418370392 403400359 386472119 368277680 349168920 330109669 311055837 292382179
3556B92382179j7839463j7048871j6329758j5305744j4255463j3220237j2269532
$$ 292382179 274542716 257493845 241164087 225858343 211602880 198382643 186113111
3549A86113111j1168168j0504025r732087q690504p703343o496265o045424n258639
$$ 186113111 174944943 164440918 154708831 146018327 138314984 131818719 125773295 120514656
3541A20514656m639316m026051l282197l016151k843348k331609j953198j690117
$$ 120514656 115875340 111849289 108567092 105550941 102707593 100375984 98422786 96732669
3533I6732669j551913j300285j007271n50238q44548p19825q65648q72827q82687
$$ 96732669 95180756 93880471 92873200 92322962 91478414 90758589 89892941 89020114 88137427
3524H8137427n41468o74213m36337n31805j85228n28031l64000p40963q63420
$$ 88137427 87595959 86921746 86485409 85953604 85768376 85240345 84876345 84135382 83271962
3515H3271962q44996q96160j114966j310207j241138j681749j371817j662792
$$ 83271962 82426966 81530806 80415840 79105633 77864495 76182746 74810929 73148137
3507G3148137j532513j297543r72034j014003r18172o27726n52943m69586o00257
$$ 73148137 71615624 70318081 69346047 68332044 67413872 66786146 66233203 65763617 65163360
3498F5163360n03552l10779m29334k34449m04828l07237n03620j71895l87128
$$ 65163360 64659808 64349029 63919695 63685246 63280418 62973181 62469561 62297666 61910538
3489F1910538o14622q48497q82616j006979j074390j073811r27314n35841p64546
$$ 61910538 61295916 60447419 59564803 58557824 57483434 56409623 55482309 54946468 54181922
3480E4181922q00500j016173r84526j127586j279540j547468j684557j829359
$$ 54181922 53381422 52365249 51380723 50253137 48973597 47426129 45741572 43912213
3472D3912213j959827k035810j985508j850029j756347j488409j387476j043072
$$ 43912213 41952386 39916576 37931068 36081039 34324692 32836283 31448807 30405735
3464C0405735j250009j226782j071457j108881j172504q19246p03877n78083o65229
$$ 30405735 29155726 27928944 26857487 25748606 24576102 23756856 23052979 22474896 21809667
3455B1809667n95120n31834n62269n94468n49174n01364n99906o55268k27923
$$ 21809667 21214547 20682713 20120444 19525976 18976802 18475438 17875532 17220264 16992341
3446A6992341k64134m79837n73030n34577m22802m89715o36646m17051J50935
$$ 16992341 16728207 16248370 15675340 15140763 14717961 14228246 13591600 13174549 13325484
3437A3325484k37212o82580m15790l52809J73242k17257j53374j60191k95804
$$ 13325484 13088272 12405692 11989902 11637093 11810335 11593078 11439704 11279513 10983709
3428A0983709j94938m64783k90004l20634j95734r9372l60908J475Q657L2066
$$ 10983709 10788771 10323988 10033984 9713350 9517616 9418244 9057336 9058811 9067468 9099534
3418I099534P4237l84868l40896k37317m54390l23853k02598j50912k83409n3924
$$ 9099534 9173771 8788903 8448007 8210690 7756300 7432447 7229849 7078937 6795528 6741604
3408F741604j5657n4714k26117k66633r5713o545p7231l22146q9745N0261K85480
$$ 6741604 6725947 6671233 6445116 6178483 6082770 6076225 5998994 5676848 5587103 5637364 5922844
3397E922844l82240j82998k63525j60716n7627n73952q1815J40127K01320k38367
$$ 5922844 5540604 5357606 5094081 4933365 4875738 4301786 4219971 4360098 4561418 4323051
3387D323051K0401K5432j36742K7515J00277J04864l1695l0202R3469J1713n9855
$$ 4323051 4343452 4368884 4232142 4259657 4359934 4464798 4433103 4402901 4496370 4508083 4448228
3376D448228J31287l41458p4215O2984m7247J51686j0608K22358L1395j97384
$$ 4448228 4579515 4238057 4163842 4226826 4179579 4331265 4320657 4543015 4574410 4377026
3366D377026N0411k2700K75430J70871P1735r5111k64077p7688j34320n535K55939
$$ 4377026 4427437 4404737 4680167 4851038 4922773 4827662 4563585 4485897 4351577 4346042 4601981
3355D601981K21336o8002k49997j39145J49764j19084k55766J52659J56200K37894
$$ 4601981 4823317 4755315 4505318 4366173 4515937 4396853 4141087 4293746 4449946 4687840
3345D687840m8279J00326K15051L88116k44166m42499n38284K2378J70648J24673
$$ 4687840 4639561 4739887 4954938 5343054 5098888 4656389 4118105 4140483 4311131 4435804
3335D435804K36196K86497J66798J9949q9698M83902L01577o2845M69703J72207
$$ 4435804 4672000 4958497 5125295 5145244 5055546 5539448 5841025 5778180 6247883 6420090
3325F420090m23733J11718j75692m8773k74277n5929j9611m64927Q0526K06941
$$ 6420090 5996357 6108075 5932383 5883610 5609333 5553404 5533793 5068866 5149392 5356333
3315E356333L90116L62866J14702J11283J61259k46099Q842K35296O48369K2081
$$ 5356333 5746449 6109315 6224017 6335300 6496559 6250460 6259302 6494598 7142967 7165048
3305G165048R772M8231K33424J14932l06300L41177L26473M59188L98080L30534
$$ 7165048 7174820 7223051 7456475 7571407 7265107 7606284 7932757 8391945 8790025 9120559
3295I120559N99819P53056N94938M82655m22982m46183m55802j06250K39004N0820
$$ 9120559 9720378 10473434 11068372 11551027 11128045 10681862 10226060 10119810 10358814 10409634
3285A0409634m022k76855J01222j29464N5614K55917L69860L9658J38702k0099
$$ 10409634 10405612 10128757 10229979 10100515 10156129 10412046 10781906 10821564 10960266 10940167
3275A0940167K16366l7334M24821M11273P1191J38667L1337J98465L94941J15027
$$ 10940167 11156533 11119199 11544020 11955293 12026484 12165151 12196488 12394953 12789894 12904921
3265A2904921j56268J24582K01037K65926J72485N48093O10107J23413K64134
$$ 12904921 12748653 12873235 13074272 13340198 13512683 14060776 14670883 14794296 15058430
3256A5058430N12237M45449L42938O18070O09681Q42548J332023J160394J263480
$$ 15058430 15570667 16016116 16359054 16977124 17586805 18429353 19761376 20921770 22185250
3247B2185250J039529J173523J656120K169096K850628L572284M566765O450716
$$ 22185250 23224779 24398302 26054422 28223518 31074146 34646430 39213195 45663911
3239D5663911Q256356O700801J134456n393069q897873p999954n426119l599561
$$ 45663911 53920267 60621068 61755524 56362455 47464582 39464628 34038509 30438948
3231C0438948k477421k028745j222001p71711p39426m93793k92900m89236L53779
$$ 30438948 27961527 25932782 24710781 23939070 23199644 22705851 22412951 21923715 22277494
3222B2277494L12151O09564Q84052J338003J352621J553778J701714K378571K800598
$$ 22277494 22589645 23199209 24083261 25421264 26773885 28327663 30029377 32407948 35208546
3213C5208546L368431M434292N550184O800310R367197J2853620J5412219J1732824
$$ 35208546 38576977 43011269 48561453 55361763 64728960 77582580 92994799 104727623
3205A04727623o40381j2253483j7311836j3853702r298818o637016n425467m420882
$$ 104727623 104087242 91833759 74521923 60668221 51369403 44732387 39306920 34886038
3197C4886038l456282k746589j957920j617409j430089j204839q45766p04742
$$ 34886038 31429756 28683167 26725247 25107838 23677749 22472910 21627144 20922402
3189B0922402l29397q0984l303L37498P80325R52037N85447J045386J742514K100565
$$ 20922402 20593005 20512021 20508718 20846216 21626541 22578578 23164025 24209411 25951925 28052490
3179B8052490K574057K875958M525716O470017P519950N145359j420265p449215
$$ 28052490 30626547 33502505 38028221 44498238 52018188 57163547 55743282 48294067
3171D8294067r283651p595310n120672l421290k528600j696822j398564j426227
$$ 48294067 39010416 31415106 26294434 22873144 20344544 18647722 17249158 15822931
3163A5822931j278376j315685j213574o95786j070118m26756l02186o32427l36095
$$ 15822931 14544555 13228870 12015296 11319510 10249392 9822636 9520450 8888023 8551928
3154H551928l68689o1661j15151l20940j59968j91017j48734J7552k51196l84406
$$ 8551928 8183239 8121578 8006427 7685487 7525519 7334502 7185768 7203320 6952124 6567718
3144F567718l10264m29278l90148j44831k92230l19822k413M85133k563j73145
$$ 6567718 6257454 5828176 5438028 5293197 5000967 4681145 4678732 5163865 5161302 4988157
3134D988157m29283O8333K26519J17772l04870n72432N9750k08417j93813k12145
$$ 4988157 4558874 4627207 4853726 4971498 4666628 4094196 4153946 3945529 3751716 3539571
3124C539571p9155j57270k2745l26267M9809K64860L76673J1643j73093m94285
$$ 3539571 3460416 3303146 3280401 2954134 3003943 3268803 3645476 3657119 3484026 2989741
3114B989741N0790O8367K885l10780J69884R9387j43384j85712j24459R7029j13624
$$ 2989741 3040531 3108898 3111783 2801003 2970887 3070274 2926890 2741178 2616719 2713748 2600124
3103B600124r2301l15937J72525L223j75830Q9815L19675m7644j38656j04244
$$ 2600124 2507823 2191886 2364411 2367634 2191804 2281619 2601294 2553650 2414994 2310750
3093B310750j36158p077j70934J09731O6018k88314k25557k70487J20348K99015
$$ 2310750 2174592 2167515 1996581 2106312 2172330 1884016 1658459 1387972 1508320 1807335
3083A807335j36891k01041K16808K39841r975R3363k64176Q5027O5983k57292
$$ 1807335 1670444 1469403 1686211 1926052 1916077 2009440 1745264 1830291 1896274 1638982
3073A638982j08267J43131J23174J94929p2399j34523r0824k30173K97318r7490
$$ 1638982 1530715 1673846 1797020 1991949 1919550 1785027 1694203 1464030 1761348 1663858
3063A663858L8575j8809j49709k1670o6232k41927K3147j91481p0461N96086M5922
$$ 1663858 1702433 1683624 1533915 1512245 1446013 1204086 1227233 1035752 965291 1561377 1607299
3052A607299q8388l8857l6715K19988l32323k20307o7405P1873j84116J53045
$$ 1607299 1518911 1480054 1443339 1663327 1331004 1110697 1043292 1115165 931049 1084094
3042A084094O0629j11282q9518j40863k73677J75719P2431L3321K86032N9780
$$ 1084094 1144723 1033441 943923 803060 529383 705102 777533 810854 1096886 1156666
3032A156666q8839j76649J64115R0217p3516j95948k57568k84542O4619j1274
$$ 1156666 1067827 891178 1055293 1145510 1071994 876046 618478 333936 398555 387281
3022C87281R6398M45689o4429J06592q1322p90R1166L12558r6287n2093k22405
$$ 387281 483679 929368 864939 971531 890209 889419 980585 1293143 1196856 1144763 922358
3011I22358k56567j34854J7426j1899P380J23733K8757k44326o5477P8061j46440
$$ 922358 665791 530937 548363 536464 543844 667577 696334 452008 386531 464592 318152
3000C18152r3357j79947K86027R3695J51391M5028M58616L2844J57395m8536l95684
$$ 318152 224795 44848 330875 424570 575961 620989 1079605 1112449 1269844 1221308 825624
2989H25624n2184j55997k922K19630J32579l36713j84152N8938J13732L90708
$$ 825624 773440 617443 614521 834151 966730 630017 445865 504803 618535 1009243
2979A009243J18564n8828P8255m2815K6416k41891l5575O1634j93010j03617L11295
$$ 1009243 1127807 1068979 1147234 1104419 1130835 888944 853369 915003 721993 618376 929671
2968I29671n9165J04509Q9614l2010l8276J2918p5240j06611n8253J79891J21910
$$ 929671 870506 975015 1064629 1032619 994343 1007261 932021 825410 767157 947048 1068958
2957A068958q7022p6235r6093J92747j83973J58247M7380N169j95492o449J09580
$$ 1068958 981936 905701 809608 1002355 818382 976629 1024009 1029178 833686 827237 936817
2946I36817K97000k59142l60739J36712K09616K90942M7838k7911P1550Q8432
$$ 936817 1233817 974675 613936 750648 960264 1251206 1299044 1271133 1342683 1431115
2936A431115r4714j7218J65869M2917l32606j97565l4602J36284J66745L0880
$$ 1431115 1336401 1319183 1485052 1527969 1195363 997798 963196 1099480 1266225 1297105
2926A297105n5869K10851J34722L5253Q5956L12390K62147J07430j65477l14390
$$ 1297105 1241236 1452087 1586809 1622062 1708018 2020408 2282555 2389985 2224508 1910118
2916A910118l55109l15933J18676n7446J59672L225o7691R4606R9879J49194J42387
$$ 1910118 1555009 1239076 1357752 1300306 1459978 1463203 1395512 1490118 1589997 1739191 1881578
2905A881578j33881M49910j28749j94641m67722k33542L28496K6067j07238J52468
$$ 1881578 1747697 2197607 2068858 1874217 1406495 1172953 1501449 1527516 1420278 1572746
2895A572746j1269K12235j7977m9684K48438j22761q5095J6089J7670K51915J74538
$$ 1572746 1561477 1773712 1755735 1706051 1954489 1831728 1746633 1762722 1780392 2032307 2206845
2884B206845m31634m0303o5588K9652j77263p8539q1204o6634L3154j45918J14774
$$ 2206845 1775211 1734908 1669320 1698972 1521709 1443170 1361966 1295332 1328486 1182568 1297342
2873A297342q9542k2446k0149K7210k25348J86228l22796j003M5258K06224k6556
$$ 1297342 1207800 1185354 1165205 1192415 967067 1153295 830499 829496 874754 1080978 1054422
2862A054422j8393L207J46934j30375j56217K09453J29731j53720j36879m47757
$$ 1054422 1036029 1039236 1186170 1055795 899578 1109031 1238762 1085042 948163 500406
2852E00406P2635J16121j52027k12681J57210K84096k52600j44808n5702P7924
$$ 500406 573041 689162 537135 324454 481664 765760 513160 368352 312650 390574
2842C90574k78Q3189k13500K35762l57652M03549k26663L025L5198M3116l80585
$$ 390574 390296 473485 259985 495747 138095 541644 314981 318006 353204 396320 15735
2831A5735q0794j88032J05738J3042O107P3991J60172m5561n2677K18010o0736
$$ 15735 -65059 -253091 -147353 -134311 -128204 -54213 105959 60398 7721 225731 164995
2820A64995O350j6198J31613J34937k2481k88302j29340j30584L14463R4087k06707
$$ 164995 171345 155147 286760 421697 399216 110914 -18426 -149010 165453 259540 52833
2809E2833J6826M7574K6359n5631L83846q0065J95284r5959k07002J68766K724
$$ 52833 69659 117233 143592 87961 471807 391742 587026 491067 284065 452831 455555
2798D55555R4293K47938j76200K26390k89826o1564r7559N5232M300j76856p6906
$$ 455555 549848 797786 621586 847976 558150 496586 399027 454259 458559 281703 204797
2787B04797K9702N1480R9008l3195m9858P5625j09416K2639n0404K1021J86057
$$ 204797 234499 285979 384987 351792 301934 377559 268143 290782 240378 261399 447456
2776D47456J30005j28233r7521n2890o4563j95086L7628L9324J88755j95490q3482
$$ 447456 577461 449228 351707 298817 234254 39168 76796 116120 304875 109385 25903
2765B5903K16259K55981J55363p9778K33930J6172l59813o0055n5209J35536k68243
$$ 25903 242162 498143 653506 573728 807658 823830 464017 403962 348753 484289 216046
2754B16046o5136k7324r6870o4058O3946j41542j31948m9081J8356l1578J26428
$$ 216046 150910 123586 26716 -37342 26604 -114938 -246886 -295967 -277611 -309189 -182761
2743a82761Q5313P1174K2732m469K9118k1047j89084J60469O4495K06643j07524
$$ -182761 -97448 -26274 -3542 -8011 21107 60 -189024 -28555 35940 242583 135059
2732A35059j13421m1869J94800j89748J01644J28747J44756k86579m2240o76L40721
$$ 135059 21638 -20231 174569 -15179 86465 215212 359968 73389 31149 30473 371194
2721C71194J92756k21396L245l7828M18354k05761J11890o6044j31878j14200
$$ 371194 563950 342554 345799 307971 726325 520564 632454 566410 434532 320332
2711C20332k11696l31984K08084L54771q2005N2079r6584M6287J91592l7583O4182
$$ 320332 108636 -223348 -15264 339507 257502 309581 212997 259284 450876 413293 477475
2700D77475O4836k72599j66887j84622M08117Q1036j31787j70855m1482J68494
$$ 477475 542311 269712 102825 -81797 326320 407356 275569 104714 63232 231726
2690B31726j41342o4438R9175L32298J93776l5719m4586l84678n301k8400j42680
$$ 231726 90384 25946 125121 457419 651195 615476 570890 186212 180911 152511 9831
2679I831k9879J09712K60784j58434P7063j7128O534n5026O2136k39671k22504
$$ 9831 -20048 89664 350448 192014 269077 251949 258483 203457 265593 25922 -196582
2668a96582O0333k11666O049N1303P6111j55822J08683J20658l9413J97239n4161
$$ -196582 -136249 -347915 -341866 -290563 -214452 -370274 -261591 -140933 -180346 16893 -37268
2657c7268J84673j47464O279o3989k38882J72351l0007K02538Q084j08489J05533
$$ -37268 147405 -59 6220 -57769 -296651 -124300 -154307 48231 56315 -52174 53359
2646E3359k75343k83795K81858L44898J11450J14673q9979j7887J09801R9013
$$ 53359 -221984 -505779 -223921 120977 232427 347100 257121 239234 349035 448048
2636D48048j76665J71490n1001j15774J9274J31370o6581K01895K857Q6447n9581
$$ 448048 271383 442873 391872 276098 295372 426742 360161 562056 564913 651360 591779
2625E91779k11995j81705j92592j08602K673J52639L3584J20334j06836J61059
$$ 591779 379784 198079 5487 -103115 -100442 52197 85781 206115 99279 260338
2615B60338J01126n8252L3347l01744j03932j90365j76947K79203J0933j57078
$$ 260338 361464 303212 336559 34815 -69117 -259482 -436429 -157226 -146293 -303371
2605c03371L27175J41775p3523j69040o0960L81153P3811K6785Q3635k00637J52189
$$ -303371 23804 165579 92056 -76984 -137944 243209 317020 343805 427440 226803 378992
2594C78992k7747k32992P5390K60810M5879j83678j0187L692L7166K42206k23914
$$ 378992 351245 118253 193643 454453 500332 316654 306467 310159 347325 589531 365617
2583C65617m6586k30730k7338n5512J91123n795j31664J59710j07860P7471j06193
$$ 365617 319031 88301 60963 5451 196574 190779 59115 218825 110965 188436 82243
2572H2243O6038K00758J95239l49200l13759k81911M03342j67674j42418K77461
$$ 82243 148281 349039 544278 195078 -118681 -400592 2750 -164924 -307342 -29881
2562b9881K10351M7399k07524j84834K38010q1749j57430K17002j82414M98958
$$ -29881 180470 227869 20345 -164489 73521 -8228 -165658 51344 -131070 367888
2552C67888K6736J60365J88670o5034l01520j60460o7083J78526j37184m77502
$$ 367888 394624 554989 743659 678625 377105 216645 149562 328088 190904 -286598
2542b86598N5918L686K1456J20367j10203K21271L3313q3056M0078K6867N4164
$$ -286598 -230680 -226994 -205538 -85171 -195374 25897 59210 -23846 16232 43099 97263
2531I7263j12176J11095R0137O7787j51827j75431r1185K7618P609P4598j60376
$$ 97263 -14913 96182 186319 254106 102279 -73152 -164337 -136719 -129110 -54512 -214888
2520b14888j14391J3242K26263K30772L53601p3479Q4882k53289j06438M2058
$$ -214888 -329279 -316037 -89774 140998 494599 421120 506002 252713 146275 188333
2510A88333j12053l18443K99054M00869O9133J22532J51312K07728M7802k14146
$$ 188333 76280 -242163 56891 457760 526893 649425 800737 1008465 1056267 842121
2500H42121k66263k43704j78903O6531r4460j60551P2548k1985l27464J79920
$$ 842121 575858 332154 153251 219782 125322 -35229 37319 15334 -312130 -132210
2490a32210r3130J78479J91252K6596m948P2632p2212P0516j65809j09441N8017
$$ -132210 -225340 -46861 144391 170987 166039 238671 166459 236975 71166 -38275 19742
2479A9742j21662P4796j36553o1417L75030j01933k47206J90582k42656l720p2173
$$ 19742 -101920 -27124 -163677 -225094 149936 48003 -199203 -8621 -251277 -254997 -327170
2468c27170J92449L74089J94028l05808j9915M7948l69572n483O8956L8127j33126
$$ -327170 -134721 239368 433396 127588 107673 155621 -213951 -219434 -150478 -112351 -245477
2457b45477J9471K21877j52228J91511K10484J19499m7274J75670l4167k08803
$$ -245477 -226006 -4129 -156357 35154 245638 365137 317863 493533 459366 250563
2447B50563J65365o6505l31923O0047k00892J95469O1294O2506J68358o6358k34842
$$ 250563 415928 349423 17500 77547 -123345 72124 133418 195924 364282 297924 63082
2436F3082j12057r0486j49921J1280k26784J88102J47753J24404L10280k0913
$$ 63082 -48975 -139461 -289382 -278102 -504886 -316784 -169031 -44627 265653 244740
2426B44740k67939J5071l16327p72L6656j83991J61502K82189K47003J27859o815
$$ 244740 -23199 -8128 -324455 -325227 -288571 -472562 -311060 -28871 218132 345991 339176
2415C39176j22160j92512K43491q5693P0090J60633K9707P6532O2633o0353R4863
$$ 339176 217016 24504 267995 182302 252392 413025 442732 519264 581897 521544 616407
2404F16407j31752k0559j14131j19227J05331l25806J25183k53654k8688L01670
$$ 616407 484655 464096 349965 230738 336069 10263 135446 -118208 -146896 154774
2394A54774Q6423j25333J63033j16468Q1325L29032l14367n7531j06526R5438
$$ 154774 241197 115864 278897 162429 243754 572786 258419 200888 94362 189800
2384A89800J78674Q7954j32864K4483J65243j72077J45648R0124M339o6052k01973
$$ 189800 368474 456428 323564 348047 513290 341213 486861 576985 581324 515272 313299
2373C13299N9500r7388k27608k78008J56709R6551k0674K16269m4565r26K38606
$$ 313299 372799 275411 47803 -230205 -73496 23055 2381 218650 174085 173159 411765
2362D11765j63402J23985q8168K62560q2560j49469k83564p1332M4787K89625
$$ 411765 248363 372348 284180 546740 464180 314711 31147 -40185 4602 294227
2352B94227q2652J26126l9523j0377J67302K7818J21371J61587l0793m51772p7137
$$ 294227 211575 337701 298178 287801 455103 482921 604292 765879 735086 283314 206177
2341B06177J26712P2019Q5197m8059J27087q0714j52709j29908p6545L73379J73901
$$ 206177 332889 404908 490105 442046 569133 488419 335710 205802 129257 502636 676537
2330F76537k91024N5204R3284J54676k1492M1989J22060l14549k51093k38476
$$ 676537 385513 440717 534001 688677 667185 709174 831234 516685 265592 27116
2320B7116j5696J06313M80802j09433j14347l06373j83204J18820K3754L17846
$$ 27116 11420 117733 598535 489102 374755 68382 -114822 3998 27752 345598
2310C45598N0297O2076n11362k84325L83798J68119R969j57321K6091j71838p9641
$$ 345598 395895 457971 -53391 -337716 46082 214201 224170 66849 92940 -78898 -158539
2299a58539j82048J10189p6519l21j38740J09291m3675J78543j05018Q5886M54146
$$ -158539 -340587 -230398 -306917 -307238 -445978 -336687 -380362 -201819 -306837 -220951 233195
2288B33195P6178j54637q4278L79913K8796P7681J72059j26110p6343J39016o4381
$$ 233195 309373 154736 70458 450371 479167 556848 728907 602797 526454 665470 601089
2277F01089j20302j15623q3245j82197k45770J37615k1961J34564J74238O4378
$$ 601089 480787 365164 281919 99722 -146048 -8433 -30394 104170 278408 342786
2267C42786N8031Q389k74441r104j25536K87048l78610J96940p3970j9020j9913
$$ 342786 400817 409206 134765 125661 125 287173 -91437 105503 31533 12513 -7400
2256g400M3361J3280J20733P3551K8811p405J39940j15802j87560n0512L986m4091
$$ -7400 35961 49241 169974 243525 272336 264931 404871 289069 101509 50997 54983 10892
2244A0892Q154m7732L7412K10107K60562J06222m37482J92579J58876J16802q4020
$$ 10892 19046 -28686 8726 218833 479395 585617 148135 340714 499590 616392 532372
2233E32372L04718j80009n2828m4231K26115q6238Q1777k7109o119J9916M9121
$$ 532372 837090 657081 604253 560022 786137 699899 781676 754567 748448 768364 817485
2222H17485Q3692J53871q7398j06984L76584j57713l3056j70163k38578j70000
$$ 817485 901177 1055048 967650 860666 1237250 1079537 1046481 876318 637740 467740
2212D67740J09171L12949j00133m10149j89919J96929K30785j43896m8233J92498
$$ 467740 576911 889860 789727 379578 189659 386588 617373 473477 425244 617742
2202F17742R8242n9402R4747J10796j17981M8108Q3927J08685J75572J57097j40531
$$ 617742 715984 656582 751329 862125 744144 792252 876179 984864 1160436 1317533 1177002
2191A177002N0614j65320L91322n7746L9517j9314l9825l1535r5899k192J28222
$$ 1177002 1227616 1062296 1453618 1395872 1435389 1416075 1376250 1344715 1248816 1246624 1374846
2180A374846J14981K39527l578K09435j42668k75471j31316Q9235j00435M0141
$$ 1374846 1489827 1729354 1725776 1935211 1792543 1517072 1385756 1474991 1374556 1414697
2170A414697L44057J173L97212P3533J92532J14820j60J65604j37967l15719L27278
$$ 1414697 1758754 1759927 2157139 2230672 2423204 2538024 2537864 2703468 2565501 2249782 2577060
2159B577060K06728q5018J76537J37372J04938k3894J94368N8436K25803J30414
$$ 2577060 2783788 2698770 2875307 3012679 3117617 3093723 3288091 3346527 3572330 3702744
2149C702744K27812j30760J65307K9482J11087J64273K76307M48676J95997M31998
$$ 3702744 3930556 3799796 3965103 3994585 4105672 4269945 4546252 4994928 5190925 5622923
2139E622923K05474N49675L68687L20878L168M79492M00100N36205O62837M30611
$$ 5622923 5828397 6378072 6746759 7067637 7070805 7550297 7950397 8486602 9149439 9580050
2129I580050P42864Q90082P12772R43365J169781J248163R95593J204245J218918
$$ 9580050 10322914 11212996 11925768 12869133 14038914 15287077 16282670 17486915 18705833
2120A8705833J665628K370759K517147L204639M258385N496948O304484P879146
$$ 18705833 20371461 22742220 25259367 28464006 32722391 38219339 44523823 52402969
2112E2402969J0007093J4602978J9382742J5416125k920032j8783118k1204522
$$ 52402969 62410062 77013040 96395782 111811907 108891875 90108757 68904235
2105F8904235j4876788r769025p028468m996141l943000k959427k609019k030467
$$ 68904235 54027447 44258422 37229954 32233813 28290813 25331386 22722367 20691900
2097B0691900j882443j507301q66008n65021r63919j385800j642674q82877o40516
$$ 20691900 18809457 17302156 16436148 15871127 14907208 13521408 11878734 10995857 10355341
2088A0355341l76375j032866l90045k19757k20010k83859N7362k98422l46500
$$ 10355341 9978966 8946100 8556055 8336298 8116288 7832429 7889791 7591369 7244869
2079G244869p67589l50757k9831l11522n18898m48034l89012l9683O4423k10744
$$ 7244869 6477280 6126523 6096692 5785170 5266272 4818238 4429226 4389543 4453966 4243222
2069D243222m7564j10927n6621K99523k23228k29297j35408k18279r5068j24190
$$ 4243222 4195658 4084731 4028110 4327633 4104405 3875108 3739700 3521421 3426353 3302163
2059C302163l33639k07104l36679r2593k69816J233r5791j48178J0217J68792
$$ 3302163 2968524 2761420 2424741 2332148 2062332 2063565 1967774 1819596 1829813 1998605
2049A998605K41834o7406J59148L4548j77307j50209l96717l99829J27898l51106
$$ 1998605 2240439 2173033 2332181 2366729 2189422 2039213 1642496 1242667 1370565 1019459
2039A019459o1375n3683R0912L74687L4749M7921K31020p1311J10200k43893m0213
$$ 1019459 958084 904401 995313 1370000 1404749 1452670 1683690 1612379 1722579 1478686 1438473
2028A438473j94427L09660k9347n0197l35383m05497l5519P1483j69791K87585
$$ 1438473 1244046 1553706 1524359 1474162 1138779 733282 697763 769246 599455 887040
2018H87040j98939O4686J25534n1636L19864J92745k7911r3763J17367k68081
$$ 887040 688101 752787 878321 826685 1146549 1339294 1311383 1217620 1334987 1066906
2008A066906j4236J1329L469k24268j06266j31221L21925k06924R9805J50775
$$ 1066906 1052670 1063999 1067468 843200 736934 605713 927638 720714 820519 971294
1998I71294L220Q0949k92781j41591R0413o785M5598K07642m3067j2182o1349
$$ 971294 974514 1055463 762682 621091 711504 704719 750317 957959 914892 902710 841361
1987H41361O0832M5131n73541k01247p825J69219J24584P9873J9406L75832j56099
$$ 841361 902193 947324 373783 172536 164711 333930 458514 538387 557793 933625 777526
1976G77526j76071o5702m69674K61491l8243n7582j85827P2206J3093K6704j48290
$$ 777526 601455 535753 66079 327570 289327 231745 45918 118124 131217 157921 9631
1965I631L7496J8333j38697J27104R0515P6947K02895j3773j67637j05794r1080
$$ 9631 47127 65460 -73237 53867 144382 221329 424224 410451 242814 137020 45940
1954D5940K74678n5223l76494L2537Q6638r8493J05688J8745J20783J19891L206
$$ 45940 320618 265395 -111099 -78562 8076 -90417 15271 34016 154799 274690 277896
1943B77896K62968P2823M2431j24006L1560L3559j21688k48383n2952J61217L7296
$$ 277896 540864 613687 656118 532112 563672 597231 475543 227160 174208 335425 372721
1932C72721p1894Q8024J04589j053j23840l45168J94694J59659m9702n9214k91325
$$ 372721 300827 388851 493440 492387 368547 23379 218073 377732 328030 268816 -22509
1921b2509P8391J6816j95593L02579O9396J5864j2236j34446N5600j36572P3589
$$ -22509 55882 72698 -122895 179684 249080 264944 252708 118262 173862 37290 110879
1910A10879k23770k58823R2040K69595k81004J62103O9731L26025M7145m12066
$$ 110879 -112891 -371714 -279674 -10079 -291083 -128980 -59249 266776 313921 -98145
1900i8145k04824K19434J07559j1169L5997j04377k45360J06226R4600N3574O5234
$$ -98145 -302969 -83535 24024 12855 48852 -55525 -300885 -194659 -100059 -46485 18749
1889A8749j54536o5877j0877L37145M5593k43646N2329L73162O5668K03366J1174
$$ 18749 -135787 -201664 -212541 124604 170197 -73449 -21120 352042 417710 621076 632250
1878F32250M9143l9218J3881r7262j31662l32797m306j59485O1967K07979k9306
$$ 632250 681393 642175 656056 558794 427132 94335 90029 -69456 -7489 200490 171184
1867A71184r2589O7719j27177m4272m566n5889J61413J38844q2181Q2517j11096
$$ 171184 78595 146314 19137 -25135 -29701 -85590 75823 214667 132486 215003 103907
1856A03907O4925Q8979m92603j12429J76680J77219q687J11949L34689K11623
$$ 103907 168832 257811 -234792 -347221 -170541 6678 -2009 109940 444629 656252
1846F56252l66332M7097Q971J56461K3694j93258J39803l3992M3458O0826m21606
$$ 656252 289920 337017 345988 502449 526143 332885 472688 438696 482154 542980 121374
1835A21374k43639J64932l84011j42513J44404Q5013J2713l865j2505J03249j08442
$$ 121374 -122265 42667 -341344 -483857 -339453 -254440 -241727 -245592 -258097 -154848 -263290
1824b63290j5183J60834M51977j04644q5226k09891j1661K40621K7862J30154
$$ -263290 -278473 -117639 334338 229694 144468 -65423 -77084 163537 191399 321553
1814C21553j99636k49087N0230k65519j66286L93868L1927j80998m183k9779L13187
$$ 321553 121917 -127170 -76940 -342459 -508745 -114877 -82950 -263948 -268131 -297910 15277
1803A5277J78927o6184J10938J4101j66514k6476k77517J72582K36714j72395
$$ 15277 194204 128020 238958 253059 86545 60069 -217448 -44866 191848 19453
1793A9453N2788j39780j3523J24210J1814L4616j5954j69640K1390R6201n6068
$$ 19453 72241 -67539 -81062 43148 54962 89578 73624 -96016 -74626 21575 -34493
1782c4493M27587P1629k98752P1691k56705q2142P8625j77283j8202J38851r1303
$$ -34493 393094 464723 165971 237662 -19043 -101185 -22560 -199843 -218045 -79194 -170497
1771a70497Q7298M3900l5427K73917k58630k58558J06948j6552K48330l5640j60301
$$ -170497 -83199 -39299 -74726 199191 -59439 -317997 -211049 -227601 20729 -14911 -175212
1760a75212L38486j3250m05090J43690K21984j6328O0021k84348P2805K901j95695
$$ -175212 163274 150024 -255066 -111376 110608 94280 154301 -130047 -57242 -54341 -250036
1749b50036R1083K34430K65599J93318k66196n9764k25665k75261j28888j25646
$$ -250036 -158953 75477 341076 534394 268198 208434 -17231 -292492 -421380 -547026
1739e47026O4330n3132J16711l5920J45846n7650L48659J34948k29360k33894
$$ -547026 -482696 -535828 -419117 -455037 -309191 -366841 -18182 116766 -112594 -346488
1729c46488K55279k04206K16146J3251M7906l29536k72985J58821N2271J4297
$$ -346488 -91209 -295415 -79269 -66018 -18112 -347648 -620633 -461812 -409541 -395244
1719c95244L65638J09046J67340K0848J45446j34740O4142j56393k05732J4089
$$ -395244 -29606 79440 246780 267628 413074 278334 342476 186083 -19649 -5560
1709e560M7311P8107N4768m5275J24893M1869j66161j89308j02870J19336k24688
$$ -5560 41751 119858 174626 129351 254244 296113 129952 -59356 -162226 -42890 -267578
1698b67578J60298n3873J15257j7570j25559p6622K60578j60409M003j17196p6021
$$ -267578 -107280 -161153 -45896 -63466 -189025 -265647 -5069 -165478 -161475 -278671 -354692
1687c54692J17305J98994q428K1081j06714M2552K20035J65676J3343j91975R7322
$$ -354692 -237387 -38393 -46821 -25740 -132454 -89902 130133 295809 309152 117177 214499
1676B14499k10576j74179J44598J72427l21292K6872N1751M1481n3191p2492L3586
$$ 214499 3923 -170256 -25658 146769 -174523 -147651 -95900 -54419 -107610 -180102 -146516
1665a46516k08278L3317k00012Q8774L08388j30741L81851o9974k56120j44410
$$ -146516 -354794 -321477 -521489 -432715 -124327 -255068 126783 56809 -199311 -343721
1655c43721j34071L94648L18229l54161l0737q8690j85121K78801j88251K48912
$$ -343721 -477792 -83144 235085 -119076 -149813 -238503 -423624 -144823 -333074 -84162
1645h4162o368j37324J39542q8509N6347J08986J66712P5068j31968O7019k36928
$$ -84162 -90530 -227854 -88312 -176821 -120474 -11488 155224 230292 98324 165343 -71585
1634g1585j7523j54101J46248l8128p4085K60258N2840j84468K02322O6944n0317
$$ -71585 -89108 -243209 -96961 -135089 -209174 51084 103924 -80544 121778 188722 138405
1623A38405k77548j86253r8108J87624J39945J33067j43759J04473K0848K06357
$$ 138405 -139143 -325396 -423504 -235880 -95935 37132 -106627 -2154 18694 225051
1613B25051j18159J97675o8823o7071Q68L0775K60296P1119n6883R8026l77186
$$ 225051 106892 304567 235744 168673 169541 200316 460612 531731 474848 572874 195688
1602A95688k4300j2880o74473j53881Q1190L63974k41342J03567K73590K80469
$$ 195688 171388 158508 -515965 -669846 -588656 -224682 -466024 -362457 -88867 191602
1592A91602O5300n5480N3105P008j56491j61580L8638J33816n8933k7372k55864
$$ 191602 256902 201422 254527 261535 105044 -56536 -17898 115918 56985 29613 -226251
1581b26251j90155q7941q9469M7647M1573K47485J13022j36144r9571K27474j56222
$$ -226251 -416406 -504347 -593816 -546169 -504596 -257111 -144089 -280233 -379804 -152330 -308552
1570c08552K38846K857j0496P1395j35188J05228k53965M26938N7944q3705J47692
$$ -308552 -69706 -66849 -77345 -5950 -141138 -35910 -289875 137063 195007 111302 258994
1559B58994J7293j8992K13740j35921K54278j33337k18152k3939O4635J06851
$$ 258994 276287 257295 471035 335114 589392 456055 237903 213964 278599 385450
1549C85450N0411j00056J44270k33160j9211j99730p5181J97486N979k90236O8871
$$ 385450 435861 335805 480075 246915 227704 27974 -47207 150279 156258 -133978 -65107
1538f5107R3555j9083K17117o0662l5519p4860J0698l81720p8272j40063J88811
$$ -65107 28448 9365 226482 165820 130301 55441 66139 -315581 -393853 -533916 -345105
1527c45105p9434j8817k85155l3908N71869m6877P5484J54479M9619N4892l02971
$$ -345105 -424539 -443356 -728511 -762419 -190550 -237427 -161943 -7464 42155 97047 -205924
1516b05924K19401L83001m30105k43338R393K75563j38478Q344J41069K83920
$$ -205924 13477 396478 -33627 -276965 -267572 7991 -130487 -122143 18926 302846
1506C02846Q4325l927l07110R5091k35737p2430k9711L6614M09951k50596k29954
$$ 302846 387171 383244 76134 171225 -64512 -136942 -166653 -130039 279912 29316 -200638
1495b00638M1940k3650j30166J29818j39255J10332J76412j27682J77845J84475
$$ -200638 -158698 -182348 -312514 -182696 -321951 -211619 -35207 -162889 14956 199431
1485A99431K65217L1865j98863k63237j37091j88072K56351k23102N5619K28235
$$ 199431 464648 496513 297650 34413 -102678 -290750 -34399 -257501 -201882 26353
1475B6353j66498m20048J58050L98324N107R6761p2337Q8753J01715j06037q6495
$$ 26353 -140145 -560193 -402143 -3819 1288 98049 25712 114465 216180 110143 23648
1464B3648K83114J64905k13046l03550j48196L36965q8775m27551l9142P2842
$$ 23648 306762 471667 258621 -44929 -193125 143840 55065 -372486 -411628 -338786
1454c38786L12820m40814J71614K77901J61094l46812j97798m01749L53105n6086
$$ -338786 -25966 -466780 -295166 -17265 143829 -202983 -400781 -802530 -449425 -505511
1444e05511N3044J75990L73075p8204J3809k41251m3941l5996J32965J36628j12258
$$ -505511 -452467 -276477 96598 18394 32203 -209048 -252989 -288985 -156020 -19392 -131650
1433a31650r8849J83086J41133P061J66818p1291J8600m71157L63039j4154j08690
$$ -131650 -230499 -47413 93720 100781 267599 196308 214908 -256249 106790 92636 -16054
1422a6054J08785K2207K17847J28576j78193Q8993o2787p1219k14748l21618L12447
$$ -16054 92731 114938 332785 461361 283168 372161 309374 238155 23407 -298211 14236
1411A4236l08466J77275j41568K16553K52625j12842k0441l6236o4736r2763j16096
$$ 14236 -294230 -116955 -258523 -41970 210655 97813 77372 41136 -23600 -116363 -232459
1400b32459j06683Q6897p2406J8995K21753Q3574R7728j95747K1182j69199k20691
$$ -232459 -339142 -252245 -324651 -305656 -83903 -329 97399 -98348 -77166 -246365 -467056
1389d67056k13270K88284M88418N7392J60351j68581q1443j24245K88887m11425
$$ -467056 -680326 -392042 96376 153768 314119 145538 64095 -60150 228737 -182688
1379a82688j02999j44540J58770l2014o6364J48978K80084j98978k18334J31837
$$ -182688 -285687 -430227 -271457 -303471 -369835 -220857 59227 -139751 -358085 -226248
1369b26248J49179L18390J1523j25399K76081k7872J16499j35771k82964Q7588
$$ -226248 -77069 241321 252844 127445 403526 375654 492153 356382 73418 161006
1359A61006J1366k43642J51867n4321l92833m5197J50480N3414P5495J19756Q223
$$ 161006 172372 -71270 80597 26276 -366557 -411754 -261274 -207860 -132365 -12609 -4386
1348d386J50970j25287j78471r6170j39048o1413M4452J36837n6827J25140K98982
$$ -4386 146584 21297 -157174 -253344 -392392 -453805 -409353 -272516 -329343 -204203 94779
1337I4779O7621j5543j39864R8339Q8277P0517J99354k00749M35856k47988l16645
$$ 94779 162400 146857 6993 105332 193609 264126 463480 262731 698587 450599 133954
1326A33954k74367J24426k11858k08003k09046J56820k06220q9634L59901j85886
$$ 133954 -140413 -15987 -227845 -435848 -644894 -488074 -694294 -783928 -424027 -609913
1316f09913m3814p366J95855L46344J84033N9517J32563j72951J52123r6397k19648
$$ -609913 -653727 -661093 -465238 -118894 65139 124656 257219 84268 236391 139994 -79654
1305g9654l0996m1044N7323K78714l30489J02520J60966k19192O1737j05382J4034
$$ -79654 -110650 -151694 -94371 184343 -146146 -43626 117340 -101852 -40115 -145497 -131463
1294a31463K13593j2010k540J22181K07941J6612k71965p9218m7280j54474k14700
$$ -131463 82130 70120 67580 189761 397702 414314 142349 63131 15851 -138623 -353323
1283c53323m93P9354P6893J19672j34878J42923N3347K27274j8424K47964j11292
$$ -353323 -353816 -274462 -197569 -77897 -212775 -69852 -16505 210769 192345 440309 329017
1272C29017j94289l12824J4945O755J06403N0439l02156q9461M2891O7947K48485
$$ 329017 134728 -178096 -163151 -156396 -49993 446 -301710 -391171 -348280 -280333 -31848
1261c1848M56766M9918j45698j54022m56406K10347r8776J4531R1551j74671k85473
$$ -31848 424918 474836 329138 175116 -281290 -70943 -169719 -155188 -63637 -238308 -523781
1250e23781k80382j2174M97684L05515K50307K84307j88979r861m372J92491O8495
$$ -523781 -804163 -816337 -318653 -13138 237169 521476 332497 322636 318264 510755 579250
1239E79250K30164j16710m58858n08544J03953K89865J27292K491k90715r0460
$$ 579250 809414 692704 233846 -274698 -170745 119120 246412 248903 -41812 -132272
1229a32272l41872n4920K55515M93930J3335K03389q7857p8743j22534r1092K8735
$$ -132272 -474144 -529064 -273549 220381 233716 437105 349248 270505 147971 56879 85614
1218H5614j73716j79655J11491l83196j9923L17678L01636J66327o14393n0499
$$ 85614 -88102 -267757 -156266 -539462 -559385 -241707 59929 226256 -388137 -438636
1208d38636J57254J96312L2155k6755K13879J20929k97746l36686k3967L24619
$$ -438636 -281382 -85070 -52915 -79670 134209 255138 -42608 -379294 -403261 -78642
1198g8642L38608k1044k75334N3249l789l82196k32948N31956J42881M20394k12468
$$ -78642 259966 238922 -36412 16837 13048 -369148 -602096 -70140 72741 493135 280667
1187B80667P9925k23270J11240r2873J78170J35059l40595k78810J38217J93461
$$ 280667 360592 137322 248562 155689 333859 468918 128323 -150487 -12270 181191
1177A81191K29404p3883j92498J11102j13768J83896j94156K67124M0780r195
$$ 181191 410595 336712 144214 255316 141548 325444 131288 398412 439192 429997
1167D29997q7889l40514k23922K64033j95517j08488j79751M2070K13576J72920
$$ 429997 342108 1594 -222328 41705 -153812 -262300 -442051 -399981 -186405 -13485
1157a3485J16797P9110J12871o9549Q8287k95746M25588m24538j3942k19399M1070
$$ -13485 103312 182422 295293 225744 314031 18285 443873 19335 5393 -214006 -172936
1146a72936j72977j63862L12652k0286K0405O7004J99774K301J28296j67285j42368
$$ -172936 -345913 -509775 -197123 -217409 -197004 -130000 69774 72075 200371 33086 -109282
1135a09282J2563J3343M6185J3176j93483m6742Q6830J0982k45124q0327K38029
$$ -109282 -96719 -83376 -37191 -24015 -217498 -264240 -177410 -166428 -411552 -491879 -253850
1124b53850J73310J21673L36280K67429P545l66394j02917M887J53457l9899j99692
$$ -253850 -80540 41133 377413 644842 652387 285993 183076 187963 341420 301521 101829
1113A01829j63594M8756K0596l34839J53712K64782k57751J47468l512r183L16386
$$ 101829 -61765 -13009 7587 -327252 -173540 91242 -166509 -19041 -22553 -31736 284650
1102B84650o8836P6458j06139l42787l731K9915J50205M26777k625n32811n7180
$$ 284650 215814 292272 186133 -156654 -160385 -130470 19735 446512 443887 -88924 -146104
1091a46104J27433j31805j17921l36869L9603J51855J26259J31945J01324M07724
$$ -146104 -18671 -150476 -268397 -605266 -565663 -413808 -287549 -155604 -54280 353444
1081C53444K3229k00627k30199n6712j30102J89952J04569j41218Q6502k63159
$$ 353444 376673 176046 -54153 -110865 -240967 -51015 53554 -87664 -1162 -264321
1071b64321q8866R2122J73096K5933k02504j19989Q0447J74594J1782l0956J1029
$$ -264321 -353187 -261065 -87969 -62036 -264540 -384529 -304082 -129488 -117706 -148662 -137633
1060a37633k36514n8627R8652J03349J98731P7267J19937j74446L13085j65867
$$ -137633 -374147 -432774 -334122 -230773 -32042 45225 165162 -9284 303801 137934
1050A37934k38475j24543K63592N22637q1426l10531k6700q4790o1188j93780
$$ 137934 -100541 -225084 38508 561145 479719 169188 142488 57698 -3490 -197270
1040a97270J14098l2377j41102j80135J33115k36667L11136J3300k08389k5702
$$ -197270 -83172 -115549 -256651 -436786 -303671 -540338 -229202 -215902 -424291 -449993
1030d49993j15083N4799J27094M240Q8621Q6820j80365j41503l8412O2764Q7943
$$ -449993 -565076 -510277 -383183 -378943 -290322 -203502 -383867 -525370 -563782 -501018 -413075
1019d13075J59036J12588J18691l4683q0966J16128N13219m4684L5194k50848
$$ -413075 -254039 -141451 -22760 -57443 -138409 -22281 490938 446254 481448 230600
1009B30600R012j61297k30851k25283k8997J06696L2273l8975n9485K84815K57962
$$ 230600 239612 78315 -152536 -377819 -406816 -300120 -267847 -306822 -366307 -81492 176470
998A76470q1692k9223J2929o3359L2878l12797J78194K74791o4771k24698j08704
$$ 176470 94778 65555 78484 15125 48003 -264794 -86600 188191 123420 -101278 -209982
987b09982M38148J26699j47762j74277K68765K97531j08050o7127n8727P3044
$$ -209982 228166 354865 207103 32826 301591 599122 491072 423945 365218 438262
977D38262l41463k04917k3889o591K26278k08489q5932J635L21385k61631L21735
$$ 438262 96799 -108118 -132007 -138598 87680 -120809 -206741 -205106 116279 -145352 176383
966A76383N0346K35994j97532k34727k21950J11310K08324O306l35740J2124K09277
$$ 176383 226729 462723 265191 30464 -191486 -80176 128148 134454 -201286 -189162 20115
955B0115M9764k25177j5484K01316J27697l83446M5425k45843L565L32282P5947
$$ 20115 69879 -155298 -170782 30534 158231 -225215 -179790 -425633 -422068 -89786 -13839
944a3839Q6502l47111J09241j8549j8023N677n0231k21298J27731K07481j7712
$$ -13839 72663 -274448 -165207 -183756 -201779 -196102 -246333 -467631 -339900 -132419 -150131
933a50131J48633L5434M6069L13376o3933j59891j60321l351j80137j24748k831
$$ -150131 -1498 33936 80005 393381 329448 169557 9236 5885 -174252 -299000 -301831
922c01831Q3328K81898J14151m11216L53769R2713J99670m22933K6153J83910
$$ -301831 -218503 63395 177546 -233670 120099 212812 412482 -10451 15702 199612
912A99612l9553J61083j30598k23506m0248j43331j3656K62427r3532J48647p6491
$$ 199612 160059 321142 190544 -32962 -73210 -216541 -230197 32230 -61302 87345 10854
901A0854k23654L04292n8935J56525N1979m3084j81764J35034k09183o5449J53089
$$ 10854 -212800 91492 32557 189082 241061 197977 16213 151247 -57936 -123385 29704
890B9704j76434J29501J7674k06405l2247K8010J23823n6086j34724M7900j65461
$$ 29704 -146730 -17229 445 -205960 -238207 -210197 -86374 -142460 -277184 -229284 -394745
879c94745Q7872K19305L4936k8120j85132n51887K16743M990p4543J17954O4511
$$ -394745 -306873 -87568 -52632 -80752 -265884 -817771 -601028 -596038 -670581 -552627 -488116
868d88116J32023L85391L70661n7778L6626k04810j64846j26888n2399J12289
$$ -488116 -356093 29298 399959 342181 378807 173997 9151 -117737 -170136 -57847
858e7847k8173j39507L55361J5435J0100j76541j61478J26173K8246r0934r6595
$$ -57847 -86020 -225527 129834 145269 155369 -21172 -182650 -56477 -28231 -119165 -215760
847b15760N1757k27779L176L21152L4242l6442K7431J74397k20372j9277r2406
$$ -215760 -164003 -391782 -388606 -67454 -33212 -69654 -42223 132174 -88198 -107475 -199881
836a99881l6094l1905k58430M96922l568J34160j38140K5417J97027L67635j54842
$$ -199881 -235975 -267880 -526310 -29388 -32956 101204 -36936 -11519 185508 553143 398301
825C98301m3026j49609k22428j24053l22015j41412K43950J25351k9827l3533
$$ 398301 355275 205666 -16762 -140815 -462830 -604242 -360292 -234941 -264768 -298301
815b98301j05882K57045R7922J30311k12475J27727o0552j67568n2092j20558
$$ -298301 -404183 -147138 -49216 81095 -131380 -3653 -64205 -231773 -283865 -404423
805d04423M8245J93882k9961K15780k39231l1936n2814j99330J14033P0042m0798
$$ -404423 -356178 -162296 -192257 23523 -215708 -247644 -300458 -499788 -385755 -315713 -356511
794c56511L45267L7896r1685M7518l48679K98080Q9411k19057j23783J7036j15817
$$ -356511 -11244 26652 -65033 -17515 -366194 -68114 21297 -197760 -321543 -304507 -420324
783d20324K71984j76967J66435K55389n9920j25539M4875j1525j15485k92135
$$ -420324 -148340 -325307 -158872 96517 36597 -88942 -44067 -55592 -171077 -463212
773d63212J7359K48700K63320j56814O2659j55877l7993K95081j97107K17711
$$ -463212 -445853 -197153 66167 -90647 -27988 -183865 -221858 73223 -123884 93827
763I3827J64472j44958j4634K17334l0809j75247r9540j77787o7786J2691r5369
$$ 93827 258299 113341 98707 316041 285232 109985 10445 -167342 -235128 -222437 -317806
752c17806k11891j3945L52883M1974k90267P2721R1620j5862j09226l0898J13809
$$ -317806 -529697 -543642 -190759 -148785 -439052 -366331 -274711 -290573 -399799 -430697 -316888
741c16888j8944R6730j4176k7159J5336N25373k31937k3644L47371o8859p4677
$$ -316888 -335832 -239102 -253278 -280437 -265101 260272 28335 4691 352062 283203 208526
730B08526k40417j88174J78678K20052k85864j245K11268J7854j97668j08948
$$ 208526 -31891 -220065 -41387 178665 -107199 -108444 102824 120678 -76990 -185938
720a85938k0664J44099J49405j42625K20183J44286k4249O8861P9933q1343j74095
$$ -185938 -206602 -62503 86902 -55723 164460 308746 284497 353358 433291 351948 177853
709A77853o3532J1406l42285j03681J12675L5878L41137l2520M970o4373R3590
$$ 177853 114321 125727 -216558 -320239 -207564 -171686 169451 136931 141901 77528 171118
698A71118N2328k29200o6989r1402j46630J83528O3187k3257M2464j10661J27855
$$ 171118 223446 -5754 -72743 -164145 -310775 -127247 -64060 -87317 -44853 -155514 -27659
687b7659Q8918K4569l11272J06947N966k9735O3661k01275K97516K46783P2741
$$ -27659 61259 85828 -225444 -118497 -112531 -142266 -78605 -279880 17636 264419 337160
676C37160L488K4019j91457j28864j6319J76591m7342P7356l24253j94620K10218
$$ 337160 340648 364667 173210 44346 28027 204618 157276 234632 -89621 -284241 -74023
665g4023q4495J13511j01645p9446L3046J27093J90564K4764J2528N9245l8544
$$ -74023 -158518 -45007 -146652 -226098 -193052 -65959 124605 149369 161897 221142 182598
654A82598k58815l19973L8237R0594j50674K64690l3518J07031P4962m15818K38295
$$ 182598 -76217 -396190 -357953 -267359 -418033 -153343 -186861 -79830 -4868 -420686 -182391
643a82391J9016k80773j58407R5668Q1607K14939J37364K56033n576J07007k81742
$$ -182391 -163375 -444148 -602555 -506887 -425280 -210341 -72977 183056 177480 284487 2745
632B745p7897J07375J09967o3739j41926J38364p2143Q1533J38922j67548L40905
$$ 2745 -75152 32223 142190 78451 -63475 74889 2746 84279 223201 55653 396558
621C96558L8756l55467k4297j7162L73853k09685l50538J59332r7669J02075J04313
$$ 396558 435314 79847 55550 38388 412241 202556 -147982 11350 -86319 15756 120069
610A20069l6917K6269j05085k70397J63200J99939Q5453J99714L6142k07394N7110
$$ 120069 83152 109421 4336 -266061 -102861 97078 182531 382245 418387 210993 268103
599B68103p7426m72484K69936k56302j02075j55956J8854J30633L04620j56966
$$ 268103 190677 -281807 -11871 -268173 -370248 -526204 -507350 -376717 -72097 -229063
589b29063j4923q50J82878L5049l49940L16093L33367J19500m63444j99124K2768
$$ -229063 -243986 -244836 -61958 -26909 -376849 -60756 272611 392111 -71333 -270457 -247689
578b47689j3595O8536K73001L0380r6696J11607k7193l317K56481k7329K3391
$$ -247689 -261284 -192748 80253 110633 13937 125544 98351 95034 351515 324186 347577
567C47577j56108j19328O0463j96243m1511O8110j45998J55557j89900M6167o3332
$$ 347577 191469 72141 132604 -63639 -105150 -37040 -183038 -27481 -217381 -171214 -234546
$$ [...]
##END NTUPLES=NMR SPECTRUM
##END=
