##TITLE=1H_EC-3273(3)
 CDCl3
 8 sc, 
 12.05.2022
##JCAMPDX= 6.0         $$ Bruker NMR JCAMP-DX V2.0
##DATA TYPE= NMR SPECTRUM
##DATA CLASS= NTUPLES
##ORIGIN= UXNMR, Bruker Analytische Messtechnik GmbH
##OWNER= root
$$ XWIN-NMR		Version 3.5
$$ Thu May 12 11:15:43 2022 Russian Standard Time (UT+4h)  she@DPX200
##.OBSERVE FREQUENCY= 200.1313499996
##.OBSERVE NUCLEUS= ^1H
##.ACQUISITION MODE= SIMULTANEOUS
##.ACQUISITION SCHEME= undefined
##.AVERAGES= 8
##.DIGITISER RES= 18
##SPECTROMETER/DATA SYSTEM= spect
##.PULSE SEQUENCE= zg30
##.SOLVENT NAME= Pyr
##.SHIFT REFERENCE= (INTERNAL, Pyr, 0, 15.7348)
##AUDIT TRAIL= $$ (NUMBER, WHEN, WHO, WHERE, WHAT)
$$ ##TITLE= Audit trail, XWIN-NMR		Version 3.5
$$ ##JCAMPDX= 5.01
$$ ##ORIGIN= Bruker BioSpin GmbH
$$ ##OWNER= she
$$ F:/spectra/data/she/nmr/H-F/1/pdata/1/auditp.txt
$$ ##AUDIT TRAIL=  $$ (NUMBER, WHEN, WHO, WHERE, WHAT)
(   1,<2022-05-12 11:14:37.26 +0400>,<she>,<DPX200>,
      <created by zg, POWCHK disabled, PULCHK disabled
       configuration hash MD5:
       00 E9 B6 7A A2 85 ED C7 34 08 36 98 17 FE 4E 26
       data hash MD5: 16K
       C9 37 BA FC 38 61 66 BE 63 F4 10 D6 B5 A9 D0 B1>)
(   2,<2022-05-12 11:14:39.65 +0400>,<she>,<DPX200>,
      <Start of raw data processing
       efp BC_mod = 2 LB = 0.24 FT_mod = 6 PKNL = 1 PHC0 = -17672.73 PHC1 = 16.00075 SI = 16K 
       data hash MD5: 16K
       68 8B 5A DD 30 76 DA 7A F2 D6 F7 B7 F4 D3 CB 82>)
(   3,<2022-05-12 11:14:54.23 +0400>,<she>,<DPX200>,
      <pk PHC0 = -4.022183 PHC1 = 4.4 
       data hash MD5: 16K
       21 83 B2 BF 27 10 8F 6D 3D 7B D5 EB 2F 56 59 6D>)
(   4,<2022-05-12 11:14:57.87 +0400>,<she>,<DPX200>,
      <abs ABSG = 5 
       data hash MD5: 16K
       03 F6 A9 77 31 DD 8F A9 35 E3 EE EF 71 24 DE D0>)
$$ ##END=
$$ 
$$ hash MD5
$$ 35 2C D4 57 54 EF FD E6 48 E7 55 20 93 BF 6A 37
##$RELAX= 
##$RELAX= 
##$RELAX= 
##$RELAX= 
##$RELAX= 
##$RELAX= 
$$ Bruker specific parameters
$$ --------------------------
##$DU= <F:/spectra>
##$EXPNO= 1
##$NAME= <H-F>
##$PROCNO= 1
##$TYPE= <nmr>
##$USER= <she>
##$AMP= (0..31)
100 100 100 100 100 100 100 100 100 100 100 100 100 100 100 100 100 100 
100 100 100 100 100 100 100 100 100 100 100 100 100 100 
##$AQSEQ= 0
##$AQ_mod= 1
##$AUNM= <au_zg>
##$AUTOPOS= <>
##$BF1= 200.13
##$BF2= 200.13
##$BF3= 200.13
##$BF4= 200.13
##$BF5= 200.13
##$BF6= 200.13
##$BF7= 200.13
##$BF8= 200.13
##$BYTORDA= 1
##$CFDGTYP= 0
##$CFRGTYP= 5
##$CHEMSTR= <none>
##$CNST= (0..31)
1 1 145 1 1 1 1 1 1 1 1 1 1 1 1 1 1 1 1 1 1 1 1 1 1 1 1 1 1 1 1 1 
##$CPDPRG= <>
##$CPDPRG1= <>
##$CPDPRG2= <>
##$CPDPRG3= <>
##$CPDPRG4= <mlev>
##$CPDPRG5= <mlev>
##$CPDPRG6= <mlev>
##$CPDPRG7= <mlev>
##$CPDPRG8= <mlev>
##$CPDPRGB= <>
##$CPDPRGT= <>
##$D= (0..31)
0 1.2 0 0 0 0 0 0 0 0.06 0 0.03 0 0 0 0 0.0002 0 0 0 0 0 0 0 0 0 0 0 0 
0 0 0 
##$DATE= 1652339676
##$DBL= (0..7)
120 120 120 120 120 120 120 120 
##$DBP= (0..7)
150 150 150 150 150 150 150 150 
##$DBP07= 0
##$DBPNAM0= <>
##$DBPNAM1= <>
##$DBPNAM2= <>
##$DBPNAM3= <>
##$DBPNAM4= <>
$$ [...]
##$SUBNAM2= <"">
##$SUBNAM3= <"">
##$SUBNAM4= <"">
##$SUBNAM5= <"">
##$SUBNAM6= <"">
##$SUBNAM7= <"">
##$SUBNAM8= <"">
##$SUBNAM9= <"">
##$SW= 18.0517283424761
##$SWIBOX= (0..15)
0 0 2 0 0 0 0 0 0 0 0 0 0 0 0 0 
##$SW_h= 3612.71676300578
##$TD= 16384
##$TD0= 1
##$TE= 0
##$TE2= 300
##$TE3= 300
##$TEG= 300
##$TL= (0..7)
0 120 120 120 120 120 120 120 
##$TP= (0..7)
150 150 150 150 150 150 150 150 
##$TP07= 0
##$TPNAME0= <>
##$TPNAME1= <>
##$TPNAME2= <>
##$TPNAME3= <>
##$TPNAME4= <>
##$TPNAME5= <>
##$TPNAME6= <>
##$TPNAME7= <>
##$TPOAL= (0..7)
0.5 0.5 0.5 0.5 0.5 0.5 0.5 0.5 
##$TPOFFS= (0..7)
0 0 0 0 0 0 0 0 
##$TUNHIN= 0
##$TUNHOUT= 0
##$TUNXOUT= 0
##$USERA1= <user>
##$USERA2= <user>
##$USERA3= <user>
##$USERA4= <user>
##$USERA5= <user>
##$V9= 5
##$VALIST= <valist>
##$VCLIST= <CCCCCCCCCCCCCCC>
##$VD= 0
##$VDLIST= <DDDDDDDDDDDDDDD>
##$VPLIST= <PPPPPPPPPPPPPPP>
##$VTLIST= <TTTTTTTTTTTTTTT>
##$WBST= 1024
##$WBSW= 4
##$XGAIN= (0..3)
0 0 0 0 
##$XL= 0
##$YL= 0
##$YMAX_a= 99205
##$YMIN_a= -161086
##$ZGOPTNS= <>
##$ZL1= 120
##$ZL2= 120
##$ZL3= 120
##$ZL4= 120
##$ABSF1= 15.72926
##$ABSF2= -2.322589
##$ABSG= 5
##$ABSL= 3
##$ALPHA= 0
##$AQORDER= 0
##$ASSFAC= 0
##$ASSFACI= 0
##$ASSFACX= 0
##$ASSWID= 0
##$AUNMP= <proc_1d>
##$AZFE= 0.1
##$AZFW= 0.1
##$BCFW= 0
##$BC_mod= 2
##$BYTORDP= 0
##$COROFFS= 0
##$CY= -3
##$DATMOD= 1
##$DC= 0
##$DFILT= <>
##$DTYPP= 0
##$F1P= 0
##$F2P= 0
##$FCOR= 1
##$FTSIZE= 16384
##$FT_mod= 6
##$GAMMA= 0
##$GB= 0
##$INTBC= 1
##$INTSCL= 0
##$ISEN= 128
##$LB= 0.24
##$LEV0= 0
##$LPBIN= 0
##$MAXI= 10000
##$MC2= 0
##$MEAN= 0
##$ME_mod= 0
##$MI= 1.114404
##$NCOEF= 0
##$NC_proc= -7
##$NLEV= 6
##$NOISF1= 3.799351
##$NOISF2= 2.8
##$NSP= 0
##$NTH_PI= 0
##$NZP= 0
##$OFFSET= 15.73477
##$PC= 1
##$PHC0= -17676.75
##$PHC1= 20.40075
##$PH_mod= 1
##$PKNL= yes
##$PPARMOD= 0
##$PSCAL= 0
##$PSIGN= 0
##$REVERSE= no
##$SF= 200.130007359193
##$SI= 16384
##$SIGF1= 3
##$SIGF2= 2
##$SINO= 5.538805
##$SIOLD= 16384
##$SREGLST= <1H.CDCl3>
##$SSB= 0
##$STSI= 16384
##$STSR= 0
##$SW_p= 3612.71676300578
##$SYMM= 0
##$S_DEV= 0
##$TDeff= 16384
##$TDoff= 0
##$TI= <>
##$TILT= no
##$TM1= 0
##$TM2= 0
##$TOPLEV= 0
##$USERP1= <user>
##$USERP2= <user>
##$USERP3= <user>
##$USERP4= <user>
##$USERP5= <user>
##$WDW= 1
##$XDIM= 16384
##$YMAX_p= 274135456
##$YMIN_p= -560400
$$ End of Bruker specific parameters
$$ ---------------------------------
##NTUPLES= NMR SPECTRUM
##VAR_NAME=  FREQUENCY,     SPECTRUM/REAL,   SPECTRUM/IMAG
##SYMBOL=    X,             R,               I
##VAR_TYPE=  INDEPENDENT,   DEPENDENT,       DEPENDENT
##VAR_FORM=  AFFN,          ASDF,            ASDF
##VAR_DIM=   16384,         16384,           16384
##UNITS=     HZ,            ARBITRARY UNITS, ARBITRARY UNITS
##FACTOR=    0.220516191357247, 1,           1
##FIRST=     3148.99960010536, 0,            0
##LAST=      -463.717162900422, 0,           0
##MIN=       -463.717162900422, -560400,     0
##MAX=       3148.99960010536, 274135456,    0
$$ Real data points
##PAGE= N=1
##DATA TABLE= (X++(R..R)), XYDATA
$$ [...]
$$ plain form
6513 57035 466666 375725 250233 332250 314219 237369 309446 269606 194104 279554 315233
6502 315233 181275 197849 295632 421375 376667 390441 349817 435086 221541 154498 201862
6491 201862 323427 490868 525259 503171 327642 178601 214108 289155 296547 445670 438682
6480 438682 308929 -13605 52629 298199 407209 439970 578480 442534 171334 202887
6470 202887 388634 276351 364588 324975 262630 183787 307498 275985 264514 302055 335953
6459 335953 255223 153749 91692 57289 333202 688146 585556 408532 352343 100905
6449 100905 7702 205986 50780 172298 244409 90948 255825 511451 520939 502124 451672
6438 451672 432520 263996 268832 275160 172507 117481 250530 207118 367607 341988 363275
$$ packed form
6513E7035M09631r0941j25492Q2017j8031p6850P2077l9840p5502Q5450L5679
6502C15233j33958J6574R7783J25743m4708J3774m0624Q5269k13545o7043M7364
6491B01862J21565J67441L4391k2088j75529j49041L5507P5047P392J49123o988
6480D38682j29753l22534O6234K45570J09010L2761J38510j35946k71200L1553
6470B02887J85747j12283Q8237l9613o2345p8843J23711l1513j1471L7541L3898
6459C35953q0730j01474o2057l4403K75913L54944j02590j77024n6189k51438
6449A00905r3203J98284j55206J21518P2111j53461J64877K55626R488j8815n0452
6438D51672j9152j68524M836O328j02653n5026J33049m3412J60489k5619K1287
$$ plain form
6427 363275 379038 260179 256297 274823 141224 436476 337095 376175 392793 367318 336702
6416 336702 51679 244101 297323 475915 405780 428491 626552 728123 695095 613400 480675
6405 480675 618582 561377 615202 585467 561778 526785 523890 679151 717904 669350 454716
6394 454716 156928 271212 149757 394318 458125 338864 260924 218471 323577 284893
6384 284893 75650 301937 338898 315182 376469 315379 415535 461626 312420 278497 396332
6373 396332 393017 428381 497304 382425 347770 450568 394009 286613 396889 472126 425560
6362 425560 325314 447869 405214 648002 617374 543435 706119 668099 523110 424127 423415
6351 423415 344843 390628 539949 524525 560326 663549 648474 754504 686554 328045 454597
$$ packed form
6427C63275J5763j18859l882J8526j33599K95252r9381L9080J6618k5475l0616
6416C36702k85023J92422N3222J78592p0135K2711J98061J01571l3028q1695j32725
6405D80675J37907n7205N3825k9735k3689l4993k895J55261L8753m8554k14634
6394D54716k97788J14284j21455K44561O3807j19261p7940m2453J05106l8684
6384B84893k09243K26287L6961k3716O1287o1090J00156M6091j49206l3923J17835
6373C96332l315L5364O8923j14879l4655J02798n6559j07396J10276P5237m6566
6362D25560j00246J22555m2655K42788l0628p3939J62684l8020j44989r8983p12
6351D23415p8572M5785J49321j5424L5801J03223j5075J06030o7950l58509J26552
$$ plain form
6340 454597 665432 541553 352009 518622 569625 725028 639537 470371 565099 439484
6330 439484 527486 703629 779156 582560 510243 516476 584027 679563 861306 977773 806792
6319 806792 852450 871953 693661 560846 420985 519692 523207 536222 541601 701924 709081
6308 709081 759279 744483 666387 483049 650070 867215 1132551 961559 857703 853521 1104886
6297 1104886 1113737 988843 900185 875090 952113 959197 1083411 1147339 1251361 1179634 1302081
6286 1302081 1642538 1385674 1373791 1397322 1302451 1329768 1286831 1202264 1043150 1014256 1016633
6275 1016633 1065471 1160703 1261187 1268290 1467471 1857041 1864767 1995279 2312041 2194002 1723565
6264 1723565 1342356 1171656 1201623 983141 784580 905950 995380 902698 852128 768055
$$ packed form
6340D54597K10835j23879j89544J66613N1003J55403q5491j69166R4728j25615
6330D39484Q8002J76143P5527j96596p2317O233O7551R5536J81743J16467j70981
6319H06792M5658J9503j78292j32815j39861R8707L515J3015N379J60323P157
6308G09081N0198j4796p8096j83338J67021K17145K65336j70992j03856m182K51365
6297A104886Q851j24894q8658k5095P7023P084J24214O3928J04022p1727J22447
6286A302081L40457k56864j1883K3531r4871K7317m2937q4567j59114k8894K377
6275A016633M8838R5232J00484P103J99181L89570P726J30512L16762j18039m70437
6264A723565l81209j70700K9967k18482j98561J21370Q9430r2682n0570q4073
$$ plain form
6254 768055 780214 726010 861441 948231 801002 799034 451999 537543 571769 704228 558702
6243 558702 320767 252745 246622 399545 592674 586645 564903 568514 668177 736704 456261
6232 456261 342407 474293 305074 275636 232493 487093 562452 317093 646435 749431
6222 749431 589966 677442 529893 499749 641136 622091 438538 474106 297923 266179 393434
6211 393434 408399 261810 546036 526074 659253 700486 805730 692770 549579 692542
6201 692542 557292 562447 619898 726160 778576 756689 613463 556116 769348 844026 645629
6190 645629 641991 746453 576937 428180 620362 547458 573039 740888 773190 917870 1100765
6179 1100765 1054051 1077304 970894 996714 962782 964816 967160 1045129 811626 960793 1144403
$$ packed form
6254G68055J2159n4204J35431Q6790j47229j968l47035Q5544L4226J32459j45526
6243E58702k37935o8022o123J52923J93129o029k1742L611R9663O8527k80443
6232D56261j13854J31886j69219k9438m3143K54600P5359k45359L29342J02996
6222G49431j59465Q7476j47549l0144J41387j9045j83553L5568j76183l1744J27255
6211C93434J4965j46589K84226j9962J33179M1233J05244j12960j43191J42963
6201F92542j35250N155N7451J06262N2416k1887j43226n7347K13232P4678j98397
6190F45629l638J04462j69516j48757J92182p2904K5581J67849L2302J44680J82895
6179A100765m6714K3253j06410K5820l3932K034K344P7969k33503J49167J83610
$$ plain form
6168 1144403 1108065 1115306 1130488 1278202 1269702 1174797 1493823 1541557 1807453 2141645 2285219
6157 2285219 2410735 2244669 1634993 1539635 1357444 1214629 1347605 1338006 1336541 1349367 1473589
6146 1473589 1488867 1609403 1671788 1633886 1988553 2161757 1907304 1536290 1231095 1057291
6136 1057291 1091407 870969 845887 944049 776411 580269 500997 611427 584185 551557 552148
6125 552148 636285 553337 338489 281730 495957 542758 402504 324470 491244 597737 686593
6114 686593 652405 533352 453966 386411 566180 607414 448407 514786 501040 722312 590062
6103 590062 450166 433621 298847 494616 617294 343959 401399 193286 201967 423840
6093 423840 263622 375931 509690 360919 349763 230182 494042 509578 307147 150270
$$ packed form
6168A144403l6338P241J5182J47714q500r4905L19026M7734K65896L34192J43574
6157B285219J25516j66066o09676r5358j82191j42815J32976r599j465J2826J24222
6146A473589J5278J20536O2385l7902L54667J73204k54453l71014l05195j73804
6136A057291L4116k20438k5082R8162j67638j96142p9272J10430k7242l2628N91
6125E52148Q4137q2948k14848n6759K14227M6801j40254p8034J66774J06493Q8856
6114F86593l4188j19053p9386o7555J79769M1234j59007O6379j3746K21272j32250
6103E90062j39896j6545j34774J95769J22678k73335N7440k08113Q681K21873
6093D23840j60218J12309J33759j48771j1156j19581K63860J5536k02431j56877
$$ plain form
6083 150270 179915 459907 537887 475423 481296 396249 414937 373417 422210 356942 486276
6072 486276 425710 134182 141715 146895 273004 376458 320875 179949 81312 246999 474503
6061 474503 360287 360838 619782 571313 601955 558165 453065 478612 546154 614721 635362
6050 635362 658906 374666 436419 555669 593312 594873 621944 564380 516852 549089 538315
6039 538315 476466 610093 483494 604219 487197 561440 727263 746701 649568 475333
6029 475333 375506 278386 428880 497003 429710 404361 550570 567891 442884 542590 662788
6018 662788 711438 792736 861575 884044 953779 634153 783618 715181 617118 621281 495339
6007 495339 576645 504180 441923 565137 596395 613327 711422 854931 980166 869173 639141
$$ packed form
6083A50270K9645K79992P7980o2464N873q5047J8688m1520M8793o5268J29334
6072D86276o0566k91528P533N180J26109J03454n5583j40926r8637J65687K27504
6061D74503j14216N51K58944m8469L0642m3790j05100K5547O7542O8567K0641
6050F35362K3544k84240O1753J19250L7643J561K7071n7564m7528L2237j0774
6039E38315o1849J33627j26599J20725j17022P4243J65823J9438r7133j74235
6029D75333r9827r7120J50494O8123o7293k5349J46209J7321j25007R9706J20198
6018F62788M8650Q1298O8839K2469O9735l19626J49465o8437r8063M163j25942
6007D95339Q1306p2465o2257J23214L1258J6932R8095J43509J25235j10993k30032
$$ plain form
5996 639141 524171 406709 488820 878423 989712 822321 923064 1026372 939911 797394
5986 797394 941108 1173890 1036498 926862 960479 1001842 823138 771574 788211 620141
5976 620141 607990 759040 811528 983230 874665 845178 887943 1090235 1023580 1030088 799750
5965 799750 881079 869879 950111 887196 819361 950612 1003967 1130809 1106084 1236306 1257602
5954 1257602 1422246 1441842 1603219 1388495 1334948 1304653 1087274 992750 1056140 1261223
5944 1261223 1149068 1186896 1264747 1254561 1234913 1150437 1333439 1254008 1033464 1053634 1005943
5933 1005943 1173687 1258058 1147401 1152630 1090856 1189880 1127965 1039757 1305191 1457635 1607968
5922 1607968 1564520 1595207 1564295 1770520 1732034 1590167 1660726 1857847 1852635 1809760 1600519
$$ packed form
5996F39141j14970j17462Q2111L89603J11289j67391J00743J03308q6461j42517
5986G97394J43714K32782j37392j09636L3617M1363j78704n1564J6637j68070
5976F20141j2151J51050N2488J71702j08565k9487M2765K02292o6655O508k30338
5965G99750Q1329j1200Q0232o2915o7835J31251N3355J26842k4725J30222K1296
5954A257602J64644J9596J61377k14724n3547l0295k17379r4524O3390K05083
5944A261223j12155L7828P7851j0186j9648q4476J83002p9431k20544K0170m7691
5933A005943J67744Q4371j10657N229o1774R9024o1915q8208K65434J52444J50333
5922A607968m3448L0687l0912K06225l8486j41867P0559J97121n212m2875k09241
$$ plain form
5911 1600519 1534241 1657608 1576053 1535181 1294307 1448398 1444127 1597154 1575858 1611446 1504043
5900 1504043 1573648 1684431 1534671 1613670 1602545 1861606 2052303 1955582 1859971 2053842
5890 2053842 2185588 2220169 2211168 2081035 2134974 2124693 2210649 2357000 2518698 2314512 2242890
5879 2242890 2337320 2384606 2123525 1879321 1881844 1753801 1789303 1908096 2086140 2031760 2236067
5868 2236067 2179213 2035694 2074916 2187303 2312745 2176836 2213822 2352923 2298210 2408031
5858 2408031 2520027 2678693 2695997 2422612 2642959 2747637 2664048 2698655 2594714 2589059
5848 2589059 2506199 2655685 2875651 2952500 3170823 3338203 3530102 3719512 3632252 3503165
5838 3503165 3464574 3284260 3069719 2913433 2787036 2794798 2782675 2849235 3005337 3297386
$$ packed form
5911A600519o6278J23367q1555m0872k40874J54091m271J53027k1296L5588j07403
5900A504043O9605J10783j49760P8999j1125K59061J90697r6721r5611J93871
5890B053842J31746L4581r001j30133N3939j0281Q5956J46351J61698k04186p1622
5879B242890R4430M7286k61081k44204K523j28043L5502J18793J78044n4380K04307
5868B236067n6854j43519L9222J12387J25442j35909L6986J39101n4713J09821
5858B408031J11996J58666J7304k73385K20347J04678q3589L4607j03941n655
5848B589059q2860J49486K19966P6849K18323J67380J91899J89410q7260j29087
5838C503165l8591j80314k14541j56286j26397P762j2123O6560J56102K92049
$$ plain form
5828 3297386 3307684 3299819 3060194 3098859 3240607 3131675 3039978 3278733 3676677 3770671 3754702
5817 3754702 3880819 4134403 4386219 4797343 5277460 5862051 6507818 7847600 8851716
5808 8851716 9493741 9116636 7629435 6280121 5281099 4696879 4361233 3993676 3869807
5799 3869807 3495808 3276972 3429944 3352581 3295451 3309428 3392769 3621534 3796308 3504045
5789 3504045 3274795 3414710 3343697 3386763 3578804 3714880 3782702 3669015 3543850 3228985
5779 3228985 3148525 2952598 2928569 2938087 2823033 2914531 2841639 2850467 2792748 2770423 2997110
5768 2997110 3027882 3237186 3346036 3236395 3259150 3419389 3536808 3614063 3794545 3836292
5758 3836292 4301115 4447203 4676498 4923811 5561223 6062463 6784465 7431080 8216270 9413177
$$ packed form
5828C297386J0298p865k39625L8665J41748j08932r1697K38755L97944R3994j5969
5817C754702J26117K53584K51816M11124M80117N84591O45767J339782J004116
5808H851716O42025l77105j487201j349314r99022n84220l35646l67557j23869
5799C869807l73999k18836J52972p7363n7130J3977Q3341K28765J74774k92263
5789C504045k29250J39915p1013M3066J92041J36076O7822j13687j25165l14865
5779C228985q0460j95927k4029R518j15054R1498p2892Q828n7719k2325K26687
5768B997110L0772K09304J08850j09641K2755J60239J17419P7255J80482M1747
5758C836292M64823J46088K29295K47313O37412N01240P22002O46615P85190J196907
$$ plain form
5748 9413177 10887150 12252793 12682884 11968776 10476565 9377421 8549723 7938922 7218500
5739 7218500 6910837 6500303 5830542 5469178 5115924 4784121 4394908 3887459 3525378 3461124
5729 3461124 3530192 3254568 2989469 2922685 2993714 2885774 2644963 2489684 2472351 2385137
5719 2385137 2477094 2362769 2217323 2355616 2415450 2375000 2349138 2163665 2116867 2116367 2234132
5708 2234132 2370027 2260020 2417381 2203838 1922772 1986286 1921529 2096750 1947327 1957943
5698 1957943 1949857 2096133 1925875 1893493 1911435 1831062 1858128 1937784 2005108 1958557 2004820
5687 2004820 1962017 1917267 1755464 1911627 2062707 1978475 1913130 1921944 1961386 1905303 2076423
5676 2076423 2141722 1997768 2145378 2123037 2073507 2067841 2052322 1798895 1860163 1985070 1981072
$$ packed form
5748I413177J473973J365643M30091p14108j492211j099144q27698o10801p20422
5739G218500l07663m10534o69761l61364l53254l31803l89213n07449l62081o4254
5729C461124O9068k75624k65099o6784P1029j07940k40811j55279j7333q7214
5719B385137R1957j14325j45446J38293N9834m0450k5862j85473m6798n00J17765
5708B234132J35895j10007J57361k13543k81066O3514o4757J75221j49423J0616
5698A957943q086J46276j70258l2382J7942q0373K7066P9656O7324m6551M6263
5687B004820m2803m4750j61803J56163J51080q4232o5345Q814L9442n6083J71120
5676B076423O5299j43954J47610k2341m9530n666j5519k53427O1268J24907l998
$$ plain form
5665 1981072 2120048 2164363 2291598 2409821 2351474 2484644 2420366 2306637 2283343 2346488
5655 2346488 2471252 2494693 2500166 2373726 2327286 2632361 2593484 2478541 2449388 2530165 2616307
5644 2616307 2516709 2385356 2496977 2627986 2531415 2604372 2447297 2477005 2606280 2664288
5634 2664288 2675073 2781811 2909569 3111477 2957293 2893053 3066240 2890279 2956977 3003351
5624 3003351 3156685 3176743 3201889 3407174 3568396 3513192 3431441 3533744 3600912 3592625 3638822
5613 3638822 3880108 3976915 3973811 4062277 4313601 4495455 4619501 4859772 5298405 5770723
5603 5770723 5928540 6090678 6383258 6671075 7310861 7889849 8143850 8194264 7688866 7456886
5593 7456886 7356747 7415682 7572852 7736999 7880716 7989630 8379710 8955198 9414625 9718750
$$ packed form
5665A981072J38976M4315J27235J18223n8347J33170o4278j13729k3294O3145
5655B346488J24764K3441N473j26440m6440L05075l8877j14943k9153Q0777Q6142
5644B616307r9598j31353J11621J31009r6571P2957j57075K9708J29275N8008
5634B664288J0785J06738J27758K01908j54184o4240J73187j75961O6698M6374
5624C003351J53334K0058K5146K05285J61222n5204q1751J02303O7168q287M6197
5613C638822K41286R6807l104Q8466K51324J81854J24046K40271M38633M72318
5603E770723J57817J62138K92580K87817O39786N78988K54001N0414n05398k31980
5593G456886j00139N8935J57170J64147J43717J08914L90080N75488M59427L04125
$$ plain form
5583 9718750 10284624 11089978 11605576 12368220 13342149 13753897 14036969 14376528 15028622 15897408
5573 15897408 16294600 16687398 17163142 17261191 16983526 16870104 17058646 17880374 19163145
5564 19163145 20838845 23029775 25236895 26716477 26125662 24398843 22865064 21968725
5556 21968725 21721087 21603081 21566173 21493126 21252683 21004038 20797088 20708614 21186733 21402484
5546 21402484 21435014 21308970 21165918 21307766 21460635 22030414 22485075 23246457 24081269 24679958
5536 24679958 24971064 25085489 24772810 24219313 23992898 24464319 24615316 24186356 23629115
5527 23629115 23204138 22879143 22903947 23164838 23847748 24774146 25572678 26523010 27563737
5518 27563737 28600974 30117191 31478682 32376658 33110568 33512062 33231663 31467874 28688053
$$ packed form
5583I718750N65874Q05354N15598P62644R73929M11748K83072L39559O52094Q68786
5573A5897408L97192L92798M75744R8049k77665j13422J88542Q21728J282771
5564A9163145J675700K190930K207120J479582n90815j726819j533779q96339
5556B1968725k47638j18006l6908p3047k40443k48645k06950q8474M78119K15751
5546B1402484L2530j26044j43052J41848J52869N69779M54661P61382Q34812N98689
5536B4679958K91106J14425l12679n53497k26415M71421J50997m28960n57241
5527B3629115m24977l24995K4804K60891O82910R26398P98532R50332J040727
5518B7563737J037237J516217J361491Q97976P33910M01494k80399j763789k779821
$$ plain form
5509 28688053 25835796 23428783 21403939 19777902 18752146 17936274 17179998 16629847 16040116
5500 16040116 15727783 15469284 15491187 15579544 15835189 16021815 15950183 15349653 14700107 13668249
5490 13668249 12535465 11851012 11172929 10696630 9929246 9451480 9136460 8789535 8697248
5481 8697248 8376778 8101408 7952818 7552865 7357371 7329625 7265197 6959173 6893805 6871658
5471 6871658 6738577 6734171 6627158 6562779 6552152 6559125 6714067 6621012 6703147 6880308 7173132
5460 7173132 7244683 7204821 7484361 7604785 7679544 7606358 7759648 7847913 8006843 8120146
5450 8120146 8141041 8170026 7907551 7635961 7288977 7034738 6837454 6603688 6522634 6241952
5440 6241952 6017945 5940374 5821923 5881966 5964815 5855042 5678210 5293837 5244599 5158634
$$ packed form
5509B8688053k852257k407013k024844j626037j025756q15872p56276n50151n89731
5500A6040116l12333k58499K1903Q8357K55645J86626p1632o00530o49546j031858
5490A3668249j132784o84453o78083m76299p67384m77766l15020l46925r2287
5481H697248l20470k75370j48590l99953j95494k7746o4428l06024o5368k2147
5471F871658j33081m406j07013o4379j0627O973J54942r3055Q2135J77161K92824
5460G173132P1551l9862K79540J20424P4759p3186J53290Q8265J58930J13303
5450H120146K0895K8985k62475k71590l46984k54239j97284k33766q1054k80682
5440F241952k24007p7571j18451O0043Q2849j09773j76832l84373m9238q5965
$$ plain form
5430 5158634 5327877 5227078 5208075 5175922 5184934 5262396 5286635 5392384 5175547 5010427 5310809
5419 5310809 5353107 5450848 5492523 5514918 5581181 5579627 5982916 6193873 6418034 6649182 6843075
5408 6843075 6800780 6617330 6535916 6760139 6637112 6483183 6686695 6872668 7107157 7221657
5398 7221657 7243150 7533144 7801596 7935466 8249457 8589184 9159690 9505055 9512691 9235136
5388 9235136 8988611 8837460 8555435 8528684 8492689 8545526 8551888 8505088 8660387 8904786 8701174
5377 8701174 8987961 9160821 9292215 9587691 10242787 10582546 10859276 11266932 11731194 12314475
5367 12314475 12496329 12356872 12561880 12850823 12932716 13208835 13166314 13242232 13357871 13831244
5357 13831244 14335274 14837934 15530083 16140549 17104535 18178128 19319263 20665567 22357387
$$ packed form
5430E158634J69243j00799j9003l2153R012P7462K4239J05749k16837j65120L00382
5419E310809M2298R7741M1675K2395O6263j554M03289K10957K24161K31148J93893
5408F843075m2295j83450q1414K24223j23027j53929K03512J85973K34489J14500
5398G221657K1493K89994K68452J33870L13991L39727N70506L45365P636k77555
5388I235136k46525j51151k82025k6751l5995N2837O362m6800J55299K44399k03612
5377H701174K86787J72860J31394K95476O55096L39759K76730M07656M64262N83281
5367A2314475J81854j39457K05008K88943Q1893K76119m2521P5918J15639M73373
5357A3831244N04030N02660O92149O10466R63986J073593J141135J346304J691820
$$ plain form
5348 22357387 24278844 26601532 29448307 33133191 37593451 42957662 49348720 55550145
5340 55550145 59092699 58965017 57096086 56323708 57213423 57786020 55892182 50429716 43983670
5331 43983670 38513150 34656257 31904320 30138611 29367132 29118964 29004648 29391902 30343514
5322 30343514 31967944 34183838 37263596 41241217 44756260 45961986 43903407 40483545
5314 40483545 37247701 35569756 35117555 35998362 38028034 40370357 41194722 38852433 33830583
5305 33830583 28611302 24658598 21627261 19471926 17495392 16214652 15372229 14271823
5297 14271823 13355738 12834979 12372743 11852615 11591909 11384038 10946077 10848128 10999921 11357377
5287 11357377 11471192 11466508 11426320 11075230 10557499 9868124 9268759 8823805 8410382 8035301
$$ packed form
5348B2357387J921457K322688K846775L684884M460260N364211O391058O201425
5340E5550145L542554j27682j868931p72378Q89715N72597j893838n462466o446046
5331D3983670n470520l856893k751937j765709p71479k48168j14316L87254R51612
5322C0343514J624430K215894L079758L977621L515043J205726k058579l419862
5314D0483545l235844j677945m52201Q80807K029672K342323Q24365k342289n021850
5305C3830583n219281l952704l031337k155335j976534j280740q42423j100406
5297A4271823r16085n20759m62236n20128k60706k07871m37961r7949J51793L57456
5287A1357377J13815m684m0188l51090n17731o89375n99365m44954m13423l75081
$$ plain form
5277 8035301 7736121 7620316 7559402 7284940 7255803 7338563 7190721 7263792 7250153 7077802
5267 7077802 6937227 6937165 6981609 7156704 7290948 7341103 7566210 7980252 8245200 8172480 7825475
5256 7825475 7615439 7300673 7056081 6732884 6607512 6416146 6392386 6348924 6281475 5929040
5246 5929040 5813223 6084191 6214658 6388627 6444280 6866594 6799746 6400952 6113885 5969375
5236 5969375 5424501 4991082 4673676 4645895 4445929 4138924 3979246 3861431 3792639 3935994
5226 3935994 3950049 3685714 3696319 3684919 3972557 3825204 3559370 3498129 3191308 3155489
5216 3155489 3362030 3207838 3160563 3292518 3288573 3343830 3279452 3166905 3204834 3151020 3124675
5205 3124675 3231308 3315933 3371609 3307511 3345183 3263183 3476634 3631606 3499456 3475193 3512350
$$ packed form
5277H035301k99180j15805o0914k74462k9137Q2760j47842P3071j3639j72351
5267G077802j40575o2M4444J75095J34244N0155K25107M14042K64948p2720l47005
5256G825475k10036l14766k44592l23197j25372j91366k3760m3462o7449l52435
5246E929040j15817K70968J30467J73969N5653M22314o6848l98794k87067j44510
5236E969375n44874m33419l17406k7781j99966l07005j59678j17815o8792J43355
5226C935994J4055k64335J0605j1400K87638j47353k65834o1241l06821l5819
5216C155489K06541j54192m7275J31955l945N5257o4378j12547L7929n3814k6345
5205C124675J06633Q4625N5676o4098L7672q2000K13451J54972j32150k4263L7157
$$ plain form
5194 3512350 3520990 3348377 3399178 3481380 3259260 3483158 3782140 3724415 3641729 3737607 3661094
5183 3661094 3768925 3872897 3926260 3825380 3962832 4034481 3886335 3868628 3884214 4021290
5173 4021290 3814760 3967720 4095796 4226028 4117384 4055058 4140732 4220099 4344894 4469524
5163 4469524 4564950 4600759 4980429 5215411 5322846 5482509 5884633 6194473 6688096 6834057
5153 6834057 6847165 7001329 7325452 7563930 7479905 7826542 8273988 8619520 8731822 8760755
5143 8760755 8703501 8460923 8129398 7723424 7603350 7348897 7016663 6823292 6918895 6880894
5133 6880894 6613025 6494405 6598841 6628391 6704205 6592541 6727169 6752768 6791161 6803677
5123 6803677 6729986 6829794 6797695 6762712 6732806 6801793 6711969 6475619 6437830 6578842 6444677
$$ packed form
5194C512350Q640j72613N0801Q2202k22120K23898K98982n7725q2686R5878p6513
5183C661094J07831J03972N3363j00880J37452P1649j48146j7707J5586J37076
5173D021290k06530J52960J28076J30232j08644o2326Q5674P9367J24795J24630
5163D469524R5426L5809L79670K34982J07435J59663M02124L09840M93623J45961
5153F834057J3108J54164L24123K38478q4025L46637M47446L45532J12302K8933
5143H760755n7254k42578l31525m05974j20074k54453l32234j93371R5603l8001
5133F880894k67869j18620J04436K9550P5814j11664J34628K5599L8393J2516
5123F803677p3691R9808l2099l4983k9906O8987q9824k36350l7789J41012j34165
$$ plain form
5112 6444677 6448974 6285085 6365851 6399047 6232070 6220977 6158741 6152561 6302570 6235523 6444150
5101 6444150 6475911 6527054 6858298 7018706 7031847 6993996 6888990 6812235 6697103 6936096
5091 6936096 6773583 6947604 6910679 6948930 7023718 7086681 7229484 7442789 7643109 7897432
5081 7897432 8064426 8103934 7903782 8070185 8412172 8462465 8664888 8682577 8677839 8835825
5071 8835825 9310107 9453324 9746736 9896865 9916067 10407332 10782009 10991231 11461450 12155851
5061 12155851 12847602 13226610 13531351 13506750 13325818 12862473 12493095 12089059 11881852 11523525
5051 11523525 11563583 11688764 11534310 11286198 10995398 11052145 10742348 10512390 10550988 10697630
5041 10697630 10720930 10773006 10575730 10515864 10787730 10703098 11110760 11198362 11170217 11417968
$$ packed form
5112F444677M297j63889Q0766L3196j66977j1093o2236o180J50009o7047K08627
5101F444150L1761N1143L31244J60408J3141l7851j05006p6755j15132K38993
5091F936096j62513J74021l6925L8251P4788O2963J42803K13305K00320K54323
5081G897432J66994L9508k00152J66403L41987N0293K02423J7689m738J57986
5071H835825M74282J43217K93412J50129J9202M91265L74677K09222M70219O94401
5061A2155851O91751L79008L04741k4601j80932m63345l69378m04036k07207l58327
5051A1523525M0058J25181j54454k48112k90800N6747l09797k29958L8598J46642
5041A0697630K3300N2076j97276n9866K71866q4632M07662Q7602k8145K47751
$$ plain form
5031 11417968 11429841 11634468 11866735 11798999 12022082 12101063 12348832 12516510 12689120 12863832
5021 12863832 13255023 13553317 13412697 13293486 13346303 13521325 13542054 13683382 13963285 14099890
5011 14099890 14046763 14295628 14531126 14722060 14822035 15289336 15459744 15581892 15796398 16082363
5001 16082363 16597613 16742496 16949340 17130010 17324688 17452310 17779732 17971593 18105664
4992 18105664 18195770 18442922 19033877 19198727 19282295 19553295 19802846 20159677 20291909 20398015
4982 20398015 20941757 21216988 21206128 21450923 21827019 22106125 22131907 22141406 22349992 22462510
4972 22462510 22630931 22744862 22805149 22910689 22752176 22780037 23036941 23070212 23073427 23106516
4962 23106516 23134347 23138778 22999196 23080273 23037832 22947574 22902155 22813113 22549596 22488779 22530361
$$ packed form
5031A1417968J1873K04627K32267o7736K23083P8981K47769J67678J72610J74712
5021A2863832L91191K98294j40620j19211N2817J75022K0729J41328K79903J36605
5011A4099890n3127K48865K35498J90934R9975M67301J70408J22148K14506K85965
5001A6082363N15250J44883K06844J80670J94678J27622L27422J91861J34071
4992A8105664R0106K47152N90955J64850Q3568K71000K49551L56831J32232J06106
4982B0398015N43742K75231j0860K44795L76096K79106K5782R499K08586J12518
4972B2462510J68421J13931O0287J05540j58513K7861K56904L3271L215L3089
4962B3106516K7831M431j39582Q1077m2441r0258m5419q9042k63517o0817M1582
$$ plain form
4951 22530361 22395845 22324606 22115815 22179545 21934407 21805379 21557009 21409484 21328263 20982101
4941 20982101 20770404 20466337 20349620 20231991 20022492 19727355 19602059 19369074 19078523
4932 19078523 18955707 18586361 18407576 18227273 17887354 17483575 17299246 17100293 17125372 16647547
4922 16647547 16243677 16182460 15942828 15634781 15492949 15502442 15073897 14830164 14615088 14524134
4912 14524134 14396137 14252579 14000827 13589575 13506703 13251433 13089591 12765712 12597919 12478233
4902 12478233 12170147 12048246 11814533 11612931 11532231 11357599 11008951 10851728 10776285 10538173
4892 10538173 10503850 10336990 10331873 10128358 9854391 9674070 9590171 9598879 9506994 9288991 9128340
4881 9128340 9076989 9182731 9174776 8980037 8899815 8978225 8917789 8519952 8471031 8440039 8536214
$$ packed form
4951B2530361j34516p1239k08791O3730k45138j29028k48370j47525q1221l46162
4941B0982101k11697l04067j16717j17629k09499k95137j25296k32985k90551
4932A9078523j22816l69346j78785j80303l39919m03779j84329j98953K5079m77825
4922A6647547m03870o1217k39632l08047j41832R493m28545k43733k15076r0954
4912A4524134j27997j43558k51752m11252q2872k55270j61842l23879j67793j19686
4902A2478233l08086j21901k33713k01602q0700j74632l48648j57223p5443k38112
4892A0538173l4323j66860n117k03515k73967j80321q3899Q708r1885k18003j60651
4881I128340n1351J05742p955j94739q0222P8410o0436l97837m8921l0992R6175
$$ plain form
4870 8536214 8247290 8060025 8151394 8029122 7846439 7993534 7740876 7798330 7766196 7754463
4860 7754463 7871585 7904972 7775952 7893322 7790134 7614652 7706798 7511835 7418128 7477604
4850 7477604 7413285 7177898 7013061 7051566 7021237 6825003 6700067 6717420 6890498 6684826
4840 6684826 6577122 6356679 6265068 6227507 6226964 6230562 6319796 6283214 6222259 6253385 6298593 6302820
4828 6302820 6226868 6197729 6329736 6474597 6235174 6283437 6382981 6280434 6103690 6077448
4818 6077448 5968985 5974596 6043433 5863983 5800735 5685469 5610024 5579220 5634855 5510244 5349615
4807 5349615 5362675 5567686 5614263 5572113 5399689 5170577 5352274 5282021 5179852 5290933
4797 5290933 5383781 5221662 5288354 5338088 5266147 5141181 5292019 5395080 5513580 5528461
$$ packed form
4870H536214k88924j87265R1369j22272j82683J47095k52658N7454l2134j1733
4860G754463J17122L3387j29020J17370j03188j75482R2146j94963r3707N9476
4850G477604o4319k35387j64837L8505l0329j96234j24936J7353J73078k05672
4840F684826j07704k20443r1611l7561n43L598Q9234l6582o0955L1126M5208M227
4828F302820p5952k9139J32007J44861k39423M8263R9544j02547j76744k6242
4818F077448j08463N611O8837j79450o3248j15266p5445l0804N5635j24611j60629
4807E349615J3060K05011M6577m2150j72424k29112J81697p0253j02169J11081
4797E290933R2848j62119O6692M9734p1941j24966J50838J03061J18500J4881
$$ plain form
4787 5528461 5612086 5702827 5821020 5684242 5497627 5622426 5643823 5841585 5758369 5888190
4777 5888190 5758343 5734506 5932492 6108089 6152745 6144029 6281375 6432114 6651021 6758348
4767 6758348 6721695 6823361 6996648 7073265 7228656 7584350 7824603 8180911 8202276 8498808
4757 8498808 8958275 9424162 10000742 10486301 11384523 12557167 13625289 14975053 16233424
4748 16233424 17817289 19028265 18791201 17240572 15715091 14536940 13781284 13354305 12911295
4739 12911295 12814748 12823244 13266576 13703702 13989729 14867224 15826494 16635791 18060959 19745970
4729 19745970 20705911 20380450 18896563 16904045 15238932 14071309 13175031 12576467 12064380
4720 12064380 11581807 11277430 11308525 11390962 11406224 11359962 11282700 11487248 11668803 11930954
$$ packed form
4787E528461Q3625R0741J18193j36778j86615J24799K1397J97762q3216J29821
4777E888190j29847k3837J97986J75597M4656q716J37346J50739K18907J07327
4767F758348l6653J01666J73287P6617J55391L55694K40253L56308K1365K96532
4757H498808M59467M65887N76580M85559Q98222J172644J068122J349764J258371
4748A6233424J583865J210976k37064j550629j525481j178151p55656m26979m43010
4739A2911295r6547Q496M43332M37126K86027Q77495R59270Q09297J425168J685011
4729A9745970R59941l25461j483887j992518j665113j167623q96278n98564n12087
4720A2064380m82573l04377L1095Q2437J5262m6262p7262K04548J81555K62151
$$ plain form
4710 11930954 11988926 12349594 12468511 12844335 13224763 13556482 14243766 14758639 15270056 15918618
4700 15918618 16745348 17618691 18432807 19774683 21566827 23748277 26562379 29244075 31284729
4691 31284729 31381464 29167120 26316514 23740412 22036871 20684923 20028847 19584859 19220250
4682 19220250 19185277 19636836 20132832 20732784 21906605 23391474 25303849 27398109 28825761
4673 28825761 28686077 26287022 23454165 20874326 18386494 16582831 15110508 14188696
4665 14188696 13509565 12627112 12130480 11866131 11429090 11217383 11100845 10915776 10688331
4656 10688331 10492278 10298294 9889815 9619709 9583885 9444162 9392434 9104528 9057134 8999969
4646 8999969 8720063 8624917 8355516 8179872 8201829 8184119 8239543 8017009 7834458 7834149 7965811
$$ packed form
4710A1930954N7972L60668J18917L75824L80428L31719O87284N14873N11417O48562
4700A5918618Q26730Q73343Q14116J341876J792144K181450K814102K681696K040654
4691C1284729R6735k214344k850606k576102j703541j351948o56076m43988l64609
4682A9220250l4973M51559M95996N99952J173821J484869J912375K094260J427652
4673B8825761j39684k399055k832857k579839k487832j803663j472323r21812
4665A4188696o79131q82453m96632k64349m37041k11707j16538j85069k27445
4656A0688331j96053j93984m08479k70106l5824j39723n1728k87906m7394n7165
4646H999969k79906r5146k69401j75644K1957j7710N5424k22534j82551l09J31662
$$ plain form
4635 7965811 7773357 7673095 7665670 7878596 7849698 7926352 8125347 8318121 8329640 8360556 8413617
4624 8413617 8166936 8409064 8523161 8589016 8949685 9342544 9868986 10036344 10270153 10737706
4614 10737706 11470521 12054828 12689206 13195664 13415542 13514529 13472896 12906141 12388742 11814038
4604 11814038 11060547 10338101 9744653 9341373 8958027 8613690 8338253 8168700 7978097
4595 7978097 7725108 7434663 7495810 7591451 7469948 7420199 7466269 7493104 7540060 7700651 7762937
4584 7762937 7702087 7870249 7995347 7846334 7761180 7690391 7601515 7610447 7907155 8269638 8333111
4573 8333111 8550869 8872726 9140781 9230700 9689812 10134042 10770427 11337454 12082175 12909883
4563 12909883 13776065 15017558 16787848 18726391 21051723 23711614 25869184 25983295
$$ packed form
4635G965811j92454j00262p425K12926k8898P6654J98995J92774J1519L0916N3061
4624H413617k46681K42128J14097O5855L60669L92859N26442J67358K33809M67553
4614A0737706P32815N84307O34378N06458K19878R8987m1633n66755n17399n74704
4604A1814038p53491p22446n93448m03280l83346l44337k75437j69553j90603
4595G978097k52989k90445O1147R5641j21503m9749M6070K6835M6956J60591O2286
4584G762937o0850J68162J25098j49013q5154p0789q8876Q932K96708L62483O3473
4573H333111K17758L21857K68055Q9919M59112M44230O36385N67027P44721Q27708
4563A2909883Q66182J241493J770290J938543K325332K659891K157570J14111
$$ plain form
4555 25983295 24192257 21166294 18448547 16263551 14654711 13422625 12267924 11685849
4547 11685849 11085816 10592296 10423481 10213189 9932972 9887713 9752749 9797052 9934356 9930044
4537 9930044 9977009 10076288 10232234 10339553 10769100 11338414 11780755 12326051 13101937 14089587
4527 14089587 15011146 16596449 18240729 20169268 22542348 24602931 25648765 24783182
4519 24783182 22380473 19728844 17551834 15749610 14469890 13856949 13482604 13025345 12849375
4510 12849375 13014819 12965004 13133244 13650284 14226655 15307710 16494722 17820301 18940893
4501 18940893 19436291 18503217 16683490 15152059 13841238 13001808 11927849 11108256 10698373
4492 10698373 10552633 10402058 10225480 10213995 10144195 10166545 10456349 10581669 10808685 11137511
$$ packed form
4555B5983295j791038l025963k717747k184996j608840j232086j154701n82075
4547A1685849o00033m93520j68815k10292k80217m5259j34964M4303J37304m312
4537I930044M6965R9279J55946J07319M29547N69314M42341N45296P75886R87650
4527A4089587R21559J585303J644280J928539K373080K060583J045834q65583
4519B4783182k402709k651629k177010j802224j279720o12941l74345m57259j75970
4510A2849375J65444m9815J68240N17040N76371J081055J187012J325579J120592
4501A8940893M95398r33074j819727j531431j310821q39430j073959q19593m09883
4492A0698373j45740j50575j76578j1485o9800K2350K89804J25320K27016L28826
$$ plain form
4482 11137511 11242621 11480322 12143951 12316482 12039208 11734134 11520803 11551822 12007917 12384315
4472 12384315 12767135 13244885 13730198 14716556 15760770 17165890 17687261 17054549 15620938
4463 15620938 13725114 12148094 11001939 10166907 9490522 8814981 8674503 8568891 8264811
4454 8264811 7867831 7361738 7127022 6845379 6516387 6206281 6212692 6127286 5939456 5879433
4444 5879433 5781510 5625934 5382979 5239586 5361094 5296142 5322142 5263784 5194650 5016579
4434 5016579 4983951 5097260 5108546 5163414 5084021 4754832 4711485 4748106 4759460 4765182 4683174
4423 4683174 4607478 4627529 4521090 4380487 4300302 4374309 4501590 4392026 4386392 4471572 4576825
4412 4576825 4687414 4567552 4394127 4517600 4629601 4706952 4827887 5056280 5301735 5429559
$$ packed form
4482A1137511J05110K37701O63629J72531k77274l05074k13331L1019M56095L76398
4472A2384315L82820M77750M85313R86358J044214J405120N21371o32712j433611
4463A5620938j895824j577020j146155q35032o76385o75541j40478j05612l04080
4454H264811l96980n06093k34716k81643l28992l10106O411q5406j87830o0023
4444E879433r7923j55576k42955j43393J21508o4952K6000n8358o9134j78071
4434E016579l2628J13309J1286N4868p9393l29189m3347L6621J1354N722q2008
4423D683174p5696K0051j06439j40603q0185P4007J27281j09564n634Q5180J05253
4412D576825J10589j19862j73425J23473J12001P7351J20935K28393K45455J27824
$$ plain form
4402 5429559 5763198 6169188 6699662 7219087 7854123 8908291 9593103 10060164 10324161
4393 10324161 9814486 9081186 8220233 7170927 6729701 6118265 5664286 5278356 5043721
4384 5043721 5011296 4782125 4701101 4573404 4141754 3928931 3801727 3859368 3872582 3755029
4374 3755029 3644042 3470540 3482418 3619333 3481002 3503499 3345257 3456528 3478392 3460056
4364 3460056 3296051 3290303 3259398 3161261 3271770 3367735 3479731 3467663 3257933 2938175 2955574
4353 2955574 3001354 3191187 3187768 3243831 3254672 3138058 3042383 3145513 3247573 3155397 3101489
4342 3101489 3419163 3548979 3647765 3698178 3866596 4162587 4119385 4338494 4471904 4618946
4332 4618946 5008877 5036811 5101149 5357019 5693917 5948411 6160018 6480539 6832393 7245468
$$ packed form
4402E429559L33639M05990N30474N19425O35036J054168O84812M67061K63997
4393A0324161n09675p33300q60953j049306m41226o11436m53979l85930k34635
4384E043721l2425k29171q1024j27697m31650k12823j27204N7641J3214j17553
4374C755029j10987j73502J1878J36915j38331K2497j58242J11271K1864j8336
4364C460056j64005n748l0905r8137J10509R5965J11996j2068k09730l19758J7399
4353B955574M5780J89833l419N6063J0841j16614r5675J03130J02060r2176n3908
4342C101489L17674J29816R8786N0413J68418K95991m3202K19109J33410J47042
4332D618946L89931K7934O4338K55870L36898K54494K11607L20521L51854M13075
$$ plain form
4322 7245468 7564741 7963617 8447199 8919458 9620483 9926917 9927754 9568600 9016828 8392544
4312 8392544 8141299 7881521 7436970 7357979 7180339 7041414 7019596 6974202 7185533 7492725
4302 7492725 7867673 8038493 8414847 8693769 9315896 9992065 10202489 9958296 9565962 9062439
4292 9062439 8451859 7871808 7629772 7519694 7209276 7155928 6994442 6958233 6992988 6980200
4282 6980200 6879811 6701414 6574046 6503949 6228399 5964004 5860148 5654536 5276331 5204180
4272 5204180 5099996 5041676 4762932 4633353 4573916 4331422 4346518 4438005 4429128 4366377 4258526
4261 4258526 4205748 4195086 4343093 4299561 4335120 4224443 4122159 3988733 4180404 4345012
4251 4345012 4405675 4571729 4614258 4788589 4771473 4788138 4764276 4977300 5010558 5006940 5001322
$$ packed form
4322G245468L19273L98876M83582M72259P01025L06434Q37l59154n51772o24284
4312H392544k51245k59778m44551p8991j77640j38925k1818m5394K11331L07192
4302G492725L74948J70820L76354K78922O22127O76169K10424k44193l92334n03523
4292I062439o10580n80051k42036j10078l10418n3348j61486l6209L4755j2788
4282F980200j00389j78397j27368p0097k75550k64395j03856k05612l78205p2151
4272E204180j04184n8320k78744j29579n9437k42494J5096R1487q877o2751j07851
4261D258526n2778j0662J48007m3532L5559j10677j02284j33426J91671J64608
4251D345012O0663J66054M2529J74331j7116J6665k3862K13024L3258l618n618
$$ plain form
4240 5001322 5013422 5015174 5119955 4968520 4926638 4783580 4581379 4603699 4620800 4647787 4554212
4229 4554212 4632257 4621699 4684885 4720570 4837063 4812660 5104512 5303475 5256856 5478991 5642058
4218 5642058 5940086 6409372 7004904 7533994 8154485 8992609 9747711 10664110 11195975 11454897
4208 11454897 10981615 9876488 8792778 7732605 7120209 6529769 5995959 5596910 5325951
4199 5325951 4954456 4829201 4803560 4781565 4776227 4829334 4831272 4518482 4228366 4132909 4122393
4188 4122393 3989101 3925244 3899214 3832432 3688860 3733462 3845068 3624933 3570752 3676982
4178 3676982 3691645 3542915 3491592 3351579 3252188 3379569 3407237 3417163 3538153 3629497 3745740
4167 3745740 3742973 3658825 3663055 3437945 3455731 3629103 3441016 3459882 3332912 3249330 3067523
$$ packed form
4240E001322J2100J752J04781j51435m1882j43058k02201K2320J7101K6987r3575
4229D554212P8045j0558O3186L5685J16493k4403K91852J98963m6619K22135J63067
4218E642058K98028M69286N95532N29090O20491Q38124P55102R16399N31865K58922
4208A1454897m73282j105127j083710j060173o12396n90440n33810l99049k70959
4199E325951l71495j25255k5641k1995n338N3107J938l12790k90116r5457j0516
4188D122393j33292o3857k6030o6782j43572M4602J11606k20135n4181J06230
4178C676982J4663j48730n1323j40013r9391J27381K7668R926J20990R1344J16243
4167C745740k767q4148M230k25110J7786J73372j88087J8866j26970q3582j81807
$$ plain form
4156 3067523 3001090 3053076 3076223 3109282 3114969 3137471 3012594 2939404 3087177 3061298 3022509
4145 3022509 2996509 3058812 3496069 3621804 3495615 3532511 3544943 3524894 3590245 3789234 3708704
4134 3708704 3650583 3690618 3529726 3385397 3300784 3329914 3368366 3318399 3083097 3148555 3133428
4123 3133428 3179097 3244134 3129796 3044297 3132670 3204304 3276628 3393337 3369029 3166042 3285814
4112 3285814 3310663 3468824 3312800 3397361 3283431 3402563 3811851 4007233 3973564 4053247
4102 4053247 3885573 3932486 4143635 4282830 4513055 4464689 4644674 4902226 5025149 5145138
4092 5145138 5149630 5016859 5179735 5429657 5498484 5662057 5614772 5657058 5929233 6251794
4082 6251794 6232505 6222110 6591951 6844266 7010180 7075500 7129132 7292796 7356254 7557301
$$ packed form
4156C067523o6433N1986K3147L3059N687K2502j24877p3190J47773k5879l8789
4145C022509k6000O2303M37257J25735j26189L6896J2432k0049O5351J98989q0530
4134C708704n8121M0035j60892j44329q4613K9130L8452m9967k35302O5458j5127
4123C133428M5669O5037j14338q5499Q8373P1634P2324J16709k4308k02987J19772
4112C285814K4849J58161j56024Q4561j13930J19132M09288J95382l3669P9683
4102D053247j67674M6913K11149J39195K30225m8366J79985K57552J22923J19989
4092E145138M492j32771J62876K49922O8827J63573m7285M2286K72175L22561
4082F251794j9289j0395L69841K52315J65914O5320N3632J63664O3458K01047
$$ plain form
4072 7557301 7836504 8004209 8204177 8255424 8778637 8910253 9109868 9187452 9319874 9371929
4062 9371929 9711475 9803587 10058682 10283837 10181214 10449762 10731888 10870232 11105546 11470191
4052 11470191 11757790 11825694 12218288 12383535 12708179 13092583 13400704 13814837 14290757 14606975
4042 14606975 15057321 15667855 16500258 16965065 17474282 18380036 19062463 19790977 20748616
4033 20748616 21854641 22897206 23775854 24827790 25961798 27121528 28518483 29674811
4025 29674811 31083195 32598258 34162440 35596311 37039692 38676667 40074033 41707907
4017 41707907 43391260 45142635 46590215 48269149 50192104 51714021 53272182 54722472
4009 54722472 56220371 57693826 58885578 59782097 60460141 61254380 62485102 63301900 63838067
$$ packed form
4072G557301K79203J67705J99968N1247N23213J31616J99615P7584J32422N2055
4062I371929L39546R2112K55095K25155j02623K68548K82126J38344K35314L64645
4052A1470191K87599O7904L92594J65247L24644L84404L08121M14133M75920L16218
4042A4606975M50346O10534Q32403M64807N09217R05754O82427P28514R57639
4033B0748616J106025J042565Q78648J051936J134008J159730J396955J156328
4025B9674811J408384J515063J564182J433871J443381J636975J397366J633874
4017D1707907J683353J751375J447580J678934J922955J521917J558161J450290
4009E4722472J497899J473455J191752Q96519O78044P94239J230722Q16798N36167
$$ plain form
4000 63838067 64452588 65236667 65715132 65983104 66098983 66114411 65681989 65113626 64538410 64145980
3990 64145980 63321180 62156383 61121450 60198486 59237008 58006074 56795193 55609833 54065123
3981 54065123 52487121 50748269 49390242 47727504 45827017 44162871 42576341 40855384
3973 40855384 39174584 37542350 35862290 34262868 32791827 31562488 30130602 28695334
3965 28695334 27371902 26046251 24541363 23080424 21836184 20602325 19722406 18891320
3957 18891320 17727301 16828290 16090814 15455611 14744335 13939452 13161760 12793019 12119734
3948 12119734 11401431 10934513 10532647 10214062 9786064 9466244 9241982 9057893 8834431
3939 8834431 8501975 8293618 7931635 7552080 7454829 7509917 7245496 6902280 6740054 6465250
$$ packed form
4000F3838067O14521P84079M78465K67972J15879J5428m32422n68363n75216l92430
3990F4145980q24800j164797j034933r22964r61478j230934j210881j185360j544710
3981E4065123j578002j738852j358027j662738j900487j664146j586530j720957
3973D0855384j680800j632234j680060j599422j471041j229339j431886j435268
3965B8695334j323432j325651j504888j460939j244240j233859q79919q31086
3957A8891320j164019q99011p37476o35203p11276q04883p77692l68741o73285
3948A2119734p18303m66918m01866l18585m27998l19820k24262j84089k23462
3939H834431l32456k08357l61983l79555r7251N5088k64421l43216j62226k74804
$$ plain form
3929 6465250 6441960 6301279 6215667 6099349 6016844 5903194 5904104 5849509 5615445 5541402 5407368
3918 5407368 5429111 5288536 5061290 5017719 4774316 4824953 5074242 5151554 5246245 5118283
3908 5118283 4995950 5038778 5165358 5229621 5118308 4944377 5147193 5186906 5111602 5073699
3898 5073699 5220730 5329149 5129802 5186907 5087851 5377394 5728321 5738476 5797914 5904271
3888 5904271 6044883 6693490 6831446 6968594 7204343 7219328 7697794 8285516 8604981 8601699
3878 8601699 8809131 8853594 8959776 9021640 8797214 8950095 8849161 8827908 8930545 8880598
3868 8880598 8957981 8955065 8706300 8475727 8517647 8179947 8028869 7904933 7614162 7302991
3858 7302991 6985203 6550773 6438327 6152883 5960404 5532962 5201151 4980114 4817506 4488319
$$ packed form
3929F465250k3290j40681q5612j16318q2505j13650R10n4595k34064p4043j34034
3918E407368K1743j40575k27246m3571k43403N0637K49289P7312R4691j27962
3908E118283j22333M2828J26580O4263j11313j73931K02816L9713p5304l7903
3898E073699J47031J08419j99347N7105r9056K89543L50927J0155N9438J06357
3888E904271J40612O48607J37956J37148K35749J4985M78466N87722L19465l282
3878H601699K07432M4463J06182O1864k24426J52881j00934k1253J02637m9947
3868H880598P7383k916k48765k30573M1920l37700j51078j23936k90771l11171
3858G302991l17788m34430j12446k85444j92479m27442l31811k21037j62608l29187
$$ plain form
3848 4488319 4539585 4620683 4155368 3970900 3888680 3847522 3777388 3812843 3554157 3391571 3363468
3837 3363468 3360152 3280910 3263162 3327894 3341735 3215746 3092292 3293112 3329512 3204819 2958794
3826 2958794 3043995 3112272 3124611 3065365 3045987 3046299 2991902 3048785 3082983 3085901 3009897 2863421
3814 2863421 2999172 3211709 3135487 3008337 2842495 2840868 2607304 2726309 2893317 2799228
3804 2799228 2953022 2971242 3094715 3035620 3034531 3126080 3180215 3176768 3134255 3024583 3022219
3793 3022219 3202653 3077342 2875345 2918252 3037907 3068342 3151649 3259656 3333853 3485074
3783 3485074 3358868 3294839 3392795 3517439 3357004 3384590 3288911 3316459 3461153 3635534
3773 3635534 3769944 3670788 3997273 3936626 4018459 4120057 3993921 3984425 4179022 4265726 4243254
$$ packed form
3848D488319N1266Q1098m65315j84468q2220m1158p0134L5455k58686j62586k8103
3837C363468l316p9242j7748O4732J3841j25989j23454K00820L6400j24693k46025
3826B958794Q5201O8277J2339n9246j9378L12n4397N6883L4198K918p6004j46476
3814B863421J35751K12537p6222j27150j65842j627k33564J19005J67008r4089
3804B799228J53794J8220J23473n9095j089R1549N4135l447m2513j09672k364
3793C022219J80434j25311k01997M2907J19655L0435Q3307J08007P4197J51221
3783C485074j26206o4029R7956J24644j60435K7586r5679K7548J44694J74381
3773C635534J34410r9156L26485o0647Q1833J01598j26136r496J94597Q6704k2472
$$ plain form
3762 4243254 4111942 4157747 4173986 4482328 4531246 4612992 4762951 4693619 4559307 4513506 4466705
3751 4466705 4513148 4791518 4864551 4655550 4787453 4950377 5198102 5299479 5227243 5040375
3741 5040375 5125851 5382927 5654830 5507729 5687030 5922643 6006785 6131644 6279301 6551273
3731 6551273 6510097 6419443 6666523 6800974 6853108 6902729 6963130 7090940 7180246 7493738 7811811
3720 7811811 7916634 7883000 8025911 8345347 8608053 8749204 8884609 9307608 9491130 9650784
3710 9650784 9788381 9699544 9926040 10432983 10736394 11042715 11106514 11282756 11722566 11817287
3700 11817287 12185198 12422550 12720533 13232623 13659619 13792836 14379859 14887937 15205322
3691 15205322 15622770 16213081 16709768 17531870 18359285 18955321 19704341 20570531 21421161
$$ packed form
3762D243254j31312M5805J6239L08342M8918Q1746J49959o9332j34312m5801m6801
3751D466705M6443K78370P3033k09001J31903J62924K47725J01377p2236j86868
3741E040375Q5476K57076K71903j47101J79301K35613Q4142J24859J47657K71972
3731F551273m1176r0654K47080J34451N2134M9621O0401J27810Q9306L13492L18073
3720G811811J04823l3634J42911L19436K62706J41151J35405M22999J83522J59654
3710I650784J37597q8837K26496N06943L03411L06321O3799J76242M39810R4721
3700A1817287L67911K37352K97983N12090M26996J33217N87023N08078L17385
3691A5205322M17448N90311M96687Q22102Q27415N96036P49020Q66190Q50630
$$ plain form
3682 21421161 22494259 23434188 24454281 25358607 26183002 27128402 28278616 29209789 30181620
3673 30181620 31376831 32510477 33625804 34605819 35682447 36895256 38091652 39150346
3665 39150346 40279761 41309228 42108719 42842284 43644268 44542312 45153570 45770059 46209358
3656 46209358 46724428 47447612 48370995 49145361 49819151 50463088 51052445 51762002 52132166
3647 52132166 52361724 52823242 52996673 53172106 53730606 54427628 54868654 55511022 56269108
3638 56269108 57263585 58363275 59406834 60747136 62128647 63679426 65397076 67418441
3630 67418441 69452063 71843612 74744444 77499314 80828313 84547114 88319987 92247996
3622 92247996 96279837 100797522 105814298 110751260 115695135 121172064 127122629 133639847
$$ packed form
3682B1421161J073098R39929J020093R04326Q24395R45400J150214R31173R71831
3673C0181620J195211J133646J115327R80015J076628J212809J196396J058694
3665C9150346J129415J029467P99491P33565Q01984Q98044O11258O16489M39299
3656D6209358N15070P23184R23383P74366O73790O43937N89357P09557L70164
3647E2132166K29558M61518J73431J75433N58500O97022M41026O42368P58086
3638E6269108R94477J099690J043559J340302J381511J550779J717650K021365
3630F7418441K033622K391549K900832K754870L328999L718801L772873L928009
3622I2247996M031841M517685N016776M936962M943875N476929N950565O517218
$$ plain form
3614 133639847 140607943 148034190 155933767 164528731 173471122 182860168 193025677 203648531
3606 203648531 214350728 224910510 235188638 244589272 252587096 259545868 265181836 269195933
3598 269195933 271914611 273681482 274135456 274129954 273744627 272709098 271593675 269958043 267843584
3589 267843584 265479627 261984618 257569804 251812653 244852834 236584095 227119140 217283580
3581 217283580 207326535 197285698 187391106 177704895 168494745 159797719 151374015 143464540
3573 143464540 136018381 128951053 122422704 116179313 110489755 104943073 99911655 95168970
3565 95168970 90651863 86815641 82969078 78968737 75342336 71933244 68138497 64764948
3557 64764948 61856617 59035640 56418823 54057676 51990833 50292166 48774021 47312032
$$ packed form
3614A33639847O968096P426247P899577Q594964Q942391R389046J0165509J0622854
3606B03648531J0702197J0559782J0278128R400634P997824O958772N635968M014097
3598B69195933K718678J766871M53974n502l85327j035529j115423j635632k114459
3589B67843584k363957l495009m414814n757151o959819q268739r464955r835560
3581B17283580r957045j0040837r894592r686211r210150q697026q423704p909475
3573A43464540p446159p067328o528349o243391n689558n546682n031418m742685
3565I5168970m517107l836222l846563m000341l626401l409092l794747l373549
3557F4764948k908331k820977k616817k361147k066843j698667j518145j461989
$$ plain form
3549 47312032 46012699 45184950 44383795 43731888 43113955 42451411 41960650 41601050 41313204
3540 41313204 41011111 40544980 40241978 40020112 39354688 38876821 38363003 37919793 37393286
3531 37393286 37221869 37084930 36713048 36552900 36196015 35780369 35155688 34590325 33797567
3522 33797567 32988032 32124017 31249674 30316823 29430327 28316723 27198526 26458902 25582901
3513 25582901 24541400 23830990 23042974 22259401 21674548 20948899 20374052 19769310 18797569
3504 18797569 17887862 17488831 16771807 16078125 15522695 14842940 14271295 13868983 13269894
3495 13269894 12868697 12310019 11853812 11580867 11344286 10970622 10687125 10196800 9817478
3486 9817478 9541218 9332576 9204260 8868312 8481500 8243659 8010312 7936554 8075251 7758530
$$ packed form
3549D7312032j299333q27749q01155o51907o17933o62544m90761l59600k87846
3540D1313204l02093m66131l03002k21866o65424m77867n13818m43210n26507
3531C7393286j71417j36939l71882j60148l56885m15646o24681n65363p92758
3522C3797567q09535q64015q74343r32851q86496j113604j118197p39624q76001
3513B5582901j041501p10410p88016p83573n84853p25649n74847o04742r71741
3504A8797569r09707l99031p17024o93682n55430o79755n71645m02312n99089
3495A3269894m01197n58678m56207k72945k36581l73664k83497m90325l79322
3486I817478k76260k08642j28316l35948l86812k37841k33347p3758J38697l16721
$$ plain form
3476 7758530 7537887 7389024 7325775 7270235 7082498 6932055 6727970 6303111 6142460 6073418
3466 6073418 6199049 6056637 5905373 5752782 5691172 5379692 5219128 5230255 5131946 4950169
3456 4950169 5093472 5177474 5113649 5012982 5041666 4915516 4741721 4481868 4483566 4553515 4495956
3445 4495956 4382581 4320796 4233806 4137753 4021483 3766283 3827314 3797007 3867022 3852294 3627309
3434 3627309 3536006 3645139 3593285 3511341 3462090 3452573 3158807 3200134 3234541 3292617 3163237
3423 3163237 3150257 3190459 3037582 2939532 3023957 3064165 2915633 2990242 3044461 2963397 2878402
3412 2878402 3040124 3145937 3092074 2920773 2643889 2791379 2643289 2582125 2736890 2799473
3402 2799473 2727096 2605371 2540373 2490669 2694875 2712316 2667575 2539737 2694018 2866987
$$ packed form
3476G758530k20643j48863o3249n5540j87737j50443k04085m24859j60651o9042
3466F073418J25631j42412j51264j52591o1610l11480j60564J1127r8309j81777
3456D950169J43303Q4002o3825j00667K8684j26150j73795k59853J698O9949n7559
3445D495956j13375o1785q6990r6053j16270k55200O1031l0307P0015j4728k24985
3434C627309r1303J09133n1854q1944m9251r517k93766M1327L4407N8076j29380
3423C163237j2980M0202j52877r8050Q4425M0208j48532P4609N4219q1064q4995
3412B878402J61722J05813n3863j71301k76884J47490j48090o1164J54765O2583
3402B799473p2377j21725o4998m9704K04206J7441m4741j27838J54281J72969
$$ plain form
3392 2866987 2769084 2584632 2575427 2476484 2494742 2612452 2603858 2413244 2283528 2426074 2256042
3381 2256042 2273374 2420027 2258671 2230789 2027709 2088924 2223044 2260610 2119966 2083992
3371 2083992 2164211 2025725 2041008 2172858 2247760 2222176 2324127 2276192 2115070 2354568
3361 2354568 2372151 2259259 2382730 2450355 2240554 2193184 2222685 2008384 2088791 2258121
3351 2258121 2093101 2092351 2089635 2228877 2345870 2249802 2204950 2082143 2127726 2145606 2297689
3340 2297689 2323192 2461389 2478286 2312483 2252167 2435969 2537743 2618273 2673506 2795596
3330 2795596 2823739 2843831 2894710 2846529 2907771 3113743 3062858 2904477 2984770 3031211 2864036
3319 2864036 3166762 3309601 3130542 3277119 3396619 3496873 3777319 3630325 3780936 3821437
$$ packed form
3392B866987r7903j84452r205r8943J8258J17710q594j90614j29716J42546j70032
3381B256042J7332J46653j61356k7882k03080O1215J34120L7566j40644l5974
3371B083992Q0219j38486J5283J31850P4902k5584J01951m7935j61122K39498
3361B354568J7583j12892J23471O7625k09801m7370K9501k14301Q0407J69330
3351B258121j65020p50k716J39242J16993r6068m4852j22807M5583J7880J52083
3340B297689K5503J38197J6897j65803o0316J83802J01774Q0530N5233J22090
3330B795596K8143K0092N0879m8181O1242K05972n0885j58381Q0293M6441j67175
3319B864036L02726J42839j79059J46577J19500J00254K80446j46994J50611M0501
$$ plain form
3309 3821437 3942894 4098232 4121890 4125680 4092136 4208279 4307839 4312460 4395888 4329911 4138812
3298 4138812 4260717 4294074 4681049 4746500 4725014 4485274 4161238 4130937 4175668 4165457 4563916
3287 4563916 4448824 4248024 4170728 4105090 4125252 4048952 4335336 4357858 4349486 4338590 4229921
3276 4229921 4165600 4403738 4613751 4826990 4790912 4824959 4947399 4933491 4980772 5355102
3266 5355102 5518906 5469209 5696828 5787547 5766322 5704265 5823704 6121419 6223195 6314702
3256 6314702 6392164 6577096 6984617 7148496 7644844 7982802 8453821 8721302 9019444 9492441
3246 9492441 10101717 10399966 10642680 10924952 10994709 10652645 10372695 9992491 9682115 9448253
3236 9448253 9226703 9338596 9202890 9209750 8454398 7410689 6843006 6315297 5782587 5477209
$$ packed form
3309C821437J21457J55338K3658L790l3544J16143R9560M621Q3428o5977j91099
3298D138812J21905L3357L86975O5451k1486k39740l24036l0301M4731j0211L98459
3287D563916j15092k00800p7296o5638K0162p6300K86384K2522q372j0896j08669
3276D229921o4321K38138K10013K13239l6078L4047J22440j3908M7281L74330
3266E355102J63804m9697K27619R0719k1225o2057J19439K97715J01776R1507
3256F314702P7462J84932M07521J63879M96348L37958M71019K67481K98142M72997
3246I492441O09276K98249K42714K82272O9757l42064k79950l80204l10376k33862
3236I448253k21550J11893j35706O860p55352j043709n67683n27709n32710l05378
$$ plain form
3226 5477209 5233159 5045351 4617417 4352804 4405546 4186976 4075845 4107507 3953578 3914417
3216 3914417 3705630 3435919 3264244 3106119 2919400 3048302 3030861 3080789 3192823 2852200
3206 2852200 2745214 2798289 2773169 2730929 2455369 2304499 2404363 2380681 2391984 2231563 2221855
3195 2221855 2428724 2218501 1999388 2086942 2204683 2141929 2017012 2147104 2059447 1901888
3185 1901888 1960821 1840780 1859060 1844088 1660583 1897070 1891314 1660264 1463551 1533140 1660310
3174 1660310 1420525 1468811 1490559 1441409 1515714 1676718 1495985 1331611 1219692 1214395 1299884
3163 1299884 1230599 1477535 1321737 996836 1053620 1119042 925168 967542 914297 966629 1120063
3152 1120063 1021675 1094342 1005379 869007 1073702 1014563 1192572 1236393 1158417 1195327 918834
$$ packed form
3226E477209k44050j87808m27934k64613N2742k18570j11131L1662j53929l9161
3216C914417k08787k69711j71675j58125j86719J28902j7441M9928J12034l40623
3206B852200j06986N3075k5120m2240k75560j50870R9864k3682J1303j60421r708
3195B221855K06869k10223k19113Q7554J17741o2754j24917J30092q7657j57559
3185A901888N8933j20041J8280j4972j83505K36487n756k31050j96713O9589J27170
3174A660310k39785M8286K1748m9150P4305J61004j80733j64374j11919n297Q5489
3163A299884o9285K46936j55798l24901N6784O5422j93874M2374n3245N2332J53434
3152A120063r8388P2667q8963j36372K04695n9139J78009M3821p7976L6910k76493
$$ plain form
3141 918834 1000421 1166233 1242029 1264929 1112594 987376 907152 841525 956056 934910 1067598
3130 1067598 1006606 852910 889949 746555 904243 999246 813200 960757 1113612 882522
3120 882522 956730 904945 831659 625638 738775 927281 906426 889183 810537 857315 761712
3109 761712 693234 775050 799098 874365 845305 849890 789864 770332 803438 984587 1189265
3098 1189265 1211605 1345793 1165128 901724 991834 1061629 967683 883098 838687 1094350 938926
3087 938926 910171 632166 644989 841979 635812 599489 755936 792885 754342 701263 674133
3076 674133 631657 631005 650890 717875 511395 503823 570953 626908 574398 665272 508265 730320
3064 730320 730091 595647 722287 718715 680573 556633 743853 545573 528410 455103 524888
$$ packed form
3141I18834Q1587J65812P5796K2900j52335j25218q0224o5627J14531k1146J32688
3130A067598o0992j53696L7039j43394J57688R5003j86046J47557J52855k31090
3120H82522P4208n1785p3286k06021J13137J88506k0855j7243p8646M6778r5603
3109G61712o8478Q1816K4048P5267k9060M585o0026j9532L3106J81149K04678
3098A189265K2340J34188j80665k63404R0110O9795r3946q4585m4411K55663j55424
3087I38926k8755k78005J2823J96990k06167l6323J56447L6949l8543n3079k7130
3076F74133m2476o52J9885O6985k06480p572O7130N5955n2510R0874j57007K22055
3064G30320k29j34444J26640l572l8142j23940J87220j98280j7163p3307O9785
$$ plain form
3053 524888 431963 355820 502267 590548 791267 670538 640096 613323 562559 542139 677192
3042 677192 679086 688204 694859 756320 645947 575431 518529 366179 580074 731680 622700
3031 622700 527021 380411 543505 655870 294137 352740 554061 542877 511595 771400
3021 771400 840986 892681 958771 765194 727960 710673 679179 808639 1048412 1018483 978781
3010 978781 957283 1014976 1238713 1192373 1137601 1157738 1314157 1421223 1491697 1406506 1529758
2999 1529758 1259704 1219535 1299198 1437796 1549500 1541594 1256397 1254711 1301415 1271509 1167808
2988 1167808 1198860 1143894 1145538 1338828 1404422 1248246 1140673 1187222 1204038 1291677 1353948
2977 1353948 1259340 1416449 1598077 1668631 1866498 1752315 1622960 1797635 2051827 2093334
$$ packed form
3053E24888r2925p6143J46447Q8281K00719j20729l0442k6773n0764k0420J35053
3042F77192J894R118O655O1461j10373p0516n6902j52350K13895J51606j08980
3031F22700r5679j46610J63094J12365l61733N8603K01321j1184l1282K59805
3021G71400O9586N1695O6090j93577l7234j7287l1494J29460K39773k9929l9702
3010I78781k1498N7693K23737m6340n4772K0137J56419J07066P0474q5191J23252
2999A529758k70054m0169P9663J38598J11704p906k85197j686M6704k9906j03701
2988A167808L1052n4966J644J93290O5594j56176j07573M6549J6816Q7639O2271
2977A353948r4608J57109J81628P0554J97867j14183j29355J74675K54192M1507
$$ plain form
2967 2093334 2111180 2225576 2423583 2482328 2508732 2775273 2800949 2526596 2398391 2305564
2957 2305564 2231305 2177735 2018822 1897003 1957219 1852540 1532422 1358884 1314497 1384735
2947 1384735 1399329 1343414 1464067 1467126 1383113 1491651 1578110 1633115 1820453 1827566 1816316
2936 1816316 1864507 1942603 1815046 2002979 2068376 2311129 2593195 2648697 2587185 2423547
2926 2423547 2364414 2459766 2575402 2451271 2311037 2150952 2024202 1902834 1907882 2252539
2916 2252539 2030529 1944884 1992261 2079025 2120236 1870964 1972788 1994271 2149034 2232055 2341519
2905 2341519 2397823 2472755 2408787 2262848 2140277 2095926 2161183 2143267 1906485 1726193 1781962
2894 1781962 1598777 1678877 1500625 1511104 1546030 1553323 1498595 1698286 1775923 1714635 1620850
$$ packed form
2967B093334J7846J14396J98007N8745K6404K66541K5676k74353j28205r2827
2957B305564p4259n3570j58913j21819O0216j04679l20118j73538m4387P0238
2947A384735J4594n5915J20653L059q4013J08538Q6459N5005J87338P113j1250
2936A816316M8191P8096j27557J87933O5397K42753K82066N5502o1512j63638
2926B423547n9133R5352J15636j24131j40234j60085j26750j21368N048L44657
2916B252539k22010q5645M7377Q6764M1211k49272J01824K1483J54763Q3021J09464
2905B341519N6304P4932o3968j45939j22571m4351O5257j7916k36782j80292N5769
2894A781962j83185Q0100j78252J0479L4926P293n4728J99691P7637o1288r3785
$$ plain form
2883 1620850 1679481 1770219 1720677 1796730 1813380 1841271 1711935 1944986 2023374 1866400 1825287
2872 1825287 1650985 1602149 1652067 1493001 1490343 1291131 1246915 1183434 1152607 1176461 1177562
2861 1177562 1271932 1246484 1288520 1378747 1367848 1268713 1088831 1223517 1171355 1294402 1346631
2850 1346631 1078849 1050974 1054590 1131036 1065256 939331 878946 730801 609171 628906 666555
2839 666555 459880 342030 527447 520825 619883 636714 542432 716264 685144 685636 599647
2828 599647 342248 542269 606669 555432 519815 519193 600072 575446 362494 463389 574607
2817 574607 614118 406504 385267 337478 269411 395626 383077 255736 274520 523121 685399
2806 685399 874399 610470 308167 543163 417922 308776 187238 278310 124019 181303
$$ packed form
2883A620850N8631R0738m9542P6053J6650K7891j29336K33051P8388j56974m1113
2872A825287j74302m8836M9918j59066k658j99212m4216o3481l0827K3854J101
2861A177562R4370k5448M2036R0227j0899r9135j79882J34686n2162J23047N2229
2850A346631k67782k7875L616P6446o5780j25925o0385j48145j21630J9735L7649
2839F66555k06675j17850J85417o622R9058J6831r4282J73832l1120M92q5989
2828E99647k57399K00021O4400n1237l5617o22Q0879k4626k12952J00895J11218
2817E74607L9511k07614k1237m7789o8067J26215j2549j27341J8784K48601J62278
2806F85399J89000k63929l02303K34996j25241j09146j21538R1072j54291N7284
$$ plain form
2796 181303 303972 255954 340286 300333 196869 163453 243543 23845 -6815 -144236 69508
2785 69508 309435 291415 330622 368289 177877 -12262 -130487 102144 58422 133800 67070
2774 67070 202699 187732 11785 -136773 18618 369113 386686 347812 88276 -93594
2764 -93594 50855 267134 96799 47693 4048 -48460 32463 131317 160005 -260007 -123830
2753 -123830 44784 202250 352105 420136 324271 87990 137256 301292 128007 76118
2743 76118 118810 183719 109672 -11354 102932 203278 70096 -10975 37298 -59371 19914
2732 19914 -60133 -18441 62454 145283 208265 9136 1100 -31976 193820 279176 16469
2721 16469 -158883 -171609 -92669 -107874 10398 -112089 -21746 87412 29807 -152903 -251990
$$ packed form
2796A81303J22669m8018Q4332l9953j03464l3416Q0090k19698l0660j37421K13744
2785F9508K39927j8020L9207L7667j90412j90139j18225K32631m3722P5378o6730
2774F7070J35629j4967j75947j48558J55391L50495J7573l8874k59536j81870
2764i3594J44449K16279j70335m9106m3645n2508Q0923R8854K8688m20012J36177
2753a23830J68614J57466J49855O8031r5865k36281M9266J64036j73285n1889
2743G6118M2692O4909p4047j21026J14286J00346j33182q1071M8273r6669P9285
2732A9914q0047M1692Q0895Q2829O2982j99129q036l3076K25796Q5356k62707
2721A6469j75352j2726P8940j5205J18272j22487R0343J09158n7605j82710r9087
$$ plain form
2710 -251990 -247310 -65263 -99920 57906 7223 -64068 21541 101578 16719 -14211 98850
2699 98850 300635 329558 432484 268844 -50281 8193 -92388 5410 169927 149267 -62789
2688 -62789 138397 -22492 -304422 -157336 -9073 85696 -19855 -57838 40992 118179 -157404
2677 -157404 -71153 -91000 -39498 198358 199377 78676 177961 158861 78985 -100817 -34142
2666 -34142 67204 90526 53759 110547 187651 222669 222157 209681 367638 247147 106987
2655 106987 10851 48997 18816 142961 232426 254683 274759 153107 81564 167384 366371
2644 366371 548875 315295 179290 233688 180962 160077 185399 63187 -48425 45136 208778
2633 208778 267701 421399 507614 408223 243322 444288 429378 447757 654492 498139 439467
$$ packed form
2710b51990M680J82047l4657J57826n0683p1291Q5609Q0037q4859l0930J13061
2699I8850K01785K8923J02926j63640l19125N8474j00581R7798J64517k0660k12056
2688f2789K01186j60889k81930J47086J48263R4769j05551l7983R8830P7187k75583
2677a57404Q6251j9847N1502K37856J019j20701R9285j9100p9876j79802O6675
2666c4142J01346K3322l6767N6788P7104L5018n12j2476J57957j20491j40160
2655A06987r6136L8146l0181J24145Q9465K2257K0076j21652p1543Q5820J98987
2644C66371J82504k33580j36005N4398n2726k0885K5322j22212j11612R3561J63642
2633B08778N8923J53698Q6215r9391j64901K00966j4910J8379K06735j56353n8672
$$ plain form
2622 439467 693477 663363 671786 503000 607331 688117 430281 567621 378249 286268 445970
2611 445970 557895 644743 710882 415121 246880 480821 315376 387193 450531 431312 449709
2600 449709 558635 672585 487399 430554 480576 522990 567020 515660 455686 460950 399980
2589 399980 601047 823216 717594 754696 804046 866552 845047 721227 641433 588398 511972
2578 511972 546476 467159 330490 426601 358041 513685 477024 527559 457689 373874 482078
2567 482078 512382 410069 399005 313967 271361 497161 599486 517851 528262 547779 572898
2556 572898 463844 279942 343233 386629 480636 508716 569415 778785 455286 485455 488649
2545 488649 550234 497530 236139 263475 513654 394802 378571 406196 314791 500915 384824
$$ packed form
2622D39467K54010l0114Q423j68786J04331Q0786k57836J37340j89372r1981J59702
2611D45970J11925Q6848O6139k95761j68241K33941j65445P1817O3338j9219J8397
2600D49709J08926J13950j85186n6845N0022M2414M4030n1360n9974N264o0970
2589C99980K01067K22169j05622L7102M9350O2506k1505j23820p9794n3035p6426
2578E11972L4504p9317j36669R6111o8560J55644l6661N0535o9870q3815J08204
2567D82078L0304j02313j1064q5038m2606K25800J02325q1635J0411J9517K5119
2556E72898j09054j83902O3291M3396R4007K8080O0699K09370l23499L0169L194
2545D88649O1585n2704k61391K7336K50179j18852j6231K7625r1405J86124j16091
$$ plain form
2534 384824 298124 206995 410379 538174 379897 145518 264196 228406 88724 37018
2524 37018 76052 76005 199325 280749 318707 262046 343644 302305 123698 143913 33708 113322
2512 113322 77549 74533 199195 334394 347244 136795 152144 136884 61073 120185 50959
2501 50959 -45337 134094 -41055 -155553 35816 82539 59830 11333 -79473 17375 119732
2490 119732 221736 234172 -9193 -171692 -33039 -13369 -78271 -64445 -33152 -117457 -255792
2479 -255792 -86043 139619 84062 94705 10833 -81347 -134993 -80212 -47629 52431 87989
2468 87989 -62540 -109270 -148680 -200305 -349062 -135912 16346 -215071 -101148 -32937 11376
2457 11376 -26844 -63795 14637 111178 21079 -189477 -84627 -122987 -178678 -153580 -182841
$$ packed form
2534C84824q6700r1129K03384J27795j58277k34379J18678l5790j39682n1706
2524C7018L9034m7J23320Q1424L7958n6661Q1598m1339j78607K0215j10205P9614
2512A13322l5773l016J24662J35199J2850k10449J5349j5260p5811N9112o9226
2501E0959r6296J79431j75149j14498J91369M6723k2709m8497r0806R6848J02357
2490A19732J02004J2436k43365j62499J38653J9670o4902J3826L1293q4305j38335
2479b55792J69749K25662n5557J0643q3872r2180n3646N4781L2583J00060L5558
2468H7989j50529m6730l9410n1625j48757K13150J52258k31417J13923O8211M4313
2457A1376l8220l6951P8432R6541r0099k10556J04850l8360n5691K5098k9261
$$ plain form
2446 -182841 -101609 -75155 -133992 -112009 -52708 -104965 12488 -67164 -180284 -104286 -132165
2435 -132165 -90501 -139549 -59048 -244194 -69561 -150030 -240270 -137001 -227233 -95248 -84252
2424 -84252 -235397 -70110 -119663 -187599 -126707 -163098 -57338 53941 6882 -11648 -166268
2413 -166268 -121366 -83100 -30327 41296 -148982 -123267 -59538 -150780 -180389 -169125 -114450
2402 -114450 60642 20586 -9136 -6478 -41017 -72811 28929 131670 37846 -7507 -225754
2391 -225754 -345030 -227935 9152 -60056 -41782 69172 55880 115809 83700 49650 155970
2380 155970 72931 29109 179659 371221 366177 337465 316363 395928 553843 585451 499401
2369 499401 375852 291792 270002 287748 139512 32519 121294 -65205 147607 180436 -21688
$$ packed form
2446a82841Q1232K6454n8837K1983N9301n2257J17453p9652j13120P5998k7879
2435a32165M1664m9048Q0501j85146J74633q0469r0240J03269r0232J31985J0996
2424h4252j51145J65287m9553o7936O0892l6391J05760J11279m7059j8530j54620
2413a66268M4902L8266N2773P1623j90278K5715O3729r1242k9609J1264N4675
2402a14450J75092m0056k9722K658l4539l1794J01740J02741r3824m5353k18247
2391b25754j19276J17095K37087o9208J8274J10954j3292N9929l2109l4050J06320
2380A55970q3039m3822J50550J91562n044k8712k1102P9565J57915L1608q6050
2369D99401j23549q4060k1790J7746j48236j06993Q8775j86499K12812L2829k02124
$$ plain form
2358 -21688 -50728 49280 159890 41911 -49779 -90132 108732 -21089 62160 191185 111372
2347 111372 -63311 -44097 41895 -38097 59332 -113257 -159868 -120092 -259251 -4990 2784
2336 2784 144358 -5224 41043 143157 21019 -92031 -53239 186305 94780 -9837 -132532
2325 -132532 -184097 41401 120235 -56269 -206535 23301 47244 -26188 106222 122335 88368
2314 88368 -88776 41480 193264 131360 47865 36001 69071 126074 -26269 19450 103482
2303 103482 140098 193116 280838 239589 57008 -91902 6883 220481 243019 98492 -168704
2292 -168704 88021 97206 58765 -107691 -106104 -80561 -33772 -93684 77013 92061 235845
2281 235845 483076 472506 316650 185389 123710 186846 265588 170134 185338 156313 174722
$$ packed form
2358b1688k9040J00008J10610j17979r1690m0353J98864j29821Q3249J29025p9813
2347A11372j74683J9214Q5992p9992R7429j72589m6611L9776j39159K54261P774
2336B784J41574j49582M6267J02114j22138j13050L8792K39544r1525j04617j22695
2325a32532n1565K25498P8834j76504j50266K29836K3943p3432J32410J6113l3967
2314H8368j77144J30256J51784o1904q3495j1864L3070N7003j52343M5719Q4032
2303A03482L6616N3018Q7722m1249j82581j48910R8785K13598K2538j44527k67196
2292a68704K56725R185l8441j66456J587K5543M6789n9912J70697J5048J43784
2281B35845K47231j0570j55856j31261o1679O3136P8742r5454J5204k9025J8409
$$ plain form
2270 174722 222585 120889 239473 200978 298815 199512 294310 195739 136423 281227 219142
2259 219142 50349 -43044 93654 240552 285252 184000 116031 156615 48597 30711 223810
2248 223810 -22959 79832 70190 172925 138257 210304 423052 473151 478089 459574 176612
2237 176612 108722 129427 200208 268611 417809 565216 512672 342234 333172 274947 294543
2226 294543 133123 100473 278667 311567 247906 317456 268324 288741 360868 529547 389847
2215 389847 126840 168508 302650 465257 570109 469898 399474 423637 382461 398418 410517
2204 410517 342326 365320 501355 808076 810062 827392 826525 882355 873999 736563 722223 835910
2192 835910 787005 781338 956726 1107959 1122264 1004747 1064458 1126088 1210818 1376797 1466888
$$ packed form
2270A74722M7863j01696J18584l8495R7837r9303R4798r8571n9316J44804o2085
2259B19142j68793r3393J36698J46898M4700j01252o7969M0584j08018j7886J93099
2248B23810k46769J02791r642J02735l4668P2047K12748N0099M938j8515k82962
2237A76612o7890K0705P0781O8403J49198J47407n2544j70438r062n8225J9596
2226B94543j61420l2650J78194L2900o3661O9550m9132K0417P2127J68679j39700
2215C89847k63007M1668J34142J62607J04852j00211p0424K4163m1176J5957J2099
2204D10517o8191K2994J36035L06721J986J7330q67N5830q356j37436j4340J13687
2192H35910m8905n667J75388J51233J4305j17517N9711O1630Q4730J65979R0091
$$ plain form
2181 1466888 1330954 1399576 1467277 1518020 1475391 1531811 1769577 1827735 1629375 1526069 1678179
2170 1678179 1703677 1717333 1728540 1867625 1852115 1751218 1920118 2201332 2326426 2351573
2160 2351573 2554740 2450243 2398928 2560435 2462104 2454537 2462027 2605318 2840012 2902326 2938987
2149 2938987 2948482 3055896 3181179 3565796 3849889 4027144 4159616 4377082 4495007 4605953
2139 4605953 4884636 5170496 5536313 5617475 5825780 6165801 6348872 6730410 7252577 7623943
2129 7623943 8074187 8390147 9036349 9741645 10280320 10945329 11529336 12389829 13410479
2120 13410479 15031769 16442314 17397135 18134321 19382415 21319063 23762395 26416166
2112 26416166 29698817 33849456 39417709 46369987 55200787 66683716 83774895 104766322
$$ packed form
2181A466888j35934O8622O7701N0743m2629N6420K37766N8158j98360j03306J52110
2170A678179K5498J3656J1207J39085j5510j00897J68900K81214J25094K5147
2160B351573K03167j04497n1315J61507r8331p567P490J43291K34694O2314L6661
2149B938987R495J07414J25283L84617K84093J77255J32472K17466J17925J10946
2139D605953K78683K85860L65817Q1162K08305L40021J83071L81538N22167L71366
2129G623943M50244L15960O46202P05296N38675O65009N84007Q60493J020650
2120A3410479J621290J410545R54821P37186J248094J936648K443332K653771
2112B6416166L282651M150639N568253O952278Q830800J1482929J7091179K0991427
$$ plain form
2104 104766322 118247255 107732699 82380050 62150260 49410421 40846071 34400050
2097 34400050 29559581 25580267 22516811 20129603 18378200 17118021 16187144 15592043
2089 15592043 15268884 14027324 12607941 11699527 10809357 10052956 9407009 8813472 8342310
2080 8342310 8066380 7583754 7157561 6921472 6492723 6360623 5851868 5682285 5380133 5119890
2070 5119890 4852410 4775354 4658708 4446835 4165908 4121085 4225138 3920127 3593564 3532245
2060 3532245 3412435 3468838 3446430 3242391 3131216 2897855 2771093 2625689 2689891 2660272
2050 2660272 2435379 2463377 2286852 2260703 2318438 2118938 2165274 2239575 2006788 2079980 1978974
2039 1978974 2043542 1945248 1835393 1943013 1911564 1864090 1848986 1550772 1421525 1501438 1432169
$$ packed form
2104A04766322J3480933j0514556k5352649k0229790j2739839q564350o446021
2097C4400050m840469l979314l063456k387208j751403j260179r30877n95101
2089A5592043l23159j241560j419383r08414q90170p56401o45947n93537m71162
2080H342310k75930m82626m26193k36089m28749j32100n08755j69583l02152k60243
2070E119890k67480p7056j16646k11873k80927m4823J04053l05011l26563o1319
2060C532245j19810N6403k2408k04039j11175k33361j26762j45404O4202k9619
2050B660272k24893K7998j76525k6149N7735j99500M6336P4301k32787P3192j01006
2039A978974O4568r8294j09855J07620l1449m7474j5104k98214j29247P9913o9269
$$ plain form
2028 1432169 1289252 1017160 1169036 1058338 970156 1116659 1107658 973230 877605 994362
2018 994362 934944 1100296 1043985 939500 982961 923350 951645 776937 854246 928274 917526
2007 917526 929197 769829 625691 570026 683704 727111 569170 646847 554666 417207 265109
1996 265109 398872 427218 397035 618326 570140 386167 552582 615792 509692 287180
1986 287180 358700 423972 385582 572309 640069 673203 654304 632968 520880 490129 500806
1975 500806 487392 474647 604214 506780 545011 568816 515896 492209 245617 216390 364323
1964 364323 404702 154356 312939 302399 287233 156003 249718 368998 371778 465195 401668
1953 401668 388040 285614 363721 305858 272252 178545 253304 328742 377637 453935 425948
$$ packed form
2028A432169j42917k72092J51876j10698q8182J46503r001j34428r5625J16757
2018I94362n9418J65352n6311j04485M3461n9611K8295j74708P7309P4028j0748
2007I17526J1671j59368j44138n5665J13678M3407j57941P7677r2181j37459j52098
1996B65109J33763K8346l0183K21291m8186j83973J66415O3210j06100k22512
1986B87180P1520O5272l8390J86727O7760L3134j8899k1336j12088l0751J0677
1975E00806j3414j2745J29567r7434L8231K3805n2920k3687k46592k9227J47933
1964C64323M0379k50346J58583j0540j5166j31230R3715J19280K780R3417o3527
1953D01668j3628j02426P8107n7863l3606r3707P4759P5438M8895P6298k7987
$$ plain form
1942 425948 343001 305467 503900 413767 352846 396655 328787 346255 90923 256920 424888
1931 424888 88034 42449 49049 132345 326865 273740 160903 231739 50303 25423 220365
1920 220365 391390 125936 300859 300160 324562 386813 272049 216249 189123 244842 146204
1909 146204 84608 -142613 -5367 285779 258602 238078 216485 45008 21394 57585 423905
1898 423905 406969 210371 81340 164509 162758 159850 144307 269267 167453 -28230 -125869
1887 -125869 -81434 52300 205652 313103 335802 195484 25880 92279 164212 63522
1877 63522 -44380 -64569 -226 10043 183145 145996 -93978 -122147 -111694 112402 125790
1866 125790 136218 61869 101204 229655 139820 155312 172656 211859 298063 379748 27876
$$ packed form
1942D25948q2947l7534J98433r0133o0921M3809o7868J7468k55332J65997J67968
1931D24888l36854m5585O600Q3296J94520n3125j12837P0836j81436k4880J94942
1920B20365J71025k65454J74923o99K4402O2251j14764n5800k7126N5719r8638
1909A46204o1596k27221J37246K91146k7177k0524k1593j71477k3614L6191L66320
1898D23905j6936j96598j29031Q3169j751k908j5543J24960j01814j95683r7639
1887a25869M4435J33734J53352J07451K2699j40318j69604O6399P1933j00690
1877F3522j07902k0189O4343J0269J73102l7149k39974k8169J0453K24096J3388
1866A25790J0428p4349L9335J28451q9835J5492J7344L9203Q6204Q1685l51872
$$ plain form
1855 27876 50583 105099 219127 243214 115075 250602 312457 310321 287384 125825 210005
1844 210005 283952 200556 273301 336018 200588 211435 558045 482817 632398 761170 616686
1833 616686 402913 461752 377615 353557 196074 222101 223629 199629 203549 242521 69076
1822 69076 -57558 85777 238140 226257 219395 89990 -2558 -41642 -9014 42339 -11981
1811 -11981 41542 24389 154522 -12117 65004 -25019 -109742 -162982 -240075 71875 190026
1800 190026 50866 -118588 -131242 137866 304945 180551 124169 93393 65440 29514 11023
1789 11023 -62522 -106278 -83625 13227 -21776 105563 136049 135556 -28591 -64488 44191 55197
1777 55197 82836 -100787 -129416 -192476 -152279 -90798 -88981 -100640 -69101 3586 -130954 -72658
$$ packed form
1855B7876K2707N4516J14028K4087j28139J35527O1855k136k2937j61559Q4180
1844B10005P3947q3396P2745O2717j35430J0847L46610p5228J49581J28772j44484
1833F16686k13773N8839q4137k4058j57483K6027J528k4000L920L8972j73445
1822F9076j26634J43335J52363j1883o862j29405r2548l9084L2628N1353n4320
1811a1981N3523j7153J30133j66639P7121r0023q4723n3240p7093L11950J18151
1800A90026j39160j69454j2654K69108J67079j24394n6382l0776k7953l5926j8491
1789A1023p3545m3756K2653R6852l5003J27339L0486m93j64147l5897J08679J1006
1777E5197K7639j83623k8629o3060M0197O1481J817j1659L1539P2687j34540N8296
$$ plain form
1765 -72658 -128939 7695 -32190 -317240 -117070 39498 -105220 -54346 -111880 -17356 145889
1754 145889 62265 -185791 -110616 -50365 81689 166675 -97602 -194565 -108868 180911 -29669
1743 -29669 29904 63174 -279386 -213969 110949 -109908 6553 -78542 -111990 -48265 -111788
1732 -111788 -58312 -23642 -21577 -90081 20170 30041 102965 28541 19458 158669 40587 -66720
1720 -66720 -33881 26651 -31281 -199434 -238334 -271163 -270745 -138600 -24150 56105 12694 98497
1708 98497 101328 50095 91250 8751 75570 73217 73351 6781 -104401 71686 39049 7498
1696 7498 -167230 -89505 -104110 -109510 -116348 -66386 -28863 131510 260565 223583 179261 -43763
1684 -43763 68471 76122 -73923 144628 150468 -72482 -306537 -233899 -64876 67635 -484
$$ packed form
1765g2658n6281J36634l9885k85050K00170J56568j44718N0874n7534R4524J63245
1754A45889q3624k48056P5175O0251J32054Q4986k64277r6963Q5697K89779k10580
1743b9669N9573L3270l42560O5417L24918k20857J16461q5095l3448O3725o3523
1732a11788N3476L4670K065o8504J10251R871P2924p4424r083J39211j18082j07307
1720f6720L2839O0532n7932j68153l8900l2829M18J32145J14450Q0255m3411Q5803
1708I8497K831n1233M1155q2499O6819k353J34o6570j11182J76087l2637l1551
1696G498j74728P7725j4605n400o838M9962L7523J60373J29055l6982m4322k23024
1684d3763J12234P651j50045K18551N840k22950k34055P2638J69023J32511o8119
$$ plain form
1673 -484 -38291 -191223 -168435 126017 61230 -21489 10097 128211 83379 167768 7684
1662 7684 -45385 6318 93528 125014 18196 -50768 107061 8462 -202369 -121574 -193847
1651 -193847 -35026 116722 273305 57961 56908 245196 168674 59364 -225136 -117405
1641 -117405 -94101 -102424 -79906 -219616 -157993 -57096 63264 -39241 -2365 -132540 -276475
1630 -276475 -28002 97670 142072 -36422 -159103 -51898 221721 209237 155960 141340
1620 141340 194042 177969 244405 91716 168752 160723 95739 -31835 28515 29756 187273
1609 187273 229705 129545 -163690 -120090 53708 -86039 -198437 -141222 49089 -119317
1599 -119317 -75459 -17640 -197401 -178793 -247120 -198344 3218 -14980 -1382 -3915 88442
$$ packed form
1673d84l7807j52932K2788K94452o4787q2719L1586J18114m4832Q4389j60084
1662G684n3069N1703Q7210L1486j06818o8964J57829r8599k10831Q0795p2273
1651a93847J58821J51748J56583k15344j053J88288p6522j09310k84500J07731
1641a17405K3304q323K2518j39710O1623J00897J20360j02505L6876j30175j43935
1630b76475K48473J25672M4402j78494j22681J07205K73619j2484n3277j4620
1620A41340N2702j6073O6436j52689P7036q029o4984j27574O0350J241J57517
1609A87273M2432j00160k93235M3600J73798j39747j12398N7215J90311j68406
1599a19317M3858N7819j79761J8608o8327M8776K01562j8198J3598k533R2357
$$ plain form
1588 88442 18662 -179739 -97897 -42572 -125702 -142007 -211287 -92729 -89338 -62298 92246
1577 92246 113404 89044 67443 83361 -93169 11969 -90462 -219512 -302252 -291658 -122320
1566 -122320 -147238 -107405 -109898 -192793 -166225 -180215 -137725 -48217 -93549 -151319 -247488 -109589
1554 -109589 -81891 -205126 -133531 -8584 -66732 -176552 -134275 120433 -67199 -38291 108739
1543 108739 165930 -37126 -47678 134261 64786 -144116 -341688 -132131 -75419 -187279
1533 -187279 50302 -111077 -99012 -73789 87763 84422 -70021 -191895 -406239 -288459
1523 -288459 -117047 -115339 -135105 -178160 -271989 -12637 105422 -69198 -198003 -69268 95394
1512 95394 70221 197762 139904 21972 14366 -16277 -127456 -32878 141896 7101 -61173
$$ packed form
1588H8442o9780j98401Q1842N5325q3130j6305o9280J18558L391K7040J54544
1577I2246K1158k4360k1601J5918j76530J05138j02431j29050q2740J0594J69338
1566a22320k4918L9833k493q2895K6568j3990M2490Q9508m5332n7770r6169J37899
1554a09589K7698j23235P1595J24947n8148j09820M2277K54708j87632K8908J47030
1543A08739N7191k03056j0552J81939o9475k08902j97572K09557N6712j11860
1533a87279K37581j61379J2065K5223J61552l341j54443j21874k14344J17780
1523b88459J71412J708j9766m3055r3829K59352J18059j74620j28805J28735J64662
1512I5394k5173J27541n7858j17932p606l0643j11179R4578J74774j34795o8274
$$ plain form
1501 -61173 197140 334159 165604 -261 -194271 33165 -24025 18352 -83860 -96239
1491 -96239 16455 -192495 -87179 -69956 -9865 5887 36844 21932 -118399 -66329 -159109
1480 -159109 -285695 -246735 -93254 -66293 -86042 -91538 -6449 -84240 -198217 43665 -54356
1469 -54356 19584 115516 250390 285491 332403 229083 77047 148923 27981 -113752 -97753
1458 -97753 -38852 -137008 -97065 -177396 -143805 6649 -78408 -136229 -145084 51742 -128264
1447 -128264 -220152 -127693 -79479 -113970 -49168 -82090 -29616 -65991 90945 47903 -210930
1436 -210930 -124612 47588 116884 127557 286504 235504 160835 -1264 -32190 -19219 -129206
1425 -129206 -266447 -102284 123991 -4512 -232071 -72307 -37729 -71639 -165806 -283640
$$ packed form
1501f1173K58313J37019j68555j65865j94010K27436n7190M2377j02212j2379
1491i6239J12694k08950J05316J7223O0091J5752L0957j4912j40331N2070r2780
1480a59109j26586L8960J53481K6961j9749n496Q5089p7791j13977K41882r8021
1469e4356P3940R5932J34874L5101M6912j03320j52036P1876j20942j41733J5999
1458i7753N8901r8156L9943q0331L3591J50454q5057n7821q855J96826j80006
1447a28264r1888R2459M8214l4491O4802l2922N2474l6375J56936m3042k58833
1436b10930Q6318J72200O9296J0673J58947n1000p4669j62099l0926J2971j09987
1425a29206j37241J64163K26275j28503k27559J59764L4578l3910r4167j17834
$$ plain form
1415 -283640 -105825 59850 -86570 -132207 -173075 -52975 165157 47023 -7098 -76952
1405 -76952 -205581 -30745 18870 4977 -16269 -140586 -120858 -13875 -148071 22268 -70034
1394 -70034 -117946 73541 188625 137727 -28627 -214662 -177743 -64399 -112014 -52869 -96887
1383 -96887 -59856 -16853 -73760 -37577 -178299 -14970 99123 172589 18071 -203799 -88527
1372 -88527 76801 20916 92901 63447 -67688 92641 122251 85649 -9108 -161912 -56478
1361 -56478 -78762 -32367 175272 200942 137992 49668 -62421 -63840 -141236 -293145 -220162
1350 -220162 -99428 2817 -12291 30372 -68999 -258644 -133068 42551 210870 118132
1340 118132 -40612 -27357 26390 -76895 3961 8806 -44548 53380 42785 194129 123659
$$ packed form
1415b83640J77815J65675j46420m5637m0868J20100K18132j18134n4121o9854
1405g6952j28629J74836M9615j3893k1246j24317J9728J06983j34196J70339r2302
1394g0034m7912J91487J15084n0898j66354j86035L6919J13344m7615N9145m4018
1383i6887L7031M3003n6907L6183j40722J63329J14093P3466j54518k21870J15272
1372h8527J65328n5885P1985k9454j31135J60329K9610l6602r4757j52804J05434
1361e6478k2284M6395K07639K5670o2950q8324j12089j419p7396j51909P2983
1350b20162J20734J02245j5108M2663r9371j89645J25576J75619J68319r2738
1340A18132j58744J3255N3747j03285Q0856M845n3354R7928j0595J51344p0470
$$ plain form
1329 123659 61106 -8910 56055 7319 3585 -32458 -80620 -84901 -166050 -159913 -4528 -24278
1317 -24278 -135515 -127794 71097 -50453 -37583 -20877 -321569 -213052 -285811 -223677 -31001
1306 -31001 -34664 35384 170053 139286 -185878 -132173 -75112 -81343 -240030 -164277 -182490 -165561
1294 -165561 -224038 -56622 -153220 -75859 83423 -45764 -224930 -125150 32260 -197167
1284 -197167 6646 -17892 -23993 -125856 128712 562 -166370 -61644 -35730 5207 -102103
1273 -102103 -36411 -8444 54778 34057 -14319 -185304 57890 35971 -48156 -126175 -178826
1262 -178826 -69435 34354 -7009 -29642 139734 76813 -67358 63882 8163 46638 -185673
1251 -185673 -88062 -134817 -141921 21682 -132306 -77169 -55351 -55007 50868 145560 84528 84549
$$ packed form
1329A23659o2553p0016O4965m8736l734l6043m8162m281q1149O137J55385j9750
1317b4278j11237P721J98891j21550J2870J6706l00692J08517p2759O2134J92676
1306c1001l663P0048J34669l0767l25164N3705N7061o231j58687P5753j8213J6929
1294a65561n8477J67416r6598P7361J59282j29187j79166R9780J57410k29427
1284a97167K03813k4538o101j01863K54568j28150j66932J04726K5914M0937j07310
1273a02103O5692K7967O3222k0721m8376j70985K43194k1919q4127p8019n2651
1262a78826J09391J03789m1363k2633J69376o2921j44171J31240n5719L8475k32311
1251a85673R7611m6755p104J63603j53988N5137K1818L44J05875R4692o1032K1
$$ plain form
1239 84549 -61129 -68416 -29390 68922 57137 41932 -45695 -71428 113021 161262 -45614
1228 -45614 -194166 -214937 -96717 -184842 -110710 121003 87456 74054 -4341 -103320 -33227
1217 -33227 -142505 61048 121924 -117737 -51721 -6681 -92870 -5493 139643 107597 65789
1206 65789 -49211 -156528 -168029 -129458 -28502 -30377 58134 -71487 -219293 -305837 -118780
1195 -118780 94592 133360 153558 -19070 -187468 -350122 -311014 -131994 -174000 -15634
1185 -15634 -62149 -3459 -161185 -198888 27888 -135401 -98934 7051 -36710 -23228 17411
1174 17411 78717 94842 65963 44531 -42476 -40944 -128976 -383007 -270543 -78814 -149499
1163 -149499 -241752 -205978 36633 145115 -48535 54655 222871 273934 -12034 73756
$$ packed form
1239H4549j45678p287L9026R8312j1785j5205q7627k5733J84449M8241k06876
1228d5614j48552k0771J18220q8125P4132K31713l3547j3402p8395r8979P0093
1217c3227j09278K03553O0876k39661O6016M5040q6189Q7377J45136l2046m1808
1206F5789j15000j07317j1501L8571J00956j875Q8511j29621j47806q6544J87057
1195a18780K13372L8768K0198j72628j68398j62654L9108J79020m2006J58366
1185a5634m6515N8690j57726l7703K26776j63289L6467J05985m3761J3482M0639
1174A7411O1306J6125k8879k1432q7007J532q8032k54031J12464J91729p0685
1163a49499r2253L5774K42611J08482j93650J03190J68216N1063k85968Q5790
$$ plain form
1153 73756 92267 135659 119876 164822 22926 47858 -52675 126457 358254 198429 119317
1142 119317 -81635 -29137 -28318 53353 169824 128755 63408 19358 -40524 -9939 -222952
1131 -222952 -223802 -56209 68470 183402 68691 -28763 55862 14058 14385 -185450 -75500
1120 -75500 -47402 48791 17306 -70846 43771 -90937 -36179 -128576 -109862 -44501 -6285
1109 -6285 81105 -32620 19533 -52202 -144863 2696 125719 34188 33339 94037 -102796 -139789
1097 -139789 -159878 -210397 -110478 -170500 -49426 15017 94782 -69487 -212805 -269018 -243664
1086 -243664 -43244 99098 -103836 -71522 -33334 -6727 -92427 -6986 106821 -21520 -129108
1075 -129108 53463 82620 105125 196746 72948 -84256 -10645 15972 78072 119989 64222
$$ packed form
1153G3756J8511M3392j5783M4946j41896K4932j00533J79132K31797j59825p9112
1142A19317k00952N2498Q19Q1671J16471m1069o5347m4050n9882L0585k13013
1131b22952q50J67593J24679J14932j14711r7454Q4625m1804L27j99835J09950
1120g5500K8098R6193l1485q8152J14617j34708N4758r2397J8714O5361L8216
1109f285Q7390j13725N2153p1735r2661J47559J23023r1531q49O0698j96833l6993
1097a39789k0089n0519R9919o0022J21074O4443P9765j64269j43318n6213K5354
1086b43664K00420J42342k02934L2314L8188K6607q5700Q5441J13807j28341j07588
1075a29108J82571K9157K2505R1621j23798j57204P3611K6617O2100M1917n5767
$$ plain form
1064 64222 -60463 140104 121549 -171545 -210738 -27276 51719 95167 -33544 -61247 -98381
1053 -98381 -97663 -154126 -105225 15752 78607 51266 111887 185409 8198 -41871 -55808 -61512
1041 -61512 -212943 -135356 -158363 -231313 -262896 -107733 -95072 -45580 19723 49893 -144715
1030 -144715 -116145 -103348 14811 198297 330095 129055 -68893 -112028 -190434 59357
1020 59357 50392 -38753 -76864 -27037 41539 -166543 -63097 -179735 -99639 71256 70493 6562
1008 6562 40153 95984 -51546 -44038 -27307 -551 -72101 140328 44347 -65383 -1160 77071
996 77071 193067 99029 -39449 -41061 -2338 -165974 -194540 -97998 89780 151372 155544 -49029
984 -49029 -6503 -237582 -336349 148065 32577 -84390 -94877 -61488 42887 -13962 -90765
$$ packed form
1064F4222j24685K00567j8555k93094l9193J83462P8995M3448j28711k7703l7134
1053i8381P18n6463M8901J20977O2855k7341O0621P3522j77211n0069j3937n704
1041f1512j51431P7587k3007p2950l1583J55163J2661M9492O5303L0170j94608
1030a44715K8570J2797J18159J83486J31798k01040j97948m3135p8406K49791
1020E9357q965q9145l8111M9827O8576k08082J03446j16638Q0096J70895p63o3931
1008F562L3591N5831j47530P508J6731K6756p1550K12429r5981j09730O4223P8231
996G7071J15996r4038j38478j612L8723j63636k8566R6542J87778O1592M172k04573
984d9029M2526k31079r8767M84414j15488j16967j0487L3389J04375n6849p6803
$$ plain form
973 -90765 -252028 -242405 43043 52791 -125368 20353 53390 -73935 -157077 46142 25141
962 25141 -48303 13145 -19774 -19345 182275 56519 2800 -318921 -123202 30146 -67391
951 -67391 -203722 -114459 49518 148508 -73504 -14986 12135 23850 -60362 32156 160393
940 160393 42168 224109 -111864 -226616 -115608 -48867 -138051 6061 -7919 -147943
930 -147943 -196670 -105618 -41795 30699 39559 117747 66483 37451 66851 76561 -138634 -65890
918 -65890 88042 -89876 -171823 -92905 -101488 -59124 113242 257743 167998 42935 -10806
907 -10806 -18877 -93090 -60675 -71336 58810 6474 2001 70492 127048 -19014 -181977 -154014
895 -154014 -186224 -161973 -70343 64290 80762 4828 143135 145093 136412 86363 -8431 61394
$$ packed form
973i0765j61263R623K85448R748j78159J45721L3037j27325q3142K03219k1001
962B5141p3444O1448l2919M29K01620j25756n3719l21721J95719J53348r7537
951f7391j36331Q9263J63977R8990k22012N8518K7121J1715q4212R2518J28237
940A60393j18225J81941l35973j14752J11008O6741q9184J44112j3980j40024
930a47943m8727R1052O3823P2494Q860P8188n1264k9032K9400R710k15195P2744
918f5890J53932j77918q1947P8918q583M2364J72366J44501q9745j25063n3741
907a0806q071p4213L2415j0661J30146n2336m473O8491N6556j46062j62963K7963
895a54014l2210K4251R1630J34633J6472p5934J38307J958q681n0049r4794O9825
$$ plain form
883 61394 58614 -106190 -166780 59674 127212 139610 106275 74302 -146979 -71508 -1047 -161624
871 -161624 18145 -145236 -183424 -182435 -74338 -110877 80357 167586 106748 94385 -152262
860 -152262 -209056 67733 82410 -82355 40805 -15309 -13896 78008 35590 -14533 53238
849 53238 -23204 195095 158102 89372 28009 -46897 2732 -29589 10931 76443 -9175 950
837 950 -178273 -51311 199023 187308 156980 116144 -74340 -300849 -177273 56108 215959
826 215959 70197 211276 22110 -55582 -70375 -38735 -26035 -1360 17787 27481 -76063
815 -76063 -154976 -60885 -71452 -192405 392 -16956 -19292 118672 127685 56060 -116652 -191265
803 -191265 -264939 -171305 -130757 -256321 -58673 -70105 -216373 -208321 -253931 -51238 -29694
$$ packed form
883F1394k780j64804o0590K26454O7538J2398l3335l1973k21281P5471P0461j60577
871a61624J79769j63381l8188R89J08097l6539J91234Q7229o0838j2363k46647
860a52262n6794K76789J4677j64765J23160n6114J413R1904m2418n0123O7771
849E3238p6442K18299l6993o8730o1363p4906M9629l2321M0520O5512q5618J0125
837I50j79223J26962K50334j1715l0328m0836j90484k26509J23576K33381J59851
826B15959j45762J41079j89166p7692j4793L1640J2700K4675J9147R694j03544
815g6063p8913R4091j0567j20953J92797j7348k336J37964R013p1625j72712p4613
803a91265p3674R3634M0548j25564J97648j1432j46268Q052m5610K02693K1544
$$ plain form
792 -29694 -144755 -43652 -49804 -74489 -139721 -139414 37627 51387 143807 43587 175713 102659
780 102659 22977 -10805 72053 -135386 17829 -81921 -106732 -191068 -191420 -5859 52531 -169998
768 -169998 -274989 -254129 -194424 -4249 -104637 -177231 -216963 -216927 2642 102221 -52820
757 -52820 -263133 -118146 -24079 -143526 -57487 46583 180893 248998 -7700 -30298 138975
746 138975 72201 221455 145918 -24965 -79425 -51723 -49664 194895 226431 112745 -64827
735 -64827 -45558 -149038 -367976 -64108 -53194 -22471 -282 137897 117113 -77291 -36809
724 -36809 199306 138771 -103427 -230700 -58688 -19527 -13003 -188581 -15968 104663 -129073
713 -129073 -44261 187036 265921 294946 337234 7661 214071 168363 -112030 -129072 -175396
$$ packed form
792b9694j15061J01103o152k4685o5232L07J77041J3760R2420j00220J32126p3054
780A02659p9682l3782Q2858k07439J53215r9750k4811q4336l52J85561N8390k22529
768a69998j04991K0860N9705J90175j00388p2594l9732L6K19569R9579j55041
757e2820k10313J44987R4067j19447Q6039J04070J34310O8105k56698k2598J69273
746A38975o6774J49254p5537j70883n4460K7702K059K44559L1536j13686j77572
735f4827J9269j03480k18938L03868J0914L0723K2189J38179k0784j94404M0482
724c6809K36115o0535k42198j27273J72012L9161O524j75578J72613J20631k33736
713a29073Q4812K31297P8885K9025M2288l29573K06410m5708k80393j7042m6324
$$ plain form
702 -175396 -61413 -62351 -139380 -91738 -97889 -75077 -127707 -229537 -234107 -33681 -196960 -199392
690 -199392 -121962 133259 195304 -79892 -329867 -182875 -112679 -58067 -105393 27146 12396
679 12396 36632 -7752 56297 145570 21521 125688 39765 -96987 -100520 8509 50847
668 50847 118674 137945 225396 155573 84527 91341 54406 66516 122078 115701 11742 108354
656 108354 -46750 27893 3673 -48697 13526 -21847 143070 63654 -20897 -66931 -236137
645 -236137 -228701 -56417 -117617 -124486 -163735 -1990 37805 24482 -15908 -68135 -22486 -51629
633 -51629 -172631 -37598 -17191 -124609 -159463 -220857 170583 88417 -33961 -60258 -31897
622 -31897 -56303 -214522 -37760 59350 48926 -1095 134831 158520 164023 77711 -71696
$$ packed form
702a75396J13983r38p7029M7642o151K2812n2630j01830m570K00426j63279k432
690a99392P7430K55221O2045k75196k49975J46992P0196N4612m7326J32539j4750
679A2396K4236m4384O4049Q9273j24049J04167q5923j36752l533J09029M2338
668E0847O7827J9271Q7451o9823p1046O814l6935J2110N5562o377j03959R6612
656A08354j55104P4643k4220n2370O2223l5373J64917p9416q4551m6034j69206
645b36137P436J72284o1200o869l9249J61745L9795j3323m0390n2227M5649k9143
633e1629j21002J35033K0407j07418l4854o1394L91440q2166j22378k6297K8361
622c1897k4406j58219J76762R7110j0424n0021J35926K3689N503q6312j49407
$$ plain form
611 -71696 -88293 -143824 -267566 -191877 -136914 -74469 -71915 -2101 83004 54213 74052 107199
599 107199 142606 -1423 141266 112782 -1018 3326 131076 60225 83531 -167368 -101921
588 -101921 20354 -842 -91187 -96557 -26090 -139954 -5036 -20107 94301 171503 31789
577 31789 60626 227852 -87152 118279 142051 -37261 -34899 40444 -30622 83927 132121
566 132121 111699 122553 57742 128266 79928 76263 62415 167581 219058 188783 216445 170566
554 170566 203015 -12159 -6353 -56904 -12111 86770 39393 104072 93961 288169 289885 57303
542 57303 -34206 -146444 -191304 47228 298183 159459 30112 68833 -43292 131022 64896
531 64896 185798 26501 -177334 6557 -48753 -33849 42336 172601 11564 -48551 -131679
$$ packed form
611g1696j6597n5531j23742P5689N4963O2445K554O9814Q5105k8791J9839L3147
599A07199L5407j44029J42689k8484j13800M344J27750p0851K3306k50899O5447
588a01921J22275k1196r0345n370P0467j13864J34918j5071J14408P7202j39714
577C1789K8837J67226l15004K05431K3772j79312K362P5343p1066J14549M8194
566A32121k0422J0854o4811P0524m8338l665j3848J05166N1477l0275K7662m5879
554A70566L2449k15174N806n0551M4793R8881m7377O4679j0111J94208J716k32582
542E7303r1509j12238m4860K38532K50955j38724j29347L8721j12125J74314o6126
531F4896J20902j59297k03835J83891n5310J4904P6185J30265j61037o0115q3128
$$ plain form
520 -131679 -134778 21180 -125952 -111960 170215 263259 392791 180757 174096 220282 3082
509 3082 100456 101985 -80733 -253509 -23937 185784 122363 229039 111657 -88557 -76418
498 -76418 -96458 15323 144304 280142 386612 82609 64440 -45971 -48000 60074 70973
487 70973 294093 186749 155461 75118 50684 125526 103064 18305 65836 -61394 -31724
476 -31724 115899 188251 233960 133352 309178 241021 106783 85105 -14024 -17240 110496
$$ packed form
520a31679l099J55958j47132J3992K82175R3044J29532k12034o661M6186k17200
509C082R7374J529j82718j72776K29572K09721o3421J06676j17382k00214J2139
498g6418k0040J11781J28981J35838J06470l04003j8169j10411k029J08074J0899
487G0973K23120j07344l1288q0343k4434P4842k2462q4759M7531j27230K9670
476c1724J47623P2352M5709j00608J75826o8157j34238k1678r9129l216J27736
$$ [...]
##END NTUPLES=NMR SPECTRUM
##END=
