##TITLE=1H_EC-3273(2)
 CDCl3
 8 sc, 
 12.05.2022
##JCAMPDX= 6.0         $$ Bruker NMR JCAMP-DX V2.0
##DATA TYPE= NMR SPECTRUM
##DATA CLASS= NTUPLES
##ORIGIN= UXNMR, Bruker Analytische Messtechnik GmbH
##OWNER= root
$$ XWIN-NMR		Version 3.5
$$ Thu May 12 11:04:18 2022 Russian Standard Time (UT+4h)  she@DPX200
##.OBSERVE FREQUENCY= 200.1313499996
##.OBSERVE NUCLEUS= ^1H
##.ACQUISITION MODE= SIMULTANEOUS
##.ACQUISITION SCHEME= undefined
##.AVERAGES= 8
##.DIGITISER RES= 18
##SPECTROMETER/DATA SYSTEM= spect
##.PULSE SEQUENCE= zg30
##.SOLVENT NAME= Pyr
##.SHIFT REFERENCE= (INTERNAL, Pyr, 0, 15.7282)
##AUDIT TRAIL= $$ (NUMBER, WHEN, WHO, WHERE, WHAT)
$$ ##TITLE= Audit trail, XWIN-NMR		Version 3.5
$$ ##JCAMPDX= 5.01
$$ ##ORIGIN= Bruker BioSpin GmbH
$$ ##OWNER= she
$$ F:/spectra/data/she/nmr/H-F/1/pdata/1/auditp.txt
$$ ##AUDIT TRAIL=  $$ (NUMBER, WHEN, WHO, WHERE, WHAT)
(   1,<2022-05-12 11:03:10.50 +0400>,<she>,<DPX200>,
      <created by zg, POWCHK disabled, PULCHK disabled
       configuration hash MD5:
       00 E9 B6 7A A2 85 ED C7 34 08 36 98 17 FE 4E 26
       data hash MD5: 16K
       3F 8F 64 98 6A 1D DA 38 A5 89 11 7C 3A 7C BA 47>)
(   2,<2022-05-12 11:03:13.23 +0400>,<she>,<DPX200>,
      <Start of raw data processing
       efp BC_mod = 2 LB = 0.24 FT_mod = 6 PKNL = 1 PHC0 = -17672.42 PHC1 = 13.60075 SI = 16K 
       data hash MD5: 16K
       1D 61 7E 7B 57 EA FB 4E 43 92 7D A6 3E 4D 7A 17>)
(   3,<2022-05-12 11:03:31.75 +0400>,<she>,<DPX200>,
      <pk PHC0 = 0.1582131 PHC1 = 1.4 
       data hash MD5: 16K
       F9 6B 7F 83 05 1C 2C 9A BE F6 9D C8 5F 82 75 53>)
(   4,<2022-05-12 11:03:34.53 +0400>,<she>,<DPX200>,
      <abs ABSG = 5 
       data hash MD5: 16K
       58 E2 EB 7F AF C2 BD 8A 03 B3 49 CF E6 3E DB F5>)
$$ ##END=
$$ 
$$ hash MD5
$$ A4 75 86 29 3A 3A F9 6B C7 6E 01 24 29 24 91 3E
##$RELAX= 
##$RELAX= 
##$RELAX= 
##$RELAX= 
##$RELAX= 
##$RELAX= 
$$ Bruker specific parameters
$$ --------------------------
##$DU= <F:/spectra>
##$EXPNO= 1
##$NAME= <H-F>
##$PROCNO= 1
##$TYPE= <nmr>
##$USER= <she>
##$AMP= (0..31)
100 100 100 100 100 100 100 100 100 100 100 100 100 100 100 100 100 100 
100 100 100 100 100 100 100 100 100 100 100 100 100 100 
##$AQSEQ= 0
##$AQ_mod= 1
##$AUNM= <au_zg>
##$AUTOPOS= <>
##$BF1= 200.13
##$BF2= 200.13
##$BF3= 200.13
##$BF4= 200.13
##$BF5= 200.13
##$BF6= 200.13
##$BF7= 200.13
##$BF8= 200.13
##$BYTORDA= 1
##$CFDGTYP= 0
##$CFRGTYP= 5
##$CHEMSTR= <none>
##$CNST= (0..31)
1 1 145 1 1 1 1 1 1 1 1 1 1 1 1 1 1 1 1 1 1 1 1 1 1 1 1 1 1 1 1 1 
##$CPDPRG= <>
##$CPDPRG1= <>
##$CPDPRG2= <>
##$CPDPRG3= <>
##$CPDPRG4= <mlev>
##$CPDPRG5= <mlev>
##$CPDPRG6= <mlev>
##$CPDPRG7= <mlev>
##$CPDPRG8= <mlev>
##$CPDPRGB= <>
##$CPDPRGT= <>
##$D= (0..31)
0 1.2 0 0 0 0 0 0 0 0.06 0 0.03 0 0 0 0 0.0002 0 0 0 0 0 0 0 0 0 0 0 0 
0 0 0 
##$DATE= 1652338990
##$DBL= (0..7)
120 120 120 120 120 120 120 120 
##$DBP= (0..7)
150 150 150 150 150 150 150 150 
##$DBP07= 0
##$DBPNAM0= <>
##$DBPNAM1= <>
##$DBPNAM2= <>
##$DBPNAM3= <>
##$DBPNAM4= <>
$$ [...]
##$SUBNAM2= <"">
##$SUBNAM3= <"">
##$SUBNAM4= <"">
##$SUBNAM5= <"">
##$SUBNAM6= <"">
##$SUBNAM7= <"">
##$SUBNAM8= <"">
##$SUBNAM9= <"">
##$SW= 18.0517283424761
##$SWIBOX= (0..15)
0 0 2 0 0 0 0 0 0 0 0 0 0 0 0 0 
##$SW_h= 3612.71676300578
##$TD= 16384
##$TD0= 1
##$TE= 0
##$TE2= 300
##$TE3= 300
##$TEG= 300
##$TL= (0..7)
0 120 120 120 120 120 120 120 
##$TP= (0..7)
150 150 150 150 150 150 150 150 
##$TP07= 0
##$TPNAME0= <>
##$TPNAME1= <>
##$TPNAME2= <>
##$TPNAME3= <>
##$TPNAME4= <>
##$TPNAME5= <>
##$TPNAME6= <>
##$TPNAME7= <>
##$TPOAL= (0..7)
0.5 0.5 0.5 0.5 0.5 0.5 0.5 0.5 
##$TPOFFS= (0..7)
0 0 0 0 0 0 0 0 
##$TUNHIN= 0
##$TUNHOUT= 0
##$TUNXOUT= 0
##$USERA1= <user>
##$USERA2= <user>
##$USERA3= <user>
##$USERA4= <user>
##$USERA5= <user>
##$V9= 5
##$VALIST= <valist>
##$VCLIST= <CCCCCCCCCCCCCCC>
##$VD= 0
##$VDLIST= <DDDDDDDDDDDDDDD>
##$VPLIST= <PPPPPPPPPPPPPPP>
##$VTLIST= <TTTTTTTTTTTTTTT>
##$WBST= 1024
##$WBSW= 4
##$XGAIN= (0..3)
0 0 0 0 
##$XL= 0
##$YL= 0
##$YMAX_a= 43262
##$YMIN_a= -74858
##$ZGOPTNS= <>
##$ZL1= 120
##$ZL2= 120
##$ZL3= 120
##$ZL4= 120
##$ABSF1= 15.74248
##$ABSF2= -2.309369
##$ABSG= 5
##$ABSL= 3
##$ALPHA= 0
##$AQORDER= 0
##$ASSFAC= 0
##$ASSFACI= 0
##$ASSFACX= 0
##$ASSWID= 0
##$AUNMP= <proc_1d>
##$AZFE= 0.1
##$AZFW= 0.1
##$BCFW= 0
##$BC_mod= 2
##$BYTORDP= 0
##$COROFFS= 0
##$CY= -3
##$DATMOD= 1
##$DC= 0
##$DFILT= <>
##$DTYPP= 0
##$F1P= 0
##$F2P= 0
##$FCOR= 1
##$FTSIZE= 16384
##$FT_mod= 6
##$GAMMA= 0
##$GB= 0
##$INTBC= 1
##$INTSCL= 0
##$ISEN= 128
##$LB= 0.24
##$LEV0= 0
##$LPBIN= 0
##$MAXI= 10000
##$MC2= 0
##$MEAN= 0
##$ME_mod= 0
##$MI= 1.114404
##$NCOEF= 0
##$NC_proc= -9
##$NLEV= 6
##$NOISF1= 3.799351
##$NOISF2= 2.8
##$NSP= 0
##$NTH_PI= 0
##$NZP= 0
##$OFFSET= 15.72816
##$PC= 1
##$PHC0= -17672.26
##$PHC1= 15.00075
##$PH_mod= 1
##$PKNL= yes
##$PPARMOD= 0
##$PSCAL= 0
##$PSIGN= 0
##$REVERSE= no
##$SF= 200.130008681909
##$SI= 16384
##$SIGF1= 3
##$SIGF2= 2
##$SINO= 5.538805
##$SIOLD= 16384
##$SREGLST= <1H.CDCl3>
##$SSB= 0
##$STSI= 16384
##$STSR= 0
##$SW_p= 3612.71676300578
##$SYMM= 0
##$S_DEV= 0
##$TDeff= 16384
##$TDoff= 0
##$TI= <>
##$TILT= no
##$TM1= 0
##$TM2= 0
##$TOPLEV= 0
##$USERP1= <user>
##$USERP2= <user>
##$USERP3= <user>
##$USERP4= <user>
##$USERP5= <user>
##$WDW= 1
##$XDIM= 16384
##$YMAX_p= 475772684
##$YMIN_p= -8314392
$$ End of Bruker specific parameters
$$ ---------------------------------
##NTUPLES= NMR SPECTRUM
##VAR_NAME=  FREQUENCY,     SPECTRUM/REAL,   SPECTRUM/IMAG
##SYMBOL=    X,             R,               I
##VAR_TYPE=  INDEPENDENT,   DEPENDENT,       DEPENDENT
##VAR_FORM=  AFFN,          ASDF,            ASDF
##VAR_DIM=   16384,         16384,           16384
##UNITS=     HZ,            ARBITRARY UNITS, ARBITRARY UNITS
##FACTOR=    0.220516191357247, 1,           1
##FIRST=     3147.67677823403, 0,            0
##LAST=      -465.039984771749, 0,           0
##MIN=       -465.039984771749, -8314392,    0
##MAX=       3147.67677823403, 475772684,    0
$$ Real data points
##PAGE= N=1
##DATA TABLE= (X++(R..R)), XYDATA
$$ [...]
4870A0592256J06202K99557L0792k01621k36412K41748l09675N81788J85955M28070
4860A1718660k35661K58467Q49539q32684n25721j68902n16701J054821M25575
4851A2027393k9480N1686J276939R69364N0986j52668m28124k24091o05665J99617
4841A3135957k40481N74113m153k67018N01153j87195n26781J22494L54873Q09889
4831A4272851O3134K00833p092O94716R08373j0026k43822j059005J195180L24115
4821A6339257Q02539P56976J015924L81613j07628j39312j426q79985L56066O89549
4811A9213573q82810n1053P54735l08667j451774L0993Q22437K65342j044762
4802A7348014l7020Q45257J207604O58214R6206p88705M83846J644166O5592R4391
$$ y = [10592256, 10698458, 10998015, 11028807, 10827186, 10590774, 10832522, 10522847, 11104635, 11290590, 11718660, 11482999, 11741466, 12591005, 11758321, 11232600, 11063698, 10546997, 11601818, 12027393, 11997913, 12049599, 13326538, 14295902, 14346888, 14194220, 13766096, 13542005, 12936340, 13135957, 12895476, 13469589, 13465436, 13198418, 13699571, 13512376, 12985595, 13108089, 13462962, 14272851, 14335985, 14536818, 14529726, 15224442, 16132815, 16122789, 15878967, 14819962, 16015142, 16339257, 17141796, 17898772, 18914696, 19296309, 19188681, 19049369, 19047943, 18167958, 18524024, 19213573, 18330763, 18279710, 19034445, 18725778, 17274004, 17304997, 18127434, 18392776, 17348014, 17310994, 18156251, 19363855, 20022069, 20118275, 19329570, 19813416, 21457582, 21523174, 21617565]
4792B1617565j03245j05926J65670m78515O339J27241n23061n94401k81723p45989
4782A9083955k79627m50899R7950P3098j592899K72012j134482N8536R30291m70793
4772A6587142L65993q4990l09171k08497n73174J57170N89732M55104n2650J2534
4762A6939193J229422p44778r83163L49706j53250j255440j52745k03302L46812
4753A5372455p15610N46007O40266L02520l9857p41848k29483J027665R4554o86267
4743A5570402K66614N93440K69170O4221M25346J85256j043068M93764K03901
4734A7029046L17013J33041l50153K10967N16653L39516j76591K1019P59407M19550
4724A9219468K40640J69941M12651M89043n45351P16212J084230J107074l61941
$$ y = [21617565, 21514320, 21408394, 21574064, 21095549, 21101888, 21229129, 20706068, 20111667, 19829944, 19083955, 18804328, 18353429, 18451379, 18524477, 16931578, 17203590, 16069108, 16127644, 17057935, 16587142, 16953135, 16868145, 16558974, 16350477, 15777303, 15934473, 16524205, 16979309, 16926659, 16939193, 18168615, 17423837, 16440674, 16790380, 16637130, 15381690, 15228945, 15025643, 15372455, 14656845, 15202852, 15843118, 16145638, 16105781, 15363933, 15134450, 16162115, 16256669, 15570402, 15837016, 16430456, 16699626, 16763847, 17189193, 17374449, 16331381, 16825145, 17029046, 17346059, 17479100, 17128947, 17339914, 17856567, 18196083, 18019492, 18040511, 18799918, 19219468, 19460108, 19630049, 20042700, 20531743, 19986392, 20702604, 21786834, 22893908, 22531967]
4715B2531967O48114Q26027L38264K15988J025117j31155k57377j71024m41781
4706B4584140j59533j80416o54810o2682j53876m9260J76704N59309J10354J45956
4696B4315886J71226K74690P82771L9201O95905J31404O72661L44762J2957M2977
4686B7484440L65792m70685M88663M85264j88823r53980O75253l42660o18080
4677B6925184j94383J98413R23350j20513P19051n66466O2323o5992L3366q0433
4667B7833900O79403n30200p30386K77065J076279p7510K6736o95980j58710L43164
4657B8043761K49111l81168j3322N23096N67182k75456L79394j47037m39956L54535
4647B8860140P66619K88723N07543o752l0046o1717j029546j61483j18211m42712
$$ y = [22531967, 23180081, 24006108, 24344372, 24560360, 25585477, 25454322, 25196945, 25025921, 24584140, 24424607, 24244191, 23589381, 23526699, 23372823, 23323563, 23500267, 24059576, 24169930, 24315886, 24487112, 24761802, 25544573, 25583774, 26279679, 26411083, 27083744, 27428506, 27441463, 27484440, 27850232, 27379547, 27868210, 28353474, 28164651, 27210671, 27885924, 27543264, 26925184, 26730801, 26929214, 27852564, 27732051, 28451102, 27884636, 27946959, 27880967, 27914333, 27833900, 28513303, 27983103, 27252717, 27529782, 28606061, 28528551, 28555287, 27859307, 27700597, 28043761, 28292872, 27911704, 27898382, 28421478, 28988660, 28713204, 29092598, 28945561, 28505605, 28860140, 29626759, 29915482, 30423025, 30416273, 30386227, 30324510, 29294964, 29133481, 29015270, 28572558]
4637B8572558k61606o21343J4240l79610r95714L36814n77118p70856N09997O72026
4627B6499388P50962l61590Q39522K89727r13920P95406R2107M04951Q864k94991
4617B8110426l47695J84865k56259j158653R6977N9951p08718k74199j839454
4608B3867241M02724K74091j91292j45251k16686J10414P1273k04378n02333J14965
4598B3580768O01882p82550m2555r4546j83452m98392m36380o71763O06034n54353
4588B1524693n33395L23489P17437J1953N43261R24011J96888k33976R01925N12321
4578B4888607M07742J127074N74915R62941P7514O18036p7202o68744r75952K8664
4568B6963595j098253j075617P8511Q0147m15041q66092O27486O50716q47862
$$ y = [28572558, 28310952, 27689609, 27703849, 27324239, 26328525, 26665339, 26088221, 25317365, 25827362, 26499388, 27250350, 26888760, 27728282, 28018009, 27104089, 27899495, 27991602, 28396553, 28405417, 28110426, 27762731, 27947596, 27691337, 26532684, 26629661, 26689612, 25980894, 25706695, 23867241, 24269965, 24544056, 24352764, 24207513, 23990827, 24101241, 24172514, 23968136, 23465803, 23580768, 24182650, 23400100, 23357545, 23262999, 23079547, 22581155, 22144775, 21473012, 22079046, 21524693, 20991298, 21314787, 22032224, 22044177, 22587438, 23511449, 23708337, 23474361, 24376286, 24888607, 25296349, 26423423, 26998338, 27961279, 28038793, 28656829, 28579627, 27910883, 26934931, 26963595, 25865342, 24789725, 24868236, 24948383, 24533342, 23667250, 24294736, 24945452, 24097590]
4559B4097590O17754L33765j67795P4342R62103K29566M01869Q96270p38380N1426
4549B6758510m39725L5325J25887q07445J95571m58222p00099R422n78512K43457
4539B4384169m88496p19336k03804o48716K08624R869o21490j075083k71549L8409
4529B0612597o5595p00299M30137N13926M03418M9726p34759n39667j105635O56720
4519A9520569K12029r74267M23299j83296j65765m96972J93357L78794k09662
4510A8698086r57490o08356r44528K25460Q03395R76598l7801n13997o35551L20482
4500A7326298P45794L1501J65530m30271k13818l26665O81794K7688K42230J42631
4490A8392712P56948P00385N57793k92141J8702J81970o23605o50516l98885K63832
$$ y = [24097590, 24715344, 25049109, 24881314, 24955656, 25917759, 26147325, 26549194, 27445464, 26707084, 26758510, 26318785, 26354110, 26479997, 25672552, 25868123, 25409901, 24709802, 24719224, 24140712, 24384169, 23895673, 23176337, 22972533, 22323817, 22532441, 22542310, 21920820, 20845737, 20574188, 20612597, 20547002, 19846703, 20276840, 20790766, 21194184, 21243910, 20509151, 19969484, 18863849, 19520569, 19732598, 18758331, 19181630, 18998334, 18832569, 18335597, 18528954, 18907748, 18698086, 17740596, 17132240, 16187712, 16413172, 17216567, 18193165, 18155364, 17641367, 17005816, 17326298, 18072092, 18103593, 18269123, 17838852, 17625034, 17298369, 17980163, 18007851, 18250081, 18392712, 19149660, 19850045, 20407838, 20115697, 20134399, 20316369, 19692764, 19042248, 18643363, 18907195]
4480A8907195r78149n98228L04545J035516l08908m56451M00860j384885j03704
4471A6817791o7846j65925o05411l7768l59138L55724k89757r91210J99928n55910
4461A4300478J64562N96889L15528K99016o54666j04944P57248n86569O60616
4452A5748158o96113O03332n9147P59050k57530L14044o46624p46611O56227O10015
4442A6284801J4941l88107M27962J20523l80567k04646J373484n75385J11619
4433A6784625p72448K95637n21713l38066q74250k59121j438M17856l7803P2213
4423A4765492O75913o1213N06569K4264q1997M20577j194842j19590L17733M61153
4413A5714059O54038J236345K97367M22373R66488L21217K37795Q6037q8282M37415
$$ y = [18907195, 17929046, 17330818, 17635363, 18670879, 18361971, 17905520, 18306380, 16921495, 16817791, 16749945, 16584020, 15978609, 15940841, 15581703, 15937427, 15647670, 14656460, 14856388, 14300478, 14465040, 15061929, 15377457, 15676473, 15021807, 14916863, 15674111, 15087542, 15748158, 15052045, 15655377, 15596230, 16355280, 16097750, 16411794, 15765170, 15018559, 15674786, 16284801, 16299742, 15911635, 16339597, 16460120, 16079553, 15874907, 17248391, 16673006, 16784625, 16012177, 16307814, 15786101, 15448035, 14573785, 14314664, 14313226, 14731082, 14693279, 14765492, 15441405, 15380192, 15886761, 15911025, 15829028, 16249605, 15054763, 14935173, 15252906, 15714059, 16368097, 17604442, 17901809, 18324182, 19290670, 19611887, 19849682, 19935719, 19847437, 20284852]
4403B0284852o79712J91908M57897Q5446J089037r19579n61727r18938j123331
4394A7905853J31760M59591j708086j011527j50646m6389m26532N79036r90012
4385A4743048O24738P30636j62559l22525l9417k114n84203N80206P94518M52555
4375A6814883r03790j246528J692728R26893P579J3425p41288R6855Q97191L46742
4365A7904690k16616j031912P74703J63614O39739R7890k5188M27794K579N45596
4355A9282889O98016K20483o64374J210612M8361L04587o3370O34463O03559k8465
4345B2246761J269109J119808j94322J737691J607244J426528J809957J619873
4337C2642649J566805J871524J732335J784823J831364K933126L329294L822114
$$ y = [20284852, 19605140, 19797048, 20254945, 20340391, 21429428, 20509849, 19948122, 19029184, 17905853, 18037613, 18497204, 16789118, 15777591, 15626945, 15580556, 15154024, 15733060, 14743048, 15367786, 16098422, 15935863, 15613338, 15573921, 15571807, 14987604, 15567810, 16362328, 16814883, 15911093, 14664565, 16357293, 17284186, 17291765, 17305190, 16563902, 16660757, 17557948, 17904690, 17688074, 16656162, 17430865, 17594479, 18234218, 18332108, 18306920, 18734714, 18737293, 19282889, 19980905, 20201388, 19537014, 20747626, 20795987, 21100574, 21037204, 21671667, 22275226, 22246761, 23515870, 24635678, 24441356, 26179047, 27786291, 29212819, 31022776, 32642649, 34209454, 36080978, 37813313, 39598136, 41429500, 44362626, 47691920, 51514034]
4329E1514034K894348J008769K35140j207182k881195k990893k778628l430216
4321D2364177k388449j282236o57196q83971j29632J72734j124912J64588M53845
4312C6688948P42141J027903O21448P97433N18248P27595K006946J296857J556770
4303D5984289K437570K358239J126226J576856J813139n11091k132078l622722
4295D9030428l333889k995644k183092k498675k238463j042380m40709r78061
4287C3319515j538589j449507j071887l31376j592369m36031K84031l49095k48762
4278B6585930J18013M42052l36853M73637j003253n15381M23971K9498n39582
4269B5678032k02092N21996l53927m34794K38550L14333R01596L7231K58398J079881
$$ y = [51514034, 54408382, 55417151, 55652291, 54445109, 51563914, 48573021, 45794393, 42364177, 39975728, 38693492, 38036296, 37152325, 37022693, 37195427, 36070515, 36235103, 36688948, 37431089, 38458992, 39080440, 39877873, 40396121, 41123716, 43130662, 44427519, 45984289, 48421859, 50780098, 51906324, 53483180, 55296319, 54785228, 52653150, 49030428, 45696539, 42700895, 40517803, 38019128, 35780665, 34738285, 34297576, 33319515, 31780926, 30331419, 29259532, 28928156, 27335787, 26899756, 27183787, 26834692, 26585930, 26703943, 27145995, 26809142, 27282779, 26279526, 25764145, 26188116, 26217614, 25678032, 25475940, 25997936, 25644009, 25209215, 25447765, 25762098, 26663694, 26700925, 26959323, 28039204]
4259B8039204J48160O70765O72974J228309J201345J867607R52044q37076J63027
4250C4106359N98261m23011K89053J387275J148858K260829K987830K761470L368909
4241D8485833L619607L753242L298250J264379j550272l651309n313525n111769
4233D4794436l235854m451254k952506k259216p18226m95785j340641j438130
4225B7902824r72681m34736R19085p77857r8906L14675l48609q66063j04404j90554
4215B5342774r29377l04470q02320p89589j502683j33070O33104M18911q32258
4206B1101022n84585l24855K65951k44518p35609Q40303L4708m85429j76556q8832
4196A9601600K22515n04325L92527o18002j156947l57782P7183L47249m18203
$$ y = [28039204, 28187364, 28858129, 29531103, 30759412, 31960757, 33828364, 34780408, 33943332, 34106359, 34704620, 34281609, 34570662, 35957937, 37106795, 39367624, 42355454, 45116924, 48485833, 52105440, 55858682, 59156932, 60421311, 58871039, 55219730, 49906205, 44794436, 41558582, 37107328, 34154822, 31895606, 31177380, 30681595, 29340954, 27902824, 26930143, 26495407, 27414492, 26636635, 26537729, 26852404, 26503795, 25637732, 25533328, 25342774, 24413397, 24108927, 23306607, 22517018, 21014335, 20881265, 21514369, 21933280, 21101022, 20516437, 20191582, 20457533, 20213015, 19477406, 20317709, 20352417, 19866988, 19690432, 19601600, 19824115, 19319790, 19712317, 19094315, 17937368, 17579586, 17656769, 18004018, 17585815]
4187A7585815n2224L00588r9927M89220l99354m54603j29452k09088k22311J059573
4177A7868237k97261l55242K1346N42309N5840o87318M8648Q71153l70172l07059
4167A7390481K18952M54455j63882k08807q27574o69625K03186K80755j56001
4158A6521940q99742n42318l95436L40324N40528l49061n24218L10259O91090
4149A5693366r35766k43048j61938o06015K4565P94354m97728m11754L0887k20896
4139A3466027J085456l27921J10693P9556M16681r27871m94373N338J058834p0269
4129A4402151n18300M41006l66497k3890l47193K06682P69560l71375k20642L56034
4119A4327536N43602k72935J17177J9044J7888m46500O90464M31332J95353N00875
$$ y = [17585815, 17533591, 17834179, 17734252, 18223472, 17824118, 17369515, 17240063, 17030975, 16808664, 17868237, 17570976, 17215734, 17237080, 17779389, 17835229, 17147911, 17196559, 18067712, 17697540, 17390481, 17609433, 18063888, 17900006, 17691199, 16863625, 16194000, 16397186, 16677941, 16521940, 15622198, 15079880, 14684444, 15024768, 15565296, 15216235, 14692017, 15002276, 15693366, 14757600, 14514552, 14352614, 13746599, 13771164, 14565518, 14067790, 13656036, 13686923, 13466027, 14551483, 14223562, 14334255, 14413811, 14830492, 13902621, 13408248, 13413586, 14472420, 14402151, 13883851, 14324857, 13958360, 13934470, 13587277, 13793959, 14563519, 14192144, 13971502, 14327536, 14871138, 14598203, 14715380, 14734424, 14752312, 14305812, 14996276, 15427608, 15622961, 16123836]
4109A6123836q94724p41873P49622N27232P41009Q6774r82855n72534J051378
4100A6087865j37354R40605O47718m64118J244063N5460L11405P75640K01562
4091A9662846n64028J61471R92615R86894N51318N32030J332412K305085J500588
4082B7461231l74517k072691j822383j241622k22877M64156J62386N91765L96577
4073B3342025n34331J153796K04852j34751n11779o3721r1441J309990J84562
4064B4859202q6034j21286k47773m52512M87410L91325p78799M68134k41571N33707
4054B4811803j42504N68774L07874M23889j022554J65856J78777p04878O07656
4045B5194693J2220l0407J73999q22453n46534R4830L55402M536j71898l4237
$$ y = [16123836, 15229112, 14487239, 15236861, 15764093, 16505102, 16591876, 15609021, 15036487, 16087865, 15950511, 16891116, 17538834, 17074716, 18318779, 18374239, 18685644, 19461284, 19662846, 19098818, 19260289, 20252904, 21239798, 21791116, 22323146, 23655558, 25960643, 27461231, 27086714, 25014023, 23191640, 21950018, 21727141, 22191297, 22353683, 22945448, 23342025, 22807694, 23961490, 24166342, 24031591, 23519812, 23456091, 23364650, 24674640, 24859202, 24773168, 24651882, 24404109, 23951597, 24439007, 24830332, 24051533, 24519667, 24278096, 24811803, 24669299, 25238073, 25545947, 25969836, 24947282, 25113138, 25291915, 24587037, 25194693, 25206913, 25176506, 25350505, 24528052, 23981518, 24076348, 24431750, 24436286, 24264388, 24230151]
4035B4230151K78976J42854K06088J39654l86352n95793p20780j61679M71990
4026B3605109P972p10446K96697L36876p73241j26137K36250M70446o52488k03289
4016B2487749R07891r85875j95270k58926l15786p56489M08962K41398l97602
4007B1136052M29210k63866m56888j68283l64730n4387n10424K89127q903J33160
3997B0160068J46554q35078k3153k43002j517055l45497M95390j112142q06200
3988A5919885P784l79363j41844j03878j50934k40560r6130k46200n26541j83316
3978A3858903j54424l45982M03073j49109j256888M84218J51024k51875l23049
3969A2415891J363499k24033o87097m05048k07606J72770K35850p18134j90756
$$ y = [24230151, 24509127, 24651981, 24858069, 24997723, 24611371, 24015578, 23294798, 23133119, 23605109, 23613081, 22902635, 23199332, 23536208, 22762967, 22636830, 22873080, 23343526, 22691038, 22487749, 23395640, 22409765, 22214495, 21955569, 21639783, 20883294, 21292256, 21533654, 21136052, 21565262, 21301396, 20844508, 20676225, 20311495, 20257108, 19746684, 20035811, 20026908, 20160068, 20306622, 19471544, 19448391, 19205389, 17688334, 17342837, 17838227, 16726085, 15919885, 15927669, 15548306, 15406462, 15302584, 15151650, 14911090, 14814960, 14568760, 14042219, 13858903, 13704479, 13358497, 13761570, 13612461, 12355573, 12839791, 12990815, 12738940, 12415891, 13779390, 13555357, 12868260, 12463212, 12255606, 12428376, 12664226, 11946092, 11755336]
3960A1755336M9227k20193j035489K75280J76084L11080L25925R000O12203n68106
3950A1690347K45720q38000M13824N45588r48953L29502j44613p3570M34230K14325
3940A1868400r1137p32649O39919J11413m54317M43643k75613p68457K11063m61815
3930A0490450J84733L87782m94520j59928P49386j50417m68913p67653p135J24925
3920I888710j90539o82236p03333P38275j32459n77719J357904N91376k56524
3911A0033455j233492q3738o7301o71324K17302O00210L71836M22783r9221j99291
3901I291219q61374n31328L11477P16396R95746k12578n59121k50322k81465N28443
3891I147093L21318O1243L3557L17605l17223Q09730l88112k63191K72598o45982
$$ y = [11755336, 11804563, 11584370, 10548881, 10824161, 11000245, 11311325, 11637250, 11646250, 12258453, 11690347, 11936067, 11098067, 11511891, 12057479, 11108526, 11438028, 11293415, 11219845, 11654075, 11868400, 11777263, 11044614, 11684533, 11795946, 11341629, 11785272, 11509659, 10741202, 10952265, 10490450, 10675183, 11062965, 10568445, 10408517, 11157903, 11007486, 10538573, 9770920, 9763785, 9888710, 9698171, 9015935, 8312602, 9050877, 8918418, 8340699, 9698603, 10289979, 10033455, 8799963, 8716225, 8648924, 7977600, 8194902, 8795112, 9166948, 9589731, 9490510, 9291219, 8429845, 7898517, 8209994, 8926390, 9922136, 9709558, 9150437, 8900115, 8618650, 9147093, 9468411, 9529654, 9563211, 9880816, 9563593, 10373323, 9985211, 9722020, 9994618, 9348636]
3881I348636R12938O2522j196320K37238Q34001M06542j98671l01499P73204l26352
3871A0552239L76789k00128l22622O75967m44187p35929M86255r0060o1785k61010
3861I975529J138898j6193o44709o40829P1475O4353L27179o95880N62193n96997
3851I545019p54632R21364L58146j74877L194M98593K69853M86012p61136r7552
3841A0293984l52755o84625N13651j29417R6798K76746L93558m38141J80376R65915
3831A1116090o48771j17452K09429L78823m2012k33785J094156P12532K81732
3822A2750742l34145Q1387k46072n1183K81939K78804l871p4267n58813l81419
3812A1743102Q6058k66817J030637k13056Q6432m13420m82331j00685M11516L80556
$$ y = [9348636, 10261574, 10324096, 9127776, 9365014, 10199015, 10605557, 10406886, 10105387, 10878591, 10552239, 10929028, 10728900, 10406278, 11082245, 10638058, 9902129, 10388384, 10298324, 10236539, 9975529, 11114427, 11098234, 10453525, 9812696, 9884171, 9948524, 10275703, 9579823, 10142016, 9545019, 8790387, 9711751, 10069897, 9895020, 9898214, 10396807, 10666660, 11152672, 10391536, 10293984, 9941229, 9256604, 9770255, 9640838, 9737636, 10014382, 10407940, 9969799, 10150175, 11116090, 10467319, 10349867, 10559296, 10938119, 10896107, 10662322, 11756478, 12469010, 12750742, 12416597, 12497984, 12251912, 12200729, 12482668, 12761472, 12757601, 12683334, 12124521, 11743102, 11829160, 11562343, 12592980, 12379924, 12466356, 12052936, 11570605, 11469920, 11881436, 12261992]
3802A2261992m70902L21972N02424j94248j82368L43757n50579Q88333O15077
3793A3535458n61807L93238m32318m25528N81738J058127r4837K94338R05549
3784A5253958J25367J13609J092416j10362n5279N2441K8752J013680q89972l33592
3774A6291018J132844N79362n46956N31023l68632L01950j45644Q38393K74020
3765A8887378l83173J022795k3797L89653J66594K00581n45916M48275L06086
3756B0468476o41355o24888K89223K75525M00080l11679L5797J1751K58510j054495
3746A9106945N83774N5280R0554k31819n44967o185O60132L77485O37996L3331
3736B0762526m04132K38070J24396L98573j28013R22883N99396p74717l5182P03491
$$ y = [12261992, 11791090, 12113062, 12615486, 12421238, 12238870, 12582627, 12032048, 12920381, 13535458, 12973651, 13366889, 12934571, 12509043, 13090781, 14148908, 14054071, 14348409, 15253958, 15379325, 15492934, 16585350, 16474988, 16419709, 16472150, 16500902, 17514582, 16624610, 16291018, 17423862, 18003224, 17456268, 17987291, 17618659, 17920609, 17774965, 18613358, 18887378, 18504205, 19527000, 19503203, 19892856, 20059450, 20260031, 19714115, 20162390, 20468476, 19827121, 19202233, 19491456, 19766981, 20167061, 19855382, 19891179, 19902930, 20161440, 19106945, 19690719, 19745999, 19836553, 19604734, 19059767, 19053582, 19713714, 20091199, 20729195, 20762526, 20358394, 20596464, 20720860, 21119433, 20991420, 21914303, 22513699, 21738982, 21703800, 22407291]
3726B2407291Q16859Q34917K86154N95881P38912K73287J03765L94022J277278
3717B7728366M21473P28793J691322Q72005R89408M49206P68445K313549O54864
3708C6617431O08547j14416Q40111J193118J04394R44798j4307o44645L75620
3699C9910651O19372q55242k29486J011105P30945j71308p21597m01990O57187
3690D0549637q9462k95945q85780k29243r67267L00499k90650p9738k85156l13466
3680C7413429l11641J076359N75199p68352o44140K60432R46206O40071j0707
3671C9176856l00580n46683L98514P81888K91852L02016O15843P07675Q2344L33611
3661D1843336O37608M32569L04018M82127M40960m29625J19582R29521J188224
$$ y = [22407291, 23224150, 24059067, 24345221, 24941102, 25680014, 25953301, 26057066, 26451088, 27728366, 28149839, 28878632, 30569954, 31441959, 32431367, 32880573, 33649018, 35962567, 36617431, 37225978, 37111562, 37951673, 39144791, 39249185, 40193983, 40179676, 39535031, 39910651, 40530023, 39674781, 39445295, 40456400, 41187345, 41016037, 40294440, 39892450, 40549637, 40460175, 40164230, 39278450, 39049207, 38081940, 38382439, 38091789, 38012051, 37726895, 37413429, 37101788, 38178147, 38753346, 37984994, 37340854, 37601286, 38547492, 39187563, 39176856, 38876276, 38329593, 38728107, 39509995, 39801847, 40103863, 40719706, 41427381, 41509725, 41843336, 42480944, 42913513, 43217531, 43699658, 44140618, 43710993, 43830575, 44760096, 45948320]
3652D5948320J90856M85413L5961k85835J89973K25236N21517K27517j8853q98948
3642D6621157J108487O03215p39958Q55396O49021k458N00573M48150J35914L97600
3632E0577097Q68770Q61514j4461L01017L25252N32725J217640N86732R29086
3623E6185372P05207N02782L06239j3378K064O02448J100697O86502P99227K4104
3613F0901264J17677L15002J7985q10380m15869L24964l71751M54981k08119j249236
3603E9076518m08575l65874k75300k91345J45565k76770j438485j285715p03788
3594E4176231m95265r32258r77071n92752j486690j156380J11418K7434j637509
3585D7037158j949706n99590j383509j36947j032722j152643j332786l92595p36349
$$ y = [45948320, 46139176, 46624589, 46660550, 46374715, 46564688, 46789924, 47311441, 47538958, 47520105, 46621157, 47729644, 48332859, 47592901, 48448297, 49097318, 49094860, 49595433, 50043583, 50179497, 50577097, 51445867, 52307381, 52292920, 52593937, 52919189, 53451914, 54669554, 55256286, 56185372, 56890579, 57393361, 57699600, 57686222, 57688286, 58290734, 59391431, 60077933, 60877160, 60901264, 61018941, 61333943, 61351928, 60541548, 60125679, 60450643, 60078892, 60533873, 60325754, 59076518, 58667943, 58302069, 58026769, 57735424, 57880989, 57604219, 56165734, 54880019, 54176231, 53680966, 52748708, 51771637, 51178885, 49692195, 48535815, 48647233, 48674667, 47037158, 45087452, 44487862, 43104353, 42967406, 41934684, 40782041, 39449255, 39056660, 38320311]
3576C8320311q64149j042500l59657p87852p62830q69369Q847j431464m61430
3567C1749907r61478p23304p59874k31069k05521m89406n64679j115174n53375
3558B6146027k64906j56798j172095K52476O98108l33800r24653n40876o51356
3549B3052127J1128o69016L31752n35790L66712l06076q4748o98498K46998q58561
3539B0856028K63028N39686M627l77025k15169p40259m09049R38179K00756k22002
3529B0838800o44157q02901J99158P78838j121547J60150k65855n03631k75709
3520A8363146M14553p26616j74401M80573L61688N2753J16458l63225l98665p41201
3510A7385063q3224K68028n82849j39433N85773m53294l04097l63474j75310j061243
$$ y = [38320311, 37456162, 36413662, 36054005, 35266153, 34503323, 33633954, 33642801, 32211337, 31749907, 30788429, 30065125, 29305251, 29074182, 28868661, 28379255, 27814576, 26699402, 26146027, 25881121, 25724323, 24552228, 24804704, 25502812, 25169012, 24244359, 23703483, 23052127, 23063255, 22394239, 22725991, 22190201, 22556913, 22250837, 22166089, 21467591, 21714589, 20856028, 21119056, 21658742, 21663369, 21286344, 21071175, 20330916, 19921867, 20860046, 21060802, 20838800, 20194643, 19391742, 19590900, 20369738, 19248191, 19408341, 19142486, 18638855, 18363146, 18777699, 18051083, 17876682, 18357255, 18718943, 18771696, 18888154, 18524929, 18126264, 17385063, 17301839, 17569867, 16987018, 16847585, 17433358, 16980064, 16675967, 16312493, 16137183, 15075940]
3500A5075940l58780K56234j20234J18901O2179p2471o66151L82916K81997k5571
3490A4934960r3706o55841j059442N47694P51956j36635R90438l95198l11105
3481A4573121m84065q33310M0006k20630N109Q5372K70326p74191M30094L9399
3471A3131231m95167J57727R66504n58860N46609L59138n3813P84698j37429o70239
3461A4030399M16902K03390o93656n52403Q72065k81727l87270J22660M32984
3452A4163344j76883j90708j24398j42534m280j00866L08913m8369n36699J38340
3442A3285860K41935K83960K34573l17423J68292j83166l73389j02311K86831
3433A3525162m24958j67003K25028j65359L50965J33283O02593m6288J00358n15567
$$ y = [15075940, 14717160, 14973394, 14853160, 14972061, 15034240, 14961769, 14295618, 14678534, 14960531, 14934960, 14841254, 14185413, 13125971, 13673665, 14425621, 14288986, 15279424, 14884226, 14573121, 14089056, 13255746, 13295752, 13075122, 13080231, 13165603, 13435929, 12661738, 13091832, 13131231, 12636064, 12793791, 13760295, 13201435, 13748044, 14107182, 14053369, 14838067, 14700638, 14030399, 14447301, 14650691, 13957035, 13404632, 14276697, 13994970, 13607700, 13730360, 14163344, 13986461, 13795753, 13671355, 13528821, 13524541, 13423675, 13732588, 13684219, 13147520, 13285860, 13527795, 13811755, 14046328, 13728905, 13897197, 13714031, 13340642, 13238331, 13525162, 13100204, 12933201, 13158229, 12992870, 13343835, 13477118, 14079711, 14033423, 14133781, 13618214]
3423A3618214R73505K18411o97531P812j39993q09590k2083J404278K25843K05034
3413A4983900m69180r8835O4914R8388j5193L3620p83595P57736K25224L98839
3403A5195818O27877O42799l65154l64158P31127o73088l04702K67414R34238
3394A6692171L43687n04287r4054K14771k41054k16336J516157q32869m64642
3385A6413544P21513N55109k56226J35476k4128j80133p8409P84615k02294L19610
3375A8188677O11352j75219m01145n97309M65062K15728M35009q796n8937R60859
3365A9635281l60930N0436L28315M13179L05743j37482J31190n57628L62083l43170
3355A9827017m05385J446719Q80893j38988j97480j09714M01017L21130O08787
$$ y = [13618214, 14591719, 14810130, 14112599, 14120411, 13980418, 13170828, 13148745, 14553023, 14778866, 14983900, 14514720, 14415885, 14480799, 14579187, 14563994, 14597614, 13814019, 14571755, 14796979, 15195818, 15823695, 16466494, 16101340, 15737182, 16468309, 15795221, 15490519, 15757933, 16692171, 17035858, 16531571, 16437517, 16652288, 16411234, 16194898, 17711055, 16878186, 16413544, 17135057, 17690166, 17433940, 17569416, 17545288, 17365155, 17286746, 18071361, 17869067, 18188677, 18800029, 18624810, 18223665, 17626356, 18091418, 18307146, 18742155, 18733359, 18674422, 19635281, 19274351, 19324787, 19653102, 20066281, 20372024, 20234542, 20365732, 19808104, 20170187, 19827017, 19421632, 20868351, 21749244, 21610256, 21412776, 21303062, 21704079, 22025209, 22633996]
3346B2633996L53417N42111O14145K95438k18561J97686R16268N61814j83584
3337B5712730J109919l11901J08984Q56087O98233P27030j61427M38433R22509
3328C0100597j012619J49170L76196N17708O95432M4467N89251O51281J424244
3319C3535727O90262j30191J8872O08279L69093K7457J282553L23255L59374N83897
3309C7668578N03061Q29807J036561J352409k74295P72758K346718R16482M69850
3300D5621929L43643M63069R10089Q5482K98691P29985O33959k08354K353816
3291E1232309K3548M14718J651841j04612R51493J865542M20270J929319J186622
3282E9571050R61686J677050R29259Q37083N30660J179660M69517K019578J790929
$$ y = [22633996, 22987413, 23529524, 24143669, 24439107, 24220546, 24418232, 25334500, 25896314, 25712730, 26822649, 26510748, 26619732, 27475819, 28174052, 28901082, 28739655, 29178088, 30100597, 29087978, 29237148, 29613344, 30131052, 30826484, 30870951, 31460202, 32111483, 33535727, 34225989, 34095798, 34114670, 34722949, 35092042, 35119499, 36402052, 36725307, 37084681, 37668578, 38171639, 39001446, 40038007, 41390416, 41116121, 41888879, 44235597, 45152079, 45621929, 45965572, 46428641, 47338730, 47424212, 47722903, 48452888, 49086847, 48878493, 51232309, 51255857, 51670575, 53322416, 53217804, 54169297, 56034839, 56455109, 58384428, 59571050, 60532736, 62209786, 63139045, 63976128, 64506788, 65686448, 66155965, 68175543, 69966472]
3273F9966472J652407J876258K184636K408506J524965K336189J943769J869090
3265H5762292K200261K682066L029280K830632L870666M383406M178557M990533
3257A13927693O576522N370904O152072O860080N931582P584839O285882N252609
3249A63942183L733479J573832r40826m727629n868345p266165q625391r684700
3241A32136438r737211p868800o663454p075191o266309n245532m266996m210947
3233H0801998m054444k866922k487050k401732k383526k045529j767392k091910
3225F0703493j758659j338615j425054j379971r50691j754431o29127p04450j260337
3216D9502158j187836m20572p80986j188802q36048k82330j252396m33796p34753
$$ y = [69966472, 71618879, 73495137, 75679773, 78088279, 79613244, 81949433, 83893202, 85762292, 87962553, 90644619, 93673899, 96504531, 100375197, 104758603, 108937160, 113927693, 120504215, 125875119, 132027191, 138887271, 144818853, 152403692, 158689574, 163942183, 167675662, 169249494, 168308668, 163581039, 157712694, 150446529, 141821138, 132136438, 122399227, 114530427, 107866973, 100791782, 94525473, 89279941, 85012945, 80801998, 76747554, 73880632, 71393582, 68991850, 66608324, 64562795, 62795403, 60703493, 58944834, 57606219, 56181165, 54801194, 53850503, 52096072, 51466945, 50762495, 49502158, 48314322, 47893750, 47112764, 45923962, 45087914, 44805584, 43553188, 43119392, 42384639]
3207D2384639r56679j133236q12131r30593j007550q70111k44016l59510p0350
3198C6000463j220967r41162L61759q83729r87741j04510p6036n9049l1227j114771
3188C0943030o62567j12555K8784q11859j293484j06334k97614m9918M62547l82340
3178B7717690n29819n46535p5075j216515n34321L5455J10098j73154J84039n96655
3168B4375208p90900j04120O75514k90434o69252l31616q6857J23715o05476P4903
3158B2370685k43878q12770K52927l16176n85517K65673l55399p74869M31434
3149B0232110J64092j00721K31212L782l85859K25638p38215J3519p1845O13275
3139B0186988n84893j108565O0931R3223n64375K83106J89675L63128L52428p41704
$$ y = [42384639, 41427960, 40294724, 39482593, 38552000, 37544450, 36674339, 36430323, 36070813, 36000463, 34779496, 33838334, 34200093, 33316364, 32328623, 32224113, 32148077, 32089028, 32057801, 30943030, 30280463, 30167908, 30196692, 29384833, 28091349, 27985015, 27687401, 27637483, 28100030, 27717690, 27187871, 26641336, 26566261, 25349746, 24815425, 24850880, 24960978, 24787824, 24971863, 24375208, 23584308, 23480188, 24155702, 23865268, 23196016, 22864400, 22777543, 22901258, 22295782, 22370685, 22126807, 21314037, 21566964, 21250788, 20665271, 20930944, 20575545, 19800676, 20232110, 20396202, 20295481, 20526693, 20530475, 20144616, 20370254, 19632039, 19645558, 19573713, 20186988, 19602095, 18493530, 18554461, 18647684, 18083309, 18366415, 18556090, 18919218, 19271646, 18529942]
3129A8529942k23541l28780l22140J50369K65514l73756k18100l32065P50952
3120A7898395n61536k37253J3875j16444l485j02423Q6794J41386K5597r3048
3110A7051858j70575J01956L29665q99294j38017k70205n45602J50092j75976
3101A5433902k92896j67966j23338R95778k16174m30201K39625M03914j7566k27702
3091A5597376j5430q1663J94117K88368j610975j84700J90012P26913J090824
3082A6194842q00896j423466l43164K60275O14814J55580n35947l10314J57460
3073A3969184L733j83235Q2195m3466N73495j087881k30371K73026Q3276N85350
3063A4025306j63732n38109K58038j30919J115103k70179k7341J74005K39105
$$ y = [18529942, 18306401, 17977621, 17655481, 17805850, 18071364, 17697608, 17479508, 17147443, 17898395, 17336859, 17099606, 17113481, 16997037, 16993552, 16891129, 16977923, 17119309, 17144906, 17051858, 16881283, 16983239, 17312904, 16413610, 16275593, 16005388, 15459786, 15609878, 15433902, 15141006, 14973040, 14849702, 15845480, 15629306, 15199105, 15438730, 15842644, 15825078, 15597376, 15581946, 15500283, 15694400, 15982768, 14371793, 14187093, 14377105, 15104018, 16194842, 15393946, 13970480, 13627316, 13887591, 14502405, 14657985, 14122038, 13811724, 13969184, 13972917, 13789682, 13871877, 13828411, 14401906, 13314025, 13083654, 13356680, 13439956, 14025306, 13861574, 13323465, 13581503, 13450584, 14565687, 14295508, 14268167, 14442172, 14681277]
3054A4681277m66060k20326j27812j009101M39071R36780l5268J20163m27307
3045A3891417J09791j09336R42840j31661k52600K23770J38754M07946O70406
3036A5891327l8669n75473j78513k11615K07882M55126N87906M095L47480K55602
3026A6745148N83822Q8492J79144O34776l96247M98777j06563R38787M96669j21719
3016A9541086O49534J60964J248433J658598O06190l78151N33763J211972J294344
3007B6526733J314311P80871R89063Q77167j41513m84755L9955Q9263O54429K97623
2997C0943147m38657o95964o79505K39467p69553P104l81399q6528m51148l01137
2987B7385827k10302J178455Q48136K34753R32840J009316J114459J328804J167958
$$ y = [14681277, 14215217, 13994891, 13867079, 12857978, 13297049, 14233829, 14198561, 14318724, 13891417, 14001208, 13891872, 14834712, 14703051, 14450451, 14674221, 14812975, 15220921, 15891327, 15852658, 15277185, 15098672, 14887057, 15094939, 15550065, 16137971, 16142066, 16489546, 16745148, 17328970, 17417462, 17596606, 18231382, 17835135, 18333912, 18227349, 19166136, 19662805, 19541086, 20190620, 20351584, 21600017, 23258615, 23864805, 23486654, 24020417, 25232389, 26526733, 27841044, 28621915, 29610978, 30488145, 30346632, 29861877, 29901832, 29991095, 30645524, 30943147, 30504490, 29808526, 29129021, 29368488, 28598935, 28606039, 28224640, 28138112, 27686964, 27385827, 27175525, 28353980, 29202116, 29436869, 30369709, 31379025, 32493484, 33822288, 34990246]
2978C4990246O21553J236917J714996J836890J624613P55364K228361K760270
2970D7769210J976525P12967P78768K36766J021523o45610j309799j516023j848705
2961D7175622l17764R0331j065496k035973j809918j146036j815270n54941n62721
2952C7957834k33718l97647r3894P17593M04372O83449Q36888P17926q1173Q55038
2942D1366668J248242J600762J038306J513588J487788O93755J307091J914759
2934E2170959O95281J75057L57495L35987l05023k58066m40970m99364o29515
2925E1601841j09624q32853q18471m11655k06483j043655K01961R92183L39805
2916D9713049J051121Q54778M787J005263J380795K338489R17423J218358j67896
$$ y = [34990246, 35611799, 36848716, 38563712, 40400602, 42025215, 42780579, 45008940, 47769210, 49745735, 50458702, 51237470, 51474236, 52495759, 51850149, 50540350, 49024327, 47175622, 46857858, 46948189, 45882693, 43846720, 42036802, 40890766, 39075496, 38520555, 37957834, 37724116, 37326469, 37232575, 37950168, 38354540, 39037989, 39874877, 40592803, 40511630, 41366668, 42614910, 44215672, 45253978, 46767566, 48255354, 48949109, 50256200, 52170959, 52866240, 53041297, 53398792, 53734779, 53429756, 53171690, 52730720, 52231356, 51601841, 51492217, 50659364, 49840893, 49429238, 49222755, 48179100, 48381061, 49373244, 49713049, 50764170, 51618948, 51623735, 52628998, 54009793, 56348282, 57265705, 58484063, 58316167]
2907E8316167k83200j255733k523415k647044j474503j092530j936117j347892
2899D5755733P44088m85718m37659p11950l21945K71606m2628J214869J761363
2890D7747759J79579M2615J779452m04072N5057j58083k62018M01952P20544N6807
2880E0159592l19937r49433L75082j514379r27069r58361k068773j381328j847361
2871D0568033j754293j013385j411903q62932k47482o56571o58915L89806L79673
2862C4732031J0986q01328p19364m72874J41903q5518j46121q16343j167419p52052
2852B9923901j041076j235177k81341j175442j174081j365484m80191l14801o51880
2843B2204428o63140k4082J02321p65554j115740n72468l96506K15592m84773
$$ y = [58316167, 58032967, 56777234, 54253819, 51606775, 50132272, 49039742, 47103625, 45755733, 46499821, 46014103, 45576444, 44864494, 44542549, 44814155, 44771527, 45986396, 47747759, 47927338, 47969953, 49749405, 49345333, 49400390, 49242307, 48980289, 49382241, 50102785, 50159592, 49839655, 48890222, 49265304, 47750925, 46823856, 45865495, 43796722, 42415394, 40568033, 38813740, 37800355, 36388452, 35525520, 35278038, 34621467, 33962552, 34352358, 34732031, 34743017, 33941689, 33222325, 32749451, 32891354, 32805836, 32659715, 31843372, 30675953, 29923901, 28882825, 27647648, 27366307, 26190865, 25016784, 23651300, 23171109, 22856308, 22204428, 21541288, 21517206, 21619527, 20853973, 19738233, 19165765, 18769259, 18984851, 18500078]
2834A8500078j84100M33460r79224j034614Q53164m3523o24498o34527n51018
2825A5735198M14094m61608q6774r17771l91399j363791k77928J095279r4661
2816A3650639j115289Q03388p6239l21611j69230J60508p52841j67660J13318
2807A2124983j97639m66488m953O2245n22752j070280p15668K57082k81499J31574
2797I316605r4906N21647N91000p80903j90418m86967M64890J27826j9712j0269
2787I438793j007578k0385N3372m38379j7724O41445m82658m92220n94025k52083
2777F828558M46786J051855n01024q66064j64643l53850N65443L51315l66673
2768F991703R4422j61566j133449k42251L74708j003865J040920Q18864o05131
$$ y = [18500078, 18315978, 18749438, 17770214, 16735600, 17588764, 17545241, 16920743, 16286216, 15735198, 16149292, 15687684, 15600910, 14683139, 14291740, 12927949, 12650021, 13745300, 13650639, 12535350, 13338738, 13262499, 12940888, 12771658, 12932166, 12179325, 12011665, 12124983, 11927344, 11460856, 11455903, 11518148, 10995396, 9925116, 9209448, 9466530, 9185031, 9316605, 9221699, 9743346, 10334346, 9553443, 9363025, 8876058, 9340948, 9468774, 9449062, 9438793, 8431215, 8410830, 8464202, 8025823, 8008099, 8649544, 8166886, 7674666, 7080641, 6828558, 7275344, 8327199, 7826175, 6960111, 6795468, 6441618, 7007061, 7358376, 6991703, 7086125, 6924559, 5791110, 5548859, 5923567, 4919702, 5960622, 6779486, 6174355]
2759F174355j162995K24572J217832q54224P4420j51999l68876L5045L6508K90893
2749E515531k64567J13421j67247n83476K28866J54094j98418p55425J058868
2740E101647m57395m2403M35245n93523J14478O65016k3972j9664K09250j97726
2730E190953q81656P8065Q71136j405000l38716K82267l43829k43193L95046N12054
2720D117127o57014k0624k17087M34738L57371n05068J16907K43610J84796L87486
2710D442242n53527K0653M04559p87157L9357n93695R1678Q53082K1309p1344
2700C867157n88067K75091O6624p940Q1921q7835K37892L33658l94112q79335
2690B905054K62554L9923j34557M86701j10944L44588K68391j13427M1057j66599
$$ y = [6174355, 5011360, 5235932, 6453764, 5599540, 5673960, 5521961, 5153085, 5188130, 5224638, 5515531, 5250964, 5364385, 5197138, 4613662, 4842528, 4996622, 4798204, 4042779, 5101647, 4644252, 4601849, 5037094, 4443571, 4558049, 5223065, 5199093, 5179429, 5388679, 5190953, 4309297, 4387362, 5258498, 3853498, 3514782, 3797049, 3453220, 3210027, 3605073, 4117127, 3460113, 3439489, 3222402, 3657140, 4014511, 3509443, 3626350, 3869960, 4054756, 4442242, 3888715, 3909368, 4313927, 3526770, 3566127, 2972432, 3064110, 3917192, 3938501, 3867157, 3279090, 3554181, 3620805, 3612865, 3694786, 3606951, 3844843, 4178501, 3784389, 2905054, 3167608, 3207531, 3072974, 3559675, 3448731, 3793319, 4061710, 3948283, 3989340, 3822741]
2680C822741J77353j137033O85099P84297M89412k45126K2599j57896j94988m1606
2670D204852P46207m85451K25881M99584j39878K3629m30047M14111N8938J51948
2660E269774J11880O4954n9859p0050l2414J012381q7301m35832J65910K85269
2650F224712P17598L75606L95380j083969k63409K98614Q22300o13222k94184
2641F579426k02144O10936O66704n14791P94760J745p43957K42966O49902j93653
2631G891894O26324N58848M76465J10995O95604N25135j81770m47827P39501N52254
2621A1547423p8405o9793m00005J84056p1395P37367J30496p38893m3640J33728
2611A1330939N08716L22118J31792l18363l48056j29009J73867j4041m30791L08327
$$ y = [3822741, 4000094, 2863061, 3548160, 4332457, 4821869, 4576743, 4599342, 4441446, 4246458, 4204852, 4951059, 4465608, 4691489, 5191073, 5051195, 5074824, 4644777, 5058888, 5117826, 5269774, 5381654, 5446608, 5386749, 5316699, 5284285, 6296666, 6209365, 5773533, 5939443, 6224712, 6942310, 7317916, 7713296, 6629327, 6365918, 6664532, 7486832, 6873610, 6579426, 6377282, 6988218, 7654922, 7140131, 7934891, 7936636, 7192679, 7435645, 8085547, 7891894, 8518218, 9077066, 9553531, 9664526, 10360130, 10885265, 10703495, 10255668, 10995169, 11547423, 11469018, 11399225, 10999220, 11183276, 11111881, 11849248, 11979744, 11240851, 11197211, 11330939, 11839655, 12161773, 12293565, 11975202, 11627146, 11498137, 11672004, 11657963, 11227172, 11535499]
2601A1535499Q70419P53268j2582n21189l13618k32386P39903J119127M008N66803
2591A4509252Q21969p979O0948m99083j246363l54162N56197m31681J97505R6221
2581A3702824j034617Q3575l32762r11707j199004O25508J284950q56452K81444
2572A1643759N13224q14781l78244m99399K77345M90416q07104K38866k83406
2563A0380676p2186L85458O42223q76706L05630O40713K42076P3887J49389O19207
2553A2490367j010526k30393N9051q26228j87432o34628j063845r11004m37308
2544G248054n47401j49822K75804N36199j60659l44924q45099L78806O77274k38502
2534F829730j069805k04464j04511k14886l0588k74374J35136n66657J08350m38802
$$ y = [11535499, 12405918, 13159186, 13146604, 12625415, 12311797, 12079411, 12819314, 13938441, 13942449, 14509252, 15331221, 15323242, 15384190, 14885107, 13638744, 13284582, 13840779, 13409098, 13606603, 13702824, 12668207, 12751782, 12419020, 11507313, 10308309, 10933817, 12218767, 11362315, 11643759, 12156983, 11342202, 10963958, 10464559, 10741904, 11232320, 10425216, 10664082, 10380676, 10308490, 10693948, 11336171, 10459465, 10765095, 11405808, 11647884, 11721771, 11871160, 12490367, 11479841, 11249448, 11308499, 10482271, 10294839, 9660211, 8596366, 7685362, 7248054, 6700653, 6550831, 6826635, 7362834, 7202175, 6857251, 6012152, 6390958, 7068232, 6829730, 5759925, 5555461, 5450950, 5236064, 5205476, 4931102, 5066238, 4499581, 4607931, 4169129]
2524D169129K35854K25320l14271j7237p71096K08495J14917j71886N1638n18085
2514C212778K73821k30693L59936m25581P02227l50892p13842r753L5594N76113
2504C429708k27636j287218m29034N13209O9826j59310m42762J115522L29217
2495B911522j71596n54209p95827l22564P97266o20864o79833M84012k63330l4393
2485G50184k82526L05227m19545l6236J70891J350191K86434l77910j08855R9903
2475A737758o2887j85296k82797l84479l38295K57780J60293n21801O88170j10330
2465I58116j08727Q7434J60504k71053L46930q50788o66537P703Q19951P90419
2455A273952k06459j32514j00798p5603l3401k73970q06901p12537Q06588Q05652
$$ y = [4169129, 4404983, 4630303, 4316032, 4298795, 3527699, 3736194, 3851111, 3679225, 3730863, 3212778, 3486599, 3255906, 3615842, 3190261, 3892488, 3541596, 2827754, 2818001, 2853595, 3429708, 3202072, 1914854, 1485820, 1999029, 2068855, 1909545, 1466783, 2582305, 2911522, 2739926, 2185717, 1389890, 1067326, 1864592, 1243728, 563895, 1047907, 784577, 750184, 467658, 772885, 353340, 317104, 487995, 1838186, 2124620, 1746710, 1637855, 1737758, 1674871, 1489575, 1206778, 822299, 484004, 741784, 902077, 380276, 1068446, 958116, 849389, 936823, 1097327, 826274, 1173204, 322416, -344121, -336418, 483533, 1273952, 1067493, 934979, 834181, 758578, 725177, 451207, -355694, -1068231, -261643, 544009]
2445E44009J65650j31022k87522L84865q80542Q2282k20384O95310m1723P24036
2435A034959k66870o64104J2667L49817K96079l43187j15202l81439O31065j00735
2425D53050L51466n0647J76493M52817n72588j90501l79692l02683O56080p0139
2415E23656o97217K99615L72012k00837L11977n56776o70866K05586m07466M54645
2405c65671L7368Q71997N877j35527L79223k864k60380j77803j054154L43299
2395c58635K24079m82998O78838J397925p33813l93607O05137k79308N7084P65472
2385A480174j26375N3736L49908o99046K42612j44433O92215q02552N16516J374560
2375B937315l61073l76232L86819J89830m34431j292478o22667L76450J22475
$$ y = [544009, 709659, 578637, 291115, 675980, -204562, -122280, -342664, 352646, 310923, 1034959, 768089, 103985, 116652, 466469, 762548, 419361, 304159, -77280, 553785, 453050, 804516, 753869, 930362, 1383179, 810591, 620090, 240398, -62285, 593795, 523656, -173561, 126054, 498066, 297229, 609206, 52430, -618436, -412850, -820316, -365671, -328303, 543694, 549571, 414044, 793267, 790403, 530023, 352220, -701934, -358635, -134556, -617554, 61284, 1459209, 725396, 331789, 936926, 657618, 714702, 1480174, 1353799, 1407535, 1757443, 1058397, 1301009, 1156576, 1848791, 1046239, 1562755, 2937315, 2576242, 2200010, 2586829, 2776659, 2342228, 1049750, 427083, 803533, 926008]
2366I26008l66351J6388m6479O9818J41115R7305l34219r9678m28069J145004
2356A120842N32563k05586J14654j63582k67538l63890K3479m01966K19097J25887
2346G33960l84913J52567k08420M74430j61344q31023K37561M3542k7388R74562
2336A003534N37814k70987N5880L8258j453289k05471K86475J42114M37615K44241
2326H16184j31821l56160p7796K01337N05343k86731l59267m4692J4566p9555
2316B01408m91909K53685Q52205M18752o6049k06305j24649O57601K09000l29738
2306A374001L62572k34260P0387J93889p41876o6902k46735l8521k46923K83530
2296G09162l1419J38937K42515j92688o04449l38215P42450N36961p74744J1836
$$ y = [926008, 559657, 576045, 529566, 599384, 740499, 837804, 503585, 403907, -24162, 1120842, 1653405, 1447819, 1562473, 1398891, 1131353, 767463, 790942, 388976, 608073, 733960, 349047, 501614, 293194, 767624, 606280, -224743, 12818, 56360, 28972, 1003534, 1541348, 1270361, 1326241, 1364499, -88790, -294261, -7786, 134328, 571943, 816184, 684363, 328203, 250407, 451744, 957087, 670356, 311089, 266397, 280963, 201408, -290501, -36816, 815389, 1234141, 1168092, 961787, 837138, 1494739, 1703739, 1374001, 1736573, 1502313, 1572700, 1766589, 1024713, 957811, 711076, 672555, 425632, 709162, 677743, 816680, 1059195, 866507, 262058, -76157, 666293, 1203254, 428510, 440346]
2286D40346J86195k32213M8390l53651M29956N08597j52830M2169l33972l74633
2276B08354L14588J10346L75639M88309m50443n86837O85377m26819k13582L97681
2266I02613n33513N27667L35415n97909N0242j47435M71119J92947R7821n93879
2256G05088L69557M64384k38383N6391o8499J38225j29615K65774Q89739K7694
2246B480355m05201n26793k94199K21261L05745J38803P5086N8934J23230o49313
2236A527908o8399j56598r3548o4270M79312O02493r015q11050j93023P67994
2226A981804j0081l26099J32751M1353R0781J24066O75125r81017j82714Q09978
2216B355947O35601l86531j62337K92326K1801m22157M94766l62239J80831L35729
$$ y = [440346, 626541, 394328, 442718, 89067, 519023, 1027620, 874790, 916959, 582987, 208354, 522942, 633288, 1008927, 1497236, 1046793, 459956, 1145333, 718514, 504932, 902613, 369100, 896767, 1232182, 634273, 684515, 537080, 1008199, 1201146, 1298967, 705088, 1074645, 1539029, 1300646, 1357037, 1288538, 1426763, 1297148, 1562922, 2452661, 2480355, 2075154, 1548361, 1254162, 1475423, 1781168, 1919971, 1995057, 2053991, 2177221, 1527908, 1459509, 1302911, 1209363, 1145093, 1624405, 2226898, 2217883, 1406833, 1213810, 1981804, 1971723, 1645624, 1778375, 1819728, 1910509, 2034575, 2709700, 1728683, 1545969, 2355947, 2991548, 2605017, 2442680, 2735006, 2756807, 2334650, 2829416, 2467177, 2648008, 2983737]
2206B983737O0640Q4755R6269N44683k29457K53984l82558n29245J598025J64127
2196D644960r23359L03684J25290P08453O9716l19290J092765M61564M4949R12591
2186G121323K75518l08062R27962l39112q13782P61615m2597k0329L51875r5484
2176G818927j67902R70036M33343o733M88083M09971L955K53738q543j15081O36136
2165A0715930L65473l34474j66020R65316M92954K3073P77827N18841K92736j91402
2155A3460254J034567N85407P88204k83539K32091J056964J678580P77007L94691
2146A9724226l5720J283321R74014N81022R92103J410401J297201Q85140J207324
2137B8319032R81243J495710J419966J794477L142654J815614K405464K595167
$$ y = [2983737, 3044377, 3129132, 3225401, 3770084, 3540627, 3794611, 3412053, 2882808, 4480833, 4644960, 3721601, 4025285, 4150575, 4859028, 4928744, 4609454, 5702219, 6163783, 6208732, 7121323, 7396841, 7088779, 8016741, 7677629, 6863847, 7625462, 7582865, 7562536, 7914411, 7818927, 7651025, 8621061, 9054404, 9047671, 9535754, 9945725, 9949680, 10203418, 10194875, 10079794, 10715930, 11081403, 10746929, 10580909, 11546225, 12039179, 12062252, 12840079, 13358920, 13651656, 13460254, 14494821, 15080228, 15868432, 15584893, 15816984, 16873948, 18552528, 19329535, 19724226, 19688506, 20971827, 21945841, 22526863, 23518966, 24929367, 26226568, 27111708, 28319032, 29300275, 30795985, 32215951, 34010428, 37153082, 38968696, 41374160, 43969327]
2129D3969327K262387L291584L854256L928619O253782N894545M810688M168939
2121G8434127N720330P366178R619232J1989164J4190895J6373255K0238887K6269666
2113A90201734L5217797M2830114O0971873P7596459O8954707p184510r8729035
2106C69859139r7802592o1382957l8792256k7686053k1843640j7268290j2584353
2099I2498998q637333o211872o131604m064148l081812k415347l592396n495237
2091E2869249m495838l487518l820778l471569k775487k060237j201298j528586
2083C0027938j078111k018988j387470j263852n35316o92707j185183j155548
2075B0710763p91581q57602l4584j180674q85951j48013j091106j155193o21287
$$ y = [43969327, 46231714, 49523298, 53377554, 57306173, 63559955, 69454500, 74265188, 78434127, 84154457, 91520635, 101139867, 113129031, 127319926, 143693181, 163932068, 190201734, 225419531, 268249645, 329221518, 406817977, 475772684, 468588174, 369859139, 272056547, 210673590, 171881334, 144195281, 122351641, 105083351, 92498998, 83861665, 77649793, 71518189, 67454041, 64372229, 61956882, 58364486, 52869249, 48373411, 44885893, 41065115, 37593546, 34818059, 32757822, 31556524, 30027938, 28949827, 26930839, 25543369, 24279517, 23744201, 23051494, 21866311, 20710763, 19919182, 19061580, 19026996, 17846322, 16960371, 16812358, 15721252, 14566059, 13944772]
2066A3944772M41819J04818p95709N7827o8486q01229N86957o25358j74565m40564
2056A2230282j201730r85687J44475J64077p72697l99197K40687q65946k864l42829
2046H208571k64341K12801o0542n02515M98631k66625k31958j8449l33978j054834
2036F186761J82782k51977o4296N09449k10716l60779l96803m41914n14554N45756
2026E183709m91130p1617K57068o61711m055J01625l7833m43027k71805j09095
2016C452129l28641p014O50167O06589J07188M6754J69039j33192n10166P9380
2006D132233k45055L74272J2926m53210k96367p77237L57559L13106k13467L58777
1996C563537o17929q02463K04153N25543k80292p03346L76912L78766q86563k09678
$$ y = [13944772, 14386591, 14491409, 13695700, 13753527, 13685041, 12883812, 13470769, 12845411, 12670846, 12230282, 11028552, 10042865, 10187340, 10351417, 9578720, 9179523, 9420210, 8554264, 8551400, 8208571, 7944230, 8157031, 8096489, 7593974, 8092605, 7825980, 7594022, 7575573, 7241595, 6186761, 6369543, 6117566, 6053270, 6562719, 6352003, 5991224, 5594421, 5152507, 4637953, 5183709, 4692579, 4620962, 4878030, 4216319, 4212264, 4313889, 4276056, 3833029, 3561224, 3452129, 3123488, 3116474, 3766641, 4373230, 4480418, 4527172, 4696211, 4563019, 4052853, 4132233, 3887178, 4261450, 4274376, 3821166, 3524799, 2747562, 3105121, 3418227, 3204760, 3563537, 2945608, 2143145, 2347298, 2872841, 2592549, 1889203, 2266115, 2644881, 1758318, 1548640]
1986A548640l54845L74950J267940J03329m03873K56219J38926k57570l74063
1977B299653n51638R020k54885K74202P84151p06502l09272o5772R09838o57413
1967A731382k97276K03322K7779L51720m44838L19276n64715l07947O77250q3657
1957A612296J09018l63932l88033N03208L80216m8575n50527J40005L91739M75581
1947B260996j141714O2556l75370L10720P7161m39408K5054N56593L28017m74428
1937A190177j05762n38133N528k06579O28115j33327J47509J58310K07386j21375
1927A231849N53443j99629o35302j69821m55422M18715L89531j1562k97830K00104
1917A024076o65O56639K48784o3604N3710p61162j14190P18587M050n79834k13132
$$ y = [1548640, 1193795, 1568745, 2836685, 2940014, 2536141, 2792360, 2931286, 2673716, 2299653, 1748015, 1757035, 1502150, 1776352, 2560503, 1854001, 1544729, 1478957, 2388795, 1731382, 1434106, 1637428, 1665207, 2016927, 1572089, 1891365, 1326650, 1018703, 1695953, 1612296, 1721314, 1357382, 969349, 1472557, 1852773, 1804198, 1253671, 1393676, 1785415, 2260996, 1119282, 1181838, 806468, 1117188, 1194349, 754941, 779995, 1336588, 1664605, 1190177, 1084415, 546282, 551810, 345231, 973346, 840019, 987528, 1145838, 1353224, 1231849, 1785292, 1585663, 950361, 780540, 325118, 743833, 1133364, 1121802, 823972, 1024076, 1023411, 1680050, 1928834, 1865230, 1918940, 1157778, 1043588, 1762175, 1766225, 1186391, 973259]
1906I73259q18435J013996j99075k17496Q4434p82066J31512P21449k04308n62515
1896A40755N29836m78231k94586J12523k83409k073K08868N51181k16165L67934
1886F36633p91063o7447O01418M89902k4826q24161k19152R3809K95887L65003
1876E56003J14611J03662R9559K90327l65912N04099n00003M8216J74726m53522
1866E71766q9253l8788L61616j62755N48815p5576j23029m39866N31294N92909
1856A677133k91469L16855N1404n72912k135o5639k5043M24689n32205m06540
1846E74138P73528K48196J23880r87546Q79260O49387J31954P71059k76487o38678
1836B248691L6820o63100n55611l79940K20357m7355q16133k25372M21653J77867
$$ y = [973259, 154824, 1168820, 969745, 752249, 836683, 54617, 186129, 907578, 703270, 140755, 670591, 192360, -102226, 10297, -273112, -275185, -66317, 484864, 268699, 636633, -154430, -221877, 379541, 869443, 844617, 20456, -198696, -104887, 191000, 556003, 670614, 774276, 873835, 1164162, 798250, 1302349, 802346, 850562, 1025288, 571766, 482513, 443725, 805341, 642586, 1191401, 1115825, 992796, 552930, 1084224, 1677133, 1385664, 1702519, 1753923, 1181011, 1178876, 1113237, 1088194, 1512883, 980678, 574138, 1347666, 1595862, 1719742, 732196, 1611456, 2260843, 2392797, 3163856, 2887369, 2248691, 2285511, 1622411, 1066800, 686860, 907217, 859862, 43729, -181643, 240010, 417877]
1826D17877o29963L52245O73692j87957P0489L05513k0291m90476L0325N70317
1816A091771j80134n06827J9479K15203q43744l06999J683060k718p40829j65656
1806B62606J60561J97518M1974Q51242o44446o14449o93895K94337L8744O36435
1796E30627N02514q19370n69105j58881O78911R7538j13771k57864J739939j37979
1786A492559q34470m08255M6759J90494k81514j376k05493P45680k12216R93661
1776A525829q3359j134819N11318q60513O10102l4439L05642j69315N26900m14346
1766G83000j129N85801j233983l60518M17030Q0640M26192o6802m92586q66322
1756g28677M28082P4234N39614o35998R3187L46774k10619J56033J26575R78512
$$ y = [417877, -212086, 140159, 813851, 625894, 696383, 1001896, 981605, 491129, 521454, 1091771, 911637, 404810, 424289, 639492, -204252, -511251, 1171809, 1169091, 428262, 262606, 423167, 620685, 662659, 1513901, 869455, 255006, -438889, -144552, -105808, 530627, 1033141, 213771, -355334, -514215, 164696, 262234, 148463, -109401, 1630538, 1492559, 658089, 249834, 296593, 487087, 205573, 204197, -1296, 744384, 532168, 1525829, 1442470, 307651, 818969, -41544, 568558, 534119, 839761, 670446, 1197346, 783000, 781871, 1367672, 133689, -226829, 190201, 270841, 697033, 630231, 137645, -728677, -300595, -226361, 313253, -322745, -229558, 117216, -93403, 62630, 189205, 1167717]
1746A167717r03441k93641L503K97859m35242L24338m05352P88106M3550p0517
1736E16880k97297j84833j76435N6041n22188k76309N27520K93816L17152j22547
1726A31800r999J58605R74473q4568r68044n0079o01259k10599N05192P77671
1716F23193p40387n25117m11278N64771k29610l0330M42655K57901l69747J43132
1706b74817j4752N0953M50407K01559l04045J07708J43804p02978l91626l55132
1696a088919o921N48142P82607q19547k67144R74478p7841M37224L2031K25772
1686G39882k01723o45096m45858m31359j19352M1266N86650j61248M85487K26095
1676G4744R77386j10031m78059K41198J6679j223928N14312J08176L39563q0849
$$ y = [1167717, 264276, -29365, -25862, 271997, -163245, 161093, -244259, 543847, 587397, 516880, 219583, 34750, -141685, -85644, -607832, -884141, -356621, -62805, 254347, 131800, 121801, 280406, 1254879, 1170311, 202267, 152188, -449071, -659670, -154478, 623193, -117194, -642311, -1053589, -488818, -718428, -748758, -306103, -48202, -417949, -274817, -289569, -238616, 211791, 413350, 109305, 217013, 360817, -342161, -733787, -1088919, -1095840, -547698, 234909, -584638, -851782, 122696, 44855, 482079, 514110, 739882, 538159, -106937, -552795, -984154, -1103506, -1062240, -475590, -636838, -151351, 74744, 1052130, 942099, 464040, 705238, 721917, -502011, 12301, 120477, 460040, 379191]
1666C79191L8228n46707J58208J55501k36398P48353l79051m47857j161954M52454
1656h40032p2020N34432L14463N48486j22175P09962J27357K50309o66223m36369
1646C48190n52716m60257R313l97110N88061m79155L30089L69032L11641k56960
1636a89872j63001J30889R2422M5708N88872o50140J27605Q54228N8176l32662
1626E62225J60323l00986o77214k85229K45803J24582M75434K91919l06958l53718
1616f3819Q03646k10466j00672l45894k03448J53731J54292J90992k57392J13165
1606B34135n84719M78966l120K29526n63117N17122P00868p57357l31631K99009
1596B19682k24270L11685O72032o45715k90886Q19720n45045K5265p61179J89005
$$ y = [379191, 417419, -129288, 28920, 184421, -51977, 696376, 317325, -130532, -1292486, -840032, -912052, -377620, -63157, 485329, 363154, 1073116, 1200473, 1450782, 784559, 348190, -204526, -664783, -655470, -1052580, -464519, -943674, -613585, -244553, 67088, -189872, -352873, -221984, -129562, -83854, 505018, -145122, -17517, 836711, 894887, 562225, 722548, 421562, -255652, -540881, -295078, -170496, 304938, 596857, 289899, -63819, 739827, 529361, 428689, 82795, -120653, 33078, 187370, 378362, 120970, 234135, -350584, 128382, 125262, 354788, -208329, 308793, 1009661, 252304, -79327, 219682, -4588, 307097, 979129, 333414, 42528, 862248, 317203, 342468, -418711, -229706]
1586b29706p3822m36410P91652n97691n3356R48255M05443l93787R03833r23523
1576C40888m47753p9734J014407L11758k39221q59138K98789l71618k15157O66162
1566D19383k09848q53117N49077j24844Q74853K4138m28294L90723o07407l9966
1556e302L42863J03475J21948p45286n44812M6585L35195K48550m30963J42451
1546c85296k5862R66695n38332L28185j03485j95809L71060J53811j07101l14827
1536A49039p80640O95070l2803m12840p2578O36328j24575k48091r8807j16620
1526d06517k17051O20098k92042K25541Q06933m77809j98832r2790J81784k64391
1516a15076L91298j00956J01716j9837J953Q00707j73148m55485p16121R1948
$$ y = [-229706, -303528, -739938, 51714, -545977, -599333, 348922, 754365, 360578, 1264411, 340888, -106865, -186599, 827808, 1139566, 900345, 41207, 339996, -31622, -246779, 419383, 209535, -643582, -94505, -219349, 655504, 679642, 251348, 642071, 34664, -5302, 337561, 441036, 562984, -182302, -727114, -680529, -345334, -96784, -527747, -385296, -411158, 555537, 17205, 345390, 241905, 46096, 417156, 570967, 463866, 149039, -631601, 63469, 30666, -382174, -454752, 181576, 57001, -191090, -289897, -406517, -623568, -3470, -295512, -69971, 736962, 259153, 60321, -32469, 149315, -115076, 276222, 175266, 276982, 257145, 259098, 1059805, 886657, 431172, -284949, -193001]
1506a93001Q09844q09305l40494j16723J150030M07351m97706k50026o73838l71183
1496h85051O88984Q38721p41422n04962j60605J18241K77492m0745k97352J67067
1486e39632m86437L08873P50771O94782r9585k98386l33026j51601N2272k05484
1476c07453O05432J60617k02659k40245q6723l47066J67289M55663j6823m24935
1466b36903o61411k25567P72466j73248k5110K83138P24640o8843M04592p46202
1456D7552o13135J099927n58813M31827k49019k87906j29018m32356k93362P12936
1446b71367L45690Q08081j054586n14914p9796J44659L33205j80965P28161m94625
1436b36457K73106P15770P79063j015403j035706n13204j16608M62424K96884
$$ y = [-193001, 616843, -192462, -532956, -649679, 500351, 907702, 409996, 159970, -513868, -885051, -196067, 642654, -98768, -603730, -764335, -646094, -368602, -409347, -706699, -539632, -1026069, -717196, 33575, 728357, 628772, 330386, -2640, -154241, -101969, -307453, 297979, 458596, 255937, 15692, -71031, -418097, -250808, 204855, 188032, -236903, -898314, -1123881, -351415, -524663, -549773, -266635, 458005, 389162, 793754, 47552, -565583, 534344, -24469, 407358, 158339, -129567, -258585, -690941, -984303, -271367, 74323, 882404, -172182, -687096, -766892, -622233, -289028, -469993, 258168, -236457, 36649, 752419, 1531482, 516079, -519627, -1032831, -1149439, -687015, -390131]
1427c90131l01300M79249J78437l86439m52184M44154k66570j1135M94697l92250
1417f03472M24229j13408Q07307M84324m57277l01555M92857n02992L79821P4481
1407F84315M0565n15664j70958N23438m46141O47491k74366l60512J46752k43264
1397C1656P904j156687K61760O67391J286754r40981n72693P48946j45402l89546
1387b00898m18917K24263K94832K67015j47682j22633M27969r84271l61918Q70836
1377a51404K04121O70178j609799O77222L08048n9918K58736J53964l60946k26595
1367a36393L91120j94679K37551p38047k80037R90927K4102M48331q40280j28221
1357b25626j34733K71836j67347L70114J53335M9277p26157k31126j49744K52518
$$ y = [-390131, -691431, -212182, -33745, -420184, -872368, -428214, -694784, -705919, -211222, -603472, -179243, -292651, 514656, 998980, 541703, 240148, 733005, 230013, 609834, 684315, 724880, 209216, 38258, 561696, 115555, 763046, 488680, 128168, 274920, 31656, 39560, -1117127, -855367, -187976, 1098778, 157797, -414896, 334050, 188648, -200898, -619815, -395552, -100720, 166295, 18613, -104020, 323949, -660322, -1022240, -151404, 52717, 722895, -886904, -209682, 98366, 38448, 297184, 451148, 90202, -136393, 254727, 60048, 297599, -440448, -720485, 270442, 294544, 742875, -97405, -225626, -360359, -88523, -255870, 114244, 267579, 316856, -409301, -640427, -790171, -537653]
1347e37653M14527O71553k37395N6105M4705m69038k23921m78109l60247N97198
1337e22275M15510J55449L70717k39115o77226N16422N97311o36517k13273p53481
1327i86478J019739L06344k45518j00198l61196R9235O98090j63354q39956r32351
1317a505643O47103J54164N12925J08670r0118k19611p29178k58877O34403M3639
1307g02523m94495N87479N85155p76753m00413M43053j48295Q88403L01063k65470
1297A7204k62658K32574N04099m74959K71206J66607o83586O12989n87551j046687
1287a250762M10487J159949M05277k33195l77207M26750M40940q43880j131403
1278i93044J36085N70675L31812M35498r14291l96204J00403Q7936j72943R24899
$$ y = [-537653, -123126, 548427, 311032, 367137, 411842, -57196, -281117, -759226, -1119473, -522275, -106765, 48684, 419401, 180286, -496940, 19482, 616793, -19724, -232997, -986478, 33261, 339605, 94087, -6111, -367307, -268072, 430018, 266664, -573292, -1505643, -858540, -704376, -191451, -82781, -172899, -392510, -1121688, -1380565, -746162, -702523, -1197018, -609539, -24384, -801137, -1201550, -758497, -906792, -18389, 282674, 17204, -245454, -12880, 491219, 16260, 287466, 454073, -229513, 383476, -204075, -1250762, -840275, 319674, 724951, 491756, 114549, 541299, 982239, 138359, -993044, -856959, -286284, 45528, 481026, -433265, -829469, -729066, -641130, -814073, 110826]
1268A10826j137587M12515M40935o2626J65129J440542m67448m34429l39841K17051
1258C45067Q2857n60019l07552j20040m4814k12851M04449J23250l65400j07225
1248g62278K40415n9523R1029Q24508O43303j12411L04705k15215k95603N593
1238F64523M1279l693n15673l97516k59661J29905n8372J79123J003528k3885
1228G59558j517077j78400J099171o8116k10844M83708L70758n23455p94955r05786
1218a485438R35827J45510M30580M61260k92793K32127J66809r36138m01627j45991
1208h89874M36442m22942j36582N82788k31013r3253N21612k0876J78677L47840
1198B72819N83600l87109o38724K44056L54009k73691n71463j036752N73994L45676
$$ y = [110826, -1026761, -614246, -173311, -235937, -70808, 1369734, 902286, 467857, 128016, 345067, 427924, -132095, -439647, -559687, -604501, -817352, -412903, -289653, -655053, -762278, -521863, -581386, -490357, 334151, 977454, 865043, 1169748, 954533, 658930, 664523, 705802, 702109, 186436, -211080, -470741, -340836, -399208, -220085, 783443, 759558, -757519, -935919, 163252, 95136, -115708, 368000, 738758, 215303, -579652, -1485438, -549611, -404101, 26479, 487739, 194946, 427073, 593882, -342256, -743883, -889874, -453432, -876374, -1012956, -430168, -661181, -754434, -232822, -253698, -75021, 272819, 856419, 469310, -169414, 74642, 428651, 154960, -416503, -1453255, -879261, -533585]
1188e33585M80238m31174L1990P06451m77177O38194j44827k42220J37129q89656
1178g24637m23483J43808P29759m0776J24702o5807J34359M29782j157997p5429
1168i25719j34472r590r55378J351257J119768K46331R20192n24115r12591n82914
1158d07231Q14586m41030M82820p7072J72021l19989r65046j5286j88543K61228
1148f83542K43491N61050K76o78433M04815P18334m26612m40091N37332l5495
1138B01125o24734K49328O39070k35005k28017k44047O80011J80960m53243N00343
1128F65791L82254n79861q07540P47568j49652p56700m70217Q05342k51717j95462
1118f10194L12179l7585O7396J26622L3145M52283N98705J36619n61181m20944
$$ y = [-533585, -53347, -484521, -452531, 253920, -223257, 414937, 270110, 27890, 165019, -724637, -1148120, -1004312, -274553, -315329, -190627, -256434, -122075, 307707, -850290, -925719, -1060191, -1069781, -2025159, -673902, 445866, 692197, 1612389, 1088274, 175683, -407231, 407355, -33675, 449145, 372073, 544094, 224105, -740941, -756227, -944770, -683542, -440051, 120999, 121275, -557158, -152343, 565991, 139379, -300712, 236620, 201125, -423609, -174281, 464789, 229784, 1767, -242280, 437731, 618691, 165448, 665791, 1048045, 468184, -339356, 408212, 258560, -498140, -968357, -163015, -414732, -610194, -298015, -335600, -268204, -141582, -108437, 343846, 942551, 1079170, 517989, 97045]
1108I7045N46114k16039n84630n44771n98811J095481l00346L9180J147076M86494
1098A166793l35878o86571m91813m50225J61523R30349Q9037j102857K05708j3117
1088e27051k25382M63657Q52840j1989r19246r8184o73321J30691J74805j16042
1078i49222K8109J48718M41425M29367o10281L4132Q08861M94200r83344l79464
1068e37499L71452j37960J59170M78648J83946K72959J2139n60741m8160L90173
1058E84127l51024m96208m33334j44370N03189J86580j30856m03994J1175L13456
1048c61259M62441M32991l14222l10900J000815o36594l37442Q20461M2589p81546
1038A7334M80221n83769k53613N98935M85886m41792r80544J196074P75394m90251
$$ y = [97045, 643159, 427120, -157510, -702281, -1301092, -205611, -505957, -466777, 680299, 1166793, 830915, 144344, -347469, -797694, -636171, 294178, 383215, -719642, -513934, -527051, -752433, -288776, 564064, 552075, -367171, -465355, -1138676, -1007985, -833180, -949222, -921113, -772395, -330970, 98397, -511884, -477752, 331109, 825309, -158035, -537499, -166047, -304007, -144837, 333811, 517757, 790716, 802855, 242114, 193954, 584127, 233103, -263105, -696439, -840809, -337620, -151040, -281896, -685890, -674715, -361259, 101182, 534173, 219951, -90949, 909866, 273272, -64170, 756291, 798880, 17334, 497555, -86214, -339827, 259108, 744994, 303202, -677342, 518732, 1294126, 803875]
1028H03875l5033m33338L18132n92419o95897n49137m22470J231551j28634J42009
1018c61361L48126m14016M0348R6118j34626M66801R60748o17694K8307N76323
1008I89074j97280j030253L58483j24212j07127j99119r22281J473994o96441
999d55162J098071M96344r5096k69169q16012M4187M0549m81526m53770P96723
989i4861K31220j10351l61128J33491L4656J02549K96428M27793m51288l10308
979a01799n77146l46600Q47567O83479p81111r177l83399Q5812L58853k18911
969d42432k79205O96141r11430K87005O59176l11697Q07733m70224m87420n4001
959e06354P45006o34027l95360o4028L42474j84068k09064O14049j06634k24699
$$ y = [803875, 768842, 335504, 653636, 61217, -634680, -1183817, -1606287, -374736, -503370, -361361, -13235, -427251, -386903, -290785, -425411, 41390, 1002138, 384444, 412751, 989074, 791794, -238459, 120024, -4188, -111315, -310434, -1232715, 241279, -455162, 642909, 1139253, 1044157, 774988, -41024, 3163, 43712, -437814, -891584, -94861, 136359, 26008, -335120, -201629, -166973, -64424, 232004, 659797, 208509, -101799, -678945, -1025545, -177978, 505501, -275610, -284787, -668186, -582374, -223521, -442432, -721637, -25496, -936926, -649921, 9255, -302442, 505291, 35067, -452353, -506354, 238652, -395375, -790735, -854763, -512289, -696357, -905421, -291372, -398006, -622705]
949f22705O59739m75961O4949P29797K71261P7295M8304o89882m2651j18531m73140
938e71525J54516N4695J12745j96328n76408M89671P01675j56478O05136k85727
928C31972o4339P42766j61281l55247n73797o57462K26694L24210q27405L34664
918f79225P97665p26022J76274o03717M43336J09607O11892O17092m29302j006752
908f89152L51113K79250k71807K37599K93206r6749o04541r934k18059L98780
898c30294L52218J79444m53189j091745O67346J338833j21060l9189m06505j62234
888f6375L1957M10513J21621p9582q59555M93955o52080J87972m38971m07823
878a258368N77680O14640O0112k19262M04246N85822M44191p11775m82846q33700
$$ y = [-622705, 37034, -438927, -373978, 355819, 627080, 704375, 752679, 62797, 20146, -98385, -571525, -417009, -362314, -249569, -445897, -1022305, -532634, 169041, 12563, 617699, 331972, 267633, 1010399, 849118, 493871, -79926, -737388, -510694, -186484, -1013889, -679225, 118440, -607582, -431308, -1035025, -591689, -482082, 129810, 746902, 317600, -689152, -338039, -58789, -330596, -92997, 200209, 103460, -501081, -511015, -729074, -330294, 21924, 201368, -251821, -1343566, -676220, 662613, 541553, 502364, 95859, -66375, -34418, 376095, 497716, 418134, -441421, 52534, -599546, -411574, -850545, -1258368, -680688, -66048, -5936, -225198, 179048, 764870, 1209061, 497286, 14440, -819260]
868h19260O5007J325539k74607n07091j61728o143N16958j61299m61805l79348
858h63777M82977M29366J38818k78302j33796P67866J42143N84288j68698o99886
848D00999M76875K34464p96886j516803P98666q22913N9084m2913N690L58369
838h45368l29969N81840Q32255l4257m58110K82462K45463p90735L01278L97286
828A82145K66261n14975J82896Q3960r95779K749l76303m90819P70736K43773
818f45356L85550L59621J01222N42520j16098k21343m0135L2297n50999J161959
808A009238r35573l31251m57347P86652k56657N19698K38507n19740L36761L6941
798D27229M45240j267066M3200K82693L51056J2916l15955J90861m24235m78562
$$ y = [-819260, -754253, 571286, 296679, -210412, -372140, -378283, 138675, -22624, -484429, -863777, -380800, 48566, 187384, -90918, -224714, 543152, 685295, 1269583, 1100885, 400999, 877874, 1112338, 315452, -1201351, -402685, -1225598, -1166514, -1209427, -1203737, -845368, -1175337, -593497, 238758, 204501, -253609, 28853, 274316, -516419, -215141, 182145, 448406, -66569, 116327, 200287, -795492, -792743, -1169046, -1659865, -889129, -645356, -259806, 99815, 201037, 743557, 627459, 406116, 365981, 398278, -152721, 1009238, 73665, -257586, -714933, 71719, -184938, 334760, 573267, 53527, 390288, 427229, 872469, -394597, -351397, -68704, 282352, 295268, -20687, 170174, -254061, -732623]
788g32623r7614n35692M90878J025229J04019j59971n0549J36414k71709n60654
778f52272l55896K50840L21134P7670O43508m11340o39467m8981l46142O44503
768e16443M54985n1152P5242m97870J110972Q6605k90117n26583l21644K23406
758b52599N09522r5647K35793M86867n18475j25775J00288k55119l57163l16262
748e88570M97430N11236m06873l56282j63003k61n72847K57775L25848j12204
738f07751K63425J82208R74643k75721p83574J17240R85451J22487q49313L8179
728A67274k79801j85710J53344R1125K27448R1408K53382P84437m68874j03210
718G30823p30882J15820R5276J39687N06600k93043J57846p14365K02863o37983
$$ y = [-732623, -830237, -1365929, -875051, 150178, 254197, 94226, 43677, 180091, -91618, -652272, -1008168, -757328, -436194, -358524, 284984, -126356, -765823, -814804, -1160946, -516443, -61458, -112610, -37368, -535238, 575734, 662339, 372222, -154361, -476005, -252599, 256923, 161276, 397069, 883936, 365461, 239686, 339974, 84855, -272308, -588570, -91140, 420096, 13223, -343059, -506062, -506323, -1079170, -821395, -495547, -607751, -344326, -162118, 812525, 536804, -246770, -129530, 855921, 978408, 129095, 167274, -112527, -298237, -144893, -53768, 173680, 265088, 518470, 1302907, 834033, 730823, -59, 115761, 211037, 350724, 857324, 564281, 722127, 7762, 210625, -427358]
708d27358l7938j06855m74387M08800k65477J15139L60987K16657M19500j2092
698A96976L94667p47312P7054R06124q95202N78024K18292j170635k45896L24466
688c63442Q22513Q00907n36728l03871K77779m48657q42284Q93153J7902Q3880
678D01152k91862O1194j58615k28083k20928m73169M27240j47350j74730M93604
668c11547J52242n0875J41613J22641m64308J57453K93508k86393N70457L95548
658G20339r48215Q40756L086k51523L0372n32498K50505j11691M29247j40786
648B89592k5337O5100j154673K33704R40751k76754O34085n35955l65072Q19255
638F24696n56205n00067K30339R45670j027435l36805Q52477o336j28821l99152
$$ y = [-427358, -465296, -572151, -1046538, -637738, -903215, -788076, -427089, -210432, 209068, 196976, 591643, -155669, -78615, 827509, -67693, 510331, 728623, -442012, -687908, -363442, 459071, 1259978, 723250, 419379, 697158, 248501, -593783, 299370, 317272, 401152, 109290, 170484, 11869, -216214, -437142, -910311, -483071, -630421, -805151, -311547, -159305, -210180, -68567, 54074, -410234, -252781, 40727, -245666, 324791, 720339, -227876, 612880, 615966, 364443, 394815, -137683, 112822, 1131, 430378, 289592, 264255, 329355, -825318, -591614, 349137, 72383, 706468, 170513, -194559, 624696, 68491, -431576, -201237, 744433, -283002, -619807, 232670, 226334, 97513, -301639]
628c01639K74402p13526R95862K52968m41437m1073K28518K78525j211387K70494
618d08293M59807l83441J1674O63535N38926j279871J72953K42589k74189k15777
608d72087M52732K30415K76649M6133j56552r05125Q27323M01538l65931j18886
598B16209n74280K61289J87089L21292N7487l26382K09791l69612O75054Q12644
588A470581q26924l90974m91132j73010J94471k77535K45548J06588k49123M51530
578F0020k50489N13828l29995J88518j23044n27603M55636q1293n28693j08413
568g31528o48561n4420L06542Q71150L35100O8319K68381k39771J44375r79643
558f60056M24012O22832j517296n38728N25091J246482N37458L24088r35464m52558
$$ y = [-301639, -27237, -740763, 255099, 508067, 66630, 25557, 254075, 532600, -678787, -408293, 51514, -331927, -320253, 343282, 882208, -397663, -224710, 17879, -256310, -472087, -19355, 211060, 487709, 533842, 377290, -527835, 299488, 701026, 335095, 216209, -358071, -96782, 90307, 411599, 469086, 142704, 352495, -17117, 657937, 1470581, 643657, 252683, -238449, -411459, -216988, -494523, -248975, -142387, -391510, 60020, -190469, 323359, -6636, 181882, 58838, -468765, -13129, -94422, -623115, -731528, -1380089, -1434509, -1127967, -256817, 78283, 146602, 414983, 175212, 319587, -660056, -236044, 386788, -1130508, -1669236, -1144145, 102337, 639795, 963883, 28419, -424139]
548d24139J16784k43636J113165o88898j44719k60672k15219K15772q34874m23137
538a789573O52288n67195R1972P74046r4234R54453K46776O9630m26087m85787
528e73711K38048k34845J80821j27737K41445J5610M83202l66448n72003O70662
518d4956M01542M0793m74490p86798N72110K71590o1294m03795Q27240m55637
508a13695m88701R54540q09484O00117K42683k98949p42526N83064O31900j15071
498D43878j483719J16641K94709N80320l13706o30677Q4204p4583J191299L14907
488E23273O63038o86604n29994L73649l9815K01780o15005k22660J97261M52049
478C16972j00477o47100M1169O69175q2991O08579k0240M79033O5294p29047M09074
$$ y = [-424139, -307355, -550991, 562174, -126724, -271443, -532115, -747334, -531562, -1366436, -1789573, -1137285, -1704480, -1612508, -838462, -932696, 21757, 268533, 338163, -87924, -573711, -335663, -570508, -389687, -517424, -275979, -260369, 222833, -143615, -715618, -44956, 356586, 397379, -77111, -863909, -291799, -20209, -81503, -485298, 341942, -113695, -602396, 352144, -457340, 142777, 385460, 86511, -656015, -72951, 558949, 443878, -1039841, -923200, -628491, -48171, -361877, -992554, -908350, -982933, 208366, 523273, 1186311, 499707, -30287, 343362, 303547, 505327, -109678, -332338, -135077, 316972, 216495, -430605, -389436, 279739, 196748, 805327, 785087, 1264120, 1329414, 600367, 1009441]
467A009441n90424l26883N63289k5792p81652q85357L87666O58838P09763J92804
457I11693l64584m57481m0130O43168o19050m97086O8346Q21581m31387M04762
447D39832k43679o30091P8000Q49895J03936K7274k80600L74994n58036k01745
437d0220L28320j387345Q00726m87874k43859Q79874Q44560j59017o51638q25662
427i42135J82932o895O00583j58421j25958K85726L12704J41543L77309o08599
417E8789m27743L20756J14100J80973p08157K37537L47134m4895k56255Q62806
407F85045q6486q67918k30954L40093m42287p4410q3899N50959j1319m16716M60674
396a77218j52276k13211M44290o47158R8561M88570o82153K7559N28094k9576
$$ y = [1009441, 419017, 92134, 655423, 629631, -152021, -1037378, -649712, 9126, 718889, 911693, 547109, 89628, 49498, 692666, 73616, -423470, -355124, 466457, 35070, 439832, 196153, -433938, -355938, 493957, 597893, 625167, 344567, 719561, 161525, -40220, 288100, -1099245, -298519, -786393, -1030252, -150378, 694182, 535165, -116473, -942135, -759203, -766098, -165515, -323936, -449894, -164168, 148536, 290079, 667388, 58789, -368954, -48198, 65902, 246875, -461282, -223745, 123389, 78494, -177761, 685045, 598559, -269359, -500313, -160220, -602507, -676917, -760816, -209857, -221176, -637892, -177218, -329494, -542705, -98415, -745573, -647012, -158442, -840595, -813036, -284942, -314518]
386c14518J40634N1135K55227r0687L6903j15064Q3459J37595o2314r00363q8362
375h66355O82217K72304m56424L31608n87067N97280R3101j95040J23359j011602
365a016619J3344N28348O08319o81881O67328K04123r38438n29117M58086J26837
355e59670J71903p3520K72901M76052p35471O9317K37235l8728n77714n89295
345a346990M60534P17514M37756j51660p3881n99730K84633L85290N02677j020316
335d04173n0447P63297j283527L0558O54746J12796n00774O28926J6185n70330
325f02743k61240J76308M27886j267799P6492R14204K38950N08954l23550J49827
315C7289Q91063q47058J7805l246O0168L21760l85944J48863J15197q7632m57632
$$ y = [-314518, -173884, -122749, 132478, 41791, 78694, -36370, 47089, 184684, 122370, -777993, -866355, -184138, 88166, -368258, -36650, -623717, -26437, 66664, -128376, -5017, -1016619, -1003275, -474927, 133392, -548489, 118839, 322962, -615476, -1144593, -686507, -559670, -387767, -461287, -188386, 287666, -447805, -378488, -141253, -179981, -757695, -1346990, -886456, -168942, 268814, 117154, 43273, -556457, -271824, 113466, 616143, -404173, -454620, 308677, -974850, -944292, -289546, -176750, -677524, -48598, -32413, -602743, -863983, -687675, -259789, -1527588, -1451096, -536892, -297942, 211012, -112538, 37289, 928352, 81294, 99099, 95853, 156021, 477781, 91837, 240700, 355897, 268265, -189367]
304a89367q27600J08198N35291P50618r303M3222J57367p1147j132210N03943
294a30988m7510o92830K41543k1199L49362m29821n17395R468J25147K99253P39320
283g5650M53055N02088k57190q86848k22784k02589N74525O4821o4949o18902
273g34423L891J98569L30797n71684n06177Q14953j22058o05890L4530J700338
263E42846o80478J05193q032o95606p33135J008413K08520k74807N89158L99192
253D61264J33174n09909l20998L37569m06691j94962M0239M006M60348o04584
243f00544K70999o01481n21630J353466K38879m65711J16393k87821J153195J22566
233G78311q89205l0219N26172l45487j26136m08288O29058N3967l04476p56285
$$ y = [-189367, -1016967, -908769, -373478, 377140, 367837, 411059, 568426, 497279, -634931, -130988, -178498, -871328, -629785, -650984, -301622, -731443, -1248838, -1239370, -1114223, -814970, -75650, 377405, 879493, 622303, -264545, -487329, -689918, -115393, -50572, -115521, -734423, -730532, -531963, -201166, -772850, -1279027, -464074, -586132, -1192022, -1157492, 542846, -137632, -32439, -40471, -736077, -1469212, -460799, -252279, -527086, 62072, 461264, 594438, 84529, -236469, 101100, -305591, -500553, -460314, -456308, 4040, -600544, -329545, -931026, -1452656, -99190, 139689, -326022, -209629, -497450, 655745, 778311, -110894, -141113, 385059, 39572, -86564, -494852, 134206, 188173, -116303, -872588]
223h72588l39421K82460o06306N36513K46918j03221M8163m93345K49210J044055
213g562N96158k77772J41269k40362o47099n24823K29602M12794M72442k69089
203a14442l90565Q14836r74366m01410L01536L48688o34777L3948P61727M37931
193A83106n75496m440Q4738J40487Q3097J2026k74378L91447J53888K59858j91342
182B62991P22737m28457n04167k77669n17925j64091K09803q0686M99263k254
172b80455P61573K62683j131768N67892N9374q46182l27085K08825j30670l66679
162a222492L69470N05538j25646m3K39954J73456J34278l6354j167619K09131
152i20327Q48592Q9781k35821R0867l85548M95875j41847M37597l30240R4318
$$ y = [-872588, -1212009, -929549, -1535855, -999342, -752424, -855645, -807482, -1300827, -1051617, -7562, 588596, 310824, 452093, 211731, -435368, -960191, -730589, -317795, 154647, -114442, -505007, 309829, -664537, -1065947, -764411, -415723, -1050500, -1016552, -254825, 183106, -392390, -396830, -312092, -171605, -88508, -76482, -350860, 40587, 194475, 454333, 262991, 985728, 557271, 53104, -224565, -742490, -906581, -696778, -777464, -278201, -280455, 481118, 743801, -387967, 179925, 239299, -606883, -933968, -725143, -855813, -1222492, -853022, -347484, -473130, -473173, -233219, -59763, 74515, 38161, -1129458, -920327, -71735, 18046, -217775, -126908, -512456, -16581, -158428, 279169, -51071, 43247]
142D3247k13808j000616M9052J177333k42360j80090M80994j73507k69648k41295
132e70698k32299L0211N79799P1374m3952o522n22647K99366J76609l52547o9457
121f40763L73041l95919j50286N17948M6765K7226n70123O17216J16097j41950
111b00748N00885j17089j177084J28329K33733L84419l71853n24529O53731K13048
101b77158K51428j76298o49247J19699L76596m55254M28501L15026n48605N51446
91f3866N03456m21701n24010J21961j12106j41192m0741Q1733M09268L84304M6450
80B43556m61581m07557L52326o41478L06357M92238m86698j99350K57277N84883
70C9973M4280Q15695k24040o14742l83245k71370j40370L44299m92597O82312
$$ y = [43247, -170561, -1171177, -1122125, 55208, -187152, -367242, 113752, -59755, -329403, -570698, -802997, -772786, -192987, -121613, -165565, -172087, -694734, -395368, -218759, -571306, -640763, -267722, -663641, -813927, -295979, -249214, -221988, -792111, -174895, -58798, -200748, 300137, 183048, -994036, -865707, -631974, -247555, -619408, -1143937, -490206, -277158, -25730, -202028, -851275, -731576, -354980, -810234, -381733, -66707, -615312, -63866, 439590, 17889, -506121, -384160, -496266, -637458, -678199, -596466, -187198, 197106, 243556, -218025, -625582, -273256, -914734, -608377, -116139, -602837, -802187, -544910, 39973, 84253, 899948, 675908, 61166, -322079, -593449, -733819, -389520, -882117, -199805]
60a99805L64716k52376j81067K20373J84020m27435l96032M52732k515M2044o37049
49h32394r9763L59573j37858P88554N33532n21817k29438m01206P9643L6672l82047
38h06549L88420Q8884L25278L81954l47314p06500l78763M98034j31218K7065
28f60709J21223j58322N39145l47147N2611J46764j76208k10467O923L16589J68255
17b01343k39977O52421R700J88232o0505j126994l04274j49171R6905M81349k19561
6h73218K75426O33463M55798n59106n05532Q12096
0B38927
$$ y = [-199805, 164911, -87465, -268532, -48159, 135861, -291574, -687606, -234874, -237389, -195345, -832394, -932157, -572584, -710442, 78112, 611644, 89827, -139611, -540817, -461174, -424502, -806549, -418129, -329245, -3967, 377987, 30673, -675827, -1054590, -556556, -687774, -660709, -539486, -697808, -158663, -505810, -453199, -306435, -482643, -693110, -686187, -369598, -201343, -441320, 211101, 220801, 409033, 348528, -778466, -1082740, -1231911, -1135006, -653657, -873218, -597792, 35671, 491469, -67637, -573169, 238927]
$$ Imaginary data points
##PAGE= N=2
##DATA TABLE= (X++(I..I)), XYDATA
16383c610021L57124J91639K89497M2862l8532N17300K74450k57467m26886J89450
16373b470584m1896o32069k276O19573M6055j18236N01144L45701J64131l526
16363a591983o20778N92324j1869j13554O44506j33108P1374P42740j026567l23833
16353a770748M05961K27330j48652r6112k34787L57674r8613M29718P616r1800
16343a012413k22690P5744Q383j66493P6901J08938m13950l61715Q53314O9551
16333i84430L24534l69054l25773L85123N33873J8102m59673J56331L7191R8858
16323e84918m94622M32155Q7818K25095j03339o24017N46950K25844K45639L83618
16313C40223k17697l07511J38591K06960p49004M59030N00723o26008k27835L12800
$$ y = [-3610021, -3252897, -3061258, -2771761, -2728899, -2767431, -2250131, -1975681, -2233148, -2660034, -2470584, -2512480, -3144549, -3146825, -2527252, -2481197, -2599433, -2098289, -1752588, -1588457, -1591983, -2212761, -1620437, -1632306, -1745860, -1101354, -1234462, -1163088, -420348, -1446915, -1770748, -1364787, -1137457, -1286109, -1382221, -1617008, -1259334, -1357947, -928229, -920613, -1012413, -1235103, -1159359, -1150976, -1317469, -1240568, -1131630, -1545580, -1907295, -1053981, -984430, -659896, -1028950, -1354723, -969600, -435727, -417625, -877298, -720967, -683776, -584918, -1079540, -647385, -559567, -334472, -437811, -1061828, -514878, -289034, -43395, 340223, 122526, -184985, -46394, 160566, -588438, -129408, 371315, -254693, -482528, -169728]
16303a69728N46636j56860p10975L40734N27799n19566l72657K16340m5838K02580
16293a41535K31842k87144K44570l10084m37052L34023J51728P01424L18773l5328
16283G71217K20236m27043K33191N1435R697j76042k62582k19355P66118J51563
16273A118435j65779J41979k39988m60588J82561K51167j50595N30293K35501
16264A442986k51344J28588M3699M44536K54748m75505o33923K77090P14741m7248
16254A898368o19936k26187J31654L5286O53238K42641n22413Q27289o47503r35017
16244H37420L51694L27021O77705k26150k61911N5081l9378L06331k77555n66832
16234A183426m20947j32253J012087j00253l59964r3915j36493N60784n74406
$$ y = [-169728, 376908, 220048, -490927, -150193, 377606, -141960, -514617, -298277, -344115, -141535, 90307, -196837, 47733, -262351, -699403, -365380, -213652, 487772, 806545, 771217, 991453, 564410, 797601, 849036, 858733, 682691, 420109, 200754, 966872, 1118435, 952656, 1094635, 854647, 394059, 576620, 827787, 677192, 1207485, 1442986, 1191642, 1320230, 1363929, 1808465, 2063213, 1587708, 953785, 1230875, 1945616, 1898368, 1278432, 1052245, 1183899, 1219185, 1872423, 2115064, 1592651, 2419940, 1772437, 837420, 1189114, 1516135, 2193840, 1967690, 1705779, 1760860, 1721482, 2027813, 1750258, 1183426, 762479, 630226, 1642313, 1542060, 1182096, 1088181, 951688, 1512472, 938066]
16225I38066N83907N18284q69283k16433L76112j28465N28395P74720j12697J67464
16215B560070l10001l22527r2390O9385o83977l80473M55512O6950J254494j81516
16205B435527l50827K94218k24953p07065M25834l14310m61406J527962L13616
16196B938596k51228j122954M51128O46021m7948m82784j33921J38444N04076
16187B639430k01311j04427l97666O48590J04102l7851n82739r50420N81394Q03923
16177B503025l06941L80157K26762K38435K60600o38981q47354Q62082j3488q7306
16167B576991n79814n33109N99833l28156P30054j75829l9011L15690k55556J78772
16157B489865J10469J14726N41142m77324M26019j48180Q8681m7727p6677n84863
$$ y = [938066, 1521973, 2040257, 1170974, 954541, 1330653, 1202188, 1730583, 2505303, 2392606, 2560070, 2250069, 1927542, 1835152, 1904537, 1220560, 840087, 1295599, 1362549, 2617043, 2435527, 2084700, 2378918, 2153965, 1446900, 1872734, 1558424, 1097018, 2624980, 2938596, 2687368, 1564414, 2015542, 2661563, 2613615, 2130831, 1996910, 2135354, 2639430, 2438119, 2333692, 1936026, 2584616, 2688718, 2650867, 2068128, 1117708, 1699102, 2503025, 2196084, 2576241, 2803003, 3041438, 3302038, 2663057, 1815703, 2677785, 2664297, 2576991, 1997177, 1464068, 2063901, 1735745, 2465799, 2289970, 2250959, 2566649, 2311093, 2489865, 2600334, 2715060, 3256202, 2778878, 3204897, 3056717, 3145398, 3097671, 3020994, 2436131]
16147B436131P25470l31814n43653J80739N68921n16712K76149M09442o3452j02884
16137C038337j16007k55135J26603P2499k41559l0032K16402Q0131q7409Q01419
16127C605249l4126J11212q34421k8547K01457j060960m46838o6077N63215K02483
16117B212647J96546L90725K06821m85852n97981M82676J158866k07938j40332
16108C216178j68336k59006L64541M73085J99749k01944K35858l04055n62137
16099B993933j74796J03680M96038n75013j97672j00686j39460n68334j78536
16090A659154O94374L69275R83841p08m64196n43762k11652n15201k6121R04558
16080B849562R1535k36496J43074m73443O26256j23186J86924n17100J85811j148505
$$ y = [2436131, 3161601, 2829787, 2286134, 2466873, 3035794, 2519082, 2795231, 3204673, 3141221, 3038337, 2922330, 2667195, 2793798, 2866297, 2624738, 2594706, 2811108, 2891239, 2803830, 3605249, 3571123, 3682335, 2847914, 2819367, 3020824, 1959864, 1513026, 1446949, 2010164, 2212647, 2409193, 2799918, 3006739, 2520887, 1922906, 2405582, 3564448, 3356510, 3216178, 3047842, 2788836, 3153377, 3626462, 3826211, 3624267, 3860125, 3556070, 2993933, 2819137, 2922817, 3418855, 2843842, 2646170, 2545484, 2406024, 1837690, 1659154, 2353528, 2722803, 3706644, 3705936, 3241740, 2697978, 2486326, 1971125, 1945004, 2849562, 2941097, 2704601, 2847675, 2374232, 3000488, 2877302, 3064226, 2547126, 2732937, 1584432]
16070A584432l11333N84816O21331P59909j66053O60469J32346n32849m74572
16061B858496j6152K05822R73079J41360n37718k54026o78281j43589j63488O66318
16051C051821O23407Q4835j250574N10844J495776J15875j380219J61162J35496
16042C548423k13643J50882O7758K08791P01709j01356o76898K91507J55138l57821
16032C774490p12213o47853J86002Q63095N39699k41204p92990k4373p01069J080942
16022C324526K07768o11126R6049O21751M57019n40200j209791N6633J029115
16013C431744J3593n77816k45522L31735m29552K70551m0000M8124L56793j74871
16003B984779K01822k14830q8454k36935p9077j0220N30732J399459k83047p05639
$$ y = [1584432, 1273099, 1857915, 2479246, 3239155, 3073102, 3733571, 3865917, 3333068, 2858496, 2842344, 3048166, 4021245, 4162605, 3624887, 3370861, 2692580, 2548991, 2385503, 3051821, 3675228, 3760063, 2509489, 3020333, 4516109, 4631984, 3251765, 3412927, 3548423, 3334780, 3485662, 3553420, 3762211, 4463920, 4362564, 3685666, 3977173, 4132311, 3774490, 3062277, 2414424, 2600426, 3463521, 4003220, 3762016, 2969026, 2944653, 2243584, 3324526, 3532294, 2921168, 3017217, 3638968, 4095987, 3555787, 2345996, 2402629, 3431744, 3445337, 2867521, 2621999, 2953734, 2524182, 2794733, 2754733, 2802857, 3159650, 2984779, 3186601, 2971771, 2883317, 2646382, 2567305, 2557085, 3087817, 4487276, 4204229, 3498590]
15993C498590L77951j026742K84606n46175J386740N51693q01095l95144o31628
15984B698796l7991K56530Q3724K37361n02698k72950k621J10296R89106J05205
15974C664758m60836N38527p66358o04026m77766J94088L16987j78760L11972
15965B538586N32846l85061m28247M03035k76079m68152Q17726J92960m5322K38781
15955C121073J32006O72133M36569j138472j14950K35430M9994m07738r37181
15946B048864M25877J59542m4319M70972J348029j597296L8370p8043M49590j98488
15936C023098j49445j03779J11185O36909l90329m36213R39712n29349j409219
15927A692570J273950j00968m73843R07919L76483n12550k00793K94455k13304
$$ y = [3498590, 3876541, 2849799, 3134405, 2588230, 3974970, 4526663, 3725568, 3330424, 2698796, 2660805, 2917335, 3001059, 3238420, 2735722, 2462772, 2460151, 2570447, 3559553, 3664758, 3203922, 3742449, 2976091, 2372065, 1894299, 2088387, 2405374, 2226614, 2538586, 3071432, 2686371, 2258124, 2661159, 2385080, 1916928, 2734654, 2927614, 2882292, 3121073, 3253079, 3925212, 4361781, 3223309, 3108359, 3343789, 3393783, 2986045, 2048864, 2474741, 2634283, 2589964, 3060936, 4408965, 2811669, 2850039, 2771996, 3221586, 3023098, 2873653, 2769874, 2881059, 3517968, 3127639, 2691426, 3631138, 3101789, 1692570, 2966520, 2865552, 2391709, 3299628, 3676111, 3163561, 2962768, 3257223, 3043919]
15918C043919l52366M14536O280l47772O06133K63665r68938K06777J25989K00980
15908C199203l48127M59179K23486l2239q1280m04129R5618m23545K90066p0996
15898B907236L40438k99496M19250K8693N64384o11276K44914n38343r35387N56571
15888B676984k09139M40846L36074N12846j84284l10473n07935m87427J271166
15879C538658M13191j01157n19259K72022j57844N44464J49312l44881j176817
15870B617689j05060K65767p09060R11926q1476J23821J83761O98583k29806j54306
15860C521839n77269M03312K15170j5751k87594q0215O39383L57502q04690m96648
15850B875039m49037m66423M16865J202718O3756J33019k92604p56988O11810
$$ y = [3043919, 2691553, 3106089, 3112369, 2764597, 3370730, 3634395, 2665457, 2872234, 2998223, 3199203, 2851076, 3310255, 3533741, 3501502, 3420222, 3016093, 3111711, 2688166, 2978232, 2907236, 3247674, 2948178, 3367428, 3396121, 3960505, 3349229, 3594143, 3055800, 2120413, 2676984, 2467845, 2908691, 3244765, 3757611, 3573327, 3262854, 2754919, 2267492, 3538658, 3951849, 3850692, 3331433, 3603455, 3445611, 3990075, 4139387, 3794506, 2617689, 2512629, 2778396, 2069336, 2981262, 2899786, 3023607, 3207368, 3905951, 3676145, 3521839, 2944570, 3347882, 3563052, 3547301, 3259707, 3179492, 3818875, 4176377, 3371687, 2875039, 2426002, 1959579, 2376444, 3579162, 3642918, 3775937, 3483333, 2726345, 3338155]
15841C338155N9642r3458k65035Q3194J88537l56248q57668N03699M78353P02850
15831C782021j78935r10287k4458Q40036M26104j46987k41042R5746m15791J97552
15821C423959L40020j818420J149912j02325k95716M23945m49124N07415j46573
15812C033093L5894l07962N89557k94657K84863o35850n73129J045947L61160
15803C538916l31346m57366j01463M72462K22281J62096m81105l16881k84047
15794B423547M34365L25080n73955J88513p5130J49793P95271o62003l04074P06253
15784C407660q9020N94890q49582l41468J26714L77441m91294P49311L59696o46375
15774C197973j06205k28068L42509q24906k47689J134957n1240R32852o78481
$$ y = [3338155, 3397797, 3304339, 3039304, 3122498, 3311035, 2954787, 2097119, 2600818, 3079171, 3782021, 3603086, 2692799, 2668341, 3508377, 3934481, 3787494, 3546452, 3642198, 3226407, 3423959, 3763979, 1945559, 3095471, 2993146, 2697430, 3121375, 2672251, 3179666, 3033093, 3068987, 2761025, 3350582, 3055925, 3340788, 2704938, 2131809, 3177756, 3538916, 3207570, 2750204, 2648741, 3121203, 3343484, 3505580, 3024475, 2707594, 2423547, 2857912, 3182992, 2609037, 2797550, 2722420, 2872213, 3667484, 3005481, 2701407, 3407660, 3318640, 3913530, 3063948, 2722480, 2849194, 3226635, 2735341, 3484652, 3844348, 3197973, 3091768, 2863700, 3206209, 2381303, 2133614, 3268571, 3217331, 4150183, 3471702]
15765C471702j313831j24060Q98688l87994J45682j91157L58526M00353J08391
15756C366300k56249j30510K01742l49078p09780L51873J289250j2003p24108
15747C027437m82258Q8969n47482m2772P85775j56292m4614Q84789N18948k05089
15737C827411l48140L75511q45728n32183q87269O33301M86558K32810J54955
15728C097226J33324K05394r40765Q57421P7112n30450o2398K94211N07796k96878
15718C341993m10863K40307k93248L99132L4934k95058j5102l43929J151844K12965
15708D022975j064126l63791n42474N59536R24896l08161Q67989m75575K54777
15699C876046o60434M3023R9913p53278m35920K37694k11987j32663L10159O72435
$$ y = [3471702, 2157871, 2033811, 2932499, 2544505, 2690187, 2499030, 2857556, 3257909, 3366300, 3110051, 2979541, 3181283, 2832205, 2122425, 2474298, 3763548, 3751545, 3027437, 2545179, 2634148, 2086666, 2043894, 2829669, 2673377, 2628763, 3513552, 4032500, 3827411, 3479271, 3854782, 3009054, 2476871, 1589602, 2222903, 2709461, 2942271, 3097226, 3230550, 3435944, 2495179, 3352600, 3429712, 2899262, 2836864, 3131075, 3638871, 3341993, 2931130, 3171437, 2878189, 3277321, 3312255, 3017197, 3002095, 2658166, 3810010, 4022975, 2958849, 2595058, 2052584, 2612120, 3537016, 3228855, 4096844, 3621269, 3876046, 3215612, 3258635, 3358548, 2605270, 2169350, 2407044, 2195057, 2062394, 2372553, 3044988]
15689C044988Q02368k2889o98238M72668K32517K30271l25461o37236J24897N57224
15679C781109k60289l73081L88789K1605m34099k9555k20536j20483j72064J079029
15669C660425M84125q2659q76320M34083O4527m05428k48638M12736J1106l75730
15659C078227N17355N42795n93269k53336n35396k05003M56384P22610O26674
15650D357041o75745K68146n34696M95374q57540j558551P49177R24833M13226
$$ y = [3044988, 3847356, 3824467, 3126229, 3598897, 3831414, 4061685, 3736224, 3098988, 3223885, 3781109, 3520820, 3147739, 3536528, 3558133, 3124034, 3094479, 2873943, 2753460, 2581396, 3660425, 4144550, 4061891, 3185571, 3619654, 3684181, 3278753, 3030115, 3442851, 3453957, 3078227, 3595582, 4138377, 3545108, 3291772, 2756376, 2551373, 3007757, 3730367, 4357041, 3681296, 3949442, 3414746, 3910120, 3052580, 1494029, 2243206, 3168039, 3581265]
$$ [...]
##END NTUPLES=NMR SPECTRUM
##END=
