##TITLE=1H_EC-3270
 CDCl3
 8 sc, 
 19.11.2021
##JCAMPDX= 6.0         $$ Bruker NMR JCAMP-DX V2.0
##DATA TYPE= NMR SPECTRUM
##DATA CLASS= NTUPLES
##ORIGIN= UXNMR, Bruker Analytische Messtechnik GmbH
##OWNER= root
$$ XWIN-NMR		Version 3.5
$$ Fri Nov 19 12:34:00 2021 Russian Standard Time (UT+4h)  she@DPX200
##.OBSERVE FREQUENCY= 200.131346
##.OBSERVE NUCLEUS= ^1H
##.ACQUISITION MODE= SIMULTANEOUS
##.ACQUISITION SCHEME= undefined
##.AVERAGES= 8
##.DIGITISER RES= 18
##SPECTROMETER/DATA SYSTEM= spect
##.PULSE SEQUENCE= zg30
##.SOLVENT NAME= D2O
##.SHIFT REFERENCE= (INTERNAL, D2O, 0, 15.7105)
##AUDIT TRAIL= $$ (NUMBER, WHEN, WHO, WHERE, WHAT)
$$ ##TITLE= Audit trail, XWIN-NMR		Version 3.5
$$ ##JCAMPDX= 5.01
$$ ##ORIGIN= Bruker BioSpin GmbH
$$ ##OWNER= she
$$ F:/spectra/data/she/nmr/H-F/1/pdata/1/auditp.txt
$$ ##AUDIT TRAIL=  $$ (NUMBER, WHEN, WHO, WHERE, WHAT)
(   1,<2021-11-19 12:31:37.56 +0400>,<she>,<DPX200>,
      <created by zg, POWCHK disabled, PULCHK disabled
       configuration hash MD5:
       00 E9 B6 7A A2 85 ED C7 34 08 36 98 17 FE 4E 26
       data hash MD5: 16K
       AF B9 DE E8 C0 C8 A2 20 AC FB 3B 6E AF F0 49 B2>)
(   2,<2021-11-19 12:31:40.75 +0400>,<she>,<DPX200>,
      <Start of raw data processing
       efp BC_mod = 2 LB = 0.24 FT_mod = 6 PKNL = 1 PHC0 = -15511.72 PHC1 = 12.00081 SI = 16K 
       data hash MD5: 16K
       5E 19 01 E3 89 5A 97 28 77 17 81 32 A3 CD 48 7C>)
(   3,<2021-11-19 12:32:00.89 +0400>,<she>,<DPX200>,
      <pk PHC0 = -3.957107 PHC1 = 3.600001 
       data hash MD5: 16K
       4B 44 34 F2 72 A7 D1 54 D5 A8 76 2D ED 15 DA D3>)
(   4,<2021-11-19 12:32:03.92 +0400>,<she>,<DPX200>,
      <abs ABSG = 5 
       data hash MD5: 16K
       B1 CB 9C 01 F1 49 61 B7 90 17 2A D1 C1 F9 91 BD>)
$$ ##END=
$$ 
$$ hash MD5
$$ C6 E2 3B A8 DF 49 CA 4F EA 4D F1 6E C9 18 9E 11
##$RELAX= 
##$RELAX= 
##$RELAX= 
##$RELAX= 
##$RELAX= 
##$RELAX= 
$$ Bruker specific parameters
$$ --------------------------
##$DU= <F:/spectra>
##$EXPNO= 1
##$NAME= <H-F>
##$PROCNO= 1
##$TYPE= <nmr>
##$USER= <she>
##$AMP= (0..31)
100 100 100 100 100 100 100 100 100 100 100 100 100 100 100 100 100 100 
100 100 100 100 100 100 100 100 100 100 100 100 100 100 
##$AQSEQ= 0
##$AQ_mod= 1
##$AUNM= <au_zg>
##$AUTOPOS= <>
##$BF1= 200.13
##$BF2= 200.13
##$BF3= 200.13
##$BF4= 200.13
##$BF5= 200.13
##$BF6= 200.13
##$BF7= 200.13
##$BF8= 200.13
##$BYTORDA= 1
##$CFDGTYP= 0
##$CFRGTYP= 5
##$CHEMSTR= <none>
##$CNST= (0..31)
1 1 145 1 1 1 1 1 1 1 1 1 1 1 1 1 1 1 1 1 1 1 1 1 1 1 1 1 1 1 1 1 
##$CPDPRG= <>
##$CPDPRG1= <>
##$CPDPRG2= <>
##$CPDPRG3= <>
##$CPDPRG4= <mlev>
##$CPDPRG5= <mlev>
##$CPDPRG6= <mlev>
##$CPDPRG7= <mlev>
##$CPDPRG8= <mlev>
##$CPDPRGB= <>
##$CPDPRGT= <>
##$D= (0..31)
0 1.2 0 0 0 0 0 0 0 0.06 0 0.03 0 0 0 0 0.0002 0 0 0 0 0 0 0 0 0 0 0 0 
0 0 0 
##$DATE= 1637310696
##$DBL= (0..7)
120 120 120 120 120 120 120 120 
##$DBP= (0..7)
150 150 150 150 150 150 150 150 
##$DBP07= 0
##$DBPNAM0= <>
##$DBPNAM1= <>
##$DBPNAM2= <>
##$DBPNAM3= <>
##$DBPNAM4= <>
$$ [...]
##$SUBNAM2= <"">
##$SUBNAM3= <"">
##$SUBNAM4= <"">
##$SUBNAM5= <"">
##$SUBNAM6= <"">
##$SUBNAM7= <"">
##$SUBNAM8= <"">
##$SUBNAM9= <"">
##$SW= 18.0517287032376
##$SWIBOX= (0..15)
0 0 2 0 0 0 0 0 0 0 0 0 0 0 0 0 
##$SW_h= 3612.71676300578
##$TD= 16384
##$TD0= 1
##$TE= 0
##$TE2= 300
##$TE3= 300
##$TEG= 300
##$TL= (0..7)
0 120 120 120 120 120 120 120 
##$TP= (0..7)
150 150 150 150 150 150 150 150 
##$TP07= 0
##$TPNAME0= <>
##$TPNAME1= <>
##$TPNAME2= <>
##$TPNAME3= <>
##$TPNAME4= <>
##$TPNAME5= <>
##$TPNAME6= <>
##$TPNAME7= <>
##$TPOAL= (0..7)
0.5 0.5 0.5 0.5 0.5 0.5 0.5 0.5 
##$TPOFFS= (0..7)
0 0 0 0 0 0 0 0 
##$TUNHIN= 0
##$TUNHOUT= 0
##$TUNXOUT= 0
##$USERA1= <user>
##$USERA2= <user>
##$USERA3= <user>
##$USERA4= <user>
##$USERA5= <user>
##$V9= 5
##$VALIST= <valist>
##$VCLIST= <CCCCCCCCCCCCCCC>
##$VD= 0
##$VDLIST= <DDDDDDDDDDDDDDD>
##$VPLIST= <PPPPPPPPPPPPPPP>
##$VTLIST= <TTTTTTTTTTTTTTT>
##$WBST= 1024
##$WBSW= 4
##$XGAIN= (0..3)
0 0 0 0 
##$XL= 0
##$YL= 0
##$YMAX_a= 140789
##$YMIN_a= -236661
##$ZGOPTNS= <>
##$ZL1= 120
##$ZL2= 120
##$ZL3= 120
##$ZL4= 120
##$ABSF1= 15.7568
##$ABSF2= -2.29505
##$ABSG= 5
##$ABSL= 3
##$ALPHA= 0
##$AQORDER= 0
##$ASSFAC= 0
##$ASSFACI= 0
##$ASSFACX= 0
##$ASSWID= 0
##$AUNMP= <proc_1d>
##$AZFE= 0.1
##$AZFW= 0.1
##$BCFW= 0
##$BC_mod= 2
##$BYTORDP= 0
##$COROFFS= 0
##$CY= -3
##$DATMOD= 1
##$DC= 0
##$DFILT= <>
##$DTYPP= 0
##$F1P= 0
##$F2P= 0
##$FCOR= 1
##$FTSIZE= 16384
##$FT_mod= 6
##$GAMMA= 0
##$GB= 0
##$INTBC= 1
##$INTSCL= 0
##$ISEN= 128
##$LB= 0.24
##$LEV0= 0
##$LPBIN= 0
##$MAXI= 10000
##$MC2= 0
##$MEAN= 0
##$ME_mod= 0
##$MI= 1.114404
##$NCOEF= 0
##$NC_proc= -7
##$NLEV= 6
##$NOISF1= 3.799351
##$NOISF2= 2.8
##$NSP= 0
##$NTH_PI= 0
##$NZP= 0
##$OFFSET= 15.71053
##$PC= 1
##$PHC0= -15515.68
##$PHC1= 15.60081
##$PH_mod= 1
##$PKNL= yes
##$PPARMOD= 0
##$PSCAL= 0
##$PSIGN= 0
##$REVERSE= no
##$SF= 200.130008209152
##$SI= 16384
##$SIGF1= 3
##$SIGF2= 2
##$SINO= 5.538805
##$SIOLD= 16384
##$SREGLST= <1H.CDCl3>
##$SSB= 0
##$STSI= 16384
##$STSR= 0
##$SW_p= 3612.71676300578
##$SYMM= 0
##$S_DEV= 0
##$TDeff= 16384
##$TDoff= 0
##$TI= <>
##$TILT= no
##$TM1= 0
##$TM2= 0
##$TOPLEV= 0
##$USERP1= <user>
##$USERP2= <user>
##$USERP3= <user>
##$USERP4= <user>
##$USERP5= <user>
##$WDW= 1
##$XDIM= 16384
##$YMAX_p= 315058830
##$YMIN_p= -587835
$$ End of Bruker specific parameters
$$ ---------------------------------
##NTUPLES= NMR SPECTRUM
##VAR_NAME=  FREQUENCY,     SPECTRUM/REAL,   SPECTRUM/IMAG
##SYMBOL=    X,             R,               I
##VAR_TYPE=  INDEPENDENT,   DEPENDENT,       DEPENDENT
##VAR_FORM=  AFFN,          ASDF,            ASDF
##VAR_DIM=   16384,         16384,           16384
##UNITS=     HZ,            ARBITRARY UNITS, ARBITRARY UNITS
##FACTOR=    0.220516191357247, 1,           1
##FIRST=     3144.14855412005, 0,            0
##LAST=      -468.568208885732, 0,           0
##MIN=       -468.568208885732, -587835,     0
##MAX=       3144.14855412005, 315058830,    0
$$ Real data points
##PAGE= N=1
##DATA TABLE= (X++(R..R)), XYDATA
$$ [...]
7132D3737117o914076n173488l890229k946394k200128j860661j623642j333916
7124A7794583j196032j227751j345754q69280r01935m73003p88743q52629q40220
7115I299236n34730l50101o34335l95589o37265l40333k09725r7369l22909l68188
7105E408692k21734n9149j63215j73533j55237l28878K2852j56879j81128j23211
7095C868580j08386k19156m8606k17902j70782j9297j93440j85058j19704K0905
7085B607154K53294o9963l02043j18051J1688K3613j63943k52477J14420j92203
7075A911489j15909L847K46252n1948k02080N1860J637j42556j34498k6278n9601
7064A482215K5298K4758r8449N3432r373k35291k2564R5345M0687k0288Q9636
$$ y = [43737117, 36823041, 31649553, 27759324, 24812930, 22612802, 20752141, 19128499, 17794583, 16598551, 15370800, 14025046, 13155766, 12253831, 11780828, 10992085, 10139456, 9299236, 8764506, 8414405, 7780070, 7384481, 6747216, 6406883, 6197158, 6099789, 5776880, 5408692, 5186958, 5127809, 4964594, 4791061, 4635824, 4306946, 4329798, 4172919, 3991791, 3868580, 3760194, 3541038, 3492432, 3274530, 3103748, 3084451, 2891011, 2705953, 2586249, 2607154, 2860448, 2790485, 2488442, 2370391, 2382079, 2405692, 2241749, 1989272, 2103692, 1911489, 1795580, 1799427, 2045679, 1993731, 1791651, 1843511, 1845148, 1702592, 1568094, 1541816, 1482215, 1507513, 1532271, 1433822, 1487254, 1477881, 1242590, 1220026, 1315371, 1356058, 1335770, 1425406]
7053A425406n6311m2718n8272q4953q2106j3815P2903j68882j0637J57102N6644
7042A194361m6364j32130l0597N5828k5544j765n063m7338j90681j46941K5930
7031F49696P9987j96818j69150K82424L3669Q713o2232j60207j02K24896r1053
7020E99823j31600J05246r6814K4144J19420j40664k61210r0739N6668L46225
7010E30499O0138j87788j22372m4937K1608K43319o3759k43519J24053j9724M4200
6999C41718m3922j19753j7685Q4247L3824K43011j03531j56796J25714q244j04614
6988B73969J2680L9895l1047j51122J39514Q2300k99785J7106M5944K5355J20830
6977B75639j5630j0944j25401J01346K7484j2971J83673j02617j05907O9762l3867
$$ y = [1425406, 1369095, 1326377, 1268105, 1183152, 1101046, 1087231, 1160134, 991252, 980615, 1137717, 1194361, 1147997, 1015867, 985270, 1041098, 1015554, 1013789, 1008726, 961388, 770707, 623766, 649696, 729683, 532865, 363715, 646139, 679808, 688521, 626289, 466082, 465980, 690876, 599823, 468223, 573469, 476655, 500799, 620219, 479555, 218345, 127606, 184274, 530499, 590637, 402849, 280477, 235540, 257148, 500467, 436708, 193189, 317242, 297518, 341718, 297796, 178043, 160358, 244605, 278429, 521440, 417909, 261113, 386827, 378583, 273969, 286649, 326544, 295497, 144375, 283889, 366189, 66404, 83510, 129454, 154809, 275639, 260009, 249065, 123664, 225010, 252494, 239523, 423196, 320579, 214672, 284434, 250567]
6966B50567O8254k93910j23973l6400J17771J92176l4016R1145K5723j40787Q1052
6955A97602j72111J7650R1555N0029P8925L5374q8079j31113L0251L9312p0822
6944G8573P2494j14572j15161J42609j00324r716R1029J72510J35413L7091k89058
6933A00888k34478K27800P5062j33382J92962J5839r4069p7924Q3276n2102O0821
6922A64693M7253p2708r4240l7754J815j53121K2767l7698P4211N4524K481R7998
6910G0221p8854o7693K15819n2514l6954Q4594k0144K6183j02536K4326P4310
6899A36758L2701J75111r9678m2754O6261q9691L5480j99119n188j82706R3414
6888g9411M3473m7066r7872J85839j37911o5434J05442J55007k6598k67249o1275
$$ y = [250567, 318821, 24911, -99062, -135462, -17691, 174485, 140469, 231614, 257337, 116550, 197602, 25491, 43141, 134696, 184725, 263650, 299024, 210945, 79832, 110083, 149395, 78573, 151067, 36495, -78666, 63943, -36381, -46097, 44932, 217442, 352855, 389946, 100888, -133590, 94210, 169272, 35890, 228852, 244691, 150622, 72698, 155974, 103872, 164693, 211946, 139238, 44998, 7244, 9059, -144062, -121295, -158993, -84782, -30258, -27777, 70221, -8633, -76326, 139493, 86979, 50025, 134619, 114475, 140658, 38122, 62448, 136758, 169459, 344570, 244892, 202138, 268399, 178708, 214188, 15069, 9881, -172825, -79411, -35938, -83004, -180876, 4963, -132948, -198382, -92940, 62067, 35469, -231780, -293055]
6877b93055K61093Q0222j47624O2608J34482m8868r7898J05397j19173j34387
6867a97203N4206j2507K6070j07942R14J14868K11511L9930j7625K4185N5322
6856A91729j43034j27807M0443q4289J08633K59268p8993j82242j8824j44546
6846a79662J48203j17190J66245Q0151K7508j8071j6311n6k7184M496K7992p2815
6834B3306K7247j18937K5981K68803n5994k46269l8060P0690O7273M3666K3866
6823I1572j4696K35001j52498j19074k1894j697j14380M6972o8801p0549K8189
6812a61855J11623K31991m7044j48240P7002j72345k33128J40315Q7208J05699
6802h774j10106o3701l2944L4593N3280J25034p8109J15604j83011j2325J2636
$$ y = [-293055, -31962, 48260, -99364, -36756, 97726, 48858, -49040, 56357, -62816, -197203, -142997, -155504, -129434, -237376, -236462, -121594, 89917, 129847, 112222, 136407, 191729, 48695, -79112, -38669, -122958, -14325, 244943, 165950, -16292, -35116, -179662, -31459, -148649, 17596, 97747, 125255, 107184, 90873, 90817, 63633, 68129, 96121, 23306, 50553, -68384, -42403, 226400, 170406, -75863, -113923, -43233, 24040, 67706, 91572, 76876, 311877, 159379, 40305, 18411, 16714, -97666, -50694, -119495, -190044, -161855, -50232, 181759, 134715, -13525, 63477, -108868, -341996, -201681, -114473, -8774, -118880, -182581, -215525, -180932, -127652, -2618, -80727, 34877, -148134, -160459, -147823]
6791a47823K05069l7618N8746K7564q0667j9026K03608j05717j4099j40252M0695
6780i520N7935k3974q7246m2084J00422k8518J13813p4216j9324p197Q6636j63240
6768i6513r5662P8647J95254L1662j55080j90711K56096j86565P2047o48M9553
6757d1920J23281o1330K4623J8129J29205j529j2341j12203m041j25176N7165
6746f137Q0613k8466J04464O5336J49133J33138p1353j29457K04154L6552r4427
6735D43550P3564p0495j12176j50980m3661O5865j14619R958j50438J20777R5712
6724A67057L7065k63075l3634J84928Q8196Q477L2173j21818j37946M7031N4451
6713F2905k21259J20359R4095p6011N8352j32558j4712R7604J13592J47189m7472
$$ y = [-147823, 57246, 19628, 78374, 105938, 25271, 6245, 209853, 104136, 90037, -50215, -9520, 48415, 24441, -62805, -104889, -4467, -32985, 80828, 6612, -12712, -19909, 66727, -96513, -192175, -113528, 81726, 113388, -41692, -232403, 23693, -162872, -90825, -91473, -41920, 81361, 20031, 44654, 62783, 191988, 190459, 178118, 65915, 61874, -63302, -6137, 74476, 46010, 150474, 215810, 364943, 498081, 426728, 297271, 501425, 537977, 443550, 517114, 446619, 334443, 183463, 139802, 205667, 91048, 101006, -49432, 71345, 167057, 204122, -58953, -92587, 92341, 180537, 189014, 221187, 99369, -38577, 8454, 62905, -158354, -37995, 56100, -19911, 38441, -94117, -108829, -11225, 102367, 249556, 202084]
6702B02084j81546p315p6339J38611P6945j57115J29554j4307m2407L1343j03761
6691d253n1103Q3182M6047o4896l9639R8209m3700M490O4746M3411N9270k6483
6679A69281l14953j2138K69848j01384J6545R8131r9600j27408J3885j77551K51820
6668a3524M8141J02260j00946j70722K1548j42601N8620K10063M1850o001r5304
6657d6616m2583K42320o2098j57955J38216k00121J49591p5259J27417o7933j04450
6646i9471J16372P4558k18822K41726r1534J07144k4440p5197k3238L585P4371
6635H5054J17914n0967n2575q3527j41278K27733M4953j63516J52379r125l86448
6624b59403o0407j01429J81270J36837J00305o7352M4002o4489R1131J84793k5726
$$ y = [202084, 20538, 13223, -63116, 75495, 152440, -4675, 124879, 110572, 68165, 99508, -4253, -55356, 27826, 73873, 8977, -30662, 67547, 23847, 28337, 93083, 136494, 195764, 169281, -145672, -157810, 112038, 10654, 27199, 125330, 25730, -101678, -87793, -265344, -13524, 34617, 136877, 35931, -134791, -113243, -255844, -197224, 12839, 54689, 48688, -46616, -89199, 153121, 91023, -66932, 71284, -128837, 20754, -54505, 72912, 4979, -99471, 16901, 91459, -127363, 114363, 22829, 129973, 105533, 30336, 7098, 10683, 85054, 202968, 152001, 99426, 15899, -125379, 102354, 147307, -16209, 136170, 127045, -259403, -319810, -421239, -239969, -103132, -2827, -70179, -26177, -90666, 465, 185258, 159532]
6613A59532k66751j62502J25718K3617J55098J70351j61014j67301j22205Q6754
6603a58703o3821N7933P5953N4904M433O3196m2582k848J54028L64678k93534
6592B13637r9244n3378K6798q6431J16440k00558o4444O1174P8126L42969l3531
6581C01558k06664J9970j01821j8017J07803j75889j07705J6953J35178O5508
6571C6874k79665o857K38203m8386o4113K52344K0800l7383L4330j76231R9816
6560F9732j52095o359k91236J25419J76861j5444k8362l443O6807j30405J19830
6549f8695K82034n1547j23829J34587j6614k02751J28375q4750o0742j9291P707
6538g5516q2269J89019N5673L4361P2700p0674j79409J88425M6851j0074N4384
$$ y = [159532, -107219, -269721, -144003, -120386, 34712, 205063, 44049, -123252, -245457, -158703, -222524, -164591, -88638, -33734, -29301, 33895, -8687, -11535, 142493, 507171, 213637, 114393, 61015, 87813, 1382, 117822, -82736, -147180, -86006, -7880, 335089, 301558, 94894, 114864, 13043, -4974, 102829, -73060, -180765, -163812, -28634, 36874, -242791, -249648, -11445, -59831, -123944, 128400, 149200, 111817, 146147, -30084, 69732, -82363, -88722, -379958, -254539, -77678, -93122, -121484, -124927, -58120, -188525, -68695, 213339, 161792, 37963, 172550, 155936, -46815, 81560, -3190, -63932, -83223, -75516, -157785, 31234, 86907, 121268, 193968, 123294, -56115, 132310, 179161, 169087, 223471]
6527B23471R174m6687j86435J12258j27745j71711m0527J5564J31659K19889K4804
6516A63714j09262j41381p376r316J64330j61279k7095j2107J13757J06251m6462
6505C3774r1992K6182J21127J00877m5534j25827j01235L91099m7705r1426j06706
6494F2634r0156R5422j81897L5425J35203m7778J2263O170K1969J02811j1828
6483A40238j02996j31487R3330p9250k01238J04709K77684O9232l2086l8143l8340
6472F1653j81649m0402J5209J14326J14623K94612j77041p5030o8231j04027P1467
6461B5510m8762k3286J56898m9077K3024R8374J31893R5416K0539p4675m4711
6450C11143J49886L3594o6198k47058j23892J5529K04936R1895K6548r7134j3201
$$ y = [223471, 232645, 185958, -477, 111781, -15964, -187675, -228202, -212638, -80979, 138910, 163714, 54452, -86929, -94305, -103621, 60709, -100570, -127665, -139772, -26015, 80236, 33774, -58218, -32036, 89091, 189968, 144434, 18607, -82628, 308471, 260766, 169340, 62634, -27522, 67900, -113997, -78572, 56631, 8853, 21116, 27286, 49255, 152066, 140238, 37242, -94245, -915, -80165, -281403, -176694, 100990, 170222, 138136, 99993, 61653, -119996, -160398, -145189, -30863, 83760, 378372, 201331, 126301, 58070, -45957, 25510, -23252, -46538, 110360, 61283, 84307, 182681, 314574, 409990, 430529, 355854, 311143, 461029, 494623, 428425, 181367, 57475, 73004, 277940, 369835, 396383, 299249, 286048]
6439B86048J21280K1248m0873n9189n7978l9437J1572L0719L9255M2575j26428
6428B28792J8258L00524n4769M2256L0611K48386K092j61556L5237q0704M46n0730
6416E58843Q2573l3668p4706J07628R6437j76364o1354j2930O3626N9832j66046
6405D43871n4700o9615j74522J71442P6626p5854K06442r5027o2632J89265J9788
6394E75084O1724K18126j34501q619L3511l85748J06495j8948j6903n0014J4747
6383C94954J51130k63595J55186J03644j7188N1789j7297j12121J1180O6575k1622
6372E02635k8114o4214J2098Q5738N6256l089k3442k62784P2286K8526J5073k2108
6360C68861j4429J80433j4150J509Q5764O178J3173j50043l265J06114j98997
$$ y = [286048, 407328, 428576, 387703, 328514, 270536, 231099, 242671, 273390, 312645, 355220, 228792, 247050, 547574, 492805, 535061, 565672, 814058, 816150, 654594, 689831, 609127, 609573, 558843, 641416, 607748, 533042, 640670, 737107, 560743, 499389, 486459, 550085, 609917, 443871, 389171, 319556, 145034, 316476, 393102, 317248, 523690, 428663, 366031, 555296, 575084, 636808, 854934, 720433, 711814, 745325, 359577, 466072, 447124, 430221, 380207, 394954, 546084, 282489, 437675, 541319, 524131, 575920, 558623, 446502, 457682, 524257, 502635, 474521, 410307, 422405, 508143, 564399, 561310, 537868, 275084, 347370, 375896, 390969, 368861, 354432, 534865, 520715, 522224, 607988, 614166, 627339, 477296, 474031, 580145, 381148]
6349C81148r3659O7613J14878J41630K6209j69497j82329J52342M1010k48840
6339B30505J38088Q2595J8012K27532k4745Q221O8968j62172r4656Q1186j4352
6328E59182j19587O1951r592k2692Q5756K49258L0850p5463k03911j76339L7294
6317D16707J10598l8414m6780J70525q3351K13506J19415j01752J04584q8765
6307G76273K1290K0133M250j1800n0790J6044L6023o6113r0041J7191J95710p5552
6295G92618o4372J63981J0557L9148m8633J08643j03436j81444J20694J44179
6285I81935k3553M4706o2939p3538K19518j43642q16K39944J62764j17760j84116
6274A042503o8232o4767j01887J23049J21774J17921n3881k98318N6455n3316
$$ y = [381148, 287489, 355102, 469980, 611610, 637819, 468322, 285993, 438335, 479345, 230505, 368593, 451188, 469200, 696732, 671987, 680208, 749176, 587004, 492348, 573534, 559182, 439595, 501546, 491954, 469262, 555018, 804276, 835126, 759663, 555752, 379413, 416707, 527305, 488891, 442111, 612636, 529285, 742791, 862206, 760454, 865038, 776273, 797563, 817696, 821946, 810146, 759356, 775400, 811423, 745310, 655269, 672460, 868170, 792618, 728246, 892227, 902784, 941932, 893299, 1001942, 898506, 717062, 837756, 981935, 958382, 1003088, 940149, 866611, 1086129, 942487, 941671, 1181615, 1344379, 1226619, 1042503, 974271, 909504, 807617, 930666, 1052440, 1170361, 1116480, 818162, 874617, 821301]
6264H21301M2817j08886L01239m5850j62708n0402P5220L2451J14842r073n4775
6253I56176q561p8718J31844J982o9266J46834J39035j5182m7935M0505K2111
6242A218825L4670j60768r2943J90460j2125J82171j57404J1972M6630j37860
6232A123628j12824L1634L31310r8065k27834R7626J96388J02977k36995j14146
6222A093699R9428J30152M2420m5282M0259K5246l4497J31684O9072k31185n563
6211A315433L45761o8843j09144O998J61668J49942l3391j35881J54708K34427
6201B021678L7534m6372j69721J45238o7629l562o0543M9123J70328j8237R2651
6190B150488K01235n9127O068J8606J7820O3185J5765K310r2238J42921J02024
$$ y = [821301, 864118, 755232, 1056471, 1010621, 847913, 797511, 872731, 905182, 1020024, 1010951, 956176, 947615, 868897, 1000741, 1002723, 933457, 1080291, 1219326, 1204144, 1156209, 1196714, 1218825, 1253495, 1092727, 999784, 1190244, 1178119, 1360290, 1202886, 1214858, 1261488, 1123628, 1010804, 1042438, 1373748, 1275683, 1047849, 1145475, 1341863, 1444840, 1207845, 1093699, 1193127, 1323279, 1365699, 1320417, 1360676, 1385922, 1351425, 1483109, 1552181, 1320996, 1315433, 1661194, 1592351, 1483207, 1490205, 1651873, 1801815, 1768424, 1632543, 1787251, 2021678, 2059212, 2012840, 1843119, 1988357, 1920728, 1917166, 1856623, 1905746, 2076074, 2057837, 2150488, 2351723, 2292596, 2298664, 2317270, 2335090, 2398275, 2414040, 2416350, 2324112, 2467033, 2569057]
6179B569057o825O0202J46207p4626P5918J22932J43073J9995R8716P3918j05790
6168C122777J38969J87902m9812M6236K35244J20342P8765m0493n160K01264J36559
6157D172593J26835K34545K26074j08975K80511j14430P8046L81008N4988K18164
6147E549359J10322m9085K21323K02902J65365L84689J60289n6596J24557L74467
6137G187592J56650M76557K21154M1809M17411M81313P05591K21239L33803L48500
6127A0591619L25878O19333M17170O97339N87433P14110Q93620J161040J236488
6118A7244030J240053J684471J865851K095443K308179K773605K887973L363555
6110C5463160L855121M298913M373506L351566J026394j562047l422639m149893
$$ y = [2569057, 2562232, 2622434, 2768641, 2694015, 2769933, 2892865, 3035938, 3055933, 3154649, 3228567, 3122777, 3261746, 3449648, 3399836, 3446072, 3681316, 3801658, 3880423, 3839930, 3834770, 4036034, 4172593, 4299428, 4533973, 4760047, 4651072, 4931583, 4817153, 4895199, 5276207, 5331195, 5549359, 5659681, 5610596, 5831919, 6034821, 6200186, 6584875, 6745164, 6688568, 6813125, 7187592, 7344242, 7820799, 8041953, 8083762, 8501173, 8982486, 9688077, 9909316, 10243119, 10591619, 10917497, 11536830, 11954000, 12651339, 13238772, 13952882, 14846502, 16007542, 17244030, 18484083, 20168554, 22034405, 24129848, 26438027, 29211632, 32099605, 35463160, 39318281, 43617194, 47990700, 51342266, 52368660, 50806613, 47383974, 43234081]
6102D3234081l815805l393245k480693j626050r73215n95617j17474K60962M28123
6093C0921067R31132J673653K073862K556363K939451L484421M086921M484063
6085E3150933N193572O406892P320434Q106714Q062630O789916K937886k233317
6077I5735660p191947r727667j0242186r002410p354678n467905l949119l195379
6069C9604369k118375j389985j249364q30825k1630J37483N75467R49464J322583
6060C6979187J740854K202655K361332L075995L454610L994474M474740L814127
6052F2097974J943143q81310l330884m666838m710175l834850k765250j719422
6044D2132388k205246l220534l284844l209564k595796j991613j610883j267054
$$ y = [43234081, 39418276, 36025031, 33544338, 31918288, 30945073, 30349456, 30231982, 30492944, 30921067, 31852199, 33525852, 35599714, 38156077, 41095528, 44579949, 48666870, 53150933, 58344505, 64751397, 72071831, 80178545, 88241175, 95031091, 97968977, 95735660, 88543713, 78816046, 68573860, 59571450, 52216772, 46748867, 42799748, 39604369, 37485994, 36096009, 34846645, 34015820, 33994190, 34131673, 34707140, 35656604, 36979187, 38720041, 40922696, 43284028, 46360023, 49814633, 53809107, 58283847, 62097974, 64041117, 63159807, 59828923, 55162085, 50451910, 46617060, 43851810, 42132388, 39927142, 36706608, 33421764, 30212200, 27616404, 25624791, 24013908, 22746854]
6036B2746854q95345o19956n90491n77835l75435k63185p0475K1508L7597J41022
6026A9554259J30419J32551J69117N0943L43040L49477L07871M45564O41160O54608
6016B2779009M68150P78404P92322J140007J52233j193619j574842j870567j418075
6007B0053022j244871o66049o12198p08915r1809N1563P6746O8272K95731L10774
5997A7532266J89356K26953J4984L36174r0423j22187M17550L16660L70753O40458
5987A9832544N42857O49836O01915O18233J165065J573274J926208J638597J656831
5978C0205360J534027J871019K095059K651552L119489L431791M216672M301082
5970E3426051L111982J325179j664413l666034m744245m556282l370885k522616
$$ y = [22746854, 21851509, 21231553, 20641062, 20063227, 19687792, 19424607, 19354132, 19375640, 19413237, 19554259, 19684678, 19817229, 19986346, 20037289, 20380329, 20729806, 21037677, 21483241, 22124401, 22779009, 23247159, 24025563, 24817885, 25957892, 26110125, 24916506, 23341664, 21471097, 20053022, 18808151, 18142102, 17529904, 16820989, 16729180, 16780743, 16857489, 16925761, 17221492, 17532266, 17721622, 17948575, 17963559, 18299733, 18209310, 18087123, 18504673, 18821333, 19192086, 19832544, 20375401, 21025237, 21627152, 22245385, 23410450, 24983724, 26909932, 28548529, 30205360, 31739387, 33610406, 35705465, 38357017, 41476506, 44908297, 49124969, 53426051, 56538033, 57863212, 56198799, 52532765, 47788520, 43232238, 39861353, 37338737]
5962C7338737j866460j464938q37257m39046J84107P22369R23856J548538J963517
5953C8073423K324195K945694L526259M054649M622274N543802O182476P093209
5945G4365981P758873P374452M698950q1570m696743q057415r627460q834437
5937F2900631p322027o213751m761266l823262k774479k195910j753404j076010
5929C2980522o02012q9888j53963L44755Q62163J142748J488429J720256K483936
5920D0176946K746373L272646L443080L059590J799268j083004l556240m626809
5912D5231850m988247m677323l826843l238408k472733k098945k038421j758830
5904B0132100j354050j353136j151028j011816r17446q69276n61099n24394n46953
$$ y = [37338737, 35472277, 34007339, 33170082, 32731036, 32915143, 33637512, 34561368, 36109906, 38073423, 40397618, 43343312, 46869571, 50924220, 55546494, 61090296, 67272772, 74365981, 82124854, 89499306, 94198256, 94116686, 89419943, 81362528, 71735068, 62900631, 55578604, 49364853, 44603587, 40780325, 38005846, 35809936, 34056532, 32980522, 32378510, 32288622, 32134659, 32479414, 33341577, 34484325, 35972754, 37693010, 40176946, 42923319, 46195965, 49639045, 52698635, 54497903, 53414899, 49858659, 45231850, 40243603, 35566280, 31739437, 28501029, 26028296, 23929351, 21890930, 20132100, 18778050, 17424914, 16273886, 15262070, 14344624, 13475348, 12914249, 12389855, 11842902]
5895A1842902n25216l25775m21574n24640m49376m04476o4173k07311k44325k98846
5885H377190J16936j83665l20263J4978j43115k43542l1484m0314j54714o99245
5875F692762j00440k96884l89694n362p7561p7864j79610j76733m30756n6821
5865D901037j97801m7200J177j7361q0623k22413m0195q7087q9961J1544l2936
5854D098181P0157k12737j05875j90075R5235J8061J29470l21321l54403J63401
5844C390094K7063l0101j97586l33606O0636P6708l5956j24550j83389N0657l1328
5833B668642J54456m4842j78938L0524O1088k0073q5902l159j21857l4166J515
5822B427288m7087J23544J3066j94102J20317J2979k07650j87028k26015Q8142
$$ y = [11842902, 11317686, 10991911, 10570337, 10045697, 9596321, 9191845, 9127672, 8920361, 8676036, 8377190, 8494126, 8310461, 7990198, 8005176, 7862061, 7618519, 7587035, 7546721, 7392007, 6692762, 6592322, 6295438, 5905744, 5900382, 5822821, 5744957, 5565347, 5388614, 4957858, 4901037, 4703236, 4656036, 4657213, 4639852, 4559229, 4336816, 4296621, 4209534, 4119573, 4131117, 4098181, 4168338, 3955601, 3849726, 3659651, 3754886, 3772947, 3902417, 3581096, 3226693, 3390094, 3417157, 3387056, 3189470, 2855864, 2916500, 2993208, 2957252, 2832702, 2649313, 2699970, 2668642, 2823098, 2778256, 2599318, 2629842, 2690930, 2670857, 2584955, 2581796, 2459939, 2425773, 2427288, 2380201, 2503745, 2516811, 2322709, 2443026, 2456005, 2248355, 2061327, 1835312, 1923454]
5812A923454M7658q0661J2017k2355J05354N730j37912r4166R2824M753Q7349
5801A944045R0613j55086m1717K2022J23136J16342j331o0423q4252K7598J53385
5790B134332m4220l29753Q9358j0553J01858j5917l0816m2950J79914J58300J41184
5779B330737j2002n6907m4938J32064J72071j81815J60652j143J13856k17723
5769B394852J07929o4667l9225J82225K29002Q1384k05772q2844M02324L7936
5759C043144N5790K27794O6666J41721J69459J05740K01695J31368K86969Q6020
5749D516366m9116j39685m7459k20068k70794p6703q9488j76974j4458j66103
5739C265518n4678J15955J70126Q3850J04180L7916M8347K4338J93126M29519
$$ y = [1923454, 1971112, 1890451, 1902468, 1880113, 1985467, 1991197, 1853285, 1759119, 1851943, 1856696, 1944045, 2034658, 1879572, 1837855, 1859877, 1983013, 2099355, 2098024, 2037601, 1953349, 1980947, 2134332, 2090112, 1760359, 1849717, 1839164, 1941022, 1925105, 1894289, 1851339, 2031253, 2189553, 2330737, 2318735, 2261828, 2216890, 2348954, 2521025, 2339210, 2499862, 2498719, 2612575, 2394852, 2502781, 2438114, 2398889, 2581114, 2810116, 2891500, 2685728, 2602884, 3005208, 3043144, 3098934, 3326728, 3393394, 3535115, 3704574, 3810314, 4012009, 4143377, 4430346, 4516366, 4467250, 4327565, 4280106, 4060038, 3789244, 3712541, 3623053, 3446079, 3431621, 3265518, 3210840, 3326795, 3496921, 3580771, 3684951, 3722867, 3771214, 3795552, 3988678, 4418197]
5729D418197M2248J37699J37952M8005L42214J40942o4330q3285r7843l09724
5719D712075l39100l28474j94819j67830l19722j42570k04198j23061N4192n1842
5709B894651j54596P5360p2921N9199J41195K15005J7996k42535k8745J56433
5699C061042N208K22383L3411J4344r2174j49169j69356m21178k47347j03133
5689B154031j03983j00110j57533K65940j07543j94051j09350p0724J03946j24064
5679A556559r6678J23570o4357m0816O7550K5199O1407j7086j31783p2112k1968
5668A389485j07602K13145n5847J5188k5406Q890M3562r5599q9501J75040L6889
5657A508244n1771J01229m5439p3449J97220J1830j20118P4904j33881N0386j30088
$$ y = [4418197, 4460445, 4598144, 4736096, 4784101, 5126315, 5267257, 5202927, 5119642, 5021799, 4712075, 4372975, 4044501, 3849682, 3681852, 3362130, 3219560, 3015362, 2892301, 2946493, 2894651, 2740055, 2815415, 2742494, 2801693, 2942888, 3157893, 3175889, 2933354, 2904609, 3061042, 3066250, 3288633, 3322044, 3336388, 3244214, 3095045, 2925689, 2504511, 2257164, 2154031, 2050048, 1949938, 1792405, 2058345, 1950802, 1756751, 1647401, 1576677, 1680623, 1556559, 1459881, 1583451, 1519094, 1478278, 1545828, 1571027, 1632434, 1615348, 1483565, 1411453, 1389485, 1281883, 1495028, 1439181, 1454369, 1428963, 1437853, 1481415, 1385816, 1296315, 1471355, 1508244, 1456473, 1557702, 1512263, 1438814, 1636034, 1647864, 1527746, 1602650, 1468769, 1519155, 1389067]
5646A389067J45519K8401R4277m8568j68107L65724o3075j49040K2856L7720J76610
5635A831384j3140P1757K12181J25506m9374o8475L8125l8201j41010q9378r9122
5624A780253J39140K02811P0647P8792q0008J6101L95468j08931l0255R2321J99078
5613B755417n5070Q0523J86047L0474Q0067Q0529M0611o6610J24200K90095r3714
5602C452569k61335P9683J58591J11079J02475k04974n3146M13161J37556J53203
5592D088862j4163J8252K32555J44022J99594J22729Q2448K12074k2977M1157
5582E104553L79794K75050J27528J11281q5885L37459K55651J77291K16340M00276
5572G299338K20553J54656L81458M15984K77780M43690M56719N04856K59608L83813
$$ y = [1389067, 1534586, 1562987, 1657264, 1608696, 1440589, 1806313, 1743238, 1594198, 1617054, 1654774, 1831384, 1818244, 1890001, 2102182, 2227688, 2178314, 2109839, 2147964, 2109763, 1968753, 1879375, 1780253, 1919393, 2122204, 2192851, 2271643, 2191635, 2207736, 2603204, 2494273, 2464018, 2556339, 2755417, 2700347, 2780870, 2966917, 2997391, 3077458, 3157987, 3198598, 3131988, 3256188, 3546283, 3452569, 3191234, 3270917, 3429508, 3540587, 3643062, 3438088, 3384942, 3798103, 3935659, 4088862, 4074699, 4092951, 4325506, 4469528, 4669122, 4791851, 4874299, 5086373, 5063396, 5104553, 5484347, 5759397, 5886925, 5998206, 5912321, 6249780, 6505431, 6682722, 6899062, 7299338, 7519891, 7674547, 8056005, 8471989, 8749769, 9193459, 9650178, 10155034, 10414642, 10798455]
5562A0798455O71855Q43663R25343O76958P51137P30498J103168J142390J072701
5553A8716168J539627J530966Q77482L42994o241j39399k54217l11672k87135
5544B2008573m4432J44433M69255M97416O78423N64493N76336M84802O38065Q80853
5534B6898217Q63440J336312R38430P48740P46005J090399J169479J515020J682470
5525C6988512J654625K094100K042883J999932Q95515q00323j896741k484399
5517D0494104k562444k121115j783567j621829j278632p99538o51685p35356p45634
5508B8194304r59733p90168q73247n88310n07530n02558k09943m30273l55248
5499B2977294j36479k285K83807J34930K18209L28241K79203J31658n51295j265497
$$ y = [10798455, 11470310, 12313973, 13239316, 13916274, 14667411, 15397909, 16501077, 17643467, 18716168, 20255795, 21786761, 22664243, 23007237, 23000996, 22861597, 22607380, 22295708, 22008573, 21964141, 22108574, 22577829, 23075245, 23753668, 24318161, 24894497, 25379299, 26017364, 26898217, 27761657, 29097969, 30036399, 30785139, 31531144, 32621543, 33791022, 35306042, 36988512, 38643137, 40737237, 42780120, 44780052, 45675567, 44875244, 42978503, 40494104, 37931660, 35810545, 34026978, 32405149, 31126517, 30326979, 29675294, 28939938, 28194304, 27234571, 26444403, 25571156, 24982846, 24475316, 23972758, 23762815, 23332542, 22977294, 22840815, 22838530, 23122337, 23257267, 23475476, 23803717, 24082920, 24214578, 23663283, 22397786]
5489B2397786j725171j990199j745019j496752q29770r00027q04526o39674o81923
5480A1584725l72337o14093l60522n49373j69044m4310j63319m18024k14631K09
5470H679281j14347K1480j37116J42571Q2425J63663J0897j70151n14369m76377
5460G687957m28713l05657n02953l95765j33087m19701m19932j47568P7431P0423
5450E082435j25453j80342n0422o5274n4702k25075O8711P656j5148P4961N9807
5439D577154J80566J73127K97557P7767j18529p6519k77288m10068l77096k4934
5429D021737j11728l20154k55081j63700n4882M5056m0970p0154j92710p6609
5419B780805j80607J77151J1149j12856J5358l1074p4480k38955J72690J53308
$$ y = [22397786, 20672615, 18682416, 16937397, 15440645, 14610875, 13710848, 12906322, 12266648, 11584725, 11212388, 10598295, 10237773, 9688400, 9519356, 9475046, 9311727, 8893703, 8679072, 8679281, 8564934, 8586414, 8449298, 8591869, 8674294, 8837957, 8848854, 8678703, 8164334, 7687957, 7259244, 6953587, 6450634, 6054869, 5921782, 5502081, 5082149, 4934581, 5012012, 5082435, 4956982, 4776640, 4726218, 4660944, 4606242, 4381167, 4449878, 4457534, 4442386, 4517347, 4577154, 4757720, 4930847, 5228404, 5306171, 5187642, 5111123, 4833835, 4423767, 4046671, 4021737, 3910009, 3589855, 3334774, 3171074, 3116192, 3161248, 3120278, 3050124, 2857414, 2780805, 2600198, 2777349, 2788498, 2675642, 2691000, 2659926, 2585446, 2346491, 2519181, 2672489]
5409B672489p7018k6540j8712K08943k53498j1978p8856Q5921K13388J027k34605
5398B480561q475m7282o9716J01083j79181J27500P0621O3670j92843J11046K04351
5387B661335j4188l1797L5575K22779P7504J28730P5686k77664q6839j90160l9052
5376B561909J51099k50824K8337J265K39807l3110j92904L2576M0478Q0607J2685
5365B671925J02687L4808Q8324o4439m8943K69279K44552L05240O1947L0133K22070
5354C917583N2712L2005j95256j67548k2700J3752k08926j04762j71003K6907
5344C172764J51433K12978J56383j4044k93650j21872K28817o9769k14920K0107
5334C228227j60957J86236J11553j94697j13620J70086K49611k78930J35879p5213
$$ y = [2672489, 2595471, 2568931, 2550219, 2759162, 2505664, 2493686, 2414830, 2500751, 2714139, 2715166, 2480561, 2472086, 2424804, 2355088, 2456171, 2276990, 2404490, 2475111, 2538781, 2345938, 2456984, 2661335, 2647147, 2615350, 2650925, 2873704, 2951208, 3079938, 3155624, 2877960, 2791121, 2600961, 2561909, 2713008, 2462184, 2490521, 2491786, 2731593, 2698483, 2505579, 2538155, 2578633, 2659240, 2671925, 2774612, 2809420, 2897744, 2833305, 2784362, 3053641, 3298193, 3603433, 3665380, 3695513, 3917583, 3970295, 4002300, 3807044, 3639496, 3616796, 3630548, 3421622, 3316860, 3145857, 3172764, 3324197, 3537175, 3693558, 3679514, 3385864, 3263992, 3492809, 3423040, 3208120, 3228227, 3067270, 3253506, 3365059, 3170362, 3056742, 3226828, 3476439, 3197509, 3333388, 3258175]
5324C258175q6488P9219j29082r8422J67486M7739J18487J48617J3657L13138
5314C832526M5941Q1222k15874l14790k42332j10071k58523M569r6216k55778
5304B470674k07879j46971j32355M5480n8226R2785J07417n2319j81764r4335
5294A842507P0774Q1393J41818J16572L9368O4632K15075J34036j84695l13060
5284B208420K9694R2765q5304q6920o8014k29865L4431j71559j67264k4757J22205
5273A653832p5980k20077k2491K4830q9568q3140P2330j40274n515J44963j37834
5262A121076N0358l6035j19732J44499m8100j51755o774n062j9469p481J43564
5251A065089l3609j52772o0949J83057P8240j07917q9677J24313J16087j2686
$$ y = [3258175, 3171687, 3250906, 3121824, 3023402, 3190888, 3238627, 3357114, 3505731, 3519388, 3832526, 3878467, 3959689, 3743815, 3429025, 3186693, 3076622, 2818099, 2822668, 2726452, 2470674, 2262795, 2115824, 1983469, 2028949, 1970723, 2063508, 2170925, 2118606, 1936842, 1842507, 1913281, 1994674, 2136492, 2253064, 2292432, 2357064, 2572139, 2706175, 2521480, 2208420, 2238114, 2330879, 2245575, 2158655, 2090641, 1860776, 1895207, 1723648, 1556384, 1531627, 1653832, 1577852, 1357775, 1335284, 1360114, 1270546, 1187406, 1259736, 1119462, 1113947, 1258910, 1121076, 1171434, 1135399, 1015667, 1160166, 1112066, 960311, 953537, 948475, 929006, 921525, 1065089, 1031480, 878708, 817759, 1000816, 1079056, 971139, 881462, 1005775, 1121862, 1109176]
5241A109176j81934j22867K52985j52923j80977r941n6018p0163r2111o2443K69698
5230G02482K0693n2624j97292N6046K76671O2735j12207q4765J44900n9228J05658
5219H63069k2436r7093l8805J07878j67324j11564J27803J7011J5639J28294j81259
5208F41213K7794m8639J30132R333n4987J11608r4635Q8300K9267N630m1415o2137
5196G41464K2215J65453l7529r7276J99313r252P1060j17991N8599K25110j81527
5185A039639k32149k964J4582Q6555J60195J7235R4931k9117j49885l51159j4362
5174F33501K29324p4244n7830J82748p3268k96548P1378P0873Q0549n2417J46180
5163H60246P7386J33395L1121j12708k274m7718p7840j2639Q8388o3815j23239
$$ y = [1109176, 927242, 804375, 1057360, 904437, 723460, 713519, 657501, 587338, 495227, 432784, 702482, 723175, 670551, 473259, 529305, 805976, 868711, 756504, 671739, 816639, 757411, 863069, 840633, 743540, 704735, 812613, 645289, 533725, 661528, 678539, 694178, 822472, 641213, 669007, 620368, 750500, 759833, 704846, 816454, 721819, 810119, 839386, 845016, 803601, 741464, 763679, 929132, 891603, 794327, 993640, 984388, 1055448, 937457, 996056, 1221166, 1039639, 807490, 804526, 819108, 905663, 1065858, 1083093, 1178024, 1148907, 999022, 647863, 633501, 862825, 788581, 730751, 913499, 840231, 543683, 615061, 685934, 766483, 714066, 860246, 937632, 1071027, 1102148, 989440, 987166, 939448, 861608, 848969, 937357, 873542, 750303]
5152G50303J9300n5496k81178K65846l3841M5800M2140n4799J81608k5636k3111
5141H30936K2128j53243K9871L6502L2931J41096J6883p6647q9746j32118J12472
5130G71065j21637O9302J15378j51233N2418P2822N373J08194n5387j05903N3086
5119H13478O4896J22534J01026O2519k08914K78233m0159j76856J69736o3143
5109A123350j3085Q6567J745k04844j69511K6060O6246j58143J37682J05100j61224
5098H39943K17110O8220K1032m0161R6490Q5854l13467j2973R2485K02891k488
5087A254936J61315L47511J01588j1664L35087J81012K03465k35593l69859j52092
5077A815706k96914r7514j60895l0281j753l92750R6428O1447j52242o0998j33028
$$ y = [750303, 769603, 714107, 432929, 698775, 664934, 710734, 752874, 698075, 879683, 854047, 830936, 853064, 699821, 729692, 766194, 799125, 940221, 957104, 880457, 790711, 658593, 771065, 649428, 718730, 834108, 682875, 735293, 808115, 813488, 921682, 866295, 760392, 813478, 878374, 1000908, 1101934, 1164453, 955539, 1233772, 1193613, 1016757, 1186493, 1123350, 1110265, 1196832, 1198577, 993733, 824222, 850282, 916528, 758385, 896067, 1001167, 839943, 1057053, 1125273, 1146305, 1106144, 1202634, 1288488, 975021, 962048, 1054533, 1257424, 1254936, 1416251, 1763762, 1865350, 1853686, 2188773, 2369785, 2573250, 2337657, 1967798, 1815706, 1518792, 1421278, 1260383, 1230102, 1228349, 835599, 932027, 993474, 841232, 780234, 647206]
5066F47206J70650J2526K6907R0617j61993j3720O5960r196L4870j09981r6215
5055F57631J02242O6790o399K0182m2969K7251p1837J21703K6789J01755j03022
5044I00116k07587L1464R970p7381J21677m2679j50209k9687K21698M4512m6364
5033G75530L9575O17R067L5577j6153m7974j20790K551J45712L5912K7565J16101
5021A003290L9680j36113j7449P4167k7525j19677j30170J00640P5394j94967
5011F67270n4530K47165N3715J1502j37300L1152p5307K920p744K20654L22478
5000A281975k22829j1740m3706K350J04388J3458j03609q550j6922K94538j32023
4989A157330j04521l1519r8445K1344J84390l8217j13391P950M3615K8459J09212
$$ y = [647206, 817856, 830382, 857289, 947906, 785913, 772193, 838153, 828957, 863827, 753846, 657631, 759873, 826663, 820264, 840446, 797477, 824728, 752891, 874594, 901383, 1003138, 900116, 692529, 723993, 733963, 656582, 778259, 735580, 585371, 555684, 777382, 821894, 775530, 815105, 815722, 824789, 860366, 844213, 796239, 675449, 678000, 823712, 859624, 887189, 1003290, 1042970, 906857, 889408, 963575, 936050, 816373, 686203, 786843, 862237, 667270, 612740, 859905, 913620, 925122, 787822, 818974, 743667, 746587, 738843, 959497, 1281975, 1059146, 1047406, 1003700, 1006050, 1110438, 1123896, 1020287, 1011737, 994815, 1289353, 1157330, 1052809, 1021290, 922845, 944189, 1128579, 1090362, 976971, 984921, 1028536, 1056995, 1166207]
4978A166207O4046j12779J11129J47672k46343q5304M1018J35396J38931j28237
4968A231736P0594Q4758j46686J45675j27593o2856K18899j7284P9455m9018o3171
4957A364509p0018r4759J52520J91569l582N6490J06825N7095l5946k18917j07978
4946A397808J30950j8673O7474n9491K65778R084L10323j12484j36503M2977l1006
4935A866237R7142j44099M8753P7810m8973J13419N6150J47738P827M5317K54140
4924B521461K0271P3933Q8883J5738J09948M9024k04853K08077J62850L1596m686
4913C072242J53235K3676J23201J5624K8591R7323q6905K5200J86829K12523K44519
4902D096058J14882N6963J72874K1858J50928J07245K31864L36875Q8329J92916
$$ y = [1166207, 1230253, 1117474, 1228603, 1376275, 1129932, 1044628, 1085646, 1221042, 1359973, 1231736, 1302330, 1387088, 1240402, 1386077, 1258484, 1195628, 1414527, 1397243, 1476698, 1427680, 1364509, 1294491, 1199732, 1352252, 1543821, 1540239, 1596729, 1703554, 1760649, 1724703, 1505786, 1397808, 1528758, 1510085, 1577559, 1518068, 1783846, 1792930, 2103253, 1990769, 1854266, 1897243, 1866237, 1963379, 1819280, 1868033, 1945843, 1896870, 2010289, 2066439, 2214177, 2222004, 2267321, 2521461, 2541732, 2615665, 2704548, 2720286, 2830234, 2879258, 2674405, 2882482, 3045332, 3076928, 3072242, 3225477, 3249153, 3372354, 3387978, 3416569, 3513892, 3426987, 3452187, 3639016, 3851539, 4096058, 4210940, 4267903, 4440777, 4462635, 4613563, 4720808, 4952672, 5289547, 5377876, 5570792]
4892E570792J73340K66243K64275J77805L45811M85720M09388M67337O03146Q66411
4882I630268O47014P77117P88289R33042J112006J182478J465474J816594R34766
4873A9287048m8820p60049j350468j278191r07975m51043o47778k96469l42779
4864A3203476q4888K14502L37449K15245Q47576R16968J127631J301645J595784
4855A9675388J852154J726795K673634K696058L129476L798763M683005N914562
4847D6149835O581262K832600k754753n931511p510171o172708m484036l105179
4839B5605339k344402j577229j136869r55082o72844l83651l98395j60656L923
4830A7980134L0743P7860Q4454K6002M0794j74704j59134k71388k27181J6555
$$ y = [5570792, 5744132, 6010375, 6274650, 6452455, 6798266, 7283986, 7693374, 8160711, 8763857, 9630268, 10277282, 11054399, 11842688, 12775730, 13887736, 15070214, 16535688, 18352282, 19287048, 19238228, 18478179, 17127711, 15849520, 14941545, 14490502, 13842724, 13546255, 13203476, 13118588, 13333090, 13670539, 13885784, 14733360, 15650328, 16777959, 18079604, 19675388, 21527542, 23254337, 25927971, 28624029, 31753505, 35552268, 40235273, 46149835, 52731097, 55563697, 52808944, 46877433, 39367262, 33194554, 28710518, 25605339, 23260937, 21683708, 20546839, 19591757, 18918913, 18535262, 18136867, 17976211, 17980134, 18010877, 18088737, 18173191, 18199193, 18239987, 18065283, 17906149, 17634761, 17407580, 17424135]
4820A7424135q8986J61654J63018L84504N45428M16887P67475R17645J252467
4811B1944227J284647J083091J469911J920386K171976K816374J706853K80506
4803C4677971r85228j813991j477846j076050m52424j70532K77424J12948L0110
4794B9122382M88801M46773O70247R10129J017133J658862J801641K167673K571883
4785D0855524K880474L170868L886382M586780O025033P425270Q701830R715081
4777H7247242J1202725J2426421J5027697J6888755J9702654K3252222K9089029
4770B14836745L5752590L8515930J0048557k3614855l9726993m5565582l7480202
4763A52766190k8340372k0019802j5250651j1440384r185266p502597o142877
$$ y = [17424135, 17335149, 17496803, 17659821, 18044325, 18589753, 19006640, 19774115, 20691760, 21944227, 23228874, 24311965, 25781876, 27702262, 29874238, 32690612, 34397465, 34677971, 33692743, 31878752, 30400906, 29324856, 28872432, 28701900, 28979324, 29092272, 29122382, 29611183, 30057956, 30728203, 31638332, 32655465, 34314327, 36115968, 38283641, 40855524, 43735998, 46906866, 50793248, 55380028, 61405061, 68830331, 77532161, 87247242, 98449967, 110876388, 125904085, 142792840, 162495494, 185747716, 214836745, 250589335, 289105265, 299153822, 275538967, 235811974, 190246392, 152766190, 124425818, 104406016, 89155365, 77714981, 68529715, 61027118, 54884241]
4756E4884241m686261m178555l680275l429786k801289k462463k150310k000107
4748B9495195j408317j248916j388430j260775j072651j245387j004085r69293
4740A9897341q82192q34640o74460n91856n00244k30606l71607m87035n56774
4731A4767927l85321m30892m02520l69220n63360l00922m11777k40753l13875
4722A1349287n36736n32636j99926n44309m05863k25121l38254k99759j82170
4713H084513l04378o2090k08737l4656j78716K6228p9679k78486m03723j88106
4703F372170j52232j14873O022j73128P481j09477O1828k1519j35729k13650p0760
4692E456133j24258J09943K3925l7964Q7651J72172j49376J14652J12361k46481
$$ y = [54884241, 50197980, 46019425, 42339150, 38909364, 36108075, 33645612, 31495302, 29495195, 28086878, 26837962, 25449532, 24188757, 23116106, 21870719, 20866634, 19897341, 19015149, 18180509, 17506049, 16914193, 16413949, 16183343, 15811736, 15324701, 14767927, 14382606, 13951714, 13549194, 13179974, 12616614, 12315692, 11903915, 11663162, 11349287, 10812551, 10279915, 10079989, 9535680, 9129817, 8904696, 8566442, 8266683, 8084513, 7780135, 7718045, 7509308, 7474652, 7295936, 7322164, 7242485, 6963999, 6560276, 6372170, 6219938, 6105065, 6111087, 5937959, 5945440, 5835963, 5897791, 5876272, 5740543, 5526893, 5456133, 5331875, 5441818, 5465743, 5427779, 5515430, 5687602, 5538226, 5652878, 5765239, 5518758]
4682E518758l81972j50947k62259j37239j90006o6621j40608q9584o5175k38038
4672C796309k0493L6455k08190j82015K3608J0127l9937j89467M1511j35240O6587
4661C199255k1648o6610j71168J40318m8131l17393j18866j09860L0830j55024
4651B361703J79140p1668o2693j04282k40027j73806Q5985J03238J44683P2467
4641B294740r6424j96506J0948J44807k4146r6500j4909O3868j36023p0571J94585
4630B073869O2809O2039N6378j81157j03554N4108J1746m376m448r1136j41270
4619A795008M2581k0757r6077L7265J06705j35411p4698o7886M0338q4200J1809
4608A554677R8857k3677J34914j65583j12614J43102q2752n4631J51374J6808
$$ y = [5518758, 5136786, 4985839, 4723580, 4586341, 4396335, 4329714, 4189106, 4099522, 4034347, 3796309, 3775816, 3812271, 3604081, 3422066, 3445674, 3455801, 3415864, 3226397, 3267908, 3132668, 3199255, 3177607, 3110997, 2939829, 3080147, 3032016, 2714623, 2595757, 2485897, 2516727, 2361703, 2540843, 2469175, 2406482, 2302200, 2062173, 1888367, 1974352, 2077590, 2222273, 2294740, 2198316, 2001810, 2012758, 2157565, 2133419, 2036919, 2022010, 2085878, 1949855, 1879284, 2073869, 2136678, 2198717, 2255095, 2073938, 1970384, 2024492, 2036238, 2031862, 2027414, 1936278, 1795008, 1837589, 1816832, 1720755, 1758020, 1864725, 1729314, 1654616, 1586730, 1627068, 1542868, 1554677, 1653534, 1629857, 1764771, 1599188, 1486574, 1629676, 1546924, 1492293, 1643667, 1660475]
4598A660475k18861N6013j52385j38284K5886j39415J20103o7432j28867N3987
4588A071220J18575K09319r0250k37910J9356J18318N551J41373o0143j98017
4578A097392j67555K17498R7666j28859N5825j40332J04617k2726J3675l555o8708
4567A054938K2182K11919P8043m0830r6366j32167k249M0432O2697N6970P9141
4556A334710q9494j08494J96070p2161j07087j89757r59M9513J40959J53480r0983
4545A215797L5071j62206k8803N2967J04977j75259J04787L27537j15753L0046
4535A389161p1719P9851p9262K6316K0305k9283J54501J0425o0645j15657Q5061
4524A409054o7963m6035q6666o3899j0533K13536J08373J9410l3955j78216L446
$$ y = [1660475, 1441614, 1497627, 1345242, 1206958, 1232844, 1093429, 1213532, 1146100, 1017233, 1071220, 1189795, 1399114, 1308864, 1070954, 1090310, 1208628, 1214179, 1355552, 1295409, 1097392, 929837, 1147335, 1245001, 1116142, 1171967, 1031635, 1136252, 1113526, 1127201, 1123646, 1054938, 1077120, 1289039, 1367082, 1326252, 1229886, 1097719, 1095470, 1135902, 1198599, 1255569, 1334710, 1245216, 1136722, 1332792, 1260631, 1153544, 963787, 962828, 1012341, 1153300, 1306780, 1215797, 1250868, 1088662, 1059859, 1112826, 1217803, 1042544, 1147331, 1474868, 1359115, 1389161, 1317442, 1397293, 1318031, 1344347, 1364652, 1335369, 1489870, 1500295, 1439650, 1323993, 1409054, 1341091, 1295056, 1208390, 1144491, 1133958, 1347494, 1455867, 1475277, 1441322, 1263106, 1266552]
4513A266552O0841k41378J56139J26621L08637Q294R9164j2801K5321J39186k57586
4502A678990Q3022Q6266J41883O8107J72826j86822o509m7834r9647J4346J75774
4491B080402J3447J02886m2326J61860J057J38168L49186K67629l1474J63605
4481C204440K66884J80660J75606K73162J79183k70K337J5821n0941j00492o9477
4470D076913k0955l35066O7109j93765j38883J62132j35292j07341M4524J26843
4460C546219m7175Q7977L5312r2311m3611L42243J34944K88439L89580K29447
4450D871064m4896j01572r4125P7339R0675J61907M1886j47167N7310j14786o3978
4439D733657J13368l78670j11351P749p6686J557k51198j98588k8802r8055p5745
$$ y = [1266552, 1327393, 1086015, 1242154, 1368775, 1677412, 1685706, 1784870, 1772069, 1797390, 1936576, 1678990, 1762012, 1848278, 1990161, 2058268, 2231094, 2044272, 2037763, 1989929, 1890282, 1904628, 2080402, 2093849, 2196735, 2154409, 2316269, 2317326, 2455494, 2804680, 3072309, 3040835, 3204440, 3471324, 3651984, 3827590, 4100752, 4279935, 4279665, 4282002, 4297823, 4246882, 4146390, 4076913, 4055958, 3720892, 3788001, 3594236, 3455353, 3617485, 3482193, 3374852, 3419376, 3546219, 3499044, 3587021, 3622333, 3530022, 3486411, 3828654, 3963598, 4252037, 4641617, 4871064, 4826168, 4724596, 4630471, 4707810, 4798485, 4960392, 5002278, 4855111, 4912421, 4797635, 4733657, 4847025, 4468355, 4357004, 4364753, 4288067, 4289624, 4038426, 3839838, 3811036, 3712981, 3637236]
4428C637236j25961K2381j36300k0760j34566j8363J07023j21188l6246K0952
4418C194208O523j85239o3478O5171J23363J52426j3299k7999R3815k0200K58155
4407C583446J10423N3530J1623L2475l1726R602j45528k27248L3265j865j22406
4396C305591l29637J1998m5937L8776K2730P3055p2864j64720k6210j56283k57865
4385B398634K6724j09290N9431P0277P7718K3427q1706j06597j04733p723j5428
4374B230734r6834P4410K9262K0875J47145P4993j67804J38975j913r1641q6722
4363B271480K29103L3015j21357l2154p7546n8337r2573J49709j7249J63346J55405
4352B602842j45373j25880M8141L5918j41088J31137K0725q1464M0511q7562J16737
$$ y = [3637236, 3511275, 3533656, 3397356, 3376596, 3242030, 3223667, 3330690, 3209502, 3173256, 3194208, 3200731, 3015492, 2952014, 3017185, 3140548, 3292974, 3279675, 3251676, 3345491, 3325291, 3583446, 3693869, 3747399, 3759022, 3791497, 3759771, 3769373, 3623845, 3396597, 3429862, 3427997, 3305591, 2975954, 2987952, 2942015, 2980791, 3003521, 3076576, 3003712, 2838992, 2812782, 2656499, 2398634, 2425358, 2316068, 2375499, 2445776, 2523494, 2546921, 2465215, 2358618, 2253885, 2246162, 2230734, 2133900, 2208310, 2237572, 2258447, 2405592, 2480585, 2312781, 2451756, 2449843, 2358202, 2271480, 2500583, 2533598, 2412241, 2380087, 2302541, 2244204, 2151631, 2301340, 2284091, 2447437, 2602842, 2457469, 2331589, 2379730, 2415648, 2274560, 2405697, 2426422, 2344958, 2385469, 2297907, 2414644]
4341B414644M5465J81989o4645j24814P3257J67067j30875J02789k95439J34442
4331B503880J95445K3402J6677O1205R5566j52282m9697J86774o998n255K32459
4320C101176j70837o8524M14693J77428j90452J71165j16048r2273J93512n5056
4310C364784j2442J89035q6472J6939l9249j61531J59510O5587j15451Q8565N0355
4299C519630J61250P1042K58634J00785K6862K5472j10661P4746N199K71620J30221
4288D534800J72269j38945J73214Q9694J31872k9586m9577J38545K44568K50115
4278E516969O3231j5343J95170J24704L05364J43409R8276J71473L24104L86724
4268G314081K84194J26297K19619J04303K37508L39578M076L30396J68100J26747
$$ y = [2414644, 2460109, 2642098, 2577453, 2452639, 2525896, 2692963, 2562088, 2664877, 2369438, 2503880, 2699325, 2722727, 2739404, 2800609, 2896175, 2743893, 2694196, 2880970, 2873972, 2868717, 3101176, 2930339, 2861815, 3276508, 3453936, 3263484, 3434649, 3318601, 3226328, 3419840, 3364784, 3352342, 3541377, 3454905, 3471844, 3432595, 3271064, 3430574, 3496161, 3380710, 3469275, 3519630, 3680880, 3751922, 4010556, 4111341, 4138203, 4163675, 4053014, 4127760, 4132959, 4404579, 4534800, 4707069, 4568124, 4741338, 4831032, 4962904, 4933318, 4883741, 5022286, 5266854, 5516969, 5580200, 5564857, 5760027, 5884731, 6190095, 6333504, 6431780, 6603253, 6927357, 7314081, 7598275, 7724572, 7944191, 8048494, 8286002, 8625580, 8629656, 8960052, 9128152, 9254899]
4258I254899K75212M92750J14020M1320J37362K07382K45574M24666J10864K43974
4248A1548023L20783J99577O28238M81594K91738J88391J49186L15238L08349
4239A4431117L01780M50824M18784L85355O91464M69585L83468M62271O59552
4230A8654200O85350O48060Q79979P71051P53601R17445J001375J112383J212658
4221B6636102J306772J421943J529041J498324J600228J732592K115993K213774
4213D0054769K416797K688851L016573L589374L986136L810308L623443L672904
4205F6859155L777643M374699N310093O824120Q390788J0057936J1728023J3627257
4197A30949714J5380131J7929400K0947937K5066719K9749088L3859834K8617608
$$ y = [9254899, 9530111, 10022861, 10136881, 10178201, 10315563, 10522945, 10768519, 11193185, 11304049, 11548023, 11868806, 12068383, 12696621, 13178215, 13469953, 13658344, 13807530, 14122768, 14431117, 14732897, 15183721, 15602505, 15987860, 16679324, 17148909, 17532377, 17994648, 18654200, 19339550, 19987610, 20867589, 21638640, 22392241, 23309686, 24311061, 25423444, 26636102, 27942874, 29364817, 30893858, 32392182, 33992410, 35725002, 37840995, 40054769, 42471566, 45160417, 48176990, 51766364, 55752500, 59562808, 63186251, 66859155, 70636798, 75011497, 80321590, 87145710, 95536498, 105594434, 117322457, 130949714, 146329845, 164259245, 185207182, 210273901, 240022989, 273882823, 302500431]
4190C02500431J2558399r429250k7937290l4397632l3033796k6416270j9655141
4183A64189451j3644362r971693q187129q150529r130083r252564q840375p976868
4175H9035848o806870n482382m256062l602598k805617j829607j066200o75410
4167F2511102j15005L32743J252709J625772K352442L010028L173137L882022
4159G8024950L979252L355925L385434K857217K140978Q90793j896894m520824
4151H8216831o389715p160501o995370o260610n126800m062087l421460k554022
4143D6246266k268839j448376j183964j116775n31996j63486L58046P44452P68695
4134D1404023J092464J747720J562325J992723K311478K316952K441114J464831
$$ y = [302500431, 315058830, 305629580, 277692290, 243294658, 210260862, 183844592, 164189451, 150545089, 140573396, 132386267, 124235738, 115105655, 105853091, 97012716, 89035848, 82228978, 76746596, 72490534, 68887936, 66082319, 64252712, 63186512, 62511102, 62396097, 62728840, 63981549, 65607321, 67959763, 70969791, 74142928, 78024950, 82004202, 85360127, 88745561, 91602778, 93743756, 94634549, 92737655, 88216831, 81827116, 74666615, 67671245, 61410635, 56283835, 52221748, 48800288, 46246266, 43977427, 42529051, 41345087, 40228312, 39696316, 39532830, 39890876, 40635328, 41404023, 42496487, 44244207, 45806532, 47799255, 50110733, 52427685, 54868799, 56333630]
4126E6333630l99521k417271m377643m540204m328989l877934l093435k379938
4118C0918695j884013j716178j438603j237619r40614q71758n08920n62661l34639
4109B1423690k04340k7085r119R2897J92137M22545K42070L80640M11649L21096
4099B3246180k31688q35204j240097j320934j253725j066946q71646l41315n05406
4090A5579219p07150n96177n94364p66338m64343l39683m10028m01200j84734
4081A1115202l05650l68235j41541j88168k29619k34934l43858j03064K53000
4072I453133l25471o2057q1166j86658j55392r4304k48598k2034q6119m3292j23657
4061H024385j63080q9998m6128K647r213N137J23251L281p3670J27738j46892
$$ y = [56333630, 55934109, 53516838, 49139195, 44598991, 40270002, 36392068, 33298633, 30918695, 29034682, 27318504, 25879901, 24642282, 23701668, 22829910, 22320990, 21758329, 21423690, 21219350, 21192265, 21183146, 21276043, 21468180, 21890725, 22132795, 22513435, 22925084, 23246180, 23014492, 22179288, 20939191, 19618257, 18364532, 17297586, 16425940, 16084625, 15579219, 14872069, 14275892, 13681528, 12915190, 12450847, 12111164, 11701136, 11299936, 11115202, 10809552, 10441317, 10299776, 10111608, 9881989, 9647055, 9303197, 9200133, 9453133, 9127662, 9065605, 8984439, 8797781, 8642389, 8548085, 8299487, 8277453, 8191334, 8148042, 8024385, 7861305, 7771307, 7725179, 7727826, 7718613, 7723750, 7847001, 7850282, 7776612, 7904350, 7757458]
4050G757458l9925M166J11174R6390j10451J38323J8231k7764L1704R6197R5998
4039H171501Q7244K92256Q7655N9299J78126Q3987J57682N16730K84521K23328
4029A0142329L36535M21291L11115K9433J55139P4925l59409k63592k87754k80122
4019A0279890k79931k27971j70384j06290l49958j13632q2332n1217k0216j19629
4009H758330P8223J4135Q9492K63577K17721K75432K0134J12315j272j78222j84660
3998I465205J125k173r4033R9976n5517J6864Q8835n8842O683K29686j25255j67689
3986I404865j07648j04790k76978O2757O3763O4596J29347J77436J62080J88792
3976I764220O424J09185R5881J8496j92952r5649q4968P6197n4285J60143k47642
$$ y = [7757458, 7717533, 7721699, 7832873, 7929263, 7818812, 7957135, 7975366, 7947602, 7979306, 8075503, 8171501, 8258745, 8551001, 8638656, 8697955, 8876081, 8960068, 9117750, 9634480, 9919001, 10142329, 10478864, 10900155, 11211270, 11240703, 11395842, 11470767, 11111358, 10847766, 10560012, 10279890, 9999959, 9771988, 9601604, 9495314, 9145356, 9031724, 8949392, 8898175, 8877959, 8758330, 8836553, 8850688, 8940180, 9203757, 9421478, 9696910, 9717044, 9829359, 9828087, 9649865, 9465205, 9466330, 9464157, 9370124, 9470100, 9414583, 9431447, 9520282, 9461440, 9468123, 9697809, 9572554, 9404865, 9297217, 9192427, 8915449, 8978206, 9041969, 9106565, 9235912, 9413348, 9575428, 9764220, 9770644, 9879829, 9975710, 9994206, 9801254, 9705605, 9620637, 9696834, 9642549, 9802692, 9555050]
3965I555050j41293J79200J32831j11813l16379r9371j97216j50202J139k07213
3955H644733K4268R2332j48094l2244K65328J53542N9197Q9107J90684K94422
3945I633275P0652J6228Q1790q8558p684k5576p6922J3040k67487j00891k03099
3934I044768j53707j82842k5208k49194l4264J62333j7388Q4219r3469P9814O6186
3923H681248j47471L00716K76333K83168K74673Q1877N9879J76277P1912J22544
3913A0181156P1070M0445o2506j95042O8854J7530R6262j39931o9376K09890M273
3902A0222625K24386K01312J78427J2329n267j43573n7707o6229j97277J96432
3892A0565458K80389P232K53811p184J31653K00583K06865N5919k11968J0673
$$ y = [9555050, 9413757, 9592957, 9725788, 9613975, 9297596, 9198225, 9001009, 8850807, 8851946, 8644733, 8669001, 8761333, 8613239, 8580995, 8846323, 8999865, 9059062, 9148169, 9338853, 9633275, 9703927, 9720155, 9801945, 9713387, 9705703, 9680127, 9603205, 9616245, 9348758, 9247867, 9044768, 8891061, 8708219, 8683011, 8433817, 8399553, 8561886, 8544498, 8628717, 8535248, 8615062, 8681248, 8533777, 8834493, 9110826, 9393994, 9668667, 9750544, 9810423, 9986700, 10058612, 10181156, 10252226, 10292671, 10230165, 10035123, 10103977, 10121507, 10217769, 10077838, 10008462, 10218352, 10222625, 10447011, 10648323, 10826750, 10839079, 10833812, 10690239, 10632532, 10566303, 10369026, 10565458, 10845847, 10853079, 11106890, 11099706, 11231359, 11431942, 11638807, 11694726, 11482758, 11493431]
3882A1493431R1677n8781N1j221m6195P6596J38660K8582r0029K31741Q3269J08027
3870A2055808l1430Q9302L73359L05453L54464K16676K12543J64959J61669J06990
3860A4009793L14074J16597k16411j41776Q3027J57283k9096J86921J17499K29575
3850A4827486K42878K55589K48183K79057K45766O06163N87556N01820P49305
3841A8543803J031010N63429O92086Q95367Q42414R35801J195292J351825J702284
3832B7753311J166350M44206l5417n69918m55086m58776k4253M8042N03023P28345
3822B9099827Q71153J199911J335841J332072R79637L75711K43886K76527J79551
3813C5894116q4384K93123L19758N14913O87599J027643J498841J837625K220835
$$ y = [11493431, 11585108, 11526327, 11526378, 11525157, 11478962, 11555558, 11694218, 11722800, 11632771, 11864512, 11947781, 12055808, 12024378, 12113680, 12487039, 12792492, 13146956, 13363632, 13576175, 13741134, 13902803, 14009793, 14323867, 14440464, 14224053, 14082277, 14165304, 14322587, 14293491, 14480412, 14597911, 14827486, 15070364, 15325953, 15574136, 15853193, 16098959, 16705122, 17292678, 17794498, 18543803, 19574813, 20138242, 20830328, 21725695, 22568109, 23503910, 24699202, 26051027, 27753311, 28919661, 29363867, 29328450, 28758532, 28303446, 27844670, 27820417, 27868459, 28371482, 29099827, 29970980, 31170891, 32506732, 33838804, 34818441, 35194152, 35438038, 35714565, 35894116, 35809732, 36102855, 36422613, 36937526, 37625125, 38652768, 40151609, 41989234, 44210069]
3804D4210069L106232L177244J928643n96391k737862l749411l627605k923372
3796C8787547k300019j407526o62995l90426m35190j68592q1981j76402l44657
3787C2819759j37279l55941p95102j229322j495922j544164j290906j041988n06572
3778B4422563k27719l04128J45974M80537M20029J73375L6493q02145j661301
3769B2683678j588048j353416j240434j273317q01607o47262q85439o22788o76704
3760A3594663n70460k60066o19997n01400l74422o0727k38849k92300k56898m4618
3750A0374926j9432k05993j27140j01579q6526l8345P3976n7717J54525k59949
3740I706746m61193j94928l30190n0331k75089j19181l7504j42875k38611k10061
$$ y = [44210069, 47316301, 50493545, 52422188, 51825797, 49087935, 45338524, 41710919, 38787547, 36487528, 35080002, 34417007, 34026581, 33591391, 33422799, 33340818, 33164416, 32819759, 32682480, 32326539, 31531437, 30302115, 28806193, 27262029, 25971123, 24929135, 24422563, 24194844, 23890716, 24036690, 24517227, 24937256, 25110631, 25147124, 24344979, 22683678, 21095630, 19742214, 18501780, 17228463, 16426856, 15779594, 14894155, 14271367, 13594663, 13024203, 12764137, 12144140, 11642740, 11268318, 11207591, 10968742, 10676442, 10419544, 10374926, 10355494, 10149501, 10022361, 9920782, 9834256, 9795911, 9869887, 9812170, 9966695, 9706746, 9245553, 9050625, 8720435, 8670104, 8395015, 8275834, 8238330, 8095455, 7856844, 7646783]
3730G646783J1811k9340p6894j15153N4438J17864q5815k94252q5555R8864J88925
3719G431676j09193N842k86864r4314p5511q7701L5668j28419n6684k68635O3106
3708F428971p6085J02867j10010k33865j79197m8858P2449R8114q8899o6500K3801
3697E922788J31088j02826j64001j4469J05328L515J57427r9339l70926K66550
3687E835135J12556k08372r1743j5313n0143o7671j985O8654p058j59917j86282
3676E227861m7197r0584k5127R0558J18981n717J94201j48075k7502Q3394m9181
3665E321612j26042q8587M8919p0519k0343o8147O0487J8829N404j11106k85410
3654D685097J44866J36921R3270J7534q3773j99693j41264J32188L5589j6036
$$ y = [7646783, 7658594, 7629254, 7552360, 7437207, 7491645, 7609509, 7523694, 7229442, 7143887, 7242751, 7431676, 7322483, 7328325, 7041461, 6947147, 6871636, 6783935, 6819603, 6691184, 6634500, 6365865, 6428971, 6352886, 6455753, 6345743, 6111878, 5932681, 5883823, 5956272, 6054386, 5965487, 5898987, 5922788, 6053876, 5951050, 5787049, 5772580, 5877908, 5881423, 6038850, 5939511, 5568585, 5835135, 5947691, 5739319, 5647576, 5632263, 5582120, 5514449, 5512464, 5581118, 5574060, 5414143, 5227861, 5180664, 5090080, 5064953, 5155511, 5274492, 5268775, 5462976, 5314901, 5287399, 5370793, 5321612, 5195570, 5106983, 5155902, 5085383, 5065040, 4996893, 5057380, 5076209, 5081613, 4970507, 4685097, 4829963, 4966884, 5060154, 5077688, 4993915, 4794222, 4652958, 4785146, 4820735, 4804699]
3644D804699o1941k2735Q7442K1157K37229j17906R768q2228j9590p2706n4663
3633D728526Q2041J05033o1149j58552j16508l8873J53710K65822L529j47461
3623D816118k91244J24234K6541m3948n1668j27329k3101o3857j5774p3503R7858
3612D374327Q4251J3463N5909m4560q8145n2513M8101J09203j48815J69236p5030
3601D445427l6864N5459k53604N6760M6048m1473J11986p8722J96115j40980j49979
3590D210173n0969k0890J61293m7607j38874J93337j49476J60302K66942l5384
3580D548847j89010o8771r0197p9115K48403K48525P0427k06417j39410K0005
3570D363287l3902L27809L3003n1296J28944J61481K3232j09562j2614j1389k6397
$$ y = [4804699, 4742758, 4720023, 4807465, 4828622, 5065851, 4947945, 4957713, 4875485, 4855895, 4783189, 4728526, 4810567, 4915600, 4854451, 4695899, 4579391, 4540518, 4694228, 4960050, 4963579, 4816118, 4524874, 4649108, 4675649, 4631701, 4580033, 4452704, 4429603, 4365746, 4349972, 4276469, 4374327, 4458578, 4472041, 4527950, 4483390, 4395245, 4342732, 4390833, 4500036, 4351221, 4520457, 4445427, 4408563, 4464022, 4210418, 4267178, 4313226, 4271753, 4383739, 4305017, 4501132, 4360152, 4210173, 4159204, 4138314, 4299607, 4252000, 4113126, 4306463, 4156987, 4317289, 4584231, 4548847, 4359837, 4291066, 4200869, 4121754, 4370157, 4618682, 4689109, 4482692, 4343282, 4363287, 4329385, 4657194, 4690197, 4638901, 4767845, 4929326, 4952558, 4842996, 4830382, 4818993, 4792596]
3559D792596j59010M600l1020n8460n6378K74393p678Q837J9937L7073K46178
3548E071068K90j68007J30816J51790K5069j71539J03502J50443p0819j28723
3538E093890R2041J93370O5850j3419O711j8696r1160o3235R4999l8737l2293
3527E289321J80937J75778J0251j04858l7535k9433n3040j40589M5122J33094
3517E469048J11200p0758J23822J53200M6344J4759j4274J11571R5339j24093
3507E916158J50985R0086J2171j51202M5112M8131P1562r9914J080J16722r8511
3496F102380K59432J5818l40549j86318l249L88794J8813r6504m547k5241j1958
3485F116871J33241L2816k58729O5937R8128K33752m7361P7359L48586L3624k16708
$$ y = [4792596, 4633586, 4638186, 4607166, 4548706, 4492328, 4766721, 4759043, 4767880, 4787817, 4824890, 5071068, 5071358, 4903351, 5034167, 5185957, 5211026, 5039487, 5142989, 5293432, 5222613, 5093890, 5185931, 5379301, 5445151, 5431732, 5438443, 5419747, 5328587, 5265352, 5360351, 5321614, 5289321, 5470258, 5646036, 5656287, 5551429, 5513894, 5484461, 5431421, 5290832, 5335954, 5469048, 5580248, 5509490, 5633312, 5786512, 5832856, 5847615, 5833341, 5944912, 6040251, 5916158, 6067143, 6157229, 6169400, 6018198, 6063310, 6111441, 6183003, 6083089, 6084169, 6200891, 6102380, 6361812, 6377630, 6037081, 5850763, 5847514, 6236308, 6255121, 6158617, 6154070, 6128829, 6116871, 6250112, 6282928, 6024199, 6090136, 6188264, 6422016, 6374655, 6452014, 6800600, 6834224, 6617516]
3474F617516j80014L61628J05383O290J71763j14344k0574J80631j26406L02362
3464G304235L12396k23016P4105M0515J47623K10698J46573L8101J20745L56743
3454H528718K63838L84559M80668M28069N65962O83452O27969P91477Q41215R04430
3444A4500357J469300J760858J115613k49026j012434j640758j661825j338544
3436A2943541n91841p36840m66776j40684r7516k41566k2548J26797O3418J05949
3426A0941934k17O6487M85065M82259M55199O37028N38909Q24226R66560Q96196
3416A6293646J229202J457374J442775K051009K489927L094341K835546R1746
3408C0985566k124318l243871l438166k578895j994938j275250r73326n59429
$$ y = [6617516, 6437502, 6799130, 6904513, 6910803, 7082566, 6968222, 6947648, 7128279, 7001873, 7304235, 7616631, 7393615, 7467720, 7508235, 7655858, 7866556, 8013129, 8051230, 8171975, 8528718, 8792556, 9177115, 9657783, 10085852, 10651814, 11335266, 11963235, 12754712, 13595927, 14500357, 15969657, 17730515, 18846128, 18597102, 17584668, 15943910, 14282085, 12943541, 12351700, 11614860, 11148084, 11007400, 10909884, 10668318, 10645770, 10772567, 10835985, 10941934, 10941717, 11008204, 11493269, 11975528, 12430727, 13067755, 13606664, 14430890, 15397450, 16293646, 17522848, 18980222, 20422997, 22474006, 24963933, 28058274, 30893820, 30985566, 28861248, 25617377, 22179211, 19600316, 17605378, 16330128, 15356802, 14797373]
3400A4797373n79625n85669j66567j64218l06023m3773L9312k79700n8636O7770
3390A2720244K45100K43769J98796J29400M86109O90554M85622N39881P66693
3381A6506168J029785J091292J410087J576626L68265q99682j388412j806393
3373A7887736j366182p45954o28570n29665l72355j14984l06308l30731J32985
3364A3625972j00904Q2030r3672J16141m2927k25829j47883L958K12499L79510
3354A3808895K10129j30810J32209J69029L95466K43996n5394P1342K82539L23623
3344A5451024J76195L67668J38272J56546M0968J86075K59105L61152M21545J88038
3334A7746588J44996K04635K45096J07856K33209L66455L56159L53645L73521
$$ y = [14797373, 14217748, 13632079, 13465512, 13301294, 12995271, 12951498, 12990810, 12711110, 12652474, 12720244, 12965344, 13209113, 13407909, 13537309, 14023418, 14713972, 15199594, 15739475, 16506168, 17535953, 18627245, 20037332, 21613958, 21982223, 21082541, 19694129, 17887736, 16521554, 15775600, 15147030, 14617365, 14245010, 14130026, 13823718, 13492987, 13625972, 13525068, 13607098, 13513426, 13629567, 13586640, 13360811, 13212928, 13216886, 13429385, 13808895, 14019024, 13888214, 14020423, 14189452, 14584918, 14828914, 14773520, 14844862, 15127401, 15451024, 15627219, 15994887, 16133159, 16289705, 16330673, 16516748, 16775853, 17137005, 17558550, 17746588, 17891584, 18096219, 18341315, 18449171, 18682380, 19048835, 19404994, 19758639, 20132160]
3325B0132160L71878L27183K50025L73632M06153O35479M83673L89151K96120
3316B3665454M43388K80125L36615L46339N00356N57905K84136O71409L83369
3307B7469096M21117M93301N40012P25805N34638O17951O18800O22502J009466
3298C3052688P42318O17572O67388Q44137Q48626R68361J287772J380248J130349
3289D1539459J210928J417328J777408J786208J897537K265816K456813K595625
3281E6947122K627516K899093L140354L552772L708966M067992M023545M022581
3273H4989941L800881L734097L544953L098879J925732P90310j75101j780662
3265I9929030k934535l873250m424576m346591m006438l891946l548743k978361
$$ y = [20132160, 20504038, 20831221, 21081246, 21454878, 21861031, 22496510, 22980183, 23369334, 23665454, 24108842, 24388967, 24725582, 25071921, 25572277, 26130182, 26414318, 27085727, 27469096, 27890213, 28383514, 28923526, 29649331, 30183969, 30801920, 31420720, 32043222, 33052688, 33795006, 34412578, 35079966, 35924103, 36772729, 37741090, 39028862, 40409110, 41539459, 42750387, 44167715, 45945123, 47731331, 49628868, 51894684, 54351497, 56947122, 59574638, 62473731, 65614085, 69166857, 72875823, 76943815, 80967360, 84989941, 88790822, 92524919, 96069872, 99168751, 101094483, 101884793, 101709692, 99929030, 96994495, 93121245, 88696669, 84350078, 80343640, 76451694, 72902951, 69924590]
3257F9924590k827799k382522k203485k222979j813665j810578j600861j508964
3249E3553737j266238j165029j011838r72301j054470q46739q60587o77159o70395
3240D5028981p15414q75007q27510n15469n19453q06965m70504n77427p57335
3231C8963897p75520q69149o91078p05464n78884o73898r86733p04354o51594
3222C2327223m97664p60678p53181p82537m65610o51622q79856l08379l41895
3213B6885801m37115n11325m78733m37414l61303l91648l93414l38263o31016
3204B2905570n79497k65015j42759j82289k58011k87749l79772j67713l93656
3195B0249109k77500j08043k35852k67989q7440j44308r9940l47776k87991r2426
$$ y = [69924590, 67096791, 64714269, 62510784, 60287805, 58474140, 56663562, 55062701, 53553737, 52287499, 51122470, 50110632, 49138331, 48083861, 47237122, 46376535, 45699376, 45028981, 44313567, 43438560, 42611050, 42095581, 41576128, 40769163, 40298659, 39721232, 38963897, 38188377, 37319228, 36628150, 35922686, 35343802, 34669904, 33683171, 32978817, 32327223, 31829559, 31068881, 30315700, 29533163, 29067553, 28415931, 27536075, 27227696, 26885801, 26448686, 25937361, 25458628, 25021214, 24659911, 24268263, 23874849, 23536586, 22905570, 22326073, 22061058, 21918299, 21736010, 21477999, 21190250, 20810478, 20642765, 20249109, 19971609, 19863566, 19627714, 19359725, 19272285, 19127977, 19028037, 18680261, 18392270, 18299844]
3185A8299844k48075j05282k21989j19709k89688j63042k52221j22839k4213j68571
3175A6584215l22267k61338N2160k43743j56400l39615o4341j25490k47672k6684
3165A4848825j77269l6368J2786m64975l22149J16074J35789j02137j65510J07677
3155A3952743k69995k84020j87938k06057k1856j88591k33014L3088j51795k07255
3145A2235310L4029M2142J00687m10761K4280j597J2320l7149k68791j55779L3966
3134A1608657k635j48902q6988K8492j13331m5496p5608K4904N4613j75670o6689
3123A1001347j47403J51680L3369k12975j8165n2915r4970l4977j11154j07751
3113A0406086k42142K39074k8682o3918j82377J8133q4020J0060J74415k35684
$$ y = [18299844, 18051769, 17946487, 17724498, 17604789, 17315101, 17152059, 16899838, 16776999, 16752786, 16584215, 16261948, 16000610, 16052770, 15809027, 15652627, 15313012, 15248671, 15123181, 14875509, 14848825, 14671556, 14635188, 14647974, 14182999, 13860850, 13976924, 14112713, 14010576, 13845066, 13952743, 13682748, 13398728, 13210790, 13004733, 12982877, 12794286, 12561272, 12594360, 12442565, 12235310, 12269339, 12311481, 12412168, 12001407, 12025687, 12024090, 12036410, 11999261, 11730470, 11574691, 11608657, 11606022, 11457120, 11370132, 11398624, 11285293, 11239797, 11164189, 11189093, 11243706, 11068036, 11001347, 10853944, 11005624, 11038993, 10826018, 10807853, 10754938, 10659968, 10624991, 10513837, 10406086, 10163944, 10403018, 10374336, 10310418, 10128041, 10146174, 10062154, 10072214, 10246629, 10010945]
3103A0010945p3935J04601j01223l9373j18630j15456J74542K672q0957j14403
3093I648783j3766j60371p0470L1064j47569l36375k3786O4587k04789J5066j59551
3082H642823n9769J47777j3062o8500Q1077J8197J6606p7954j13620q2663k17253
3071H273659o3691L8297k05006m6070J48230j01215j17866j3499n7808k74432
3061G580599L7002M7715l8948J02481p8907M5476j9231J00696J50515n3345l44629
3050G529424n8099K05855N803j74827j55163M60924k22273o2337K7005J08140
3040G664452N2966j30750q4030L53657K23721k8628J60612P0239J63530K71076
3030H716845J6080J16615J01380O6982K9155J36576J7547n7253r8048j541j0164
$$ y = [10010945, 9937010, 10041611, 9940388, 9901015, 9782385, 9666929, 9841471, 9844143, 9763186, 9648783, 9635017, 9474646, 9404176, 9435240, 9287671, 8951296, 8927510, 8992097, 8787308, 8802374, 8642823, 8583054, 8730831, 8717769, 8649269, 8730346, 8748543, 8765149, 8687195, 8573575, 8490912, 8273659, 8209968, 8248265, 8043259, 7997189, 8145419, 8044204, 7926338, 7912839, 7855031, 7580599, 7617601, 7665316, 7626368, 7728849, 7649942, 7695418, 7676187, 7776883, 7927398, 7874053, 7529424, 7471325, 7677180, 7682983, 7508156, 7352993, 7813917, 7591644, 7529307, 7556312, 7664452, 7717418, 7586668, 7502638, 7856295, 8080016, 8051388, 8212000, 8282239, 8445769, 8716845, 8732925, 8849540, 8950920, 9017902, 9047057, 9183633, 9201180, 9143927, 9045879, 9044338, 9034174]
3019I034174j16940K1119P1509J13827k1824K80032r9443K8181q8040o0702J94527
3008I356420J94164J27656J2974l8656J45230K34130K64734K96311M13728K12669
2998A1219360J65488K09021J2535L46664N39671J24827L14212K99296J29310o538
2988A3353846K5944q9427J24104k7223j16528J03101Q6770M5346J1496m6267K5232
2977A3496394j55204P336J86464L9317N171P3967K04196N66375M17551K7114N10115
2966A5378796N38093K70116M67564L77260L81105M78386O99321O77627N69932
2957A9838200L69432N82798N17043Q5618K82407J35057J37484J28158J09914J52083
2947B2338194K28439J48092K71596J96759L10902J35338L68155N07167O17305
$$ y = [9034174, 8917234, 8938353, 9009862, 9123689, 9101865, 9381897, 9282454, 9310635, 9222595, 9161893, 9356420, 9550584, 9678240, 9691214, 9652558, 9797788, 10031918, 10296652, 10592963, 11006691, 11219360, 11384848, 11593869, 11606404, 11953068, 12492739, 12617566, 12931778, 13231074, 13360384, 13353846, 13379790, 13290363, 13414467, 13387244, 13270716, 13373817, 13460587, 13505933, 13517429, 13471162, 13496394, 13341190, 13348526, 13534990, 13574307, 13579478, 13653445, 13857641, 14424016, 14841567, 14868681, 15378796, 15916889, 16187005, 16654569, 17031829, 17412934, 17891320, 18590641, 19268268, 19838200, 20207632, 20790430, 21307473, 21393091, 21675498, 21810555, 21948039, 22076197, 22186111, 22338194, 22566633, 22714725, 22986321, 23183080, 23493982, 23629320, 23997475, 24504642, 25121947]
2938B5121947M77008Q14085R05816Q31100P89086R59046J047946R96829J167770
2929C3110633J308422R87680N47889M03975P8203j76059n78238p64613r00080
2920C4017812j061085q03451o97639o16629k49556K2262J80261L04652K35873
2911C1332500M58100N70009P52812P51092P57648R69179O37485P49397O39472
2902C7617694L89606M90613M42391o7858l46354n08117l74562q06956j158072
2893C5678385j143975j193008j025062r80083p59200q81079o85383m61190n33429
2884B8015976k27333j64398O3239M540K9188N2537p600k57238l50456l24823m19901
2873B6413731l52162n61683p55232r11718q59038j129751j062929r60021o27581
$$ y = [25121947, 25598955, 26413040, 27318856, 28149956, 28939042, 29898088, 30946034, 31942863, 33110633, 34419055, 35406735, 35954624, 36358599, 36436802, 36260743, 35682505, 34917892, 34017812, 32956727, 32153276, 31455637, 30839008, 30589452, 30611714, 30791975, 31096627, 31332500, 31790600, 32360609, 33113421, 33864513, 34622161, 35591340, 36228825, 36978222, 37617694, 38007300, 38497913, 38940304, 38872446, 38526092, 38017975, 37643413, 36836457, 35678385, 34534410, 33341402, 32316340, 31336257, 30577057, 29695978, 29010595, 28549405, 28015976, 27788643, 27624245, 27687484, 27692024, 27721212, 27773749, 27766149, 27508911, 27158455, 26833632, 26413731, 26061569, 25499886, 24744654, 23832936, 22973898, 21844147, 20781218, 19821197, 19193616]
2864A9193616o94389p94730m63286o56479n16167m70766n66248n38166m35302
2855A4058083l61286j98355k13431l87757k73831k66757k12483j44538l58663
2846A1640982j34364n4621m60390n26292l18634m75891k40279k02735p4479q7863
2836I065434l89106k57036j19861j65156l9447j61689k24106j96315q6973m5024
2826G380721m00225o8510j08498l42016j9379K0882k60164Q2730M3009l12515
2816F016035j45882Q9036k4569l0485m1380j49198j70933K6010q5171j84920k95804
2805E002739j82481J34371L8550o7910j79508k10166j16899m3872p3899j38255
2795D162670Q155k1361n4120l0815J6955K093l4102m9517l02986M5530K39874
$$ y = [19193616, 18499227, 17704497, 17241211, 16584732, 16068565, 15597799, 15031551, 14493385, 14058083, 13696797, 13498442, 13285011, 12897254, 12623423, 12356666, 12144183, 11999645, 11640982, 11506618, 11451997, 10991607, 10465315, 10146681, 9670790, 9430511, 9227776, 9153297, 9065434, 8676328, 8419292, 8299431, 8134275, 8094828, 7933139, 7709033, 7512718, 7425745, 7380721, 6980496, 6911986, 6803488, 6461472, 6442093, 6462975, 6202811, 6285541, 6328550, 6016035, 5870153, 5959189, 5934620, 5904135, 5862755, 5713557, 5542624, 5568634, 5483463, 5298543, 5002739, 4820258, 4954629, 4993179, 4925269, 4745761, 4535595, 4418696, 4374824, 4300925, 4162670, 4170825, 4149464, 4095344, 4064529, 4081484, 4083577, 4049475, 3999958, 3696972, 3742502, 3982376]
2784C982376k67576q6000o6650L6118J92267k21187k90279j11211j66820J64502
2774C165540l0368j6369P9620j41867j44146j73792N5104q0691j66585k0209L40979
2763B867216m1296j77872k3939N5613K0634k99707n2671n78j36701J54052p9994
2752B284757J6529j0486J34974j34976j10009R2236L2664j63200O745Q8842j88371
2741B049705k03988k760j58321J27410j7635k19589K71303l7078q4738K13003
2731A937312j1138q1031l8893p3591n2677K9430J10039j85234n9801N6915M358
2720A635689K0481K06116l59437j32460N4680Q6765Q6840P5937j12448j23395
2710A438768M3617K6493j22429Q2418J92791q8142n8045o9584L44859j5277j91423
$$ y = [3982376, 3714800, 3628800, 3562150, 3598268, 3790535, 3569348, 3279069, 3167858, 3001038, 3165540, 3135172, 3118803, 3198423, 3056556, 2912410, 2738618, 2793722, 2713031, 2546446, 2526237, 2867216, 2825920, 2648048, 2624109, 2679722, 2700356, 2400649, 2347978, 2347400, 2210699, 2364751, 2284757, 2301286, 2290800, 2425774, 2290798, 2180789, 2273025, 2305689, 2142489, 2149234, 2238076, 2049705, 1845717, 1842957, 1684636, 1812046, 1794411, 1574822, 1846125, 1809047, 1724309, 1937312, 1926174, 1845143, 1806250, 1732659, 1679982, 1709412, 1819451, 1634217, 1574416, 1631331, 1635689, 1656170, 1862286, 1502849, 1370389, 1425069, 1511834, 1598674, 1674611, 1562163, 1438768, 1482385, 1508878, 1386449, 1468867, 1661658, 1573516, 1515471, 1445887, 1790746, 1775469, 1584046]
2699A584046K5004k4420j82188M3071P4736r6468R2888K72385L8467K8810j2641
2688A843690k93614O7635k2974J9563J2433l7162J45879N9284j65635o4158K1747
2677A586688J63780L6088J26640O3258r4252q8455K4480r0168L7378l9282l5381
2666A690774j39536J71157K04663M8578l0861k73304k4407O5893r247o1141K49052
2655A891621J45660J43229o9530M788k1572K3549M8474o3186o4300J41095O4551
2644B244379m4708j69598N9465j6193O6463J80540j5094J1895l5104J62572K1392
2633B466009o3234N9902j14377p7428J10514j01185j81944J52898J89583k25326
2623B215412q2808K05918K7594l1365M7439J40956J34046q5202k8656J39489O5374
$$ y = [1584046, 1609050, 1584630, 1402442, 1445513, 1520249, 1423781, 1516669, 1789054, 1827521, 1856331, 1843690, 1550076, 1617711, 1594737, 1614300, 1626733, 1589571, 1735450, 1794734, 1629099, 1564941, 1586688, 1750468, 1786556, 1913196, 1976454, 1882202, 1793747, 1818227, 1728059, 1765437, 1726155, 1690774, 1551238, 1722395, 1927058, 1975636, 1944775, 1671471, 1647064, 1712957, 1703710, 1642569, 1891621, 2037281, 2180510, 2110980, 2115768, 2094196, 2117745, 2166219, 2103033, 2038733, 2179828, 2244379, 2199671, 2030073, 2089538, 2073345, 2139808, 2320348, 2305254, 2317149, 2282045, 2444617, 2466009, 2402775, 2462677, 2348300, 2270872, 2381386, 2280201, 2098257, 2251155, 2440738, 2215412, 2132604, 2338522, 2366116, 2334751, 2382190, 2523146, 2657192, 2571990, 2543334, 2682823, 2748197]
2612B748197R4757j08129N3489r6510k93347o1011J30754K03917j88335k26030
2602B257752k980K9011l2433n7151O3096j14599l1313M1397o7433J5050q8217
2591B012180J7057O882L1797j2288K2418M5447k72610J6530J70998J93990j40102
2580B092299o9512J97707n9244n9805R7428k3701k51766J6424j02812l2116j41586
2569A663316P0554q8574j32588k1911j56781J0322P274J757L9075n5156j09753
2558A227535K9999J10265l0270l16275j9762J54537m567m6898k6232j11649r2280
2547H74403R7359Q2709j71883m4149j6955L31893J77711l33064M5635Q4428j38467
2536I89620M9145M5456q9366M302k12787R5029J00218j58576j19777q3219P2058
$$ y = [2748197, 2842954, 2734825, 2788314, 2691804, 2398457, 2337446, 2468200, 2672117, 2483782, 2257752, 2254772, 2283783, 2251350, 2194199, 2257295, 2142696, 2111383, 2152780, 2085347, 2100397, 2012180, 2029237, 2036119, 2067916, 2055628, 2078046, 2123493, 1850883, 1867413, 2038411, 2232401, 2092299, 2022787, 2220494, 2161250, 2101445, 2198873, 2175172, 1923406, 1939830, 1837018, 1804902, 1663316, 1733870, 1645296, 1512708, 1490797, 1334016, 1344338, 1351612, 1353369, 1392444, 1337288, 1227535, 1257534, 1367799, 1337529, 1021254, 1001492, 1156029, 1151462, 1104564, 1078332, 966683, 874403, 971762, 1054471, 882588, 838439, 821484, 1153377, 1331088, 998024, 1043659, 1128087, 989620, 1038765, 1084221, 994855, 999157, 786370, 881399, 981617, 823041, 703264, 620045, 692103]
2525F92103J9067q3429R3558M0768j58873j60312N1916K48914N7837p5789K301
2514G28061l2114J33274p6204j10071J08842j36475q5424M3124N9847J86890j40297
2503F79453k5527j8338j21189o4650p7494Q9831J56109O2840j5739L9382p3749
2492F30929j77580j04130Q7409l1973L3391m949k2488k37316J76555m2665o7384
2481B39799K23218J30752j34945j25592K11379Q3933n6621j3867M709k02859K53519
2470F13425L5015l36567m7402J8405O2793j1439J00505J0397j93338j39073N8691
2459A71412J662o8927N1899o167m6082P273O7876k0705J25304q452n8867J00839
2447C17065l4512J05870o2240n2198P5335n6357J59911R702P909M6386o959k03642
$$ y = [692103, 711170, 627741, 721299, 762067, 603194, 442882, 494798, 743712, 801549, 725760, 728061, 695947, 829221, 753017, 642946, 751788, 615313, 529889, 573013, 632860, 819750, 679453, 653926, 635588, 514399, 449749, 372255, 462086, 618195, 681035, 665296, 704678, 630929, 453349, 349219, 436628, 404655, 438046, 433097, 410609, 173293, 349848, 307183, 239799, 463017, 593769, 458824, 333232, 544611, 628544, 571923, 558056, 562765, 359906, 613425, 648440, 311873, 264471, 282876, 345669, 334230, 434735, 445132, 251794, 112721, 171412, 173074, 104147, 156046, 149879, 103797, 111070, 178946, 158241, 283545, 275093, 216226, 317065, 282553, 388423, 326183, 273985, 349320, 292963, 452874, 462576, 470485, 516871, 509912, 306270]
2435C06270l9697K4559j15072O9807o7316n5765m329K10953j45357j69417M2220
2424E6856n5420K24636J92238o0315k10746j06758J63793J00393N9357j91963
2414A72071o3237L0375n5977R3436J03348K64826j63225k7657J00644L8552j29823
2403C63333m8651n7793K6298N6344N3081j64323L0141Q2912K7382J20576J10268
2392E99568m3217r5731l4162J2220J53804j3860K465j2109k84391m981M9951P17
2380C30274r705j01969p1530j552k681J19580P463k06431N8495J70375J34517
2369D26836q4060O3194j53751j20628j72696K01566n009r2094Q0176n9784K12682
2358B96432J41867q5066l10076k83734K58231K01274o1537q6477K5622J08744
$$ y = [306270, 266573, 291132, 176060, 245867, 178551, 122786, 118457, 329410, 184053, 14636, 56856, 1436, 226072, 418310, 357995, 147249, 40491, 204284, 304677, 364034, 172071, 108834, 139209, 83232, 176668, 280016, 544842, 381617, 353960, 454604, 493156, 363333, 314682, 256889, 283187, 339531, 392612, 228289, 258430, 341342, 368724, 489300, 599568, 556351, 460620, 426458, 438678, 592482, 578622, 581087, 568978, 284587, 279606, 329557, 330274, 320569, 218600, 147070, 145518, 142837, 262417, 269880, 63449, 121944, 292319, 426836, 342776, 405970, 252219, 131591, -41105, 160461, 155452, 63358, 143534, 83750, 296432, 438299, 353233, 43157, -240577, 17654, 218928, 157391, 70914, 96536, 205280]
2348B05280L12378k23080n6601n5904p3494N1199J06513q053j63886j10158P3032
2337E7226J30346j00263k09023K13372K37070P47q7094J5530J33628l327l04077
2326H4135n2526L30862k17876L6873O1588l9764k3613j03307Q0511K23122J5628
2315C95633O1892j714j55540j58419Q7341O2948q280N3584J13666M8709j11707
2304C88113o7485K40671p0663j67664j14220O707J4495J3348J0486k3009O1686
2293B92465m7516j27761M499K368J78012L1996R8335K22021P0420j77644j84822
2282C62373r9330k63392j81943L65055J27341j9663n503R5171J09497p5525j69219
2271B44862k0545O6558r890j26957J18583K27442N1862k00920o8078P5195J9870
$$ y = [205280, 517658, 294578, 237977, 182073, 108579, 159778, 266291, 258238, 94352, -15806, 57226, 187572, 87309, -121714, 91658, 328728, 329475, 242381, 257911, 391539, 388212, 84135, 31609, 362471, 144595, 181468, 243056, 203292, 179679, 76372, 156883, 380005, 395633, 457525, 455811, 300271, 141852, 229193, 292141, 283861, 337445, 451111, 499820, 388113, 320628, 561299, 490636, 322972, 208752, 215459, 229954, 243302, 253788, 230779, 292465, 244949, 117188, 121687, 124055, 302067, 334063, 432398, 654419, 724839, 547195, 362373, 263043, -349, -182292, 182763, 310104, 290441, 284938, 380109, 489606, 414081, 244862, 224317, 290875, 280985, 154028, 272611, 500053, 551915, 350995, 282917, 358112, 377982]
2260C77982n6538o0426O8687Q4081J7289J72096r3695q3464j02038P3748J61926
2249E59648k21152J85076K9483J6737j05595J24651o9693k0403L9172n2063J33386
2238F19247Q0352o5309K2602l5211J45535R8072Q5691k59728j01r8666R421p1248
2226E30657J41702J5173j59880J9208J03809J99296O7804k8075j27097k5212r5741
2215F41644p5950Q1627K88097J52672m2458l1891n4878O3216M2107O1571J8615
2204A144372J07292J36739J88661j36767l4202j04447L6542K50553r3472J43587
2194A638858R3691p459J03165K41166k58155l9282K53452J16076O0381N5747N153
2183B262793J36301J25027j13091k560M9939P0042J74760q8112p7544J43175P5647
$$ y = [377982, 321444, 261018, 329705, 413786, 431075, 603171, 509476, 426012, 323974, 397722, 559648, 338496, 523572, 553055, 569792, 464197, 588848, 519155, 498752, 537924, 485861, 619247, 699599, 634290, 656892, 621681, 767216, 865288, 950979, 691251, 691150, 592484, 601905, 530657, 672359, 687532, 527652, 546860, 650669, 849965, 917769, 889694, 762597, 737385, 641644, 565694, 647321, 935418, 1088090, 1045632, 1013741, 958863, 1022079, 1064186, 1125757, 1144372, 1251664, 1388403, 1577064, 1440297, 1406095, 1301648, 1338190, 1588743, 1495271, 1638858, 1732549, 1725090, 1828255, 2069421, 1811266, 1771984, 2025436, 2141512, 2201893, 2257640, 2262793, 2399094, 2524121, 2411030, 2408470, 2458409, 2528451, 2703211, 2615099, 2537555, 2680730, 2756377]
2172B756377K57712J72617J3697k6071L06351O6689N9193J77271J51610K06041
2162D141487J98671N6694J46381K71692J88239L98638K56012L09624M54505K38434
2152F660377K64397M90360J56929N24517M46399O80337R12628Q39298Q89636J151915
2142A3016793J457084J288514J213276J435708J900394K418316L018880L122722
2134B8871687L626844M865816N138264O219394P412513R134870J2105646J3618020
2126I0993054J581685q787467j3010901j4235717j0846890q263210n885669m420249
2118B7124636l310630k603368j901476j656127j052251j064274p51756q25554
2110A3959200j239034j138445q34044p45845o85055o69092k96285o32786m01554
$$ y = [2756377, 3014089, 3186706, 3200403, 3174332, 3480683, 3547372, 3606565, 3783836, 3935446, 4141487, 4340158, 4396852, 4543233, 4814925, 5003164, 5401802, 5657814, 5967438, 6421943, 6660377, 6924774, 7415134, 7572063, 8096580, 8542979, 9223316, 10135944, 10975242, 11864878, 13016793, 14473877, 15762391, 16975667, 18411375, 20311769, 22730085, 25748965, 28871687, 32498531, 37364347, 42502611, 48722005, 56134518, 65269388, 77375034, 90993054, 92574739, 83787272, 70776371, 56540654, 45693764, 37430554, 31544885, 27124636, 23814006, 21210638, 19309162, 17653035, 16600784, 15536510, 14784754, 13959200, 12720166, 11581721, 10747677, 10001832, 9316777, 8647685, 8351400, 7718614, 7317060]
2101G317060m65922m44298l10639k10329k64649k62513j72117o0485k41941J74692
2091E058859j75588o0912k80640l48604K4325k53674r9927l4223j76214J10927
2081C764329j29313l73415j94360J1571q1461j7795r3023j54768j73748n2462
2071B505555m1965j00531J0692j17115j16881j21817r2851M8608M3046R3256j53146
2060A956851k59613K45705J1529k99878P1377m8333j7119p1397j96508J92003
2050A584617k4516j91954o6092L11831J51671k63344j08655p1778K5014K7925
2040A374719l7278J52263o1414k96424J20832J91249q39j28769L880j35342j00460
2029A082417l6208J09406k7893j86632n1008j79352m8498Q4060j7388r4585R2095
$$ y = [7317060, 6851138, 6406840, 6096201, 5885872, 5621223, 5358710, 5186593, 5126108, 4884167, 5058859, 4883271, 4822359, 4541719, 4193115, 4217440, 3963766, 3863839, 3829616, 3653402, 3764329, 3635016, 3261601, 3067241, 3078812, 2997351, 2979556, 2886533, 2731765, 2558017, 2505555, 2463590, 2363059, 2373751, 2256636, 2139755, 2017938, 1925087, 1973695, 2016741, 2109997, 1956851, 1697238, 1942943, 1954472, 1654594, 1725971, 1677638, 1660519, 1589122, 1392614, 1584617, 1560101, 1368147, 1302055, 1613886, 1765557, 1502213, 1393558, 1321780, 1346794, 1374719, 1337441, 1489704, 1428290, 1131866, 1252698, 1443947, 1443108, 1314339, 1318219, 1182877, 1082417, 1046209, 1155615, 1127722, 941090, 890082, 710730, 662232, 746292, 728904, 634319, 726414]
2018G26414j39269r8989L05864J96444P6149o3425j78906k5273j26674Q502o1702
2007F19135N4523K29095j09960J3932r838r3539p5575j62095K9938o8331J56431
1996E83716J7564J1547j30011k01061P866J02520k369n6040o9243Q1482K65816
1985F11787m04q2559J4539n93J3398k04074M1881J23297J07592P251N319L8422
1973F75856K2805r0791j84736J21020o478n6846K03499J17280p4820k78433J32266
1962E80622J10398l00500l7559q5374J36715O5019k43997J58986R8962m6126k88653
1951A48493J21789J53173J21790k35825j03210n5616Q7129j25353R840R5499q419
1940B09290n6408R6003R7892J4173P5271k5893N1152j39627J3031l4678p5050
$$ y = [726414, 587145, 488156, 794020, 990464, 1066613, 1003188, 824282, 799009, 672335, 680837, 619135, 673658, 902753, 792793, 806725, 796887, 703348, 627773, 465678, 495616, 427285, 583716, 601280, 612827, 482816, 281755, 289621, 392141, 389772, 333732, 264489, 345971, 611787, 611383, 528824, 543363, 542770, 556168, 352094, 393975, 517272, 624864, 632115, 637434, 675856, 698661, 607870, 423134, 544154, 537676, 480830, 684329, 801609, 726789, 448356, 580622, 691020, 390520, 352961, 267587, 404302, 469321, 225324, 384310, 483272, 437146, 148493, 270282, 423455, 545245, 309420, 206210, 150594, 237723, 112370, 122210, 217709, 209290, 152882, 248885, 346777, 360950, 436221, 410328, 461480, 321853, 334884, 300206, 225156]
1929B25156k8676Q5886j53024J26659j96026P9518Q5719m1995l3456K36532l121
1918C83172R4468k55351j16409o3200K23540j8429j22629j06013P9810R1285J8961
1907B09205m9488K8138J7147l7811J95463k08366j0606j0773N4692j05909O3990
1896A45682j46016L4285J57736j70175q871J45115p7305O516k4469j88762K23529
1885I7265J17104m6707r7037r3287O8516j91297J05627P6676J64566n5581J79128
1874C24973r3696k12658K28087J8662L9035j47471Q2859K6809J31241n284R572
1863D02129j5027r5883m1536M5875K17174j16206l8342k4563j1375J0513J17666
1852D50425N1630k79660R9336J07329j61432k37738Q3105J13206Q413O4232j15023
$$ y = [225156, 196480, 282366, 129342, 256001, 59975, 139493, 225212, 183217, 149761, 386293, 383172, 477640, 222289, 105880, 42680, 266220, 247791, 125162, 19149, 98959, 190244, 209205, 159717, 187855, 205002, 167191, 362654, 154288, 143682, 132909, 187601, 81692, 145682, -334, 33951, 191687, 21512, 12641, 157756, 80451, 86967, 62498, -126264, 97265, 214369, 167662, 70625, -22662, 45854, -145443, -39816, 36860, 201426, 145845, 324973, 231277, 18619, 246706, 265368, 304403, 156932, 239791, 266600, 397841, 392557, 402129, 387102, 291219, 249683, 295558, 512732, 396526, 358184, 333621, 322246, 332759, 450425, 502055, 222395, 321731, 429060, 267628, 29890, 112995, 226201, 234614, 298846, 183823]
1841A83823j09540j8374j46753N0901J17308p1586l08q594J34812J45687o6458
1830B10918M0620K867j73884R1394Q4612P327q9789o4771m0164j34641R1015L11658
1818C37162j3080J7953m4082m0021j06677r3434j31920J0903J15417J67654l5478
1807A84397k31921P2066J00288Q3789j1720j65394P4317l7472r6648j22567J30375
1796b0490K45852j78033J23025j65043r9432K9996N5855O3556J1340J5313k0638
1785F1301J3164J19109L5279J39102k11636L7392m4501j99582J99423J5584m8892
1774A15743l8157k11756R3586J42776n4355j00826j34928K34934J53834j49926
1764E0925P310J90094j58805p7679K18890J14855j31063j10049l4220Q7432j26670
$$ y = [183823, 74283, 55909, -90844, -39943, 77365, 5779, 5471, -3123, 131689, 277376, 210918, 251538, 254405, 80521, 171915, 256527, 263854, 174065, 109294, 69130, -65511, 25504, 337162, 324082, 342035, 297953, 257932, 151255, 57821, -74099, -63196, 52221, 219875, 184397, -47524, 24542, 124830, 208619, 196899, 31505, 105822, 68350, -28298, -150865, -20490, 225362, 47329, 170354, 5311, -94121, -64125, -8270, 55286, 66626, 81939, 61301, 74465, 193574, 228853, 367955, 156319, 193711, 149210, -50372, 149051, 164635, 115743, 77586, -134170, -40584, 102192, 47837, -52989, -187917, 47017, 200851, 50925, 58235, 248329, 89524, 11845, 230735, 345590, 214527, 104478, 70258, 157690, 31020]
1753C1020M6139K11791k5674J4040K2950k02730j93839J10175K01934l4864m6975
1742A33967K6909j1913o8124J58671j46393j64101O9593k2404K9965M7496K42404
1731B96070j96722k02392J56366J33458O8281j7520k75128J69684j1285k34647
1721a13835J4578r9789P8944j67532J94202J0206k9219n8699N1559J77780j30282
1710g2087j5604l3514N6261r4058j0641M3367J12133M4173j64430k2472J6772
1699a40100q3610J48645K75606O9333k61055r4544J50112R8587k0114r7063M8802
1688I4599l1067j01365M3680J74137m3719j11000n5423J44095J76003j86420k10961
1677a07441Q0184j23161J17779J9697J42570p1161k0645R1985K6168J05944j90409
$$ y = [31020, 77159, 288950, 263276, 277316, 300266, 97536, -96303, 13872, 215806, 180942, 133967, 160876, 148963, 80839, 239510, 93117, -70984, -1391, -23795, 6170, 53666, 296070, 99348, -103044, 53322, 186780, 255061, 237541, -37587, 132097, 120812, -113835, -99257, -199046, -120102, -287634, -93432, -83226, -112445, -171144, -119585, 58195, -72087, -87691, -121205, -64944, -159002, -169643, -126276, -14143, 30030, -134400, -156872, -140100, -223710, -75065, 200541, 269874, 8819, -85725, 64387, 162974, 142860, 45797, 94599, 63532, -37833, 5847, 179984, 136265, 25265, -30158, 113937, 289940, 103520, -107441, -27257, -150418, -32639, -12942, 129628, 58467, 37822, 129807, 155975, 261919, 71510]
1666G1510K1555j9802k20186p953J16491J0917O3997J95224q4068j11031j91467
1655a54813R4327J90404j09638r0887L2645N5674O8472R6536j74810j96562J54554
1644c4098N0970l7821K2020q1554R8736p0516j13372j39550Q9561n428R911r4351
1632c05492j9408J86916O3608o8141m8215P0577j19924J52626K12235j97407L0568
1621d2057l2789j21839J69250O6420j9659K15703j03690r2928j885M327j35262
1610i4409J81707n9857Q2042j51939n5637J02628L8063p0023J78761L0335o6476
1599A15195o8339j2770k19542L6803R4257J3451J85468j355j13801j60385J67308
1588C6290M2394K1884m0584J4428m3270m4918L16462o2414k49828J79680l07416
$$ y = [71510, 93065, 73263, -146923, -154876, -38385, -27468, 36529, 231753, 147685, 36654, -154813, -60486, 129918, 20280, -70607, -37962, 17712, 86184, 182720, 7910, -188652, -34098, 16872, -20949, 1071, -80483, 18253, -52263, -165635, -305185, -215624, -221052, -211141, -305492, -324900, -137984, -74376, -142517, -190732, -120155, -240079, -87453, 124782, -72625, -42057, -74846, -196685, -27435, 38985, 19326, 235029, 131339, 38411, 36526, 40853, -94409, 87298, 27441, 109483, -42456, -98093, 4535, 42598, -27425, 151336, 181671, 115195, 46856, 34086, -185456, -148653, -54396, -40945, 144523, 143168, 29367, -131018, 36290, 78684, 100568, 59984, 74412, 31142, -13776, 302686, 240272, -9556, 170124, -137292]
1577a37292j00477K58055j92738K49725R3631j29311P2236L5865J59923n4974
1567B54643k35434j30258k1107j6593J07234j38967J03238J62602m2270q7947
1557d4859J49525r2707o0030j40541K32974k03469n4048K43183r3902K6129k08
1546c7953M2238j6683K24500Q3639p0325j15172j21594J64992q6201j01537o4858
1535i8954L42515j30281k33493L9600J20157n3031N8353j46087l226J4560l0292
1524a20179L607j5317P1123J23890j89315L1271L6682M6409M2731j13823l5529
1513a18450J12270J28605k3692j99820r8101J07010K1708Q7849r4986L8832n10
1502c9285J57856k41867J12104N8678p9635r1608n1674K51006l7535j77471K8163
$$ y = [-137292, -237769, 20286, -172452, 77273, 170904, 41593, 113829, 149694, 309617, 254643, 19209, -111049, -132156, -148749, -41515, -180482, -77244, 85358, 43088, -44859, 104666, 11959, -48071, -188612, 44362, -159107, -213155, 30028, -63874, -37745, -37953, 4285, -12398, 212102, 295741, 225416, 110244, -11350, 153642, 67441, -34096, -98954, 243561, 113280, -120213, -80613, 39544, -13487, 44866, -101221, -104447, -89887, -120179, -116572, -131889, -60766, 63124, -126191, -94920, -58238, -11829, 30902, -82921, -118450, -6180, 122425, 98733, -101087, -199188, -92178, -70470, 17379, -77607, -38775, -39285, 118571, -123296, -11192, 47486, -32149, -123757, -175431, 75575, 38040, -139431, -111268]
1491a11268K83273J98881q7047j57836L4321J0025Q3785k10170L6878O2316k1564
1480A21594j31479l6849J66417j02431O8258j08033O3410j04178L849J4491J4164
1469c0787j40605n7391j36153L6109K12782K32547P8586j85082l5271J80722q954
1458A46503o0936l7932L8617J9745n0052k06823K9032M0948N244n8378J11243
1447b2789M8416M1924p8021j32802P5451k5382J4123K0457J08805M4768N1491
1436A46441j57670n0099J37549O0178l669j24018l9511J877j2590n1668J24659
1425C1479j32635O7580n8892K17483L0295o7989q6785k391R2508k66523P0822
1414a05048P0095J7503p0536j14549m0629K73368J75145j12165k21862j27048
$$ y = [-111268, 172005, 370886, 283839, 126003, 160324, 170349, 254134, 43964, 80842, 143158, 121594, -9885, -46734, 119683, 17252, 85510, -22523, 40887, -63291, -59442, -44951, -30787, -171392, -228783, -364936, -328827, -116045, 116502, 195088, 10006, -25265, 155457, 146503, 85567, 47635, 86252, 105997, 55945, -150878, -121846, -80898, -75654, -134032, -22789, 25627, 67551, -10470, -143272, -67821, -93203, -79080, -58623, 50182, 94950, 146441, -11229, -61328, 76221, 136399, 132730, 8712, -30799, -28922, -41512, -93180, 31479, -101156, -33576, -92468, 125015, 155310, 87321, 536, -1855, 90653, -175870, -105048, -34953, -17450, -87986, -202535, -243164, 30204, 205349, 93184, -128678, -255726]
1404b55726K39867K64134j77086l3239k8272M0164j69504K19654K34274j205j85854
1393A47207j48378l3466J1186m9608Q923j05975j95341L2842J62964r4762l320
1382b67728J0826R5394J31313L5786r6365q364J86257j16840p377L113r0738J16067
1370h656P7947m2055J23641k4817l0960k01628Q3629J46114j08937J44617k11893
1359e2998m6578j0935j68920J01821J5545N2627J24139q5052r8509J08548N8583
1348a729O2140q9470l2326p0367J20267L4491O6789m2299k02147r826J4519j17067
1336b67025J52829K12177m5267O5312j69447O634j05962J47831k3298k2123j13303
1325a61642j10426J24135J59285j5010J38980r780j74439J20717Q2024K0104n1899
$$ y = [-255726, -15859, 248275, 71189, 37950, 9678, 49842, -119662, 99992, 334266, 333061, 147207, -1171, -34637, -23451, -73059, -64136, -170111, -365452, -332610, -169646, -264408, -267728, -256902, -161508, -30195, 5591, -90774, -99138, 87119, -29721, -37098, -33985, -124723, -8656, 69291, 27236, 150877, 126060, 95100, -106528, -22899, 123215, 14278, 158895, -52998, -99576, -110511, -279431, -177610, -162065, -109438, 14701, -70351, -168860, -60312, -1729, 60411, -29059, -61385, -131752, -11485, 23006, 89795, 47496, -154651, -164477, -149958, -267025, -114196, 97981, 52714, 118026, -51421, -44787, -150749, -2918, -26216, -48339, -161642, -272068, -147933, 11352, -3658, 135322, 125542, -48897, 71820, 153844, 173948, 122049]
1314A22049j01724j91125n6439Q7437R9026j49199J77522L6511K5210L5982j16613
1303c1363k9745K05799j23231o1493R4722K4389M889J92229n4626k26918J7427
1292A2079m8427J477R1863R7037P8891p4693j57389P3035k37549k8412J35555
1281e6533M269q1917k05388K0790K34731O2877P3920J45026j48809k11478K52847
1270I0335m6994K09588O0371j65784j26192K9083m0030k4407n1518j34603K54805
1259E4654R3768m7640j2453p9427J19818O3972l39600J41666J67343m4253M4656
1248A62504n9904k58462R0076J4573J37355N5978j15911k7569R6690n8035m0202
1237b907m6655p8584J1438N6431N8331P3588l0529J28344M2699j66257J34855
$$ y = [122049, 20325, -170800, -227239, -139802, -40776, -189975, -12453, 24058, 49268, 85250, -31363, -61108, 144691, 21460, -40033, 54689, 79078, 83967, 276196, 221570, -5348, 12079, -36348, -34871, 56992, 154029, 232920, 158227, 838, 73873, -163676, -192088, -56533, -52264, -134181, -339569, -318779, -84048, -21171, 52749, 197775, 48966, -162512, 90335, 43341, 252929, 313300, 147516, 21324, 50407, 10377, -14030, -65548, -200151, 54654, 148422, 100782, 88329, 8902, 128720, 192692, -146908, -5242, 162101, 117848, 162504, 102600, -155862, -65786, -51213, 86142, 142120, 26209, -1360, 95330, 37295, -2907, -49562, -128146, -116708, -60277, -1946, 71642, 41113, 169457, 212156, 45899, 180754]
1226A80754k2414J00933j59282J5584R044p4016K6143k3276j61340K3307J27422
1215D2859o5337N5009J2807p5540n0389M9940J6335j08207Q6487m866j79885K39002
$$ y = [180754, 158340, 259273, 99991, 115575, 124619, 50603, 76746, 53470, -107870, -84563, 42859, -22478, 32531, 45338, -30202, -80591, -30651, -14316, -122523, -36036, -40902, -220787, 18215]
$$ [...]
##END NTUPLES=NMR SPECTRUM
##END=
