##TITLE=1H_EC-3269x
 CDCl3
 8 sc, 
 19.11.2021
##JCAMPDX= 6.0         $$ Bruker NMR JCAMP-DX V2.0
##DATA TYPE= NMR SPECTRUM
##DATA CLASS= NTUPLES
##ORIGIN= UXNMR, Bruker Analytische Messtechnik GmbH
##OWNER= root
$$ XWIN-NMR		Version 3.5
$$ Fri Nov 19 12:40:25 2021 Russian Standard Time (UT+4h)  she@DPX200
##.OBSERVE FREQUENCY= 200.131346
##.OBSERVE NUCLEUS= ^1H
##.ACQUISITION MODE= SIMULTANEOUS
##.ACQUISITION SCHEME= undefined
##.AVERAGES= 8
##.DIGITISER RES= 18
##SPECTROMETER/DATA SYSTEM= spect
##.PULSE SEQUENCE= zg30
##.SOLVENT NAME= D2O
##.SHIFT REFERENCE= (INTERNAL, D2O, 0, 15.7238)
##AUDIT TRAIL= $$ (NUMBER, WHEN, WHO, WHERE, WHAT)
$$ ##TITLE= Audit trail, XWIN-NMR		Version 3.5
$$ ##JCAMPDX= 5.01
$$ ##ORIGIN= Bruker BioSpin GmbH
$$ ##OWNER= she
$$ F:/spectra/data/she/nmr/H-F/1/pdata/1/auditp.txt
$$ ##AUDIT TRAIL=  $$ (NUMBER, WHEN, WHO, WHERE, WHAT)
(   1,<2021-11-19 12:39:07.64 +0400>,<she>,<DPX200>,
      <created by zg, POWCHK disabled, PULCHK disabled
       configuration hash MD5:
       00 E9 B6 7A A2 85 ED C7 34 08 36 98 17 FE 4E 26
       data hash MD5: 16K
       6E AC 47 AE F1 45 6D EA 74 DC 66 EB AE 03 1B 09>)
(   2,<2021-11-19 12:39:11.32 +0400>,<she>,<DPX200>,
      <Start of raw data processing
       efp BC_mod = 2 LB = 0.24 FT_mod = 6 PKNL = 1 PHC0 = -15515.68 PHC1 = 15.60081 SI = 16K 
       data hash MD5: 16K
       D3 D0 DD 2C 7F B3 C8 92 95 63 57 B5 73 FE 32 3E>)
(   3,<2021-11-19 12:39:35.39 +0400>,<she>,<DPX200>,
      <pk PHC0 = 11.63008 PHC1 = -13 
       data hash MD5: 16K
       08 EA A5 5A 22 29 0F AE 44 AF 25 59 F5 A1 C9 FB>)
(   4,<2021-11-19 12:39:38.90 +0400>,<she>,<DPX200>,
      <abs ABSG = 5 
       data hash MD5: 16K
       08 5E AE 02 FC 5B CA 4C 7A FB 9B 98 3A 65 82 D8>)
(   5,<2021-11-19 12:40:04.10 +0400>,<she>,<DPX200>,
      <abs ABSG = 5 
       data hash MD5: 16K
       73 F1 63 18 76 60 1F 3B 5F 89 1E 58 C2 85 29 6B>)
$$ ##END=
$$ 
$$ hash MD5
$$ 36 E4 35 A2 DD B7 D7 5A C1 BC 37 91 4D A6 43 9E
##$RELAX= 
##$RELAX= 
##$RELAX= 
##$RELAX= 
##$RELAX= 
##$RELAX= 
$$ Bruker specific parameters
$$ --------------------------
##$DU= <F:/spectra>
##$EXPNO= 1
##$NAME= <H-F>
##$PROCNO= 1
##$TYPE= <nmr>
##$USER= <she>
##$AMP= (0..31)
100 100 100 100 100 100 100 100 100 100 100 100 100 100 100 100 100 100 
100 100 100 100 100 100 100 100 100 100 100 100 100 100 
##$AQSEQ= 0
##$AQ_mod= 1
##$AUNM= <au_zg>
##$AUTOPOS= <>
##$BF1= 200.13
##$BF2= 200.13
##$BF3= 200.13
##$BF4= 200.13
##$BF5= 200.13
##$BF6= 200.13
##$BF7= 200.13
##$BF8= 200.13
##$BYTORDA= 1
##$CFDGTYP= 0
##$CFRGTYP= 5
##$CHEMSTR= <none>
##$CNST= (0..31)
1 1 145 1 1 1 1 1 1 1 1 1 1 1 1 1 1 1 1 1 1 1 1 1 1 1 1 1 1 1 1 1 
##$CPDPRG= <>
##$CPDPRG1= <>
##$CPDPRG2= <>
##$CPDPRG3= <>
##$CPDPRG4= <mlev>
##$CPDPRG5= <mlev>
##$CPDPRG6= <mlev>
##$CPDPRG7= <mlev>
##$CPDPRG8= <mlev>
##$CPDPRGB= <>
##$CPDPRGT= <>
##$D= (0..31)
0 1.2 0 0 0 0 0 0 0 0.06 0 0.03 0 0 0 0 0.0002 0 0 0 0 0 0 0 0 0 0 0 0 
0 0 0 
##$DATE= 1637311147
##$DBL= (0..7)
$$ [...]
##$SUBNAM2= <"">
##$SUBNAM3= <"">
##$SUBNAM4= <"">
##$SUBNAM5= <"">
##$SUBNAM6= <"">
##$SUBNAM7= <"">
##$SUBNAM8= <"">
##$SUBNAM9= <"">
##$SW= 18.0517287032376
##$SWIBOX= (0..15)
0 0 2 0 0 0 0 0 0 0 0 0 0 0 0 0 
##$SW_h= 3612.71676300578
##$TD= 16384
##$TD0= 1
##$TE= 0
##$TE2= 300
##$TE3= 300
##$TEG= 300
##$TL= (0..7)
0 120 120 120 120 120 120 120 
##$TP= (0..7)
150 150 150 150 150 150 150 150 
##$TP07= 0
##$TPNAME0= <>
##$TPNAME1= <>
##$TPNAME2= <>
##$TPNAME3= <>
##$TPNAME4= <>
##$TPNAME5= <>
##$TPNAME6= <>
##$TPNAME7= <>
##$TPOAL= (0..7)
0.5 0.5 0.5 0.5 0.5 0.5 0.5 0.5 
##$TPOFFS= (0..7)
0 0 0 0 0 0 0 0 
##$TUNHIN= 0
##$TUNHOUT= 0
##$TUNXOUT= 0
##$USERA1= <user>
##$USERA2= <user>
##$USERA3= <user>
##$USERA4= <user>
##$USERA5= <user>
##$V9= 5
##$VALIST= <valist>
##$VCLIST= <CCCCCCCCCCCCCCC>
##$VD= 0
##$VDLIST= <DDDDDDDDDDDDDDD>
##$VPLIST= <PPPPPPPPPPPPPPP>
##$VTLIST= <TTTTTTTTTTTTTTT>
##$WBST= 1024
##$WBSW= 4
##$XGAIN= (0..3)
0 0 0 0 
##$XL= 0
##$YL= 0
##$YMAX_a= 135409
##$YMIN_a= -143065
##$ZGOPTNS= <>
##$ZL1= 120
##$ZL2= 120
##$ZL3= 120
##$ZL4= 120
##$ABSF1= 15.72375
##$ABSF2= -2.328099
##$ABSG= 5
##$ABSL= 3
##$ALPHA= 0
##$AQORDER= 0
##$ASSFAC= 0
##$ASSFACI= 0
##$ASSFACX= 0
##$ASSWID= 0
##$AUNMP= <proc_1d>
##$AZFE= 0.1
##$AZFW= 0.1
##$BCFW= 0
##$BC_mod= 2
##$BYTORDP= 0
##$COROFFS= 0
##$CY= -3
##$DATMOD= 1
##$DC= 0
##$DFILT= <>
##$DTYPP= 0
##$F1P= 0
##$F2P= 0
##$FCOR= 1
##$FTSIZE= 16384
##$FT_mod= 6
##$GAMMA= 0
##$GB= 0
##$INTBC= 1
##$INTSCL= 0
##$ISEN= 128
##$LB= 0.24
##$LEV0= 0
##$LPBIN= 0
##$MAXI= 10000
##$MC2= 0
##$MEAN= 0
##$ME_mod= 0
##$MI= 1.114404
##$NCOEF= 0
##$NC_proc= -8
##$NLEV= 6
##$NOISF1= 3.799351
##$NOISF2= 2.8
##$NSP= 0
##$NTH_PI= 0
##$NZP= 0
##$OFFSET= 15.72375
##$PC= 1
##$PHC0= -15504.05
##$PHC1= 2.60081
##$PH_mod= 1
##$PKNL= yes
##$PPARMOD= 0
##$PSCAL= 0
##$PSIGN= 0
##$REVERSE= no
##$SF= 200.130005563216
##$SI= 16384
##$SIGF1= 3
##$SIGF2= 2
##$SINO= 5.538805
##$SIOLD= 16384
##$SREGLST= <1H.CDCl3>
##$SSB= 0
##$STSI= 16384
##$STSR= 0
##$SW_p= 3612.71676300578
##$SYMM= 0
##$S_DEV= 0
##$TDeff= 16384
##$TDoff= 0
##$TI= <>
##$TILT= no
##$TM1= 0
##$TM2= 0
##$TOPLEV= 0
##$USERP1= <user>
##$USERP2= <user>
##$USERP3= <user>
##$USERP4= <user>
##$USERP5= <user>
##$WDW= 1
##$XDIM= 16384
##$YMAX_p= 530076870
##$YMIN_p= -3635759
$$ End of Bruker specific parameters
$$ ---------------------------------
##NTUPLES= NMR SPECTRUM
##VAR_NAME=  FREQUENCY,     SPECTRUM/REAL,   SPECTRUM/IMAG
##SYMBOL=    X,             R,               I
##VAR_TYPE=  INDEPENDENT,   DEPENDENT,       DEPENDENT
##VAR_FORM=  AFFN,          ASDF,            ASDF
##VAR_DIM=   16384,         16384,           16384
##UNITS=     HZ,            ARBITRARY UNITS, ARBITRARY UNITS
##FACTOR=    0.220516191357247, 1,           1
##FIRST=     3146.79419787768, 0,            0
##LAST=      -465.922565128101, 0,           0
##MIN=       -465.922565128101, -3635759,    0
##MAX=       3146.79419787768, 530076870,    0
$$ Real data points
##PAGE= N=1
##DATA TABLE= (X++(R..R)), XYDATA
$$ [...]
5734A188364l03313K7436j67248L4172j14376K60703o7123j25857n02414j55127
$$ 1188364 885051 912487 745239 779411 665035 925738 858615 732758 230344 75217
5724G5217K77598N58613P2254l50021r535K51344K58967k6305L7112L5200m52409
$$ 75217 352815 911428 983682 633661 624126 875470 1134437 1108132 1145244 1180444 728035
5713G28035n9469R807L36722O9928q4325j01115M6969q8760P2215k34908k37036
$$ 728035 668566 678373 1015095 1085023 1000698 899583 946552 857792 930007 695099 458063
5702D58063P1849P0541J65792k48898N66440j26428j67985N6148n07263Q5143
$$ 458063 529912 600453 766245 517347 1083787 957359 789374 845522 338259 423402
5692D23402K7957k58939O27556O63955l08178j88032J50113k40397j00198o83523
$$ 423402 451359 192420 819976 1483931 1175753 987721 1137834 897437 797239 113716
5682A13716N73583k03127j71511k1995L5982n1418M1654J80844j89158K17479
$$ 113716 687299 484172 312661 290666 326648 275230 316884 497728 308570 526049
5672E26049M52746l21056J17820J91903m63599k91366j425O6543K51694J38964
$$ 526049 978795 657739 775559 967462 503863 212497 211072 277615 529309 668273
5662F68273l68459K32871J56001m90090J54880J43320j58333M23560J29243j74625
$$ 668273 299814 532685 688686 198596 353476 496796 338463 762023 891266 716641
5652G16641j78716K40186J59707k29345P0833m98155K11675J46381j61797k34972
$$ 716641 537925 778111 937818 708473 779306 281151 492826 639207 477410 242438
5642B42438P8478L65603k78637o4924L0102r1221J3179j82320L5762L30522j27157
$$ 242438 320916 686519 407882 342958 373060 281839 295018 112698 148460 478982 351825
5631C51825j92357K7797K19301j10755l44769k70082L78752M69833j43280j4191
$$ 351825 159468 187265 406566 295811 -48958 -319040 59712 529545 386265 372074
5621C72074p1L11358k02669l7089K04162J23940L13818n31036k29289n1777K52294
$$ 372074 372003 683361 480692 443603 647765 771705 1085523 554487 325198 273421 525715
5610E25715L68887M6312k13650P1636j83203o4566j25198M8165J46005K35657
$$ 525715 894602 940914 727264 798900 615697 551131 425933 474098 620103 855760
5600H55760P6168J17993l01114j05347K61150J22359m78976l97530K06410P4856
$$ 855760 931928 1049921 748807 643460 904610 1026969 547993 150463 356873 431729
5590D31729M8837L51251j80050j7158k29847J93888M64890j79566m07418L59752
$$ 431729 480566 831817 651767 634609 404762 598650 1063540 883974 476556 836308
5580H36308J8089K68741m54228l8108K80715M7461m0896o2387K0610K73635l71397
$$ 836308 854397 1123138 668910 630802 911517 958978 918082 855695 876305 1149940 778543
5569G78543j50432L41283J55680r2464k6482J33702j70508N37602l24386k60824
$$ 778543 628111 969394 1125074 1032610 1006128 1139830 969322 1506924 1182538 921714
5559I21714L2737j31000j51235L52798M12677J13766j21256P110m7327J85418
$$ 921714 954451 823451 672216 1025014 1437691 1551457 1430201 1437311 1389984 1575402
5549A575402k50031k48984K76957L9877l6014k57433j62504J53981k30817J80759
$$ 1575402 1325371 1076387 1353344 1393221 1357207 1099774 937270 1091251 860434 1041193
5539A041193L66938j11782o9168Q6994k78804J86196K96875m50999r7448n0633
$$ 1041193 1408131 1296349 1227181 1314175 1035371 1221567 1518442 1067443 969995 919362
5529I19362K52444M06554j64883K9058m0897l88862l32437L69508K36344K85069
$$ 919362 1171806 1578360 1413477 1442535 1401638 1012776 680339 1049847 1286191 1571260
5519A571260k00784j37986j24056L40000J08461M08495r2773j56200j01151j6491
$$ 1571260 1370476 1232490 1108434 1448434 1556895 1965390 1872617 1716417 1615266 1598775
5509A598775j39536l5899m06711J98877K28096j17773L79691j24346k43028j84096
$$ 1598775 1459239 1423340 1016629 1215506 1443602 1325829 1705520 1581174 1338146 1154050
5499A154050K08880K49475m67177k8887k26831J82220K64665L76672l62514m96019
$$ 1154050 1362930 1612405 1145228 1116341 889510 1071730 1336395 1713067 1350553 854534
5489H54534L05431J43499j59774O0452j24712J12050M23823l2892j99840k75535
$$ 854534 1159965 1303464 1143690 1204142 1079430 1191480 1615303 1582411 1382571 1107036
5479A107036O3929Q8322j97643J30780J12619j84941J9923j42800L18401j18256
$$ 1107036 1170965 1259287 1061644 1192424 1305043 1120102 1140025 997225 1315626 1197370
5469A197370r1091k52420K72317L61246K51403k09769j88898k03330Q2366K28821
$$ 1197370 1106279 853859 1126176 1487422 1738825 1529056 1340158 1136828 1219194 1448015
5459A448015J24744m21127r750N0000K75159J00146K77387m1205j13035n507j0330
$$ 1448015 1572759 1151632 1141882 1191882 1467041 1567187 1844574 1803369 1690334 1684827 1674497
5448A674497j35046J99385O8225K7412l786q8830M7037o3909K30735l65721r4515
$$ 1674497 1539451 1738836 1807061 1834473 1830687 1741857 1788894 1724985 1955720 1589999 1495484
5437A495484j74119K466P3432P1161j42568l5324J59330K76843K18056l09764
$$ 1495484 1321365 1323831 1397263 1468424 1325856 1290532 1449862 1726705 1944761 1634997
5427A634997K05979n5646K6135J61709k38178o7701N90719j99225Q8287L76577
$$ 1634997 1840976 1785330 1811465 1973174 1734996 1667295 2258014 2058789 2147076 2523653
5417B523653r4189l1288k94114o1834j3383R6975j44074j27270Q4800J30202N54800
$$ 2523653 2429464 2398176 2104062 2042228 2028845 2125820 1981746 1854476 1939276 2069478 2624278
5406B624278q6825m52237j16394j69643K15504L15570l88392j67757L48950J79563
$$ 2624278 2537453 2085216 1968822 1799179 2014683 2330253 1941861 1774104 2123054 2302617
5396B302617P0481j17657K79154m2800Q129N269l74484q2121j19487p6465j47331
$$ 2302617 2373098 2255441 2534595 2491795 2499924 2505193 2130709 2048588 1929101 1852636 1705305
5385A705305q8298L90809K17869n73883m28287J80314K77630J06490j71519m7580
$$ 1705305 1617007 2007816 2225685 1651802 1223515 1403829 1681459 1787949 1616430 1568850
5375A568850J10226l06886Q4296L44155L7806L16791l32399L91045K90160k59913
$$ 1568850 1679076 1372190 1456486 1800641 1838447 2155238 1822839 2213884 2504044 2244131
5365B244131m21956N1755m1551J25908N84711m97724j5876k33918K53469K06879
$$ 2244131 1822175 1873930 1832379 1958287 2542998 2045274 2029398 1795480 2048949 2255828
5355B255828l43515K78523L75649o65281k35021K43745P2778n6448K01728p4496
$$ 2255828 1912313 2190836 2566485 1901204 1666183 1909928 1982706 1926258 2127986 2053490
5345B053490J13388K29382K82364k38840j5859L74172j59009R9228l30696R9677
$$ 2053490 2166878 2396260 2678624 2439784 2423925 2798097 2639088 2738316 2407620 2507297
5335B507297K71772j60350k59657m7135j06206L29928r2303L29034J17097j72001
$$ 2507297 2779069 2618719 2359062 2311927 2205721 2535649 2443346 2772380 2889477 2717476
5325B717476k04840o4051J04395K16708k08292p505K08374L41793M00071l7669
$$ 2717476 2512636 2448585 2552980 2769688 2561396 2553891 2762265 3104058 3504129 3466460
5315C466460J32037K62087M37714J26794O0297L37958R6599J80341j58718K75325
$$ 3466460 3598497 3860584 4298298 4425092 4485389 4823347 4919946 5100287 4941569 5216894
5305E216894k32169l82167j77758L31874k34668k89574O0361p6107l04290K68098
$$ 5216894 4984725 4602558 4424800 4756674 4522006 4232432 4292793 4216686 3912396 4180494
5295D180494l4932K80491K05219k79694J50236J37285K95045M30131K47325K09067
$$ 4180494 4145562 4426053 4631272 4351578 4501814 4639099 4934144 5364275 5611600 5820667
5285E820667N37728N32953O43639j11013l31287m00625q4477k01527l41959k28793
$$ 5820667 6358395 6891348 7534987 7423974 7092687 6692062 6607585 6406058 6064099 5835306
5275E835306k74844n69877J04493l37937m11263J4048n4475l17385K08332k61094
$$ 5835306 5560462 4990585 5095078 4757141 4345878 4359926 4305451 3988066 4196398 3935304
5265C935304l73571r0332L00672J23745M7350J59666k48844L06812R9116K57364
$$ 3935304 3561733 3471401 3772073 3895818 3943168 4102834 3853990 4160802 4259918 4517282
5255D517282K75384m2831k13734k4205j30573n27639K6980j07696l22372l64860
$$ 4517282 4792666 4749835 4536101 4511896 4381323 3853684 3880664 3772968 3450596 3085736
5245C085736n28670q1696J0416l38895K43904l78638o4805J31777K90558q1693
$$ 3085736 2557066 2475370 2485786 2146891 2390795 2012157 1947352 2079129 2369687 2287994
5235B287994k71951l42747K41899J38926L3018k16170n28715K5200K41560J24830
$$ 2287994 2016043 1673296 1915195 2054121 2087139 1870969 1342254 1367454 1609014 1733844
5225A733844j08905J14358n4523J23294j33580p3557l19885J22296j13032K25119
$$ 1733844 1624939 1739297 1684774 1808068 1674488 1600931 1281046 1403342 1290310 1515429
5215A515429k99367K66732l9968n07156M61189l10817m5086J7011j12142m5960
$$ 1515429 1216062 1482794 1442826 935670 1396859 1086042 1040956 1057967 945825 899865
5205H99865k31081O4286L07010l81276L48765L47961m6762j74219J82464k73207
$$ 899865 668784 733070 1040080 658804 1007569 1355530 1308768 1134549 1317013 1043806
5195A043806l29902n6112N4885q9452k09983M21263k42184k23311M31076J24605
$$ 1043806 713904 657792 712677 623225 413242 834505 592321 369010 800086 924691
5185I24691N32827o26659k62379L49662k05433j73534l17551L15111J39194R6680
$$ 924691 1457518 830859 568480 918142 712709 539175 221624 536735 675929 772609
5175G72609j62796N805J29287n3889N6882J40654O0043k91055l05879M75130j15310
$$ 772609 609813 615618 744905 691016 747898 888552 948595 657540 351661 826791 711481
5164G11481P3861J33401K37794k8602m2393j70198J49138j11770n30668J6829
$$ 711481 785342 918743 1156537 1127935 1085542 915344 1064482 952712 422044 438873
5154D38873J1256o9830N50756n09504j98490J27532k6783J13135K43637k73762
$$ 438873 450129 380299 931055 421551 223061 350593 323810 436945 680582 406820
5144D06820l31223N8800r201k34354n5070k367j27180N28613L85607k1827j6027
$$ 406820 75597 134397 125196 -109158 -164228 -166595 -293775 234838 620445 598618 582591
5133E82591k12765l20325K63959K32812J52443k1121k21082Q746L40914m87743
$$ 582591 369826 49501 313460 546272 698715 677594 456512 465258 806172 318429
5123C18429k11222o0618R6339p6769j72072L68970O3174j61801n6982L5720J56472
$$ 318429 107207 46589 142928 66159 -105913 263057 326231 164430 107448 143168 299640
5112B99640j0440j00113k74498J72467K0976k17231j11116o9667L75882r4873
$$ 299640 289200 189087 -85411 87056 108032 -109199 -220315 -289982 85900 -8973
5102h973j68467R9554k19425n2145n0467K28367L63438n6016p4316K47532J46074
$$ -8973 -177440 -77886 -297311 -349456 -399923 -171556 191882 135866 61550 309082 455156
5091D55156K2237j53073M50403l21359m65038P6597k11632l6753m6300l95372
$$ 455156 477393 324320 774723 453364 -11674 64923 -146709 -183462 -229762 -625134
5081f25134Q8089K58263j03401J61182K71277o385J92942J67165m03008K95246
$$ -625134 -537045 -278782 -382183 -221001 50276 43891 236833 403998 990 296236
5071B96236K08507n13581k08989J26412j61507K92160l64275M2295K46687K79190
$$ 296236 504743 -8838 -217827 -91415 -252922 39238 -325037 -282742 -36055 243135
5061B43135k21015m15321m00845M67030N59494k5457L7396j27986k1712k2597
$$ 243135 22120 -393201 -794046 -327016 232478 207021 244417 116431 94719 72122
5051G2122O4401K2178p8234j15303L29714j45327m09948J57458O8330k25554n0018
$$ 72122 136523 158701 80467 -34836 294878 149551 -260397 -102939 -34609 -260163 -310181
5040c10181Q0373J33308l33588J68703M4305j21529J8446R1640j80481K4842m0264
$$ -310181 -229808 -96500 -430088 -261385 -217080 -338609 -320163 -228523 -409004 -384162 -424426
5029d24426l901L21496j83432J21689j38135J4746N3135l02358R4861k8953r6857
$$ -424426 -428327 -106831 -290263 -168574 -306709 -291963 -238828 -541186 -446325 -475278 -572135
5018e72135j08951K05159K79923j45852M00701j11455m35137O5861J80096K07969
$$ -572135 -681086 -475927 -196004 -341856 58845 -52610 -487747 -421886 -241790 -33821
5008c3821k28192Q187J60953K52344n79299J34038K18906N6225l74705M14459
$$ -33821 -262013 -253826 -92873 159471 -419828 -285790 -66884 -10659 -385364 29095
4998B9095l7241l38561l179O0738M07489K390l7532q1120K6389j73544L4391o7624
$$ 29095 -8146 -346707 -349886 -289148 118341 120731 83199 2079 28468 -145076 -110685 -178309
4986a78309l55095J95827J18121j87955J56952M56714l1219n45986L52451m69016
$$ -178309 -533404 -337577 -219456 -407411 -250459 206255 175036 -370950 -18499 -487515
4976d87515J44161j05081r3197K22548K67936K58817n5969j22450k93879j71556
$$ -487515 -343354 -448435 -541632 -319084 -51148 207669 151700 29250 -264629 -436185
4966d36185m7441J29568J83155j91243m35013L48343J59294Q6838L13784k73951
$$ -436185 -483626 -354058 -170903 -362146 -797159 -448816 -289522 -202684 111100 -162851
4956a62851m228J40890k26158j70085k1070K1138k37006j37714N80636L74597
$$ -162851 -167079 -26189 -252347 -422432 -443502 -422364 -659370 -797084 -216448 158149
4946A58149j71655k50949j58948J81732k10896J58401k6985M9903K11802J12721
$$ 158149 -13506 -264455 -423403 -241671 -452567 -294166 -321151 -271248 -59446 53275
4936E3275p7694k5305j0209j645M8784J85013K63468j29721R1354k47933K4449
$$ 53275 -24419 -49724 -59933 -61578 -12794 172219 435687 305966 397320 149387 173836
4925A73836Q679M3547r2078K00046k92292O8211J74188j64843o4186L2263k22826
$$ 173836 182515 226062 133984 334030 41738 109949 284137 119294 55108 87371 -135455
4914a35455j39599J56102m15397j91424Q1145m9361J89027K75034J43710P392
$$ -135455 -275054 -118952 -534349 -725773 -644628 -693989 -504962 -229928 -86218 -78826
4904g8826K1741L30755R0968l33276J12548n3640K4833n39185J50930M73722N6368
$$ -78826 -57085 273670 364638 31362 143910 90270 115103 -424082 -273152 200570 256938
4893B56938k12252J93919K02474j90095o9419k56201j06250j6082M01177j495
$$ 256938 44686 238605 441079 250984 181565 -74636 -180886 -196968 204209 202714
4883B02714L71041j54743O62O9904o7234L51438k60861k42786L66527k57464m381
$$ 202714 573755 419012 419674 489578 422344 773782 512921 270135 636662 379198 374817
4872C74817r9053K7847o0599m694R0813K62167o1824k8785K14103j61689J20914
$$ 374817 275764 303611 243012 238318 329131 591298 529474 500689 714792 553103 674017
4861F74017m4518j36838J69897O9504K3844j52974l55384M11833K03951o19657
$$ 674017 629499 492661 662558 732062 755906 602932 247548 659381 863332 243675
4851B43675J10261J77021p5557m0933J80336O6923r6244k13795J40018N49390
$$ 243675 353936 530957 455400 414467 594803 661726 565482 351687 491705 1041095
4841A041095l9868j11908k75025M9814L90359K7519k66998j22154L1690J25092
$$ 1041095 1001227 889319 614294 664108 1054467 1081986 814988 692834 724524 849616
4831H49616k36498m8127K11747K18835j88007L3663j23637p4096M0117M12217
$$ 849616 613118 564991 776738 995573 807566 841229 717592 643496 683613 1095830
4821A095830K88370n0228k26924n56510j19155k42696K24029K00289k55901M00786
$$ 1095830 1384200 1333972 1107048 550538 431383 188687 412716 613005 357104 757890
4811G57890J79450k08969J37966K39038J02437r0020p4938k61260k22867j22483
$$ 757890 937340 728371 866337 1105375 1207812 1117792 1042854 781594 558727 436244
4801D36244J91878J34903L64137j69637n8853L042L48067L10714j74945j07268
$$ 436244 628122 763025 1127162 957525 898672 901714 1249781 1560495 1385550 1278282
4791A278282R120k88535L30821k53488k82280J27969K16795J93876l44560L17803
$$ 1278282 1287402 998867 1329688 1076200 793920 921889 1138684 1332560 988000 1305803
4781A305803j83353J17265k5503m96597L13655n4983J23499o834k40962J83624
$$ 1305803 1122450 1239715 1214212 717615 1031270 976287 1099786 1092952 851990 1035614
4771A035614J96722k0682L5580j50778Q3670k03721m18764L94123p0229P8256
$$ 1035614 1232336 1211654 1247234 1096456 1180126 976405 557641 951764 881535 959791
4761I59791l41468J20952R7900L81307k10902j24275J43071k42962K19855J3004
$$ 959791 618323 739275 837175 1218482 1007580 883305 1026376 783414 1003269 1016273
4751A016273j74284L27098j67466o5204O9273P926p4349L84491k11901j46038
$$ 1016273 841989 1169087 1001621 936417 1005690 1013616 939267 1323758 1111857 965819
4741I65819J23512p9778R8971r1119J91271J63232k6429j97747J87367K048M7272
$$ 965819 1089331 1009553 1108524 1017405 1208676 1371908 1345479 1147732 1335099 1337147 1384419
4730A384419J20155o53774J77425P4088k31181K9408O4103L72210q4412j6015
$$ 1384419 1504574 850800 1028225 1102313 871132 900540 964643 1336853 1252441 1236426
4720A236426K30351l30513J43561k4466l07128K57270R0145P7627n3339o6377
$$ 1236426 1466777 1136264 1279825 1255359 948231 1205501 1295646 1373273 1319934 1253557
4710A253557K74886K49467l17577J77358j01128R5193k38479M1641Q642M09753
$$ 1253557 1528443 1777910 1460333 1637691 1536563 1631756 1393277 1434918 1443560 1853313
4700A853313l1713K65784K82661K68421m62574k92976J47135m6035K50690L19766
$$ 1853313 1821600 2087384 2370045 2638466 2175892 1882916 2030051 1984016 2234706 2554472
4690B554472J66545j74803K98890l5159j97286L43722L4715K2359k12293J87961
$$ 2554472 2721017 2546214 2845104 2809945 2612659 2956381 2991096 3013455 2801162 2989123
4680B989123P6203O9115L77508m01994l69708M37715L25759k56031n9571L1997
$$ 2989123 3065326 3134441 3511949 3109955 2740247 3177962 3503721 3247690 3188119 3220116
4670C220116O30681J85813K25059K69955J14652j29177K55134J37796J34375L79826
$$ 3220116 3850797 4036610 4261669 4531624 4646276 4517099 4772233 4910029 5044404 5424230
4660E424230Q41679l41623O309O03030r5436N66283O50855J29002K83505M41596
$$ 5424230 6265909 5924286 5930595 6533625 6438189 7004472 7655327 7784329 8067834 8509430
4650H509430P86346Q56645K22711M18485O10820O82472R76876Q05716J263437
$$ 8509430 9295776 10152421 10375132 10793617 11404437 12086909 13063785 13869501 15132938
4641A5132938J363256J435999R65007J516302J687942K217206K339218K120224
$$ 15132938 16496194 17932193 18897200 20413502 22101444 24318650 26657868 28778092
4633B8778092K308206K739349K029158J909846J661760Q45467K0769q70478j385887
$$ 28778092 31086298 33825647 35854805 37764651 39426411 40271878 40292647 39422169 38036282
4624C8036282k869133k042430k421988k650793k068816j922161k017139j720852
$$ 38036282 35167149 33124719 30702731 28051938 25983122 24060961 22043822 20322970
4616B0322970j646125j389753j219630r68115q79889j046825n51631o89393j057461
$$ 20322970 18676845 17287092 16067462 15099347 14219458 13172633 12621002 11931609 10874148
4607A0874148k32822n38566l83331j80263Q0860o78545m96156n69466o02242K27786
$$ 10874148 10641326 10102760 9719429 9539166 9620026 8941481 8445325 7875859 7273617 7501403
4597G501403j50039k26237j50362O67003p07525m87453k15990Q7137k4317n55004
$$ 7501403 7351364 7125127 6974765 7641768 6934243 6446790 6230800 6317937 6293620 5738616
4587E738616O0206l5611J79892n89427l20034L84799K39895q9156R9064k26071
$$ 5738616 5798822 5763211 5943103 5353676 5033642 5418441 5658336 5569180 5668244 5442173
4577E442173k53652n21474j43105J32450K10937l33595k62640J01136J64276N22692
$$ 5442173 5188521 4667047 4523942 4656392 4867329 4533734 4271094 4372230 4536506 5059198
4567E059198k80116n95702M20741J47014P7960J5229j7582k24608j59782L04109
$$ 5059198 4779082 4183380 4604121 4751135 4829095 4844324 4826742 4602134 4442352 4746461
4557D746461j83448J09083J05660j62264j00334K84455j89725j07922K75238r3135
$$ 4746461 4563013 4672096 4777756 4615492 4515158 4799613 4609888 4501966 4777204 4684069
4547D684069J57192N54428n1670k23283o630J82612K20059k5817L45338L04924
$$ 4684069 4841261 5395689 5344019 5120736 5114106 5296718 5516777 5490960 5836298 6141222
4537F141222m4087P7429o1189L02206l0252L21417K87120k66164j5728K75612
$$ 6141222 6097135 6174564 6113375 6415581 6385329 6706746 6993866 6727702 6711974 6987586
4527F987586K66804K38436K59460O72942K55029L10080L24006J15549L52658L30657
$$ 6987586 7254390 7492826 7752286 8425228 8680257 8990337 9314343 9429892 9782550 10113207
4517A0113207P87718J104128P87145P78843N68933J143041J151121R02550R59783
$$ 10113207 10900925 12005053 12792198 13571041 14139974 15283015 16434136 17336686 18296469
4508A8296469O55615K03578M43762J48853l90231m59281p21196r28479k64902
$$ 18296469 18952084 19155662 19599424 19748277 19358046 18898765 18177569 17249090 16984188
4499A6984188n51467p88630p09046n93346p60888o53957l90167n13209l65802
$$ 16984188 16432721 15644091 14935045 14341699 13580811 12926854 12536687 12023478 11657676
4490A1657676n40913N4794j35292o253j63696J2321l38670j25572K08846L26786
$$ 11657676 11116763 11171557 11036265 11030012 10866316 10878637 10539967 10414395 10623241 10950027
4480A0950027j09870k8984n2338L5569j17613l71479k3715o0328K64180K00842
$$ 10950027 10840157 10811173 10758835 10794404 10676791 10305312 10281597 10221269 10485449 10686291
4470A0686291R6304J04605P3001L6181k30473o0939j77975k90454J92044J94059
$$ 10686291 10782595 10887200 10960201 10996382 10765909 10704970 10526995 10236541 10428585 10622644
4460A0622644j59368J66020Q9662L2964m4487r1540K5370J48119L23634k38906
$$ 10622644 10463276 10629296 10718958 10751922 10707435 10615895 10641265 10789384 11113018 10874112
4450A0874112m13200j73655o9365K8576l41166k72561m0152l68400K19699Q3718
$$ 10874112 10460912 10287257 10217892 10246468 9905302 9632741 9592589 9224189 9443888 9527606
4440I527606l49431k89214j59801m86655j06434P0883k13208O1235K71299k23909
$$ 9527606 9178175 8888961 8729160 8242505 8136071 8206954 7993746 8054981 8326280 8102371
4430H102371M5769K41612n1124M9564n6043L29466l92819l00823J85212q6324
$$ 8102371 8148140 8389752 8338628 8388192 8332149 8661615 8268796 7967973 8153185 8066861
4420H066861j49738P8709j45866J53303l47179n6566j01746j16899j15870k51133
$$ 8066861 7917123 7995832 7849966 8003269 7656090 7599524 7497778 7380879 7265009 7013876
4410G013876j79851l5273k24246p6742R1117j36224J31235l54099k43742L58750
$$ 7013876 6834025 6798752 6574506 6497764 6588881 6452657 6583892 6229793 5986051 6344801
4400F344801K12689l50855K73377j01335m61438j12184J93119K52676k78202n28420
$$ 6344801 6557490 6206635 6480012 6378677 5917239 5805055 5998174 6250850 5972648 5444228
4390E444228q5402M1484K98318j76393k20531J2205M36593K27606j41862n6205
$$ 5444228 5358826 5400310 5698628 5522235 5301704 5313909 5750502 5978108 5836246 5780041
4380E780041o2372k63843P6964K35811J73255N4168k73037k84265O5662K0167
$$ 5780041 5717669 5453826 5530790 5766601 5939856 5994024 5720987 5436722 5502384 5522551
4370E522551K49301m2876q3794j18167r4529J48773j66926k72739j93172K23829
$$ 5522551 5771852 5728976 5645182 5527015 5432486 5581259 5414333 5141594 4948422 5172251
4360E172251n3051N64836l40468k28905O95953N2315J45868o27854l84006L79172
$$ 5172251 5119200 5684036 5343568 5114663 5810616 5862931 6008799 5380945 4996939 5376111
4350E376111R4332r3808K35557M13595l1235n58445K66376K34061j08595k97615
$$ 5376111 5470443 5376635 5612192 6025787 5994552 5436107 5702483 5936544 5827949 5530334
4340E530334M836J53925j5573P1153k59455r444K9059K08189m28059K57643M84185
$$ 5530334 5535170 5689095 5673522 5744675 5485220 5475776 5504835 5713024 5284965 5542608 6026793
4329F026793N6392j7652J20019o8203k15940l2070m5318j01479m90181j9037J25697
$$ 6026793 6083185 6065533 6185552 6117349 5901409 5869339 5824021 5722542 5232361 5213324 5339021
4318E339021j7511J69219J13707l77946k0942L93939J4386K9086l03244K9725
$$ 5339021 5321510 5490729 5604436 5226490 5205548 5599487 5613873 5642959 5339715 5369440
4308E369440j98728J50963P4728m02438o2084m18449K09267N34211o9920m02591
$$ 5369440 5170712 5321675 5396403 4993965 4931881 4513432 4722699 5256910 5186990 4784399
4298D784399j30041R4098J18514q1846k79799N10414k19112P313j53341J53243
$$ 4784399 4654358 4748456 4866970 4785124 4505325 5015739 4796627 4803940 4650599 4803842
4288D803842j1349n3651L03591k39290j98577J3469j87829J08613J63562P4445
$$ 4803842 4792493 4738842 5042433 4803143 4604566 4618035 4430206 4538819 4702381 4776826
4278D776826O9169k06623j31903n2059R4617M4881j72661q1207P99566J14455
$$ 4776826 4845995 4639372 4507469 4455410 4550027 4594908 4422247 4341040 5140606 5255061
4268E255061l26652j74339Q520j62386N83985K58906l88455j27934j87636l2375
$$ 5255061 4928409 4754070 4762590 4600204 5184189 5443095 5054640 4926706 4739070 4706695
4258D706695J74086J24403J97662j04101N9873k33531L43269r8778R180K24410
$$ 4706695 4880781 5005184 5202846 5098745 5158618 4925087 5268356 5169578 5178758 5403168
4248E403168J16320k15059K0859K30727l13308M90271J05574k43157K15488q9321
$$ 5403168 5519488 5304429 5325288 5556015 5242707 5732978 5838552 5595395 5810883 5721562
4238E721562m0714M15551k14390L0206k4401O0027J72840l9100L87132K07986
$$ 5721562 5680848 6096399 5882009 5912215 5887814 5947841 6120681 6081581 6468713 6676699
4228F676699k99049l18501j81304M99397j34213l69228J87971K97028n800K31037
$$ 6676699 6377650 6059149 5877845 6377242 6243029 5873801 6061772 6358800 6353000 6584037
4218F584037P83549j48997M2945K08917m13589j91603J54425M80351l30768L91960
$$ 6584037 7367586 7218589 7261534 7470451 7056862 6865259 7019684 7500035 7169267 7561227
4208G561227M92203m65804l76788Q6135P93391j67613m4819K23733K47676n2250
$$ 7561227 8053430 7587626 7210838 7296973 8090364 7922751 7877932 8101665 8349341 8297091
4198H297091K0892M80960L52716O3758N9630Q9471O42797L88190J24153j00209
$$ 8297091 8317983 8798943 9151659 9215417 9275047 9364518 10007315 10395505 10519658 10419449
4188A0419449k12735J15949j95655K2270j70290P1941M10183j7699j71623L96357
$$ 10419449 10206714 10322663 10127008 10149278 9978988 10050929 10461112 10443413 10271790 10668147
4178A0668147k0565m0358K33369N10332K56605J6876j40662K78294K34412L68922
$$ 10668147 10647582 10607224 10840593 11350925 11607530 11624406 11483744 11762038 11996450 12365372
4168A2365372P3249K83669L61746K35028P260K61005N84052J98460K21470N86849
$$ 12365372 12438621 12722290 13084036 13319064 13326324 13587329 14171381 14369841 14591311 15178160
4158A5178160Q04620M253M18613K28171M02840L14358Q15488J012504L83414j27507
$$ 15178160 15982780 15987033 16405646 16633817 17036657 17351015 18166503 19179007 19562421 19434914
4148A9434914J064976J101479J98009R14595J342454P26796N38719J155599Q32429
$$ 19434914 20499890 21601369 21799378 22713973 24056427 24783223 25321942 26477541 27309970
4139B7309970R46395R44243J029686J254472J158177R03568J167878J239314J445408
$$ 27309970 28256365 29200608 30230294 31484766 32642943 33546511 34714389 35953703 37399111
4130C7399111Q72938J074168J177509P65383J101644J333473J204299Q05845J035831
$$ 37399111 38272049 39346217 40523726 41289109 42390753 43724226 44928525 45734370 46770201
4121D6770201O18777R32765R03851R58607P95448N83410K98672O79341J238227
$$ 46770201 47388978 48321743 49225594 50184201 50979649 51563059 51861731 52541072 53779299
4112E3779299P41912J09231k19856j21684l18716j90317j1104m72604k60942n01648
$$ 53779299 54521211 54630442 54410586 54288902 53970186 53779869 53768765 53296161 53035219 52533571
4102E2533571j12781L78567q29583l11233M91578N75308L53023M91687Q70012
$$ 52533571 52420790 52799357 51969774 51658541 52150119 52725427 53078450 53570137 54440149
4093E4440149J468652J973960J971169J875566J391582p59396k086666l092922
$$ 54440149 55908801 57882761 59853930 61729496 63121078 62361682 60275016 57182094
4085E7182094n026189n029086m124398l377882l333202k285228j709545j418104
$$ 57182094 52155905 47126819 43002421 39624539 36291337 34006109 32296564 30878460
4077C0878460j530507j253804j147734j563645r91860q71798j148866q37802j125593
$$ 30878460 29347953 28094149 26946415 25382770 24390910 23519112 22370246 21532444 20406851
4068B0406851j004728l86604o01922n51617r65229m11675n93731q16652n66005
$$ 20406851 19402123 19015519 18413597 17861980 16896751 16485076 15891345 15074693 14508688
4059A4508688J24484n34471m39415l89423k52929l43839l29590l80056k98675
$$ 14508688 14633172 14098701 13659286 13269863 13016934 12673095 12343505 11963449 11664774
4050A1664774k7661r7472j32553l42312r7555l88489L23991M6863j33906k04671
$$ 11664774 11637113 11539641 11407088 11064776 10967221 10578732 10902723 10949586 10815680 10611009
4040A0611009k83605k07800j82180j92468k33009K61677J74222j70866j03619
$$ 10611009 10327404 10119604 9937424 9744956 9511947 9773624 9947846 9776980 9673361
4031I673361K02492K09054m14597j60478J46075n85119k00068r8309L37772K31798
$$ 9673361 9875853 10084907 9670310 9509832 9655907 9070788 8870720 8772411 9110183 9341981
4021I341981l37984j28088j53549m26145K44002N6425k03173L44449J35042K86284
$$ 9341981 9003997 8875909 8722360 8296215 8540217 8596642 8393469 8737918 8872960 9159244
4011I159244l04048j03582Q7770N94425m1671J97407K33866k03738m00445J27569
$$ 9159244 8855196 8751614 8839384 9433809 9392138 9589545 9823411 9619673 9219228 9346797
4001I346797q5668k09881k8373N2921j64580o15798l82909L56913J94900k76944
$$ 9346797 9261129 9051248 9022875 9075796 8911216 8295418 7912509 8269422 8464322 8187378
3991H187378R2233l6347j30698J44705M08151j22811M30765L5636J00740J01234
$$ 8187378 8279611 8243264 8112566 8257271 8665422 8542611 8973376 9009012 9109752 9210986
3981I210986J87630K24254k19779M5853J42314J51258k54454K93826k28085l38932
$$ 9210986 9398616 9622870 9403091 9448944 9591258 9742516 9488062 9781888 9553803 9214871
3971I214871J83936k13530p6197m6367j58240l0054O6458j85188J44102m02018
$$ 9214871 9398807 9185277 9109080 9062713 8904473 8874419 8940877 8755689 8899791 8497773
3961H497773J71568M63468Q4540o8413k55776o2057L68550K90199k33908l24831
$$ 8497773 8669341 9132809 9217349 9148936 8893160 8831103 9199653 9489852 9255944 8931113
3951H931113n0428m5422n3808L19002J02739O0044k96980J723m6661k62160J34736
$$ 8931113 8880685 8835263 8781455 9100457 9203196 9263240 8966260 8967983 8921322 8659162 8793898
3940H793898J89915l60103j45034J80731K47299J13440m50596O815P5209M37899
$$ 8793898 8983813 8623710 8478676 8659407 8906706 9020146 8569550 8576365 8651574 9089473
3930I089473J39197O1806j80825j69634J39109k16006L46727K53336m33517j05405
$$ 9089473 9228670 9290476 9109651 8940017 9079126 8863120 9209847 9463183 9029666 8924261
3920H924261J72059M1902R0294K7567o4479q9929J6626L38143J61338k52823L75772
$$ 8924261 9096320 9138222 9228516 9256083 9191604 9101675 9118301 9456444 9617782 9364959 9740731
3909I740731j42226k68230J59357M2319j9370K47712K40295K8953J31417Q1537
$$ 9740731 9598505 9330275 9489632 9531951 9512581 9760293 10000588 10029541 10160958 10242495
3899A0242495K45875N07752L8778m38J58155K55820O4378P9654M93909O6027j21987
$$ 10242495 10488370 10996122 11034900 11034462 11192617 11448437 11512815 11592469 12086378 12152405 12030418
3888A2030418K21504O45558k54698L04015M92518N28301P0499P8501M62493L86934
$$ 12030418 12251922 12897480 12642782 12946797 13439315 13967616 14038115 14116616 14579109 14966043
3878A4966043J2507J70493O28858L93718K32220j5991J48001N14304P98714L77822
$$ 14966043 14978550 15149043 15777901 16171619 16403839 16387848 16535849 17050153 17848867 18226689
3868A8226689M41438L86921L85412L22849M91734N11833P43077N05455K88731
$$ 18226689 18668127 19055048 19440460 19763309 20255043 20766876 21509953 22015408 22304139
3859B2304139N88376J107904J147972N91913R88268J194820J016210J069640J058901
$$ 22304139 22892515 24000419 25148391 25740304 26728572 27923392 28939602 30009242 31068143
3850C1068143J280680J290121J583523J186714J850077J730776J735089K275587
$$ 31068143 32348823 33638944 35222467 36409181 38259258 39990034 41725123 44000710
3842D4000710K559692K569587K615396K861030K713328L215250L945504M005902
$$ 44000710 46560402 49129989 51745385 54606415 57319743 60534993 64480497 68486399
3834F8486399L930902M053934M611314M532030M002597M269339L811537L235569
$$ 68486399 72417301 76471235 81082549 85614579 89617176 93886515 97698052 100933621
3826A00933621L042919K947623J849561J659717J649593R56822R82390J78090
$$ 100933621 103976540 106924163 108773724 110433441 112083034 113039856 114022246 114200336
3818A14200336n99363n05823m71836o38242q19651j468124k218745k071157k828506
$$ 114200336 113600973 113095150 112623314 111985072 111165421 109697297 107478552 105407395 102578889
3809A02578889k397414k858571l724130l841494l920091l765302l466459m301879
$$ 102578889 100181475 97322904 93598774 89757280 85837189 82071887 78605428 74303549
3801G4303549l596702m090391l834834k966391l094840k362125k110429k020523
$$ 74303549 70706847 66616456 62781622 59815231 56720391 54358266 52247837 50227314
3793E0227314k876926k337627j587232j702920j721923j468529j416485j099168
$$ 50227314 47350388 45012761 43425529 41722609 40000686 38532157 37115672 36016504
3785C6016504j046810q94842j086335q43814n45493j020563o05056r94680m79508
$$ 36016504 34969694 34074852 32988517 32144703 31599210 30578647 29973591 28978911 28499403
3776B8499403k21826o77662m10959j053822m47209m01070l13685l06107l41629
$$ 28499403 28277577 27599915 27188956 26135134 25687925 25286855 24973170 24667063 24325434
3767B4325434m76608m56535m9478n5048o68556p3386q2673J59940J3259o90854
$$ 24325434 23848826 23392291 23342813 23287765 22619209 22545823 22463150 22623090 22636349 21945495
3757B1945495m08467J0575j74500j93182j48582j11664l77165J15971J21782m01100
$$ 21945495 21537028 21547603 21373103 21179921 21031339 20919675 20542510 20658481 20780263 20379163
3747B0379163J21047O36140K50966j73634J58423L33946P9456m86124Q3564J70357
$$ 20379163 20500210 21136350 21387316 21213682 21372105 21706051 21785507 21299383 21382947 21553304
3737B1553304N92048J21498K87749K72696J94638M0718J57899j52467Q28754N87338
$$ 21553304 22145352 22266850 22554599 22827295 23021933 23062651 23220550 23068083 23896837 24484175
3727B4484175N40031O90920N85322N27479M44479Q84067P01677Q32640R40208
$$ 24484175 25024206 25715126 26300448 26827927 27272406 28156473 28858150 29690790 30630998
3718C0630998J212033P37148R10636J417245J223553J083666J298102J118333
$$ 30630998 31843031 32580179 33490815 34908060 36131613 37215279 38513381 39631714
3710C9631714O91450O21770J110687Q62852O80462L20044J58708J29396j15013
$$ 39631714 40323164 40944934 42055621 42918473 43598935 43918979 44077687 44207083 44092070
3701D4092070j55422k30973n64164n74719m41712o6469k61611L81918l10444K20276
$$ 44092070 43936648 43705675 43141511 42566792 42125080 42058611 41797000 42178918 41868474 42088750
3691D2088750P89136N96144m9552L76461P25028O68148R05897J328474J355409
$$ 42088750 42877886 43474030 43424478 43800939 44525967 45194115 46100012 47428486 48783895
3682D8783895J045585J356321Q38781J720580J988348J898869J930360J716799
$$ 48783895 49829480 51185801 52024582 53745162 55733510 57632379 59562739 61279538
3674F1279538K659807K738872L155379L567123L729704L800332M044709M606920
$$ 61279538 63939345 66678217 69833596 73400719 77130423 80930755 84975464 89582384
3666H9582384M991966N610134N860305O082593O044218O660863O633837O700478
$$ 89582384 94574350 100184484 106044789 112127382 118171600 124832463 131466300 138166778
3658A38166778N981026O622582N559858M973726M422188L760577L339234K388269
$$ 138166778 144147804 150770386 156330244 161303970 165726158 169486735 172825969 175214238
3650A75214238J561563R66316L63610j6820j78253m00578r81385q52944r06811
$$ 175214238 176775801 177742117 178105727 178088907 177910654 177510076 176528691 175675747 174768936
3641A74768936j039145j171092j689166j510068k321867k219290k633334l299289
$$ 174768936 173729791 172558699 170869533 169359465 167037598 164818308 162184974 158885685
3633A58885685l831119l683810m163935n068915n189998o140133n422215n355227
$$ 158885685 155054566 151370756 147206821 142137906 136947908 130807775 125385560 120030333
3625A20030333n765103n718862n445472m740457m741890m601073m133827l903335
$$ 120030333 114265230 108546368 103100896 98360439 93618549 89017476 84883649 80980314
3617H0980314l659417l554369l377641k822422k980874k529103k272501k128977
$$ 80980314 77320897 73766528 70388887 67566465 64585591 62056488 59783987 57655010
3609E7655010k256799j657500j615200j383898j000536j660120j256472r49676
$$ 57655010 55398211 53740711 52125511 50741613 49741077 48080957 46824485 45874809
3601D5874809j201603j013201p42459r99497o33331m63436L28583L62070p44152
$$ 45874809 44673206 43660005 42917546 41918049 41284718 40821282 41149865 41511935 40767783
3592D0767783J32028j26252j7022J58886L32278j22227K1973O3407j32594K98862
$$ 40767783 40899811 40773559 40756537 40915423 41247701 41125474 41147447 41210854 41078260 41377122
3582D1377122m4931m00736n93105n64053r38471q07968j047057j206368j164537
$$ 41377122 41332191 40931455 40338350 39774297 38835826 38027858 36980801 35774433 34609896
3573C4609896j214636n70231j299227j307278j358386r64772r07136r19561o49252
$$ 34609896 33395260 32825029 31525802 30218524 28860138 27895366 26988230 26068669 25419417
3564B5419417p29295q89681j102951p52258l62030l17625n83761p60665n04505
$$ 25419417 24690122 23800441 22697490 21945232 21583202 21265577 20681816 19921151 19416646
3555A9416646Q8545l07512m23332o85688j62726l35732l81587k80713k68196l33423
$$ 19416646 19505191 19197679 18774347 18088659 17925933 17590201 17208614 16927901 16659705 16326282
3545A6326282j50416p89436P6622k4383l06616l70163j80621J66256J37306J05684
$$ 16326282 16175866 15386430 15463052 15438669 15132053 14761890 14581269 14747525 14884831 14990515
3535A4990515p03325j71154k94270l16097J84318J6439l36086m39394J61715L9592
$$ 14990515 14287190 14116036 13821766 13505669 13689987 13706426 13370340 12930946 13092661 13132253
3525A3132253n2497j45401M6314l34130j27213n7557K26039Q9999n61693o6258
$$ 13132253 13079756 12934355 12980669 12646539 12519326 12461769 12687808 12777807 12216114 12149856
3515A2149856M9452K82884k73096K05289L29456j61864o51516j04630N02213j45126
$$ 12149856 12199308 12482192 12209096 12414385 12743841 12581977 11930461 11825831 12328044 12182918
3505A2182918o5892K20129j07470l26478j14834K27758M58548M9584n77741O8875
$$ 12182918 12117026 12337155 12229685 11903207 11788373 12016131 12474679 12524263 11946522 12015397
3495A2015397K82312J30292k83019J70101k97647M1561J90799o2771M42320k410
$$ 12015397 12297709 12428001 12144982 12315083 12017436 12058997 12249796 12187025 12629345 12626935
3485A2626935j10090M3382p1531K62520J00467L79397J04834j65706j93907K24201
$$ 12626935 12516845 12560227 12488696 12751216 12851683 13231080 13335914 13170208 12976301 13200502
3475A3200502J60439J75148J67391L97087m5898m47448R2073J8172R09514M70473
$$ 13200502 13360941 13536089 13703480 14100567 14054669 13607221 13699294 13717466 14626980 15097453
3465A5097453p2253k68759k6009L97606K59281j40945R4739R0545J95113J91031
$$ 15097453 15025200 14756441 14730432 15128038 15387319 15246374 15341113 15431658 15626771 15817802
3455A5817802M40249M25464J40950p770M05208K19168L33337K23188O06360L96125
$$ 15817802 16258051 16683515 16824465 16816695 17221903 17441071 17774408 17997596 18603956 19000081
3445A9000081M96160N56607N56996R46125L15892Q51512P72306P97027P74696
$$ 19000081 19496241 20052848 20609844 21555969 21871861 22723373 23495679 24292706 25067402
3436B5067402P96756P19953J188734R84110J125333P93585J095409J568848J539415
$$ 25067402 25864158 26584111 27772845 28756955 29882288 30675873 31771282 33340130 34879545
3427C4879545J003754J331666O90555L25005J391042P76774O04579N78972M88560
$$ 34879545 35883299 37214965 37905520 38230525 39621567 40398341 41002920 41581892 42070452
3418D2070452L91283k948L30428N22637K37584M21752K27097l59099j17837k19882
$$ 42070452 42461735 42458787 42789215 43311852 43549436 43971188 44198285 43839186 43721349 43501467
3408D3501467k66253j6133n16531m43867o60679k23849o46374l81252o00060l92673
$$ 43501467 43235214 43219081 42702550 42258683 41598004 41374155 40727781 40346529 39746469 39353796
3398C9353796R8798n5391p7168M18183J24573O43398J07862O41958P29701O91263
$$ 39353796 39452594 39397203 39320035 39738218 39862791 40506189 40614051 41256009 41985710 42676973
3388D2676973Q29962J288611J431260J163453J567327J985624K602272K240055
$$ 42676973 43506935 44795546 46226806 47390259 48957586 50943210 53545482 55785537
3380E5785537K088602K432730L140226L111315L783275L742945L351550L440312
$$ 55785537 57874139 60306869 63447095 66558410 70341685 74084630 77436180 80876492
3372H0876492L614408L391335L713686L665360L580136L054183L075893K544992
$$ 80876492 84490900 87882235 91595921 95261281 98841417 101895600 104971493 107516485
3364A07516485J920923J744436J196610J279437R68437O99671K45952K12619K03952
$$ 107516485 109437408 111181844 112378454 113657891 114626328 115325999 115571951 115784570 115988522
3355A15988522m89994p7558j081251j059656j091767j388686j377302j918030
$$ 115988522 115498528 115420970 114339719 113280063 112188296 110799610 109422308 107504278
3347A07504278j729303k026409j709942j461915j411178j173346j145712k81886
$$ 107504278 105774975 103748566 102038624 100576709 99165531 97992185 96846473 96564587
3339I6564587l63586P018Q68350R81521J183434J377747J467006J410436K037764
$$ 96564587 96201001 96208019 97076369 98057890 99241324 100619071 102086077 103496513 105534277
3330A05534277K426201K187650J657397J809839J580451J153560J005963P09369
$$ 105534277 107960478 110148128 111805525 113615364 115195815 116349375 117355338 118064707
3322A18064707Q98845P08603j67410j1621l38091p80474r55290q88426j160844
$$ 118064707 118963552 119672155 119504745 119493124 119155033 118374559 117419269 116530843 115369999
3313A15369999k255373j811189j838075k409105l057423l040969l086325l217399
$$ 115369999 113114626 111303437 109465362 107056257 103998834 100957865 97871540 94654141
3305I4654141l412168l618561l371949l254831l400884l321635k875517k310962
$$ 94654141 91241973 87623412 84251463 80996632 77595748 74274113 71398596 69087634
3297F9087634k461896k199532j781168j927785j554267j302150j192602j125565
$$ 69087634 66625738 64426206 62645038 60717253 59162986 57860836 56668234 55542669
3289E5542669o48192n14295p16802k87968k79448o2887K81642J3117K11272N71995
$$ 55542669 54894477 54380182 53663380 53375412 53095964 53033077 53314719 53327836 53539108 54111103
3279E4111103K26240O94379J433409J299463J111644J401232J416011J170170
$$ 54111103 54337343 55031722 56465131 57764594 58876238 60277470 61693481 62863651
3271F2863651J672865J435625J142067J527936J446812N47854J120590L55278
$$ 62863651 64536516 65972141 67114208 68642144 70088956 70636810 71757400 72112678
3263G2112678L75259L57196j77123m72805p10057n78009m85720k85286n13622
$$ 72112678 72487937 72845133 72668010 72195205 71485148 70907139 70421419 70136133 69622511
3254F9622511q70384o86898j125099j257637j725237j779925k064154j818341
$$ 69622511 68752127 68065229 66940130 65682493 63957256 62177331 60113177 58294836
3246E8294836j977175j854465k010617k161787j550015j515386j138388j877614
$$ 58294836 56317661 54463196 52452579 50290792 48740777 47225391 46087003 44209389
3238D4209389j323314j097747j070628j135819n05257o06026m95014j149355l67710
$$ 44209389 42886075 41788328 40717700 39581881 39076624 38470598 37975584 36826229 36458519
3229C6458519k35172p4631J1067J72661K43642l89190L55489M48149P1333Q89018
$$ 36458519 36223347 36148716 36159783 36332444 36576086 36186896 36542385 36990534 37061867 37950885
3219C7950885M90078M39711Q07209Q97426Q68423R50394J173444J001169J187215
$$ 37950885 38440963 38880674 39687883 40585309 41453732 42404126 43577570 44578739 45765954
3210D5765954J456850J499822K260717K806110J952474K293507K829380K771244
$$ 45765954 47222804 48722626 50983343 53789453 55741927 58035434 60864814 63636058
3202F3636058K805834K687258L282809L618776L267322L453589K944997L383016
$$ 63636058 66441892 69129150 72411959 76030735 79298057 82751646 85696643 89079659
3194H9079659L023113K907329K875663K072600K510119K404570K113450J320989
$$ 89079659 92102772 95010101 97885764 99958364 102468483 104873053 106986503 108307492
3186A08307492J015731J281042J355967J008465K58318l1354P9781p4324n09747
$$ 108307492 109323223 110604265 111960232 112968697 113227015 113195661 113275442 113201118 112691371
3177A12691371j579088j681710j852871k430648k412713l646325l761349l651531
$$ 112691371 111112283 109430573 107577702 105147054 102734341 99088016 95326667 91675136
3169I1675136l938024l995078m246636m371508l704965l657607l882107l363479
$$ 91675136 87737112 83742034 79495398 75123890 71418925 67761318 63879211 60515732
3161F0515732k256572k388872k098567j951647k003624j838687j329622j211315
$$ 60515732 58259160 55870288 53771721 51820074 49816450 47977763 46648141 45436826
3153D5436826j005569r65554l00341q61057J17196N56546R1594R66489N78774
$$ 45436826 44431257 43465703 43165362 42304305 42421501 42978047 43069641 44036130 44614904
3144D4614904L16583J97577j32009j164401j768870j812084k394120k035123j410130
$$ 44614904 44931487 45129064 44997055 43832654 42063784 40251700 37857580 35822457 34412327
3135C4412327j290847q08578p95080q61618k08814j7726k35056j91807l644M2414
$$ 34412327 33121480 32312902 31517822 30656204 30447390 30429664 30194608 30002801 29999157 30041571
3125C0041571O70620P78439N64729Q69032J459090J218688R99393J190926O95148
$$ 30041571 30712191 31490630 32055359 32924391 34383481 35602169 36601562 37792488 38487636
3116C8487636Q03214J34637p00011j261465j933113k545448k405018j900709j935161
$$ 38487636 39290850 39425487 38725476 37464011 35530898 32985450 30580432 28679723 26744562
3107B6744562j039647j275394j100476r13946j279843q39817m66614o64643p16128
$$ 26744562 25704915 24429521 23329045 22415099 21135256 20295439 19828825 19164182 18448054
3098A8448054l87375n53945p8124o68625l20380K77693p2922p10245r1709m60060
$$ 18448054 18060679 17506734 17428610 16759985 16439605 16717298 16644376 15934131 15842422 15382362
3088A5382362q3266j37802J09147j97022q74038m45114J51046k3320p3123R8082
$$ 15382362 15299096 15161294 15270441 15073419 14199381 13754267 13905313 13881993 13808870 13906952
3078A3906952J01196o22083o76867K38059J77677l87327n0310J94007l65245P875
$$ 13906952 14008148 13386065 12709198 12947257 13124934 12737607 12687297 12881304 12516059 12523934
3068A2523934j4458j77713k14656N0152m176j48903N58005j95409m53279K88555
$$ 12523934 12509476 12331763 12117107 12167259 12163083 12014180 12572185 12376776 11923497 12212052
3058A2212052J08101k49035n5278j09243J2911L62543j46589l0466l650l118m9219
$$ 12212052 12320153 12071118 12015840 11906597 11919508 12282051 12135462 12104996 12101346 12098228 12049009
3047A2049009N6873J04260k83531j36712J0770n9931O0971m3510Q4002K12275
$$ 12049009 12105882 12210142 11926611 11789899 11800669 11740738 11801709 11758199 11842201 12054476
3037A2054476J85197J16580L8094K42164j20838r376o9944J72540M7942j10519
$$ 12054476 12239673 12356253 12394347 12636511 12515673 12506297 12436353 12608893 12656835 12546316
3027A2546316l9959L30043o8091J49586L58370P9670J70203r5955n9070K27438
$$ 12546316 12506357 12836400 12768309 12917895 13276265 13355935 13526138 13430183 13371113 13598551
3017A3598551K18345k2472j09505J15327N2426J65727K71689m62668K16740L11375
$$ 13598551 13816896 13794424 13684919 13800246 13852672 14018399 14290088 13827420 14044160 14355535
3007A4355535L43357N19028N70559O5322J62019L611N4659Q10789M49575M74944
$$ 14355535 14698892 15217920 15788479 15853801 16015820 16019431 16074090 16884879 17334454 17809398
2997A7809398J67084j12123L57235M32272M92505j21854O24603K54459K26918
$$ 17809398 17976482 17864359 18221594 18653866 19146371 19024517 19649120 19903579 20130497
2988B0130497L57984K57980L10631M74164N49719K50724L32056K71186Q43333
$$ 20130497 20488481 20746461 21057092 21531256 22080975 22331699 22663755 22934941 23778274
2979B3778274L63645L17056L31331O46260J062256N52506N30044M65728r4520
$$ 23778274 24141919 24458975 24790306 25436566 26498822 27051328 27581372 28047100 27952580
2970B7952580P8588J453600O90280K76095J125388P78724P94871M31834L70207
$$ 27952580 28031168 29484768 30175048 30451143 31576531 32355255 33150126 33581960 33952167
2961C3952167R64183J066206J195290Q20835R37437O39226Q21273J039324J171774
$$ 33952167 34916350 35982556 37177846 37998681 38936118 39575344 40396617 41435941 42607715
2952D2607715J136047Q18471P83751J267953J067763J380495J804012J022287
$$ 42607715 43743762 44562233 45345984 46613937 47681700 49062195 50866207 51888494
2944E1888494J052183J617486J757061K068866J871893J547612J677466J926721
$$ 51888494 52940677 54558163 56315224 58384090 60255983 61803595 63481061 65407782
2936F5407782K272875K218346K706722K867254K650705K688256L140434L226947
$$ 65407782 67680657 69899003 72605725 75472979 78123684 80811940 83952374 87179321
2928H7179321L500521L527481M144069L864919M951728M735196N344314O094995
$$ 87179321 90679842 94207323 98351392 102216311 107168039 111903235 117247549 123342544
2920A23342544O133181P181062P593300Q260605R127955R699975R593694J0930683
$$ 123342544 129475725 136656787 144250087 152510692 161638647 171338622 180932316 191862999
2912A91862999J1662072J2730879J4196007J5631353J8211525K1259924K2973380
$$ 191862999 203525071 216255950 230451957 246083310 264294835 285554759 308528139
2905C08528139K5923678K8083422L0377904L1320199L1338888K8397541K3442833
$$ 308528139 334451817 362535239 392913143 424233342 455572230 483969771 507412604
2898E07412604J6202496O461770m101736j4491437k4180535l0856608l3483611
$$ 507412604 523615100 530076870 525975134 511483697 487303162 456446554 422962943
2891D22962943l4354290l2651091l0570429k7353730k4405449k1875289j9465008
$$ 422962943 388608653 355957562 325387133 298033403 273627954 251752665 232287657
2884B32287657j6652263j5233446j3803138j2683891j1237459j0040346r455772
$$ 232287657 215635394 200401948 186598810 173914919 162677460 152637114 143181342
2877A43181342q067646p475590o913455o520943n725422n013182m860346m520701
$$ 143181342 135113696 127638106 120724651 114203708 108478286 103465104 98604758 94084057
2869I4084057m173167l355942l585564l100540k858682l191115k620707k073437
$$ 94084057 89910890 86554948 82969384 79868844 77010162 73819047 71198340 69124903
2861F9124903k336477k411550k461852j921333k032185j832189k159918j888463
$$ 69124903 66788426 64376876 61915024 59993691 57961506 56129317 53969399 52080936
2853E2080936j716987j687338j731769j159521j000019j640336j695203j102185
$$ 52080936 50363949 48676611 46944842 45785321 44785302 43144966 41449763 40347578
2845D0347578j123215r32408r52246j388864j157694j218135j059975j000135
$$ 40347578 39224363 38291955 37339709 35950845 34793151 33575016 32515041 31514906
2837C1514906j084705j290428o31038n11903n55393p31645m86326j76711n95754
$$ 31514906 30430201 29139773 28508735 27996832 27441439 26709794 26223468 26046757 25451003
2828B5451003n40815n99866p82033q32741k43840m55588n44426p92732m65297
$$ 25451003 24910188 24310322 23528289 22695548 22451708 21996120 21451694 20658962 20193665
2819B0193665k03602o60315k21787k71742k83350m98155r76977k95684j03543
$$ 20193665 19990063 19329748 19107961 18836219 18552869 18054714 17077737 16782053 16678510
2810A6678510l04816J39520m77775n41815l95370m48039j39238k71653l11691
$$ 16678510 16373694 16513214 16035439 15493624 15098254 14650215 14510977 14239324 13927633
2801A3927633M905m49898m37966n55532k74816j76068j80547J65194J5904p55431
$$ 13927633 13932538 13482640 13044674 12489142 12214326 12038258 11857711 12022905 12038809 11283378
2791A1283378l63553j60586K6522M0441l26168k06761n38823k17221L33063K39660
$$ 11283378 10919825 10759239 10785761 10826202 10500034 10293273 9754450 9537229 9870292 10109952
2781A0109952o12169m79058k62587K050l72521n3737K40109m26513K2383m14297
$$ 10109952 9497783 9018725 8756138 8758188 8385667 8331930 8572039 8145526 8167909 7753612
2771G753612j17558P6229k85650k30098l89465O3632L71195m17191l83488j5009
$$ 7753612 7636054 7712283 7426633 7196535 6807070 6870702 7241897 6824706 6441218 6426209
2761F426209J08121p2645r5333j48768J11666k28381l96962l0003r6533m7847
$$ 6426209 6534330 6461685 6366352 6217584 6329250 6100869 5703907 5673904 5577371 5529524
2751E529524J52671K72760K2217m0605m4050N999r1498l6124N9308j64633k90155
$$ 5529524 5682195 5954955 5977172 5936567 5892517 5898516 5807018 5770894 5830202 5665569 5375414
2740E375414j08087K86897m00234k33569n7864j70494J8822N0137J78450K36675
$$ 5375414 5267327 5554224 5153990 4920421 4862557 4692063 4710885 4761022 4939472 5176147
2730E176147L56130l88142n67498j04792Q8748l35785o6225K30848L42007k433
$$ 5176147 5532277 5144135 4576637 4471845 4560593 4224808 4158583 4389431 4731438 4729005
2720D729005m39962K25574j96586l80311K23904K34801j07697l80768k90050L62574
$$ 4729005 4289043 4514617 4318031 3937720 4161624 4396425 4288728 3907960 3617910 3980484
2710C980484k98064K47394m33870j62773k55861P804O13882m80541j27859K86901
$$ 3980484 3682420 3929814 3495944 3333171 3077310 3085114 3698996 3218455 3090596 3377497
2700C377497J18559n33323j51036M98684k11234n2886J81800k04228j76403K70894
$$ 3377497 3496056 2962733 2811697 3310381 3099147 3046261 3228061 3023833 2847430 3118324
2690C118324K35166m21337k91076M2777J45959m4777J17072j91456j64873J91433
$$ 3118324 3353490 2932153 2641077 2683854 2829813 2785036 2902108 2710652 2545779 2737212
2680B737212m2359M8302K42588J20152m33802m12962K5836K68829N9559n0177
$$ 2737212 2694853 2743155 2985743 3105895 2672093 2259131 2284967 2553796 2613355 2563178
2670B563178k3518l78227M48238J46458n81212k14663J76621M77735J83727m24236
$$ 2563178 2539660 2161433 2609671 2756129 2174917 1960254 2136875 2614610 2798337 2374101
2660B374101K16875K35695k32446O4087k8524m41j34138k93120M7045J5431P7849
$$ 2374101 2590976 2826671 2594225 2658312 2629788 2629347 2495209 2202089 2249134 2264565 2342414
2649B342414R9495J86713o26593J32661K14865J74627j44507k94659j48436O42112
$$ 2342414 2441909 2628622 2002029 2134690 2349555 2524182 2379675 2085016 1936580 2578692
2639B578692P36071n16458l65792K2992m26995K2272J23405K56875Q7526J38744
$$ 2578692 3314763 2798305 2432513 2455505 2028510 2050782 2174187 2431062 2518588 2657332
2629B657332L93156k69636l26697J37283N72614K89849j76758J40416L7322O2689
$$ 2657332 3050488 2780852 2454155 2591438 3164052 3453901 3277143 3417559 3454881 3517570
2619C517570K59571k31300J15739M84266j36485k59200J42126r0353n25594k4362
$$ 3517570 3777141 3545841 3661580 4145846 4009361 3750161 3892287 3801934 3276340 3251978
2609C251978j30917J65394K62392k65356k17176J70283m09893o5456m88131l60188
$$ 3251978 3121061 3286455 3548847 3283491 3066315 3236598 2826705 2761249 2273118 1912930
2599A912930m6747L32477j31010j76207L65955O7739o422m7231J94901r780j98790
$$ 1912930 1866183 2198660 2067650 1891443 2257398 2325137 2318715 2271484 2466385 2456605 2257815
2588B257815j37191k79513J38494p7441m66005q9709k3015j40175j04497J49656
$$ 2257815 2120624 1841111 1979605 1902164 1436159 1346450 1323435 1183260 1078763 1228419
2578A228419L69199J19603J84118L99581o09929o02074k12211J35359m52544j18717
$$ 1228419 1597618 1717221 1901339 2300920 1690991 1088917 876706 1012065 559521 440804
2568D40804N70230Q0412l70199J48778K94966k49016j26530N7303Q7665J42799
$$ 440804 1011034 1091446 721247 870025 1164991 915975 789445 846748 934413 1077212
2558A077212K02707J99109n15209L03425M5711k2811l10411q491n8555R2562Q1024
$$ 1077212 1279919 1479028 963819 1267244 1312955 1290144 979733 971242 912687 1005249 1086273
2547A086273J6635q6599p0695k42723L1166j34165k28133q1389P8079K07431L20877
$$ 1086273 1102908 1016309 945614 702891 734057 599892 371759 290370 368449 575880 896757
2536H96757k29237J29992k32906J87828R6668p3269k28323j4831o1171M49974
$$ 896757 667520 797512 564606 752434 849102 775833 547510 532679 471508 921482
2526I21482p0395n17296k32378L44576J12880j84672n2479J12084K58190J97577
$$ 921482 851087 333791 101413 445989 558869 374197 321718 433802 691992 889569
2516H89569Q6490O0838k92928n82235J62959J88603P2182J22245j2035k81993
$$ 889569 976059 1036897 743969 161734 324693 513296 585478 707723 695688 413695
2506D13695j41228m0627l7140K98795R2725j53406K46741K63002j52390m91142
$$ 413695 272467 231840 194700 493495 586220 432814 679555 942557 790167 299025
2496B99025j30092K89714L9692m79230M48975K8245m01328J86568p3305j72131
$$ 299025 168933 458647 498339 19109 468084 496329 95001 281569 208264 36133
2486C6133L42721J59944P6582m8206o3784p4557K25549j13810J55991p02918P9662
$$ 36133 378854 538798 615380 567174 503390 428833 654382 540572 696563 -6355 73307
2475G3307K93740J49665l65125K95867Q0034Q2023k92835l53456K63810O3161
$$ 73307 367047 516712 151587 447454 527488 609511 316676 -36780 227030 290191
2465B90191j46100P3019J13739m92237j12990K39421j55554L3479M76980j22823
$$ 290191 144091 217110 330849 -161388 -274378 -34957 -190511 -157032 319948 197125
2455A97125l13290K29726j54741q4083M41290J11924q5295k05784k73362L06700
$$ 197125 -116165 113561 -41180 -125263 316027 427951 342656 136872 -136490 170210
2445A70210j21300j30316J4079M35834k53j39259r3040J73477j425j7307j75715
$$ 170210 48910 -81406 -67327 368507 368254 228995 135955 309432 308007 290700 114985
2434A14985J36558R9651K41680K90005o43286j14740j12945L25926k4629n59712
$$ 114985 251543 351194 592874 882879 239593 124853 11908 337834 313205 -246507
2424b46507K11601L30666J97781j7942m2545J0986O1762J53086m21445j13626
$$ -246507 -34906 295760 493541 475599 433054 444040 505802 658888 237443 123817
2414A23817M4453K22920J94238l22690l3667L86004l0551j86717j04816L42462
$$ 123817 168270 391190 585428 262738 229071 615075 584524 397807 292991 635453
2404F35453m38944k1218R0105l93750l8209K91736K87474L10031j73087j96390
$$ 635453 196509 175291 265396 -128354 -166563 125173 412647 722678 549591 353201
2394C53201J90537l48453l49421O2416K11045P139M20579m6359j32788j35616
$$ 353201 543738 195285 -154136 -91720 119325 126464 547043 500684 367896 232280
2384B32280K89727K63967j97396N00577K22454j28934l61377p6469j87447j33767
$$ 232280 522007 785974 588578 1089155 1311609 1182675 821298 744829 557382 423615
2374D23615K5135j1966l52177R4403L42921j96394j90814K88206J28236k65000
$$ 423615 448750 436784 84607 179010 521931 325537 134723 422929 551165 286165
2364B86165J38167n3167j14036o1333o8616J16001L72751j50014Q3117k08693
$$ 286165 424332 371165 257129 195796 127180 243181 615932 465918 549035 340342
2354C40342K6806j02045j33080L31842k17404p4956o1058N2570L90999r1645n16356
$$ 340342 367148 265103 132023 463865 246461 171505 110447 163017 554016 462371 -53985
2343e3985L04377j83093M01201O487N2866L2717K64208j97328m01133j69602J83890
$$ -53985 250392 67299 468500 474987 527853 560570 824778 627450 226317 56715 240605
2332B40605l8474j31697M25021o048L8688k2410n22186L29103o5765O301J38997
$$ 240605 202131 70434 495455 489407 528095 505685 -16501 312602 246837 253138 392135
2321C92135j35108j84838j95016k52925M47629O91368j67216k13931J99463k42114
$$ 392135 257027 72189 -122827 -375752 71877 763245 596029 382098 581561 339447
2311C39447j20222j00103q8117j924K69561j24624k2479J44028J25064K2712M9068
$$ 339447 219225 119122 31005 29081 298642 174018 151539 295567 420631 443343 492411
2300D92411N8052k4252J33299k61367k2899k76532N42566N270l88385K1869j45249
$$ 492411 550463 526211 659510 398143 375244 98712 641278 646548 258163 280032 134783
2289A34783m920O2635k47655N16704L13196k66942r2731k6101k69209k898P8527
$$ 134783 129863 192498 -55157 461547 774743 507801 415070 388969 119760 116862 195389
2278A95389J14489M79416L3812l89406k51119j10858J23542L37151L9526k34762
$$ 195389 309878 789294 823106 433700 182581 71723 195265 532416 571942 337180
2268C37180J23976n9580k67919N68726J79642l19215M19329n87040k63645M17047
$$ 337180 461156 401576 133657 702383 882025 562810 982139 395099 131454 548501
2258E48501m4461K08683M82482k42460K84356K87829j52170m31391m3149k1485
$$ 548501 504040 712723 1195205 952745 1237101 1524930 1372760 941369 898220 876735
2248H76735J41477m7385q608k52529o4103L04138J06809j01932L6717m8292n9029
$$ 876735 1018212 970827 962219 709690 645587 949725 1056534 954602 991319 943027 883998
2237H83998l15797l1295j60458R2450O14206J08797K43751l2554m39639Q8158
$$ 883998 568201 536906 376448 468898 1083104 1191901 1435652 1403098 963459 1051617
2227A051617J96672j6859j92659J39965q5933L39992L46227J17607k95851M4797
$$ 1051617 1248289 1231430 1038771 1178736 1092803 1432795 1779022 1896629 1600778 1645575
2217A645575K5057k41165J99470K49870J33384o631j25726o1566O07608L1736
$$ 1645575 1670632 1429467 1628937 1878807 2012191 2005560 1879834 1818268 2425876 2457612
2207B457612j48717k05911m85514M79908K71098K96707L94394n89387k61825j01479
$$ 2457612 2308895 2102984 1617470 2097378 2368476 2665183 3059577 2470190 2208365 2106886
2197B106886M03823K89117l927k79610J25506K38489M16451R0520O4318M9732
$$ 2106886 2510709 2799826 2795899 2516289 2641795 2880284 3296735 3387255 3451573 3501305
2187C501305J0651J68910Q8603L55557J10349J39058o4211K86551J20779k65253
$$ 3501305 3511956 3680866 3769469 4125026 4235375 4374433 4310222 4596773 4717552 4452299
2177D452299K31716K59717j06171j68278J17863j53860R8646M10585K40556j80151
$$ 4452299 4684015 4943732 4837561 4669283 4787146 4633286 4731932 5142517 5383073 5202922
2167E202922R920K09437Q7534J51607K12115J09556K95261n51963L70007J8467
$$ 5202922 5212842 5422279 5509813 5661420 5873535 5983091 6278352 5726389 6096396 6114863
2157F114863M23781L05959L14006J11216O16613K80457J41892P50973R3190N28501
$$ 6114863 6538644 6844603 7158609 7269825 7886438 8166895 8308787 9059760 9152950 9681451
2147I681451J83864N49517M46946J124327P05517J09238N33921L45635O91584
$$ 9681451 9865315 10414832 10861778 11986105 12691622 12800860 13334781 13680416 14372000
2138A4372000J026384R54571P13011J028535J000485R22262J624561J695827J754478
$$ 14372000 15398384 16352955 17065966 18094501 19094986 20017248 21641809 23337636 25092114
2129B5092114J766511K657963K145176J850695K817583L089268M219314N448398
$$ 25092114 26858625 29516588 31661764 33512459 36330042 39419310 43638624 49087022
2121D9087022O506403Q111412R524972J2464671J6152869J7047445J4467495J4841227
$$ 49087022 55593425 63704837 73229809 85694480 101847349 118894794 133362289 148203516
2113A48203516J0246127m066660q944007j5999855k3010560j9586428j4422560
$$ 148203516 158449643 154382983 145438976 129439121 106428561 86842133 72419573
2106G2419573j0571340q728169o588598m790744l773840k946006k370843k190004
$$ 72419573 61848233 53120064 46531466 41740722 37966882 35020876 32650033 30460029
2098C0460029j950907k092811k099359k142068j528278r17323j688324j121935
$$ 30460029 28509122 26416311 24316952 22174884 20646606 19729283 18040959 16919024
2090A6919024r89051r79645q68053r04567p29343j85542n08340p30337r9690m31265
$$ 16919024 15929973 14950328 14082275 13177708 12448365 12262823 11754483 11024146 10924456 10493191
2080A0493191k50995m41017j22765l15118k27492p78210m96918q4579p25330M6513
$$ 10493191 10242196 9801179 9678414 9363296 9135804 8357594 7860676 7776097 7050767 7097280
2070G097280l8791j64051k67141l01883J72310j33202n33449m40063k15067j75992
$$ 7097280 7058489 6894438 6627297 6325414 6497724 6364522 5831073 5391010 5175943 4999951
2060D999951J48878k39894j15245q9430k37093m25830j43846K5867N9448k34277
$$ 4999951 5148829 4908935 4793690 4704260 4467167 4041337 3897491 3923358 3982806 3748529
2050C748529l68211j91842K04537n12292k84664M6468j88711J19832q6140J04273
$$ 3748529 3380318 3188476 3393013 2880721 2596057 2642525 2453814 2573646 2487506 2591779
2040B591779J15306k26706O4890k02415j32583k20201K06465o4029L73964J66680
$$ 2591779 2707085 2480379 2545269 2342854 2210271 1990070 2196535 2132506 2506470 2673150
2030B673150m05196k41334q7682N8181K44406p2969l55742l16892J71336M59362
$$ 2673150 2267954 2026620 1938938 1997119 2241525 2168556 1812814 1495922 1667258 2126620
2020B126620k44269j78351j1337k77824K84170J75527m51117l20207J3415N47883
$$ 2126620 1882351 1704000 1692663 1414839 1699009 1874536 1423419 1103212 1116627 1664510
2010A664510J04959L0597m76824j29781J39244j17552n8658r7474J23856m31722
$$ 1664510 1769469 1800066 1323242 1193461 1332705 1215153 1156495 1059021 1182877 751155
2000G51155j07777K7901J65492K15454k0314K8760k44942l38090M41613J71660
$$ 751155 643378 671279 836771 1052225 1031911 1060671 815729 477639 919252 1090912
1990A090912l09855j56693O1142j97851k29118n4648p8973L57318L0378K42160
$$ 1090912 781057 624364 685506 487655 258537 203889 124916 482234 512612 754772
1980G54772j10856P1663P1260K72954o2843k82392j34009k23285L2500O5281k53662
$$ 754772 643916 715579 786839 1059793 996950 714558 580549 357264 389764 455045 201383
1969B01383M449m50846j12418K52124K60175J11267J56629k47795M57563k31273
$$ 201383 205832 -245014 -357432 -105308 154867 266134 422763 174968 632531 401258
1959D01258k07475l63024J27957O76816M3048k18308o0310K08832j63531J47046
$$ 401258 193783 -169241 -41284 635532 678580 460272 399962 608794 445263 592309
1949E92309k97573J71581j50699j71513K82204k73433K10425K866j21819J17194
$$ 592309 294736 466317 315618 144105 426309 152876 363301 366167 244348 361542
1939C61542l9210J56019M6615l21443l43349L8940M80087K20977J13053J53235
$$ 361542 322332 478351 524966 203523 -139826 -100886 379201 600178 713231 866466
1929H66466n64950n6808m071k25913j05847K03081L12990J97262l1531j31587
$$ 866466 301516 244708 240637 14724 -91123 111958 424948 622210 590679 459092
1919D59092J27170j85040n51009R3357r239J99479K32396J25710n9630j35820
$$ 459092 586262 401222 -149787 -56430 -65669 133810 366206 491916 432286 296466
1909B96466k02408J89313L6392j35073j37397J94124K86885j38304k25538J25155
$$ 296466 94058 283371 319763 184690 47293 241417 528302 389998 164460 289615
1899B89615k24022L38891q5803k21940L17621k32306J68055k55906J1124k86953
$$ 289615 65593 404484 318681 96741 414362 182056 350111 94205 105329 -181624
1889a81624R6204J33203j51906l1878J14216r3535J10588K83334m8039l81048
$$ -181624 -85420 47783 -104123 -136001 -21785 -115320 -4732 278602 230563 -150485
1879a50485L52277L34354l81773L3505J14203j06066j13963j66020J81610K25848
$$ -150485 201792 536146 154373 187878 302081 196015 82052 -83968 97642 323490
1869C23490m98701j57874J67069k79060j23279J39635L47765K9879p1204K12134
$$ 323490 -175211 -333085 -166016 -445076 -568355 -428720 -80955 -51076 -122280 89854
1859H9854p7415m6240j49304q1321Q3655J74604K38120O8155k01402j23468L6782
$$ 89854 12439 -33801 -183105 -264426 -180771 -6167 231953 300108 98706 -24762 12020
1848A2020P6421K30677J67118K68152m706j57476J44506O7868j72508p72033j92728
$$ 12020 88441 319118 486236 754388 749682 592206 736712 804580 632072 -139961 -332689
1837c32689K43271k6375J37589j91846j91379M06261p2203O6053K82965r4915
$$ -332689 -89418 -115793 21796 -170050 -361429 44832 -27371 38682 321647 226732
1827B26732L15914J55200K7778l60032n09049N5236j18900P4484k00328K46382
$$ 226732 542646 697846 725624 365592 -143457 -88221 -207121 -132637 -332965 -86583
1817h6583o04029K0455J71518J82876J20504l09080K190l54955K92128M37937
$$ -86583 -690612 -670157 -498639 -315763 -195259 -504339 -502149 -857104 -564976 -127039
1807a27039P5893k80022P4524L33851L7400k9378J04813l52655o0947k25742q535
$$ -127039 -51146 -331168 -256644 77207 114607 85229 190042 -162613 -223560 -449302 -457837
1796d57837K8116l03968K19617M02908L43506l27621K46195K25241m27197j60208
$$ -457837 -429721 -733689 -514072 -111164 232342 -95279 150916 376157 -51040 -211248
1786b11248J13303J74533j53665Q3671l17669m87365K29713J007664j06428k85254
$$ -211248 -97945 76588 -77077 6594 -311075 -798440 -568727 438937 332509 47255
1776D7255j97810l33104K40379M59609j08171n77509l85769L03122j23216R2979
$$ 47255 -150555 -483659 -243280 216329 108158 -469351 -855120 -551998 -675214 -582235
1766e82235N300o2348M18619K02173m38207J51064L78925m19433l70187L30688
$$ -582235 -576935 -639283 -220664 -18491 -456698 -305634 73291 -346142 -716329 -385641
1756c85641J90776N4151L71320j10707k72706N5591n7820j14717K98650M167j03573
$$ -385641 -194865 -140714 230606 119899 -152807 -97216 -155036 -269753 28897 33064 -70509
1745g0509l7409M3543J06789L21742j89927m11274L15187J5325k36587k9039L27506
$$ -70509 -107918 -64375 42414 364156 174229 -237045 78142 93467 -143120 -172159 155347
1734A55347j43127j93464j56150l07779N62596j22124n2994L19868l97624l82656
$$ 155347 12220 -181244 -337394 -645173 -82577 -204701 -257695 62173 -335451 -718107
1724g18107L35357n7843J39619J413N50956J45726m76812q65732J83566K93555
$$ -718107 -382750 -440593 -300974 -299561 251395 397121 -79691 -945423 -761857 -468302
1714d68302J56416l17099N32611L30350n29397K10773J47886r7995l03877k44009
$$ -468302 -311886 -628985 -96374 233976 -295421 -84648 63238 -34757 -338634 -582643
1704e82643N60417L63927k00796Q7845l80251k29193J65130K43861m45246L74112
$$ -582643 -22226 341701 140905 228750 -151501 -380694 -215564 28297 -416949 -42837
1694d2837M00530l51761l75987J13766J03939O3013m7910j22773N7922J99540
$$ -42837 357693 5932 -370055 -256289 -152350 -89337 -137247 -260020 -202098 -2558
1684b558k93066q1335j99934l40659K20891l5937L15937J88797n7768J70603J12939
$$ -2558 -295624 -376959 -576893 -917552 -696661 -732598 -416661 -227864 -285632 -115029 -2090
1673b090J6178k57278L48952j26053J9466M8972k24739L49548J35414J11701Q7480
$$ -2090 14088 -243190 105762 -20291 -825 48147 -176592 172956 308370 420071 507551
1662E07551k38162j36034l29730j63086j22429k46167L36709L21966m2547K89728
$$ 507551 269389 133355 -196375 -359461 -481890 -728057 -391348 -69382 -111929 177799
1652A77799L05265o42618m93634K90167k49359j61584P96642K07493J53709k2401
$$ 177799 483064 -159554 -653188 -363021 -612380 -773964 22678 230171 383880 361479
1642C61479K0600j96746k22235o4694k03139R2988J29752J97752p8508o9391Q9832
$$ 361479 382079 185333 -36902 -101596 -304735 -211747 -81995 115757 37249 -32142 57690
1631E7690k24124l7521k125k1176J84393j7378l0381k90808J86438K16385k60827
$$ 57690 -166434 -203955 -206080 -227256 -42863 -60241 -90622 -381430 -194992 21393 -239434
1620b39434j75362K61645j44164m9672K42104n3194j81924r9830J31886k9696
$$ -239434 -414796 -153151 -297315 -346987 -104883 -158077 -340001 -439831 -307945 -337641
1610c37641L5577M75311j71791P8290l3690k32088K43296k4724q0922j596l9267
$$ -337641 -302064 173247 1456 79746 46056 -186032 57264 32540 -48382 -49978 -89245
1599h9245m5701K15929p118m06840M86231j65266J94717J01789j55045l13064
$$ -89245 -134946 80983 73865 -332975 153256 -12010 182707 284496 129451 -183613
1589a83613J26857k94233k51032K42123p6296p0793j8497J24801J65993P1722
$$ -183613 -56756 -350989 -602021 -359898 -436194 -506987 -525484 -400683 -234690 -162968
1579a62968N9117M99689J95851m72094m29844L03608K55629L4884n50059k10715
$$ -162968 -103851 395838 591689 119595 -310249 -6641 248988 283872 -266187 -476902
1569d76902p4416O1785m5553K08889k26073q8073K39107J3198J20996j46613M8627
$$ -476902 -551318 -489533 -535086 -326197 -552270 -640343 -401236 -388038 -267042 -413655 -365028
1558c65028L70363l8878q4759m2946m8358l7334K47533l9640l39822j4571K69317
$$ -365028 5335 -33543 -118302 -161248 -209606 -246940 593 -39047 -378869 -393440 -124123
1547a24123j64947k82145J07347L53915K12603J66772k91137K00724j35177l46456
$$ -124123 -289070 -571215 -463868 -109953 102650 269422 -21715 179009 43832 -302624
1537c02624L49860L0830L4573Q520o67078n5150N58579M5234k38610M30848J2511
$$ -302624 47236 78066 112639 121159 -545919 -601069 -42490 2744 -235866 194982 207493
1526B07493p1353m44309l5339m3525n8615L32105K7397m5118l89447J91774q4107
$$ 207493 136140 -308169 -343508 -387033 -445648 -113543 -86146 -131264 -520711 -328937 -413044
1515d13044p0864M40684J9771J48124k35320k4488L7042k9241K55954J87078l10772
$$ -413044 -483908 -43224 -23453 124671 -110649 -135137 -98095 -127336 128618 315696 4924
1504D924l66973J62013K02231m14443M78088J91507l61461J04448j67614j7842
$$ 4924 -362049 -200036 2195 -412248 65840 257347 -104114 334 -167280 -185122
1494a85122j98230j3293J41861k97805K4448J87761K0276Q1714Q68K48460J590
$$ -185122 -383352 -396645 -254784 -552589 -528141 -340380 -320104 -238390 -237522 10938 12528
1483A2528p7317j71252j44817M3956L71446j54979j16011j64668M37018k44423
$$ 12528 -64789 -236041 -380858 -336902 34544 -120435 -236446 -401114 35904 -208519
1473b08519L9979M66355m35218m24255k06057J39015J89185p3705J96189K12616
$$ -208519 -168540 297815 -137403 -561658 -767715 -628700 -439515 -513220 -317031 -104415
1463a04415J29721m7448l10397j22829M42862L94178j0002j98654j78123J34543
$$ -104415 25306 -22142 -332539 -455368 -12506 381672 371670 173016 -5107 129436
1453A29436l88786L37180K88053l56076l0557J14106j4517k27837j6696k37124
$$ 129436 -259350 77830 365883 9807 -20750 93356 78839 -148998 -165694 -402818
1443d02818J10136K52566J07202j14220l24289p0434j93236L23613O4572l51969
$$ -402818 -292682 -40116 67086 -47134 -371423 -441857 -635093 -311480 -246908 -598877
1433e98877M8381M18955K63149k89381k88107j69664O1836N41378L5822l90005
$$ -598877 -550496 -131541 131608 -157773 -445880 -615544 -553708 -12330 23492 -366513
1423c66513L93639o36806P7534r1353N78718K7510l70542L56228k43594k26457
$$ -366513 27126 -609680 -532146 -623499 -44781 -17271 -387813 -31585 -275179 -501636
1413e01636K80425Q6643O26984r4789l21497j67026J32444j33853K40963k12230
$$ -501636 -221211 -134568 492416 397627 76130 -90896 41548 -92305 148658 -63572
1403f3572k08341K95868R7943j32748j62277K4629j31258j8664j15972J05194
$$ -63572 -271913 23955 121898 -10850 -173127 -148498 -279756 -298420 -414392 -309198
1393c09198m4782O0854O92758p9691m02458j62214j78167J16924P2683J49572
$$ -309198 -353980 -293126 399632 319941 -82517 -244731 -422898 -305974 -233291 -83719
1383h3719n0624q6269k43361K14123L2277Q1350L0073J28833j64831J00778j55167
$$ -83719 -134343 -220612 -463973 -249850 -217573 -136223 -106150 22683 -142148 -41370 -196537
1372a96537l9378m76855K26388N00738J49664l52951j4705K04312l2602k26029
$$ -196537 -235915 -712770 -486382 14356 164020 -188931 -203636 676 -31926 -257955
1362b57955L13311k18000k05758L06398m1506k38500K37913j67193k26792K84986
$$ -257955 55356 -162644 -368402 -62004 -103510 -342010 -104097 -271290 -498082 -213096
1352b13096k57415J08757K79614M0817K01626j57136m44561N0433J74382j34110
$$ -213096 -470511 -361754 -82140 -41323 160303 3167 -441394 -390961 -216579 -350689
1342c50689K13021l67255n0976L19017K00139r321j74443l45063N66037k47372
$$ -350689 -137668 -504923 -555899 -236882 -36743 -46064 -220507 -565570 467 -246905
1332b46905K0503R7944J449q4226J97394J54890j34626k96168M4743N6715m6050
$$ -246905 -226402 -128458 -127009 -211235 -13841 141049 6423 -289745 -245002 -188287 -234337
1321b34337L36937j38953K69870m0297K51666l03206j93518k34262L915K37112
$$ -234337 102600 -36353 233517 193220 444886 141680 -51838 -286100 -282185 -45073
1311d5073m00365j4559J90305k76503r4413J59083M31923L3180l0489j81168j77457
$$ -45073 -445438 -459997 -269692 -546195 -640608 -481525 -49602 -16422 -46911 -228079 -405536
1300d05536j76531K15954k0291Q3427o8841j31089M96497l4463n7867L1707J38505
$$ -405536 -582067 -366113 -386404 -302977 -371818 -502907 -6410 -40873 -98740 -67033 71472
1289G1472k67132l12520L59443j07835k12002N11520j60018j19829m41467k38053
$$ 71472 -195660 -508180 -148737 -256572 -468574 42946 -117072 -236901 -678368 -916421
1279i16421R11658K61271k86023m32706l3529K43937k1994J8014K31225p2016
$$ -916421 -4763 256508 -29515 -462221 -495750 -251813 -273807 -255793 -24568 -96584
1269i6584m6633J96869O4055J7238M32939l69316j68844k83876L2612J61681k65368
$$ -96584 -143217 53652 117707 134945 567884 198568 29724 -254152 -221540 -59859 -325227
1258c25227O6857o798R4328J16408j92061N8203j8021j66809J58864M8618o8038
$$ -325227 -258370 -265168 -170840 -54432 -246493 -188290 -206311 -373120 -214256 -165638 -233676
1247b33676K8893j6026J50902L36964j66760k50442P355m27596j12131N38634
$$ -233676 -204783 -220809 -69907 267057 100297 -150145 -142790 -570386 -682517 -143883
1237a43883K32654R809J89999l23601J29371k79974j03462j7839O5901K12039
$$ -143883 88771 98580 288579 -35022 94349 -185625 -289087 -306926 -241025 -28986
1227b8986l7415m51309N899L02903j54873O7997L81238k61066n7127M40494r5347
$$ -28986 -66401 -517710 -511811 -208908 -363781 -295784 85454 -175612 -232739 207755 112408
1216A12408n59192P3949P0581P3171K90815J35690O6559l03290l51048N9834K98477
$$ 112408 -446784 -372835 -302254 -229083 61732 197422 263981 -39309 -390357 -330523 -32046
1205c2046J55000j51405J51846j44436k04778N9639m3323K22894j23618J23468
$$ -32046 122954 -28451 123395 -21041 -225819 -166180 -209503 13391 -110227 13241
1195A3241k86017M27788L68648l73871j86071J21672j27272n24676n238J48790
$$ 13241 -272776 155012 523660 149789 -36282 85390 -41882 -566558 -571796 -423006
1185d23006K20097L69974j88319k64002n4567k62551K48204K38642k7094P510
$$ -423006 -202909 167065 -21254 -285256 -339823 -602374 -354170 -115528 -142622 -135112
1175a35112R742K19733M3022m9504r1755k68847J33797M34534k06634j40224R4650
$$ -135112 -125370 94363 137385 87881 -3874 -272721 -138924 295610 88976 -51248 43402
1164D3402N8092j81885M32690N906r1789k27056j34648l15031L09245J94389L04397
$$ 43402 101494 -80391 352299 358205 266416 39360 -95288 -410319 -101074 93315 397712
1153C97712j97115k42123r8390k01160k24721J10446K80184l61498J83556L4935
$$ 397712 200597 -41526 -139916 -341076 -565797 -455351 -175167 -536665 -353109 -318174
1143c18174L30302J41061k69086j19667j29278L38102j26565k10956K70269k42066
$$ -318174 12128 153189 -115897 -235564 -364842 -26740 -153305 -364261 -93992 -336058
1133c36058j50408K63376j40897J81968K85949O27099k73360l55348J42800l60453
$$ -336058 -486466 -223090 -363987 -182019 103930 731029 457669 102321 245121 -115332
1123a15332j39709J17469M61627k27910k13248j2676j0254q0044J35170L33649
$$ -115332 -255041 -137572 324055 96145 -117103 -129779 -140033 -220077 -84907 248742
1113B48742l59184k50132K73794J60514J79836j44509j33929k741n3143j23233
$$ 248742 -110442 -360574 -86780 73734 253570 109061 -24868 -27609 -80752 -203985
1103b03985J51075l34472J48926L10618M6959K2444l9546L872k59044N6081j44250
$$ -203985 -52910 -387382 -238456 72162 119121 141565 102019 105891 -153153 -97072 -241322
1092b41322j73930M51330j36632l1571K57665m59544J03035k1239M20504r3849
$$ -241322 -415252 36078 -100554 -132125 125540 -334004 -230969 -252208 168296 74447
1082G4447L6097n7699l49535J55727K50169J90133l67347p0769o354j44733O7594
$$ 74447 110544 52845 -296690 -140963 109206 299339 -68008 -138777 -145131 -289864 -222270
1071b22270J59102o2710P0534j3379p8737m0122l54395j54061J58668J67668K09186
$$ -222270 -63168 -125878 -55344 -68723 -147460 -187582 -541977 -696038 -537370 -369702 -160516
1060a60516J11293j65883L93549J36044q8290k65812o1178J04689k42556N2891
$$ -160516 -49223 -215106 178443 314487 226197 -39615 -100793 3896 -238660 -185769
1050a85769R7189r3477r1697N83022K16315j27600j18138o7630k23908k5384n3441
$$ -185769 -88580 -182057 -273754 309268 525583 397983 279845 212215 -11693 -37077 -90518
1039i0518R825l57633P3766L42362M45843k95973j76606K7490K41789l2431r0990
$$ -90518 -80693 -438326 -364560 -22198 423645 127672 -48934 -21444 220345 187914 96924
1028I6924n1753k15201j73096K21977l369K38527j06107l71366j22553J21173
$$ 96924 45171 -170030 -343126 -121149 -124518 114009 7902 -363464 -486017 -364844
1018c64844J29234K92865m5111l0543O4635k79100k59415j22901J77357j17234
$$ -364844 -235610 57255 12144 -18399 46236 -232864 -492279 -615180 -437823 -555057
1008e55057K99423M6816j30757j80203J90459N89476n6587l11249M29836J88578
$$ -555057 -255634 -208818 -339575 -519778 -329319 260157 203570 -107679 322157 510735
998E10735j55292m88666l23377j67277N24494L19461j11157K39154J00678r4817
$$ 510735 355443 -133223 -456600 -623877 -99383 220078 108921 348075 448753 353936
988C53936l88680k20078k73721J43055Q8590m5820K43460k0483o821k5521K8362
$$ 353936 -34744 -254822 -528543 -385488 -296898 -342718 -99258 -119741 -126562 -152083 -123721
977a23721R2870q6822j09525L36803K78796N7053j50955m7745p5209K2211N2769
$$ -123721 -30851 -117673 -227198 109605 388401 445454 294499 246754 171545 193756 246525
966B46525k49564j28888k00728m5042K68292n0893K20066j71081j87642O8262
$$ 246525 -3039 -131927 -332655 -377697 -109405 -160298 59768 -111313 -298955 -230693
956b30693L31988k20009K5417K92863k23618J19404k0575q3217J53192J7955R1095
$$ -230693 101295 -118714 -93297 199566 -24052 95352 74777 -8440 144752 162707 253802
945B53802k60003k45276N33521m5458j24970M8966j61316O4704j14484J21343
$$ 253802 -6201 -251477 282044 236586 111616 160582 -734 63970 -50514 70829
935G0829k40667J21814R3778q0466J26373k60804K164k23956j95944J82777k0685
$$ 70829 -169838 -48024 45754 -34712 91661 -169143 -166979 -390935 -586879 -404102 -424787
924d24787L19595J51882k53425L7579K56274j68732N3101J18646j998j27471J42893
$$ -424787 -105192 46690 -206735 -169156 87118 -81614 -28513 90133 88135 -39336 103557
913A03557j58165j8224L12486l28226k21226N44293L54402k97370j97650K89342
$$ 103557 -54608 -72832 239654 -88572 -309798 234495 588897 291527 93877 383219
903C83219n37067k76978n3955m958K51755j68731M12733J4593L29824k65790l90711
$$ 383219 -153848 -430826 -484781 -489739 -237984 -406715 6018 20611 350435 84645 -306066
892c06066Q6089K32651K94234J14560l09822r3846R9404J30193P1583K7787m03738
$$ -306066 -219977 12674 306908 421468 111646 17800 117204 247397 318980 346767 -56971
881e6971q4835J9566o9750K53098j007M4349J98174l34541K7509j88410M21474
$$ -56971 -141806 -122240 -191990 61108 60101 104450 302624 -31917 -4408 -192818 228656
870B28656K55059o8750k33101j95214r9387J03844L46274l8730k00888j94678
$$ 228656 483715 414965 181864 -13350 -112737 -8893 337381 298651 97763 -96915
860i6915j68752k22433K60794P4849M66706l06345j72092q7989K11332j47595
$$ -96915 -265667 -488100 -227306 -152457 314249 7904 -164188 -252177 -40845 -188440
850a88440j4898K85651k06204L40539l37098j71331K32750K57649K96963l97422
$$ -188440 -203338 82313 -123891 216648 -120450 -291781 -59031 198618 495581 98159
840I8159k48812J40227L00151K13929J07593p3511n11115j00853K24053k57104
$$ 98159 -150653 -10426 289725 503654 611247 537736 26621 -74232 149821 -107283
830a07283L12612M82788l04094J15389J2609l81691Q0118l54991k94702J19391
$$ -107283 205329 688117 384023 499412 512021 130330 210448 -144543 -439245 -319854
820c19854J83442L00175J67539M5839q2187j48741j35305M903k92673k28358j05602
$$ -319854 -136412 163763 331302 377141 294954 146213 10908 15811 -276862 -505220 -610822
809f10822J61264J03630J66622K87920J45803p8817k27563J72111L2387n8429
$$ -610822 -449558 -345928 -179306 108614 254417 175600 -51963 120148 152535 94106
799I4106R8484J63753J33105m2548o44198r9941M07545J08141j49988p4717l20030
$$ 94106 192590 356343 489448 446900 -197298 -297239 110306 218447 68459 -6258 -326288
788c26288J35321K30417P9431l19442L52748K55627k78826k19751l53684J48000
$$ -326288 -190967 39450 118881 -200561 152187 407814 128988 -90763 -444447 -296447
778b96447L01081o5481l27445K86837j16576J03266K4901J26141L9162J65195
$$ -296447 4634 -60847 -388292 -101455 -218031 -114765 -89864 36277 75439 240634
768B40634n755m6797L2887r7211k70389L11028q9224L6793p4795k85771L15695
$$ 240634 234879 188082 220969 123758 -146631 164397 75173 111966 37171 -248600 67095
757F7095k16738L18605M74265j39954p4089P7568J5771k49572P1540q3523j57310
$$ 67095 -149643 168962 643227 503273 429184 506752 522523 272951 344491 260968 103658
746A03658j62921k96657N06263L8734p8055J03068J52609M7015k66258k49417
$$ 103658 -59263 -355920 150343 189077 111022 214090 366699 413714 147456 -101961
736a01961J34415p718R0347L62540l75316j2025N64825m89337m07570K41819L01899
$$ -101961 32454 24736 115083 477623 102307 90282 655107 165770 -241800 19 301918
725C01918k28360l91456J03315J17219j24019J73538j57920j31535N54841n2619
$$ 301918 73558 -317898 -214583 -97364 -221383 -47845 -205765 -337300 217541 164922
715A64922J24248j66076k02128L0805p8576K02668p482j72189k8416j89600o1945
$$ 164922 289170 123094 -79034 -48229 -126805 75863 68381 -103808 -132224 -321824 -383769
704c83769L18215J95372o2935J23626P5692q0001q4977J05012j57864r2174q5896
$$ -383769 -65554 129818 66883 190509 266201 186200 101223 206235 48371 -43803 -129699
693a29699j81806O76914j29932l56880M46381l74383J02843O4032j45275J1183
$$ -129699 -311505 365409 235477 -121403 324978 -49405 53438 117470 -27805 -16622
683a6622J16515k88319m6499O07954Q6179l60475j86330N6127k85123k67013K96495
$$ -16622 99893 -188426 -234925 373029 459208 98733 -87597 -31470 -316593 -583606 -287111
672b87111L99485Q4685j5571o1041K50408p2421m61685K01651J03738l12009J80777
$$ -287111 112374 197059 181488 120447 370855 298434 -163251 38400 142138 -169871 10906
661A0906M63712p0122r6889p7773J0286j70021J2020K92967k27706J70060k61109
$$ 10906 474618 404496 307607 229834 240120 70099 82119 375086 147380 317440 56331
650E6331k17228K56344R3807l34187K31235L11571q565k79426N5989Q4030K28632
$$ 56331 -160897 95447 189254 -144933 86302 397873 389308 109882 165871 249901 478533
639D78533j04428M76198l80276k94081j14278K10920r8448k30870R4353K97909
$$ 478533 374105 850303 470027 175946 61668 272588 174140 -56730 37623 335532
629C35532j92838j5099j2392n3890J58053n2759j43195k8249J77014K10726k97622
$$ 335532 142694 127595 115203 61313 219366 166607 23412 -4837 172177 382903 85281
618H5281l77065j93484L28515r9826J95447L60016J80086l4154m0935J03883j99807
$$ 85281 -291784 -485268 -156753 -256579 -61132 298884 478970 444816 403881 507764 307957
607C07957Q4133l07589j9097k14517K38830k2428K58595n4119k69034o55998O84638
$$ 307957 392090 84501 65404 -149113 89717 67289 325884 271765 2731 -653267 31371
596C1371K34517M82904j72057l24987K2113k46051j24286L33802k02332o6916
$$ 31371 265888 748792 576735 251748 273861 27810 -96476 237326 34994 -31922
586c1922K2420j09762J90296j63915l97406K06148L61211K4203K6704J00464M8129
$$ -31922 -9502 -119264 71032 -92883 -490289 -284141 77070 101273 127977 228441 276570
575B76570l33110J36855k85628m0466l5572J38088j41891N8952N65657K03886
$$ 276570 -56540 80315 -205313 -245779 -281351 -143263 -285154 -226202 339455 543341
565E43341k2201m91394q752N2712K57083K92125O0480n78422j02585j77069j01895
$$ 543341 521140 29746 20994 73706 330789 622914 683394 104972 2387 -174682 -276577
554b76577J32530K2471L17885j79882Q5956j39887J22280K01848j64676O8610
$$ -276577 -144047 -121576 196309 16427 102383 -37504 84776 286624 121948 190558
544A90558Q5369l74484J3535K94527J81066Q3376m24001L51412q2882k30811l7550
$$ 190558 275927 -98557 -85022 209505 390571 473947 49946 401358 318476 87665 50115
533E0115j05863J79635J9564p2122K10613l07036q5335K34705L13129m12359J74221
$$ 50115 -55748 123887 143451 71329 281942 -25094 -110429 124276 437405 25046 199267
522A99267j80730K30813J70393O0719k51975l54183M26093j61401J51454m36859
$$ 199267 18537 249350 419743 480462 228487 -125696 300397 138996 290450 -146409
512a46409K48083J09573l55300j65726l2048j55007M13124L04136p3674q6284
$$ -146409 101674 211247 -144053 -309779 -341827 -496834 -83710 220426 146752 60468
502F0468m0029p9043J02228j77239k2731N3329K03542J05936Q1861J93055J82002
$$ 60468 20439 -58604 43624 -133615 -156346 -103017 100525 206461 288322 481377 663379
491F63379l23522J97420L12968l22315m47178L19842P20m20454n5098K20785K9517
$$ 663379 339857 537277 850245 527930 80752 400594 401314 -19140 -74238 146547 176064
480A76064O4377K68593J19072j06257m4904r3634L4103p757J7357l45963M59380
$$ 176064 240441 509034 628106 521849 476945 383311 417414 409657 427014 81051 540431
469E40431J24274j89836O5937l63987j01718j05419K28164J92802l82713P4453
$$ 540431 664705 474869 540806 176819 75101 -30318 197846 390648 7935 82388
459H2388l583N06613j17821J42905L31478j15894J48649l63019j21960j46833
$$ 82388 78805 585418 467597 610502 941980 826086 974735 611716 489756 342923
449C42923l45095J26919J18484j24021J57092l6494q5821j48782k46052K22430
$$ 342923 -2172 124747 243231 119210 276302 239808 153987 5205 -240847 -18417
439a8417l36062j8361K78948Q4223k04411L3710P33088N9084j13648l97668k0993
$$ -18417 -354479 -372840 -93892 -9669 -214080 -180370 552718 611802 498154 100486 79493
428G9493j64136l9936K80401P1690j05127l00895j38015L07890p4951M8625j2087
$$ 79493 -84643 -124579 155822 227512 122385 -178510 -316525 -8635 -83586 -34961 -47048
417d7048n6804m87900M76246j27979J61089N4174k16404R4460L21412O2296j00091
$$ -47048 -103852 -591752 -115506 -243485 -82396 -28222 -244626 -150166 171246 233542 133451
406A33451J86247n62843J34408K83267k91537M28246m9476j89318M50171L45387
$$ 133451 319698 -243145 -108737 174530 -117007 311239 261763 72445 522616 868003
396H68003l80207m19296j94735j3730N8936k00277K78547P3873K08650O3293j35966
$$ 868003 487796 68500 -126235 -139965 -81029 -281306 -2759 71114 279764 343057 207091
385B07091K34978k28890r1641K00596o4341J13239k08000L47817r2902j35455
$$ 207091 442069 213179 121538 322134 257793 371032 163032 510849 417947 282492
375B82492K56974M04721k02760n02725J03310m132N7486j20458Q3815k43931j99525
$$ 282492 539466 944187 741427 238702 342012 337880 395366 274908 358723 114792 -84733
364h4733K53137m6114J20643M5559k6694j2575m5405K13208k9397J06101j80623
$$ -84733 168404 122290 242933 288492 261798 249223 203818 417026 387629 493730 313107
353C13107N2830r6324K45887j78589l25153J02143l44446J94136j256r6519L04824
$$ 313107 365937 269613 515500 336911 11758 113901 -230545 -36409 -37665 -134184 170640
342A70640j08344l44370m4777J56259L87490N10668m88671l08339M12911L21256
$$ 170640 62296 -282074 -326851 -170592 216898 727566 238895 -69444 343467 664723
332F64723n68688J3537M06100l79547K95689j95859J3763j14927O8898m85203
$$ 664723 96035 109572 515672 136125 431814 235955 249718 134791 203689 -281514
322b81514K03067L14087l01789K57979q1466M02753j0415l13450l51349k04225
$$ -281514 -78447 235640 -66149 191830 110364 513117 502702 189252 -162097 -366322
312c66322J90785L11154R1901k29430L94460j52317k2839k26128k88395M09844
$$ -366322 -175537 135617 227518 -1912 392548 240231 217392 -8736 -297131 112713
302A12713K42804L70021J22168k33801j49607J33255l14707L78022m61078m11526
$$ 112713 355517 725538 847706 613905 464298 597553 282846 660868 199790 -211736
292b11736k1796L19678l5509k47179M20470O5031K01979k05227j64268L2825J22285
$$ -211736 -233532 86146 50637 -196542 223928 288959 490938 285711 121443 154268 276553
281B76553L9060R6056K80709m2309j59176O3306n5193l96747k88942O03708l13519
$$ 276553 315613 411669 692378 650069 490893 554199 499006 102259 -186683 417025 103506
270A03506J59733L32727J82883j61406l71089k71253n446Q1086J38027N0283R7190
$$ 103506 263239 595966 778849 617443 246354 -24899 -30345 50741 188768 239051 336241
259C36241k610j6833l0284l22328m27341L98793K50323L4681O296o7800M8310
$$ 336241 333631 316798 286514 -35814 -463155 -64362 185961 220642 226938 159138 207448
248B07448P7875J10446j66897o4088p9136l5222l28526M41375P2897j82052l63662
$$ 207448 285323 395769 228872 164784 85648 50426 -278100 163275 236172 54120 -309542
237c09542k698M16974j11280J63350K44532m3337k48242J06515K96789k62042
$$ -309542 -312240 104734 -6546 156804 401336 357999 109757 216272 513061 251019
227B51019o7609l4805K02177R0322m20261J10960K0001r7580J73225L08366L7075
$$ 251019 183410 148605 350782 441104 20843 131803 151804 54224 227449 535815 572890
216E72890l50749k26991n3731J71988J07148j56274j1050J47255J7781L24739
$$ 572890 222141 -4850 -58581 113407 220555 64281 53231 200486 218267 543006
206E43006l29035l32586K88199o2679J18554J73329k26367K96923l48039k13683
$$ 543006 213971 -118615 169584 106905 225459 398788 172421 469344 121305 -92378
196i2378J96218j21246J82922Q9185J32926J31992k55698J11472o4621l99663
$$ -92378 103840 -17406 165516 254701 387627 519619 263921 375393 310772 -88891
186h8891J59328L53617j40868M39506j64491k45895q4011J37707j18824j07752
$$ -88891 70437 424054 283186 722692 558201 312306 228295 366002 247178 139426
176A39426M7258l20423K98207L9809l0329j37189K11367o2130J90868R09j58697
$$ 139426 186684 -133739 164468 204277 173948 36759 248126 185996 376864 377773 219076
165B19076J23533r9360M2535J56251k12019n2855M2166M9404J60102k0188R8719
$$ 219076 342609 243249 285784 442035 230016 177161 219327 268731 428833 408645 507364
154E07364J07800n83633L5984K44801J5213l7685J14169J11478K13201j05746
$$ 507364 615164 31531 67515 312316 327529 289844 404013 515491 728692 622946
144F22946j45718q0735m99986j56110O9149K63421K77365J75593J58482L4991
$$ 622946 477228 396493 -103493 -259603 -190454 72967 350332 525925 684407 719398
134G19398l0338k66455k20853J08701J32335n1572k48320j60686n8126q2319J02184
$$ 719398 689060 422605 201752 310453 442788 391216 142896 -17790 -75916 -158235 -56051
123e6051K01715k91884M82596l0523j05261j08021o3602J09424K49952l14881
$$ -56051 145664 -146220 336376 305853 200592 92571 28969 138393 388345 73464
113G3464l16852J78488M17548k68611J23623J17047l5707J60324m7750j8990l15030
$$ 73464 -243388 -64900 352648 84037 207660 324707 289000 449324 401574 382584 67554
102F7554J61032K19869J53429n00858j29137J27003N61469j66014k75088L06451
$$ 67554 228586 448455 601884 101026 -28111 98892 660361 494347 219259 525710
92E25710j84403j25008k31444P0300K99345r6208p0991j13058J5873J3213J15157
$$ 525710 341307 216299 -15145 55155 354500 258292 187301 74243 90116 103329 218486
81B18486J54516k7395j94965r1915p8083J46174o2272k12443L10424m7963o6660
$$ 218486 373002 345607 150642 58727 -19356 126818 64546 -147897 162527 114564 47904
70D7904J82979k70997K7260l8088J41570K26775J93480k746M0060J73899l18813
$$ 47904 230883 -40114 -12854 -50942 90628 317403 510883 508137 548197 722096 403283
59D03283j8632K35273j09086l41898r6417J89726J29199k27138n6479R2520P179
$$ 403283 384651 619924 510838 168940 72523 262249 391448 164310 107831 200351 207530
48B07530P0030r087J11413J66287k38493m9873R6275j32794Q5078J17885j12243
$$ 207530 277560 268473 379886 546173 307680 257807 354082 221288 306366 424251 312008
37C12008k32717k2296J74619k42958j68179L24710P1616j14107O4206M3550m9914
$$ 312008 79291 56995 231614 -11344 -179523 145187 216803 102696 166902 210452 160538
26A60538j02776O0442L01564j40120r3909N4524K37919p6875k39500j41645J83557
$$ 160538 57762 118204 419768 279648 185739 240263 478182 401307 161807 20162 203719
15B03719l6109R3780P5882K88253j86558p8345K51243k57134M9083j35365j11707
$$ 203719 167610 261390 337272 625525 438967 360622 611865 354731 403814 268449 156742
4A56742j09740Q7246J77707j80940
$$ 156742 47002 134248 311955 131015
0A31015
$$ 131015
$$ Imaginary data points
##PAGE= N=2
##DATA TABLE= (X++(I..I)), XYDATA
16383b798291j75902Q8273J18948j32834K4623J45394J1061k35359J24338K54112
$$ -2798291 -2974193 -2885920 -2766972 -2899806 -2875183 -2729789 -2718728 -2954087 -2829749 -2575637
16373b575637J31560L8021J94460o8125l6461J28310n0977k1280k21099l13012
$$ -2575637 -2444077 -2406056 -2211596 -2279721 -2316182 -2187872 -2238849 -2260129 -2481228 -2794240
16363b794240J89641M65411L3330n4375r6145K07483R1652j24033K09533P922
$$ -2794240 -2604599 -2139188 -2105858 -2160233 -2256378 -2048895 -1957243 -2081276 -1871743 -1863821
16353a863821k87884k40929M14198L98018Q0584k39550q8295n3464L15721K1268
$$ -1863821 -2151705 -2392634 -1978436 -1580418 -1499834 -1739384 -1827679 -1881143 -1565422 -1544154
16343a544154J88597J00889J01244m0853K47169k8285j04998J5572k8585n557
$$ -1544154 -1355557 -1254668 -1153424 -1194277 -947108 -975393 -1080391 -1064819 -1093404 -1098961
16333a098961j65336o104k008M08507L04198k88375N0683J37933j84056J65079
$$ -1098961 -1264297 -1270401 -1272409 -863902 -559704 -848079 -797396 -659463 -843519 -678440
16323f78440M7109j04495P7094M8085m2634N8539m5335J14707L8645J71024K94327
$$ -678440 -631331 -735826 -658732 -610647 -653281 -594742 -640077 -525370 -486725 -315701 -21374
16312b1374l26419j41401L48532K44480J52375j25083k65988k52116k37344j9973
$$ -21374 -347793 -489194 -140662 103818 256193 131110 -134878 -386994 -624338 -644311
$$ [...]
##END NTUPLES=NMR SPECTRUM
##END=
