##TITLE=1H_EC-3269(22)
 CDCl3
 8 sc, 
 17.11.2021
##JCAMPDX= 6.0         $$ Bruker NMR JCAMP-DX V2.0
##DATA TYPE= NMR SPECTRUM
##DATA CLASS= NTUPLES
##ORIGIN= UXNMR, Bruker Analytische Messtechnik GmbH
##OWNER= root
$$ XWIN-NMR		Version 3.5
$$ Thu Nov 18 11:24:00 2021 Russian Standard Time (UT+4h)  she@DPX200
##.OBSERVE FREQUENCY= 200.131346
##.OBSERVE NUCLEUS= ^1H
##.ACQUISITION MODE= SIMULTANEOUS
##.ACQUISITION SCHEME= undefined
##.AVERAGES= 8
##.DIGITISER RES= 18
##SPECTROMETER/DATA SYSTEM= spect
##.PULSE SEQUENCE= zg30
##.SOLVENT NAME= CDCl3
##.SHIFT REFERENCE= (INTERNAL, CDCl3, 0, 15.7271)
##AUDIT TRAIL= $$ (NUMBER, WHEN, WHO, WHERE, WHAT)
$$ ##TITLE= Audit trail, XWIN-NMR		Version 3.5
$$ ##JCAMPDX= 5.01
$$ ##ORIGIN= Bruker BioSpin GmbH
$$ ##OWNER= she
$$ F:/spectra/data/she/nmr/H-F/1/pdata/1/auditp.txt
$$ ##AUDIT TRAIL=  $$ (NUMBER, WHEN, WHO, WHERE, WHAT)
(   1,<2021-11-18 11:21:40.50 +0400>,<she>,<DPX200>,
      <created by zg, POWCHK disabled, PULCHK disabled
       configuration hash MD5:
       00 E9 B6 7A A2 85 ED C7 34 08 36 98 17 FE 4E 26
       data hash MD5: 16K
       34 60 49 01 74 FB E5 A6 A5 86 3F F4 45 F6 DA 79>)
(   2,<2021-11-18 11:21:42.82 +0400>,<she>,<DPX200>,
      <Start of raw data processing
       efp BC_mod = 2 LB = 0.24 FT_mod = 6 PKNL = 1 PHC0 = -15513.92 PHC1 = 5.600809 SI = 16K 
       data hash MD5: 16K
       EF 23 D2 FD 9E B5 29 EB 95 DC A8 82 1E 56 E1 DF>)
(   3,<2021-11-18 11:23:11.37 +0400>,<she>,<DPX200>,
      <pk PHC0 = -3.075985 PHC1 = 10.2 
       data hash MD5: 16K
       9E 9C 7E 4E D6 4C 06 8D 91 15 65 64 7E BE EE DE>)
(   4,<2021-11-18 11:23:15.21 +0400>,<she>,<DPX200>,
      <abs ABSG = 5 
       data hash MD5: 16K
       82 9A C5 50 AE A1 31 C7 E8 AB 07 C1 5D 30 4E B9>)
$$ ##END=
$$ 
$$ hash MD5
$$ 6B D6 DE 08 B8 36 58 18 80 AA CF 42 E7 5E A1 0C
##$RELAX= 
##$RELAX= 
##$RELAX= 
##$RELAX= 
##$RELAX= 
##$RELAX= 
$$ Bruker specific parameters
$$ --------------------------
##$DU= <F:/spectra>
##$EXPNO= 1
##$NAME= <H-F>
##$PROCNO= 1
##$TYPE= <nmr>
##$USER= <she>
##$AMP= (0..31)
100 100 100 100 100 100 100 100 100 100 100 100 100 100 100 100 100 100 
100 100 100 100 100 100 100 100 100 100 100 100 100 100 
##$AQSEQ= 0
##$AQ_mod= 1
##$AUNM= <au_zg>
##$AUTOPOS= <>
##$BF1= 200.13
##$BF2= 200.13
##$BF3= 200.13
##$BF4= 200.13
##$BF5= 200.13
##$BF6= 200.13
##$BF7= 200.13
##$BF8= 200.13
##$BYTORDA= 1
##$CFDGTYP= 0
##$CFRGTYP= 5
##$CHEMSTR= <none>
##$CNST= (0..31)
1 1 145 1 1 1 1 1 1 1 1 1 1 1 1 1 1 1 1 1 1 1 1 1 1 1 1 1 1 1 1 1 
##$CPDPRG= <>
##$CPDPRG1= <>
##$CPDPRG2= <>
##$CPDPRG3= <>
##$CPDPRG4= <mlev>
##$CPDPRG5= <mlev>
##$CPDPRG6= <mlev>
##$CPDPRG7= <mlev>
##$CPDPRG8= <mlev>
##$CPDPRGB= <>
##$CPDPRGT= <>
##$D= (0..31)
0 1.2 0 0 0 0 0 0 0 0.06 0 0.03 0 0 0 0 0.0002 0 0 0 0 0 0 0 0 0 0 0 0 
0 0 0 
##$DATE= 1637220099
##$DBL= (0..7)
120 120 120 120 120 120 120 120 
##$DBP= (0..7)
150 150 150 150 150 150 150 150 
##$DBP07= 0
##$DBPNAM0= <>
##$DBPNAM1= <>
##$DBPNAM2= <>
##$DBPNAM3= <>
##$DBPNAM4= <>
$$ [...]
##$SUBNAM2= <"">
##$SUBNAM3= <"">
##$SUBNAM4= <"">
##$SUBNAM5= <"">
##$SUBNAM6= <"">
##$SUBNAM7= <"">
##$SUBNAM8= <"">
##$SUBNAM9= <"">
##$SW= 18.0517287032376
##$SWIBOX= (0..15)
0 0 2 0 0 0 0 0 0 0 0 0 0 0 0 0 
##$SW_h= 3612.71676300578
##$TD= 16384
##$TD0= 1
##$TE= 0
##$TE2= 300
##$TE3= 300
##$TEG= 300
##$TL= (0..7)
0 120 120 120 120 120 120 120 
##$TP= (0..7)
150 150 150 150 150 150 150 150 
##$TP07= 0
##$TPNAME0= <>
##$TPNAME1= <>
##$TPNAME2= <>
##$TPNAME3= <>
##$TPNAME4= <>
##$TPNAME5= <>
##$TPNAME6= <>
##$TPNAME7= <>
##$TPOAL= (0..7)
0.5 0.5 0.5 0.5 0.5 0.5 0.5 0.5 
##$TPOFFS= (0..7)
0 0 0 0 0 0 0 0 
##$TUNHIN= 0
##$TUNHOUT= 0
##$TUNXOUT= 0
##$USERA1= <user>
##$USERA2= <user>
##$USERA3= <user>
##$USERA4= <user>
##$USERA5= <user>
##$V9= 5
##$VALIST= <valist>
##$VCLIST= <CCCCCCCCCCCCCCC>
##$VD= 0
##$VDLIST= <DDDDDDDDDDDDDDD>
##$VPLIST= <PPPPPPPPPPPPPPP>
##$VTLIST= <TTTTTTTTTTTTTTT>
##$WBST= 1024
##$WBSW= 4
##$XGAIN= (0..3)
0 0 0 0 
##$XL= 0
##$YL= 0
##$YMAX_a= 241782
##$YMIN_a= -307196
##$ZGOPTNS= <>
##$ZL1= 120
##$ZL2= 120
##$ZL3= 120
##$ZL4= 120
##$ABSF1= 15.71934
##$ABSF2= -2.332509
##$ABSG= 5
##$ABSL= 3
##$ALPHA= 0
##$AQORDER= 0
##$ASSFAC= 0
##$ASSFACI= 0
##$ASSFACX= 0
##$ASSWID= 0
##$AUNMP= <proc_1d>
##$AZFE= 0.1
##$AZFW= 0.1
##$BCFW= 0
##$BC_mod= 2
##$BYTORDP= 0
##$COROFFS= 0
##$CY= -3
##$DATMOD= 1
##$DC= 0
##$DFILT= <>
##$DTYPP= 0
##$F1P= 0
##$F2P= 0
##$FCOR= 1
##$FTSIZE= 16384
##$FT_mod= 6
##$GAMMA= 0
##$GB= 0
##$INTBC= 1
##$INTSCL= 0
##$ISEN= 128
##$LB= 0.24
##$LEV0= 0
##$LPBIN= 0
##$MAXI= 10000
##$MC2= 0
##$MEAN= 0
##$ME_mod= 0
##$MI= 1.114404
##$NCOEF= 0
##$NC_proc= -7
##$NLEV= 6
##$NOISF1= 3.799351
##$NOISF2= 2.8
##$NSP= 0
##$NTH_PI= 0
##$NZP= 0
##$OFFSET= 15.72706
##$PC= 1
##$PHC0= -15517
##$PHC1= 15.80081
##$PH_mod= 1
##$PKNL= yes
##$PPARMOD= 0
##$PSCAL= 0
##$PSIGN= 0
##$REVERSE= no
##$SF= 200.13000490172
##$SI= 16384
##$SIGF1= 3
##$SIGF2= 2
##$SINO= 5.538805
##$SIOLD= 16384
##$SREGLST= <1H.CDCl3>
##$SSB= 0
##$STSI= 16384
##$STSR= 0
##$SW_p= 3612.71676300578
##$SYMM= 0
##$S_DEV= 0
##$TDeff= 16384
##$TDoff= 0
##$TI= <>
##$TILT= no
##$TM1= 0
##$TM2= 0
##$TOPLEV= 0
##$USERP1= <user>
##$USERP2= <user>
##$USERP3= <user>
##$USERP4= <user>
##$USERP5= <user>
##$WDW= 1
##$XDIM= 16384
##$YMAX_p= 382197710
##$YMIN_p= -443292
$$ End of Bruker specific parameters
$$ ---------------------------------
##NTUPLES= NMR SPECTRUM
##VAR_NAME=  FREQUENCY,     SPECTRUM/REAL,   SPECTRUM/IMAG
##SYMBOL=    X,             R,               I
##VAR_TYPE=  INDEPENDENT,   DEPENDENT,       DEPENDENT
##VAR_FORM=  AFFN,          ASDF,            ASDF
##VAR_DIM=   16384,         16384,           16384
##UNITS=     HZ,            ARBITRARY UNITS, ARBITRARY UNITS
##FACTOR=    0.220516191357247, 1,           1
##FIRST=     3147.45665852962, 0,            0
##LAST=      -465.260104476162, 0,           0
##MIN=       -465.260104476162, -443292,     0
##MAX=       3147.45665852962, 382197710,    0
$$ Real data points
##PAGE= N=1
##DATA TABLE= (X++(R..R)), XYDATA
$$ [...]
5707A3737325p8914R6744K4636p9196p7177Q3951O4055K83386J84962K53871O84864
5696A5178507O93373N68982O81869M10346k35411q73773j210221j067961p24192
5687A3421519m38417k61938l35043k20624m0021l52986j84667k51580O0055l2473
5677A1363825m12143m29416l40573m56166m55837p6243k34029r7411k37898l53257
5667H270852J31403M9795p1502l58659k26376m00367J50509r8868l44336r9716
5657G002735j68213r2892L00J76937J70052J73182l6097O3074J31832K028j4657
5646G408281j03092k8370n2534r6074J55174l7410R918N6265k9255k78671m35071
5635F569161k66102l76187m84164j07558k62118j62922j70286p8484K8670k2346
$$ y = [13737325, 13658411, 13755155, 13779791, 13700595, 13623418, 13707369, 13771424, 14054810, 14239772, 14493643, 15178507, 15871880, 16440862, 17122731, 17533077, 17297666, 16423893, 15213672, 14145711, 13421519, 12983102, 12721164, 12386121, 12165497, 12125476, 11772490, 11587823, 11336243, 11396298, 11363825, 10951682, 10522266, 10181693, 9725527, 9269690, 9193447, 8959418, 8862007, 8624109, 8270852, 8402255, 8452050, 8380548, 8021889, 7795513, 7395146, 7545655, 7446787, 7102451, 7002735, 6834522, 6741630, 6741930, 6918867, 7088919, 7262101, 7226004, 7289078, 7420910, 7422938, 7408281, 7305189, 7276819, 7224285, 7128211, 7283385, 7245975, 7255893, 7312158, 7282903, 7004232, 6569161, 6303059, 5926872, 5442708, 5335150, 5073032, 4910110, 4739824, 4661340, 4690010, 4667664]
5625D667664j43506P3540l0609n2935O3468J03266j32295J02913J48479p5333
5615D724652j55389K724k0647j90726k36712k21165k27527k20472j34313k26354
5605C094071j91916j16817N3598k90571k6158J11192m0410J76546j20480j71902
5595B477153j23610j43669j22153J62813k8973P9967j09650o4127o5757J06075
5585B168069K45881j82886p1161l0615J36582R8823n1843q766J62152K37809Q4768
5574B788813k17862J35337K53283K70231J09542M11994N34101K14617L28927N01733
5564E330716L90973N59359O52618O49604J02571m13909r21652j030606n74244
5555D745430n43528l54257j59148J5309r7547K9654j99413k60897K92133O1227
$$ y = [4667664, 4524158, 4597698, 4567089, 4514154, 4577622, 4680888, 4548593, 4651506, 4799985, 4724652, 4569263, 4571987, 4551340, 4360614, 4123902, 3902737, 3675210, 3454738, 3320425, 3094071, 2902155, 2785338, 2838936, 2548365, 2522207, 2633399, 2592989, 2769535, 2649055, 2477153, 2353543, 2209874, 2087721, 2250534, 2221561, 2301528, 2191878, 2127751, 2061994, 2168069, 2413950, 2231064, 2159903, 2129288, 2265870, 2364693, 2312850, 2304084, 2466236, 2704045, 2788813, 2570951, 2706288, 2959571, 3229802, 3339344, 3751338, 4285439, 4500056, 4828983, 5330716, 5721689, 6281048, 6933666, 7583270, 7685841, 7271932, 6350280, 5319674, 4745430, 4201902, 3847645, 3688497, 3703806, 3606259, 3635913, 3436500, 3175603, 3467736, 3528963]
5545C528963K03113M2865j35371J73714K31879J93208k2808J55668K93986K80750
5535D945967L62397M5031k17518l24345k91271m34750j71843n33334k76035n5616
5525C048683l8013J2409K5311o7860j8637j0616k87010M3654K7162J36894K72915
5514C144892L447j04491N4899P2596K3407J55044L48016P919l9219o8501r6626
5503C501383k45459k50232j39722r8877l7987N8023r2348q8884J1363K65798m3054
5492B840004P8629K06554Q4779Q6417J26438K30283l84l20151K14287n6424m08086
5481C082346j01667J55105k86317k14172J01452J9845j10262J3002L1401j76703
5471B514030K43493J288J27558J2967q4097J71083O4028L6297J07358J64829K11223
$$ y = [3528963, 3732076, 3774941, 3639570, 3813284, 4045163, 4238371, 4215563, 4371231, 4665217, 4945967, 5308364, 5353395, 5135877, 4811532, 4520261, 4085511, 3913668, 3380334, 3104299, 3048683, 3010670, 3023079, 3048390, 2980530, 2961893, 2951277, 2664267, 2707921, 2735083, 2871977, 3144892, 3148339, 3043848, 3098747, 3171343, 3194750, 3349794, 3697810, 3705729, 3666510, 3598009, 3501383, 3255924, 3005692, 2865970, 2767093, 2729106, 2787129, 2694781, 2605897, 2617260, 2883058, 2840004, 2918633, 3125187, 3209966, 3296383, 3422821, 3653104, 3652720, 3332569, 3546856, 3490432, 3082346, 2980679, 3135784, 2849467, 2635295, 2736747, 2756592, 2646330, 2659332, 2690733, 2514030, 2757523, 2758811, 2886369, 2899336, 2815239, 2986322, 3050350, 3086647, 3194005, 3358834, 3570057]
5460C570057O0957M14019J13486Q1637J95046R2360k3374R4679M1223j95670j94126
5449D250294j1456k43910m5714l8394j39769j91388n1801J41192r6473r4390q756
5438C469435q1037r0445o3053P4413L4552O7088q2484N7331r178m2299J76117
5427C510440J06746J21598J50738m7640p4563J05992L1495k82685j09042j18516
5417C394563j97610n5520J17426k48767l88411k6856j30029N3302j36953M7382
5407B428527K06350J5928k110M0287n8906k8075j09792J31422L5026l37366L0522
5396B351813L14725j7749O8224j16923j48193m9988p9222q9941P5748m7433N5668
5385B316729o2905J06714P4836J59123N8180J59575K10543K40084r6013O4702
$$ y = [3570057, 3631014, 4045033, 4158519, 4240156, 4435202, 4527562, 4504188, 4598867, 4640090, 4444420, 4250294, 4238838, 3994928, 3949214, 3910820, 3771051, 3579663, 3527862, 3669054, 3572581, 3478191, 3469435, 3388398, 3297953, 3234900, 3309313, 3343865, 3410953, 3328469, 3385800, 3376622, 3334323, 3510440, 3617186, 3738784, 3889522, 3841882, 3767319, 3873311, 3904806, 3622121, 3513079, 3394563, 3196953, 3141433, 3258859, 3010092, 2621681, 2594825, 2464796, 2518098, 2381145, 2428527, 2634877, 2650805, 2648695, 2688982, 2630076, 2602001, 2492209, 2623631, 2658657, 2321291, 2351813, 2666538, 2648789, 2717013, 2600090, 2451897, 2401909, 2322687, 2232746, 2308494, 2261061, 2316729, 2253824, 2360538, 2435374, 2594497, 2652677, 2812252, 3022795, 3262879, 3166866, 3231568]
5375C231568L9382K3094M6492O7060j54302j28548j15987P296j7444j90939J89503
5364B997175K07116j05433j00318L39121J0717j38758q1907j22632o4244J71720
5354C112557j83343j44923m2905K42808O8141R485J52658J27436Q7049j11408
5344C317555j32297M2413J55136k90423j73532M6359r3949j1406N2383K95207
5334C207446K75784K04277R1329K80153J18972J55243r274K7325J6995k98324
5324D069926j01477O0431n5255k35163j2730l6442j20507l4679Q0340j9083j68685
5313C426676l46387K4928p5087o8688J93686k4237Q5180J75424J43854M5956P7897
5302C659202P1583L72355J78379J45889P5322P3736j48438J01644j91090l44011
$$ y = [3231568, 3270950, 3294044, 3340536, 3407596, 3253294, 3124746, 3008759, 3016055, 2998611, 2807672, 2997175, 3204291, 3098858, 2998540, 3337661, 3348378, 3209620, 3127713, 3005081, 2940837, 3112557, 2929214, 2784291, 2741386, 2984194, 3052335, 3061820, 3214478, 3341914, 3428963, 3317555, 3185258, 3227671, 3382807, 3092384, 2918852, 2965211, 2871262, 2859856, 2912239, 3207446, 3483230, 3687507, 3778836, 4058989, 4177961, 4333204, 4323930, 4351255, 4368250, 4069926, 3968449, 4028880, 3973625, 3738462, 3725732, 3689290, 3568783, 3534104, 3614444, 3595361, 3426676, 3080289, 3105217, 3030130, 2961442, 3155128, 3130891, 3216071, 3391495, 3535349, 3581305, 3659202, 3730785, 4103140, 4281519, 4427408, 4502730, 4576466, 4428028, 4529672, 4338582, 3994571]
5292C994571j98537J2708p3491p9043j28825m9605q649j96828k499m4599J6368
5281C241571O1375m4350J51476J34990L7566Q3411J96969O0529K36027J10590
5271D270154n2828K49325J70942N5313j9726k9031l2060Q6458r1359l1218J36999
5260D712969J59026M7574J8912j27631j49273J95506J25665K70805L43110K09537
5250E806200j1735J04144Q5969m6295N36708J74849m6598j33317j5829j02592
5240F351504q8928N0443j5552l65409j01962r3839J01492L21169J23154R8448
5230F380520o566N5318K08300J96629K82798M2609L64371L74073J56079P3669
5220H127800N4549j38444j5462j4606k14800k79371n53492m80557m80164k45786
$$ y = [3994571, 3796034, 3808742, 3735251, 3656208, 3527383, 3477778, 3469129, 3272301, 3269802, 3225203, 3241571, 3302946, 3258596, 3410072, 3545062, 3582628, 3666039, 3863008, 3923537, 4159564, 4270154, 4217326, 4466651, 4637593, 4692906, 4673180, 4644149, 4612089, 4698547, 4607188, 4575970, 4712969, 4871995, 4919569, 4938481, 4810850, 4661577, 4857083, 4982748, 5253553, 5596663, 5806200, 5794465, 5898609, 5984578, 5938283, 6474991, 6649840, 6603242, 6469925, 6454096, 6351504, 6262576, 6313019, 6297467, 5932058, 5830096, 5736257, 5837749, 6158918, 6282072, 6380520, 6373954, 6429272, 6637572, 6834201, 7116999, 7159608, 7523979, 7898052, 8054131, 8127800, 8182349, 8043905, 8028443, 8013837, 7799037, 7519666, 6966174, 6485617, 6005453, 5759667]
5210E759667j00169l69449q1403k02581Q46R8757j93549P6455k10842j05294o6082
5199D606356n1121O5329P3782j33953j33485J18367J79346q2102p0130j9308l8827
5188D514254J223k68519l83870k49477j20959j01324k31972l61615j96760m5747
5178B555234J76365o0102L9444j38552m08717n1259l8137j8380l73180J74661
5168A857377m7590j7272n7706j12782q7370k04954K91026L7803j28188j16245
5158A414099J76030m4332k24028L2372q9287R7703J08767J02100k7502j48048
5148A397874j28521m539O111j52551K4512J07868q7545J4167j40367j92799j989
5137H42221J38518N4953M0838J03003k19997k64833J22660J44449m1104j63867
$$ y = [5759667, 5659498, 5290049, 5208646, 5006065, 5006911, 5105668, 4912119, 4988574, 4777732, 4672438, 4606356, 4555235, 4620564, 4694346, 4560393, 4426908, 4545275, 4724621, 4642519, 4572389, 4553081, 4514254, 4515477, 4246958, 3863088, 3613611, 3492652, 3391328, 3159356, 2797741, 2600981, 2555234, 2731599, 2671497, 2710941, 2572389, 2163672, 2112413, 2074276, 2055896, 1682716, 1857377, 1809787, 1792515, 1734809, 1622027, 1534657, 1329703, 1620729, 1658532, 1530344, 1414099, 1590129, 1545797, 1321769, 1354141, 1264854, 1362557, 1471324, 1573424, 1545922, 1397874, 1269353, 1264814, 1270925, 1118374, 1142886, 1250754, 1163209, 1177376, 1037009, 844210, 842221, 980739, 1035692, 1076530, 1179533, 959536, 694703, 817363, 961812, 920708, 756841]
5127G56841M9881j27443N8744N2425l080J95396j63829m7856j53372J58196M7340
5116H23243j37785j38133M0452M9250j74005l0238J20797R5290j02164p1607L6249
5105E11349J29365j02344J17708J55609n8031j25658j12016J67974J6607J25215
5095H25778j4029N4071j84792o8133o025J5242k1895K23062l8975n1201J16627
5084H49730p1095j4740k8967j83963j78990j7777j18402J45249K23651l08960
5074B95736n954K9283m4354J49686j51684m9589J91136K40168l73855J78742J35895
5063E95210n5500p0358j09732O5206J7928o1640O351Q9249J85850Q1834k57968
5052D86430o5525J89752l1255j75373P480L766j42689j26178r1204K33774N4219
$$ y = [756841, 806722, 679279, 738023, 790448, 787368, 982764, 818935, 771079, 617707, 775903, 823243, 685458, 547325, 587777, 637027, 463022, 432784, 553581, 648871, 546707, 475100, 511349, 640714, 538370, 656078, 811687, 753656, 627998, 515982, 683956, 700563, 825778, 811749, 865820, 681028, 612895, 606870, 622112, 600217, 823279, 784304, 733103, 849730, 778635, 763895, 734928, 550965, 371975, 354198, 235796, 381045, 604696, 295736, 289782, 319065, 274711, 424397, 272713, 223124, 414260, 654428, 280573, 459315, 595210, 539710, 469352, 359620, 424826, 442754, 381114, 387465, 476714, 662564, 744398, 486430, 420905, 610657, 579402, 404029, 411509, 415275, 272586, 146408, 55204, 288978, 343197]
5041C43197j23909K1116J68454J1107L0557q2572r6510J97936j61110L6606K0578
5030C65450q936N9210n5102p2409N5931m9737J22804j20585J5103K7459p1179
5019B68009n5260N3900J57233r4149J3351J53651J07012j43367n4111k03122j3795
5008A89352n3143K50734J31847q5722k37947J6778p6257M8185p1539J60562j3990
4997B58860J5425J13321j91183J5578k8066J19777J391L80913J91498k33933p686
4986F35895j24502L4901M5443n3153j32105j16043O8766j09200J45750r9096J27407
4975D24063J44961M7938J6126j30333p1486k23465J26219n0754J16341K49452
4965F49062j52929p6532q5653M1010m86l6853O1289N689o5099L2994M5995J7035
$$ y = [343197, 219288, 240404, 408858, 419965, 450522, 367950, 271440, 469376, 308266, 344872, 365450, 356514, 415724, 360622, 288213, 344144, 294407, 417211, 296626, 311729, 339188, 268009, 212749, 266649, 423882, 329733, 343084, 496735, 603747, 460380, 406269, 203147, 189352, 136209, 386943, 518790, 433068, 195121, 211899, 135642, 183827, 112288, 272850, 258860, 274285, 387606, 196423, 212001, 183935, 303712, 305103, 686016, 877514, 643581, 635895, 511393, 546294, 591737, 538584, 406479, 290436, 359202, 250002, 395752, 296656, 424063, 569024, 616962, 633088, 502755, 431269, 207804, 334023, 283269, 399610, 649062, 496133, 419601, 333948, 374958, 374472, 337619, 398908, 404597, 339498, 372492, 418487, 435522]
4953D35522m0698J3795O8956P1536Q5975J38884l41485l7977q6472K6627J6302
4942C50965N6126J74965N0683j30514N1626o9387j21638J21178J51168j27304
4932E07868j60861L1527J36631J72782j64394k05167K00677J6774P7037K6720
4922F39594j72786m9609K05818N5418j22931J68160q7450J20931J4673J24752
4912H96570p3225j67722J21923J0435l0703p8896k0544N7907R1588k9273k5955
4901G52105K17648J95744j88689n3606J09513j04883O3285K06582p975n5778l4708
4890A099238q7854k2394R840L2354m7123l5895P2964K25938k78361J07260p7456
4879I98511n2322L70107J30844O0868J2012l25182J21791K77972r3211j90379
$$ y = [435522, 394824, 408619, 477575, 549111, 635086, 773970, 432485, 394508, 308036, 334663, 350965, 407091, 582056, 632739, 502225, 553851, 484464, 362826, 484004, 635172, 507868, 347007, 378534, 515165, 687947, 523553, 318386, 519063, 535837, 612874, 639594, 466808, 417199, 623017, 678435, 555504, 723664, 636214, 757145, 771818, 896570, 823345, 655623, 777546, 787981, 757278, 678382, 657838, 715745, 807333, 778060, 752105, 969753, 1165497, 976808, 923202, 1032715, 927832, 991117, 1197699, 1189724, 1133946, 1099238, 1011384, 988990, 998830, 1031184, 984061, 948166, 1021130, 1247068, 968707, 1075967, 998511, 946189, 1316296, 1447140, 1508008, 1520020, 1194838, 1316629, 1594601, 1501390, 1311011]
4869A311011K3976O8147R8157q4436J84188j8156J2764J13906J4236R5707l33
4858A819167J9422K46373J00744M6023N1999j21109N8694m8811M8350L2387J22445
4847B375684M4872K30441p9256p385Q9423J56006j8504j17399J89512K89297J55322
4836C308013N7396r5959p9447p6174K61804L18161Q7970J29274P3597p087K68563
4825D246111M7825Q4101K32081J81997J94578J02193K23889K30807J83955J7967
4815E745504K53863L86817J11270K73833J37199J98944Q1137K45605K96462L22211
4805H052845J46213K50490M19195K30882M42989M27094R05737N78307L26722O33130
4795A2413604R28880R17854R29201J046304J068964J167054J353679J080814J377359
$$ y = [1311011, 1334987, 1403134, 1501291, 1416855, 1601043, 1582887, 1595651, 1709557, 1723793, 1819500, 1819167, 1838589, 2084962, 2185706, 2231729, 2283728, 2162619, 2221313, 2172502, 2220852, 2253239, 2375684, 2420556, 2650997, 2571741, 2564356, 2653779, 2809785, 2791281, 2673882, 2863394, 3152691, 3308013, 3365409, 3269450, 3190003, 3113829, 3375633, 3693794, 3781764, 3911038, 3984635, 3977548, 4246111, 4293936, 4378037, 4610118, 4792115, 4986693, 5088886, 5312775, 5543582, 5727537, 5745504, 5999367, 6386184, 6497454, 6771287, 6908486, 7107430, 7188567, 7434172, 7730634, 8052845, 8199058, 8449548, 8868743, 9099625, 9542614, 9969708, 10875445, 11453752, 11780474, 12413604, 13342484, 14260338, 15189539, 16235843, 17304807, 18471861, 19825540, 20906354, 22283713]
4786B2283713J429208J575824J594864J311684J295297J068653P07015O42636
4778C1908894j5625k77774n75073n98452p57619p22981l77296n28592m59855j40866
4768B7454761J41252J86859J78111K07903N45415P44207Q50479J155782J080249
4759C2545018J190738J501459J437837J628350J749660J947437K095366K213119
4751D6308984K153903K097512J755371J426792R15713K62759l04676p71976j160725
4742E2683657j531533j894623j882118k077393k180589k035416j673630j636569
4734C7771786j665655j118724q06575q66903o94301m38838l35828j75068k90709
4725C1379185J04025K25567J11415L63626N53345R80656P36412P88736J096203
$$ y = [22283713, 23712921, 25288745, 26883609, 28195293, 29490590, 30559243, 31266258, 31908894, 31893269, 31615495, 31040422, 30441970, 29684351, 28961370, 28584074, 28055482, 27595627, 27454761, 27596013, 27782872, 27960983, 28168886, 28714301, 29458508, 30308987, 31464769, 32545018, 33735756, 35237215, 36675052, 38303402, 40053062, 42000499, 44095865, 46308984, 48462887, 50560399, 52315770, 53742562, 54658275, 54921034, 54616358, 53844382, 52683657, 51152124, 49257501, 47375383, 45297990, 43117401, 41081985, 39408355, 37771786, 36106131, 34987407, 34180832, 33313929, 32619628, 32180790, 31844962, 31669894, 31379185, 31483210, 31708777, 31820192, 32183818, 32737163, 33717819, 34454231, 35242967, 36339170]
4716C6339170Q74266N75025N02194L40495M0708n04162q75187j389991j823496
4707C4079022k134860k011484k061632j822091j503272j556496j314128j329971
4699B0345088j278282j162283j088417j028328o42203p40854q61420n31641m78649
4690A2533011n49625n78575m34764k94393l90203n00971q305l45922m05833q3453
4680H940967j89890l2315l47545k66763j08293j61736j13148l46224m79851j38550
4670F756652p144j92192j59239n4125p0168j34602n4786j62435J5962k14729M498
4659E727692k37641o9251N3982l9124q8046j52276K41640l8309m1537j60100J72796
4648E369826O0523q8337n4798n8563j9257J85932q9951j63091Q3779j498k9915
$$ y = [36339170, 37213436, 37788461, 38290655, 38631150, 38671858, 38167696, 37292509, 35902518, 34079022, 31944162, 29932678, 27871046, 26048955, 24545683, 22989187, 21675059, 20345088, 19066806, 17904523, 16816106, 15787778, 15145575, 14404721, 13543301, 13011660, 12533011, 11983386, 11404811, 10970047, 10675654, 10285451, 9784480, 9776175, 9430253, 9024420, 8940967, 8751077, 8718762, 8371217, 8104454, 7996161, 7834425, 7721277, 7375053, 6895202, 6756652, 6749508, 6557316, 6398077, 6343952, 6273784, 6139182, 6084396, 5921961, 5937923, 5723194, 5727692, 5490051, 5420800, 5474782, 5435658, 5347612, 5195336, 5436976, 5398667, 5357130, 5197030, 5369826, 5430349, 5342012, 5287214, 5228651, 5209394, 5395326, 5305375, 5142284, 5226063, 5224565, 5194650]
4637E194650m7966J22897J58328k97837q4985J5605J43548l27301r265J03298
4627D970972J51981k3828k11551q7835J56200J88790j68060m7358J63515R2254
4617E185080M592J30892J54840Q1171j87260J47812J24082l2566q390P2966j29767
4606E543452J20974M8563R132j2202j14846n7473K83461k25692j40940K88084
4596E742513j75601k6796Q003L04521k5724j07984J51988O0737R5717J14263J26463
4585F268100L25676M20254M14175M7979M41519N92398L21307O31195O94150R01903
4575A1058656J186965J086290J108293J421471J474513J511099J655111J480906
4567B1983304O9692j787566k580426k631438k113065j405594j080794r80827p44585
$$ y = [5194650, 5146684, 5269581, 5427909, 5130072, 5045087, 5060692, 5204240, 4876939, 4867674, 4970972, 5122953, 5099125, 4887574, 4799739, 4955939, 5144729, 4976669, 4929311, 5092826, 5185080, 5189672, 5320564, 5475404, 5556575, 5369315, 5517127, 5641209, 5608643, 5600253, 5673219, 5543452, 5664426, 5712989, 5722121, 5709919, 5595073, 5537600, 5821061, 5595369, 5454429, 5742513, 5566912, 5540116, 5548119, 5852640, 5826916, 5718932, 5870920, 5931657, 6027374, 6141637, 6268100, 6593776, 7014030, 7428205, 7476184, 7917703, 8510101, 8831408, 9462603, 10156753, 11058656, 12245621, 13331911, 14440204, 15861675, 17336188, 18847287, 20502398, 21983304, 22052996, 20265430, 17685004, 15053566, 12940501, 11534907, 10454113, 9473286, 8728701]
4558H728701o08826p00025l94198m55261k35247j45066j49309l66858k57950j44895
4548E271066j40480j1267k22538o1090j7435r4138k70310O1476p183j5426K1817
4537D514492k05386j21710j69247O2830J37876N4906m2975K9457k6271J33773
4527D367745j1193o4885J535j68130L5531N6405L1316k590J87295j28539j49807
4516D154683J45553q4631n8037J37136Q3034j21318n327p3030R3456r5359r6240
4505D079920m573J15163L2299j53323k9919j01680J91807J16955P2932p3478j60368
4494D085735K20762J48358J47600Q3815O5008J01818J66289J42098J83417K26160
4484E571060J80264L12484L6682L86299N96193M85277j54957m95851m86230n43983
$$ y = [8728701, 8119875, 7419850, 7025652, 6570391, 6335144, 6190078, 6040769, 5673911, 5415961, 5271066, 5130586, 5119319, 4896781, 4835691, 4818256, 4724118, 4453808, 4515284, 4508101, 4492675, 4514492, 4309106, 4187396, 4018149, 4080979, 4218855, 4273761, 4230786, 4260243, 4233972, 4367745, 4356552, 4291667, 4293202, 4125072, 4160603, 4217008, 4248324, 4245734, 4433029, 4304490, 4154683, 4300236, 4215605, 4157568, 4294704, 4377738, 4256420, 4251093, 4178063, 4271519, 4176160, 4079920, 4075347, 4190510, 4222809, 4069486, 4039567, 3937887, 4129694, 4246649, 4319581, 4246103, 4085735, 4306497, 4454855, 4602455, 4686270, 4751278, 4853096, 5019385, 5161483, 5344900, 5571060, 5751324, 6063808, 6100490, 6486789, 7082982, 7568259, 7413302, 6917451, 6431221, 5887238]
4474E887238l63804k44650k63058j71261k27069j06091r0612j65423o6531j93868
4464C994871J68043Q0205j8060p6859j32135j21419J58222R7716L2139M3736Q8934
4453D315393n4667J33000Q6670K88534J68618j94550L5748J3637J6494j43795
4443D665082l40497k26408o6278q3170p6220q5789k88669j18224K55116R633L8235
4432C682811k4093j07112j44103K5258o821m5001J19129j41004L8802O3605q5093
4421C376378o9020j28433p731K6710k0712j85483o3366N8751J1597j69271n1344
4410B778076J4395M7501J22119R5761j04663n4975L7370J97297J1615p3839O3361
4399C134018J38010J40827J22381J10379K5475j69406j04799P5004O3557q9488
$$ y = [5887238, 5523434, 5278784, 5015726, 4844465, 4617396, 4511305, 4420693, 4255270, 4188739, 3994871, 4162914, 4243119, 4225059, 4148200, 4016065, 3894646, 4052868, 4150584, 4182723, 4226459, 4315393, 4260726, 4393726, 4480396, 4768930, 4937548, 4742998, 4778746, 4792383, 4808877, 4665082, 4324585, 4098177, 4031899, 3948729, 3872509, 3786720, 3498051, 3379827, 3634943, 3644576, 3682811, 3658718, 3551606, 3407503, 3432761, 3425940, 3380939, 3500068, 3359064, 3397866, 3461471, 3376378, 3307358, 3178925, 3171194, 3197904, 3177192, 2991709, 2928343, 2987094, 2998691, 2829420, 2778076, 2792471, 2839972, 2962091, 3057852, 2953189, 2898214, 2935584, 3132881, 3144496, 3070657, 3134018, 3272028, 3412855, 3535236, 3645615, 3671090, 3501684, 3396885, 3471889, 3535446, 3445958]
4389C445958R5265J21488k76079K56007K33371k15850O4128P8912J8189Q6400
4379C907789K43051K30564K6985L1274k5282M14997L32918K5929J75746o564q1473
4368E275934j34353q462M5649j0883k9903K37J64978M8387m9857j58745k157J06197
4356E247022J1173L7711J58367N5318Q5260K8857J3452K24780J36706L6537J98244
4345F233427M30722J48530J02508K93011Q2839j3101J82728K91725J53303k7856
4335G877836J52217m8540J25363Q2311k20309q2081O0341k5041j26428j63135
4325G632534K76376n410k74831K915j00065J62084O6857j36941j5245J17182j17688
4314G607768l918J3712J32577r5078K3488K06318p760J20120J10710n9508J04195
$$ y = [3445958, 3541223, 3662711, 3386632, 3642639, 3876010, 3660160, 3724288, 3803200, 3821389, 3907789, 4150840, 4381404, 4408389, 4439663, 4414381, 4829378, 5162296, 5188225, 5363971, 5357407, 5275934, 5141581, 5133119, 5178768, 5167885, 5137982, 5138219, 5303197, 5351584, 5301727, 5142982, 5140825, 5247022, 5258195, 5295906, 5454273, 5509591, 5594851, 5623708, 5637160, 5861940, 5998646, 6035183, 6233427, 6664149, 6812679, 6915187, 7208198, 7291037, 7277936, 7460664, 7752389, 7905692, 7877836, 8030053, 7981513, 8106876, 8189187, 7968878, 7886797, 7947138, 7922097, 7795669, 7632534, 7908910, 7903500, 7628669, 7631584, 7531519, 7693603, 7760460, 7623519, 7608274, 7725456, 7607768, 7603850, 7617562, 7750139, 7655061, 7678549, 7884867, 7877107, 7997227, 8107937, 8048429, 8152624]
4303H152624R0346r4307J564L0622k24224J39612j8643k02051m2234p7920j137
4292G754252r6712K7166j85494P7253n2150J55987o1932n6996j17593K40696N9626
4281G744103k63658J83621j54292j9815J96299m9394j38520K6029m6685k0062
4271G457626J28675q873J1424J92857R8287L3450O1035M9237K32087J85158p4961
4260H366002K64808J39588l0847L7412K81325J48865J46838J75971N5073K33439
4250I818474L69736K130J95332K47803M29587J18092M14813K44895K48636N74347
4240A2663845N79350K97109L49609N04881O67562N91986O72963N80414L53884
4231A7261603N63939N44680R29036O50616O02308P60111P44495O61206N57516
$$ y = [8152624, 8242970, 8148663, 8150227, 8180849, 7956625, 8096237, 8077594, 7875543, 7833309, 7755389, 7754252, 7657540, 7684706, 7499212, 7576465, 7524315, 7680302, 7618370, 7561374, 7443781, 7684477, 7744103, 7480445, 7664066, 7509774, 7489959, 7686258, 7636864, 7498344, 7524373, 7477688, 7457626, 7586301, 7577428, 7588852, 7781709, 7879996, 7913446, 7974481, 8023718, 8255805, 8440963, 8366002, 8630810, 8770398, 8739551, 8776963, 9058288, 9207153, 9353991, 9529962, 9585035, 9818474, 10188210, 10190340, 10385672, 10633475, 11063062, 11181154, 11595967, 11840862, 12089498, 12663845, 13243195, 13540304, 13889913, 14394794, 15062356, 15654342, 16327305, 16907719, 17261603, 17825542, 18370222, 19299258, 19949874, 20552182, 21312293, 22056788, 22717994, 23275510]
4222B3275510K50908M09433L33117M66637N30590L85324M49632N26739O92321
4213B7320211P18736Q54724Q47529J064535R32155Q30608J341381J019287J138990
4204C6068156J455229J467244J410827J687210J479900J461260J704721J348808
4196D8083355J164734J165066J047470J205168R12021J012126J241450J224080
4188E7055470J198276J112120J287736J736158J808924J959900K377028K613147
4180G1148759L508522L744576M095969M725760N398522O438446P116156Q187717
4172A14364427R392784J0839539J1955010J2573935J3049472J3186834J4012362
4165A99374363J5052820J6610261J9060974K1781705K2505732J7806727M132869
$$ y = [23275510, 23526418, 23935851, 24268968, 24735605, 25266195, 25651519, 26101151, 26627890, 27320211, 28038947, 28893671, 29741200, 30805735, 31737890, 32568498, 33909879, 34929166, 36068156, 37523385, 38990629, 40401456, 42088666, 43568566, 45029826, 46734547, 48083355, 49248089, 50413155, 51460625, 52665793, 53577814, 54589940, 55831390, 57055470, 58253746, 59365866, 60653602, 62389760, 64198684, 66158584, 68535612, 71148759, 74657281, 78401857, 82497826, 87223586, 92622108, 99060554, 106176710, 114364427, 123757211, 134596750, 146551760, 159125695, 172175167, 185362001, 199374363, 214427183, 231037444, 250098418, 271880123, 294385855, 312192582, 316325451]
4158C16325451j4918925k9625796l4145595k9952090k3277755j8338768j5079130
4151A50987392j2691395j0730328q629836p066602n650800m574629l921191l147533
4143I4575078k501477k052898j805832r07675o46937l89903N6454k68782o94115
4134H5363913j366892j700657k229566k568161k660718k199023k268142k352993
4126F8017761k461434k536066k538793k344589k249640k166517j618958j491676
4118E0610088j333255j101889r93799r20950q81769n11316p83565o03741l08255
4109D3171549l70661k95762j49869m9080m6694J01264m7093j26719k1166k95653
4099D1870116o2510L1912k07408j39273j12440j22534q7483J34133L4216K18969
$$ y = [316325451, 301406526, 271780730, 237635135, 207683045, 184405290, 166066522, 150987392, 138295997, 127565669, 118935833, 111869231, 106218431, 101643802, 97722611, 94575078, 92073601, 90020703, 88214871, 87307196, 86660259, 86270356, 86326810, 86058028, 85363913, 83997021, 82296364, 80066798, 77498637, 74837919, 72638896, 70370754, 68017761, 65556327, 63020261, 60481468, 58136879, 55887239, 53720722, 52101764, 50610088, 49276833, 48174944, 47181145, 46260195, 45378426, 44867110, 44083545, 43479804, 43171549, 42800888, 42505126, 42355257, 42306177, 42259483, 42360747, 42313654, 42186935, 42165769, 41870116, 41807606, 41839518, 41632110, 41492837, 41380397, 41257863, 41170380, 41304513, 41338729, 41557698]
4089D1557698O64576J93334K79700P69802L53906N09809N88604P32825P51482
4080D6401736R10599Q04388Q00803M79184O8323L4609M4776J07662J51084J70296
4070D9973460K67188p1317l07990L38650L60207J50219P1637K2811j19064m00037
4060E0285764m21246o05327o40153o34189n43264l29711k39841l32518r3109r4938
4050D6351468l73369j78880n3748k94752n33698l19634m0469o9406k62682q3378
4040D4141452K75679L00852L50404J91745l20522j035565r02040j266847j920853
4031C9814305j797991j638448j261003j099528q12014n46415m91416j01183l80134
4022C1686173j14442J86201N42796K63740O61426O97753M13403M06369k08133
$$ y = [41557698, 42222274, 42415608, 42695308, 43465110, 43819016, 44328825, 44917429, 45650254, 46401736, 47312335, 48116723, 48917526, 49396710, 49465033, 49499642, 49544418, 49652080, 49803164, 49973460, 50240648, 50169331, 49861341, 50199991, 50560198, 50710417, 50782054, 50804865, 50685801, 50285764, 49864518, 49259191, 48619038, 47984849, 47441585, 47111874, 46872033, 46539515, 46446406, 46351468, 45978099, 45799219, 45745471, 45450719, 44917021, 44597387, 44556918, 44487512, 44224830, 44141452, 44417131, 44717983, 45068387, 45260132, 44939610, 43904045, 43002005, 41735158, 39814305, 38016314, 36377866, 35116863, 34017335, 33205321, 32658906, 32167490, 32066307, 31686173, 31571731, 31757932, 32300728, 32564468, 33225894, 33923647, 34337050, 34743419, 34535286]
4013C4535286j471113k158966j925861j869838j495190q46149q27695q52152p25342
4004B2362980n04872p09160m21652l09146n02499j71659n8556l03162k91142q7631
3994A9003501L37519K80424M7839L85951L90180M41002N33731O23607J35926n59701
3984B1619979j350773j161838p92663o84767m58267o1370j35660k49948j47475
3975A6577218p06l79938l38268l80705l25716l80354k16849J37407j05713m4315
3965A4542061K13426j89770K88130J34928J71350L72615L45267L99292M54820
3956A6732119P40725R23312R24934J179851J370762J341459J208862J899803J511542
3947B7833369P02829n54782k699151k983818k633661k101700j480459j128264
$$ y = [34535286, 33064173, 30905207, 28979346, 27109508, 25614318, 24768169, 23940474, 23088322, 22362980, 21858108, 21148948, 20727296, 20418150, 19915651, 19743992, 19685436, 19382274, 19091132, 19003501, 19341020, 19621444, 19669283, 20055234, 20445414, 20886416, 21420147, 22043754, 22179680, 21619979, 20269206, 19107368, 18314705, 17629938, 17171671, 17110301, 16974641, 16724693, 16577218, 16576512, 16196574, 15858306, 15477601, 15151885, 14771531, 14554682, 14692089, 14586376, 14542061, 14755487, 14565717, 14853847, 14988775, 15160125, 15532740, 15878007, 16277299, 16732119, 17472844, 18396156, 19321090, 20500941, 21871703, 23213162, 24422024, 26321827, 27833369, 28536198, 27981416, 25282265, 22298447, 19664786, 17563086, 16082627, 14954363]
3939A4954363q99385p52090m87351n13615l06434j61089k40345k48823k6267k0285
3929A1298679O8915q2222N7288j19527J19338K35184j38096k15795K926l8623
3919A1188067j91430l66175l89565k62777j72809n2407l44533j01501J73017J26500
3909I606387k10903J71479J49031J95825L64001L69219J96188M74439N07035O88340
3899A2511041P47706P65700N64420p7767k54637r28287r31613q60055p15515o89689
3889A0131304n12302l11665j77865k18005l91126j08202k32930k77342J10284
3880H012151K28621j53228o7312j72550J60779J11453m0612M9629L87784J54446
3870H671161J39460K07245o0793l07131k83255j51030k25481l32893j0818j30566
$$ y = [14954363, 14054978, 13302888, 12815537, 12301922, 11995488, 11834399, 11594054, 11345231, 11318964, 11298679, 11367594, 11285372, 11342660, 11223133, 11342471, 11577655, 11439559, 11223764, 11226690, 11188067, 10996637, 10630462, 10240897, 9978120, 9805311, 9752904, 9408371, 9306870, 9479887, 9606387, 9395484, 9566963, 9715994, 9911819, 10275820, 10645039, 10841227, 11315666, 11822701, 12511041, 13258747, 14024447, 14588867, 14511100, 14256463, 13328176, 12396563, 11536508, 10820993, 10131304, 9619002, 9307337, 9129472, 8911467, 8520341, 8412139, 8179209, 7901867, 8012151, 8240772, 8087544, 8020232, 7847682, 8008461, 8119914, 8079302, 8128931, 8516715, 8671161, 8810621, 9017866, 8957073, 8649942, 8366687, 8215657, 7990176, 7657283, 7646465, 7515899]
3860G515899p2195n5162N6404n8352l91749K55756K00801j1130J66282N093R5106
3849G706753L2399K19556K34492K99996L8834J94179n8926J147k16892j41476
3839H310062j9151k28455P6349L91629J4015l20783L1878J01508O9846L5286J14310
3828H576494j69683J3853J76417N2977J95140j505J72618K38578J38798L35846
3818I729533K18306k53908K59658L74013k88411J36247j00113r1119O3526J46061
3808A0193793l5227J93690K68499K6315O6937K82579j08078J75488K82981J73356
3798A1520333M7997J08035J48274K36883L03393Q6671M22045J88035l1987J52263
3788A3181942L0983m9767J49053R9103k13359q3859J19904M8871j4285O0256j67106
$$ y = [7515899, 7443704, 7388542, 7444946, 7386594, 6994845, 7250601, 7451402, 7440272, 7606554, 7611647, 7706753, 7739152, 7958708, 8193200, 8493196, 8532030, 8726209, 8667283, 8668430, 8451538, 8310062, 8290911, 8062456, 8138805, 8530434, 8544449, 8223666, 8255544, 8357052, 8426898, 8462184, 8576494, 8406811, 8420664, 8597081, 8650058, 8845198, 8843693, 9016311, 9254889, 9393687, 9729533, 9947839, 9693931, 9953589, 10327602, 10039191, 10175438, 10075325, 9984206, 10047732, 10193793, 10158566, 10352256, 10620755, 10647070, 10714007, 10996586, 10888508, 11063996, 11346977, 11520333, 11568330, 11676365, 11824639, 12061522, 12364915, 12451586, 12873631, 13061666, 13029679, 13181942, 13212925, 13163158, 13312211, 13411314, 13197955, 13114096, 13234000, 13282871, 13268586, 13328842, 13161736]
3777A3161736j8442Q0727J19167k50332P1850J48688j9434j10303k05051j96055
3767A2782551p3107j55456k22610q9179p580k4473j63067K0034l1477j04422j9059
3756A1912155J57329Q3751R3514O0170m7505J11212J98588j55017J4987Q4471
3746A2513655O1697K20960l2618r8283Q08m2120P4831K11980J41860O2982P0299
3735A3186051J94836k3556Q1146k1635M7755K68173j8010o8140J25841n9834J0846
3724A3723473p7374M3802m6885k38188r6590J14624j05292m2798J82566l22086
3714A3135252j59808J78012L5460n2625j5433k6592P8726j09856k7682r942J05501
3703A3131013j92029q1176J87706K1724Q4819K11015j29607Q3494P9523K05575
$$ y = [13161736, 13143294, 13224021, 13343188, 13092856, 13164706, 13313394, 13293960, 13183657, 12978606, 12782551, 12709444, 12553988, 12331378, 12242199, 12234619, 12210146, 12047079, 12067113, 12035636, 11931214, 11912155, 12069484, 12153235, 12246749, 12306919, 12259414, 12370626, 12569214, 12414197, 12429184, 12513655, 12575352, 12796312, 12763694, 12665411, 12666219, 12624099, 12698930, 12910910, 13052770, 13115752, 13186051, 13380887, 13357331, 13438477, 13416842, 13464597, 13732770, 13714760, 13646620, 13772461, 13712627, 13723473, 13646099, 13689901, 13643016, 13404828, 13308238, 13422862, 13317570, 13274772, 13457338, 13135252, 12975444, 13153456, 13188916, 13136291, 13120858, 13094266, 13172992, 13063136, 13035454, 13025512, 13131013, 12938984, 12857808, 13045514, 13067238, 13152057, 13363072, 13233465, 13316959, 13396482, 13602057]
3693A3602057J71617J00799J68914P7102j00777K81383K00230K88702P4382J90685
3683A5055094K4942J29924K34412M170o0844j84823K18567J23994K28583J51377
3673A5925396q692K32091M71339L22136K20083L34373M79568M76650M12965M09724
3663A9275633M32492N39363P75905O85057P17914P95262Q89591N23189P95273
3654B5429679R87856J186223J113904J399381J616439J572571J715973J966435
3646C6988461K301561K320239K399479K477802K704417L033734K963683K871234
3638E8060610K752780K666847K719657K460687K106819J491318J299289R22749
3630G4480756N76807N00053J49605l7582k97398o2812o861k20888r3835m31028
$$ y = [13602057, 13773674, 13874473, 14043387, 14120489, 14019712, 14301095, 14501325, 14790027, 14864409, 15055094, 15080036, 15209960, 15444372, 15448542, 15387698, 15202875, 15421442, 15545436, 15774019, 15925396, 15916704, 16148795, 16620134, 16942270, 17162353, 17496726, 17976294, 18452944, 18865909, 19275633, 19708125, 20247488, 21023393, 21708450, 22426364, 23221626, 24111217, 24634406, 25429679, 26417535, 27603758, 28717662, 30117043, 31733482, 33306053, 35022026, 36988461, 39290022, 41610261, 44009740, 46487542, 49191959, 52225693, 55189376, 58060610, 60813390, 63480237, 66199894, 68660581, 70767400, 72258718, 73558007, 74480756, 75057563, 75557616, 75707221, 75669639, 75372241, 75309429, 75302568, 75081680, 74987845, 74556817]
3620G4556817r13130j027306j306579j483235j719295k075331k171684k378938
3612F1481319k224647k450928k175341j889670j974333j804463j770673j762471
3604D5428793j394333j396146j248709j210848r91914j000649p79117r12774j006056
3595C5488247o88672p40395o68388o29566p28239q80889m76177o41442p29588
3586B9304891o92771n11971o34635o16151o42593m87475o32327o91436n57550
3577B3837982m12707m44288l47313m62672m18288j98842l29427k18460j45157
3568B0860828l15855J3097j52183p2166J05534J98460J90050M2634M9052j66239
3558B0753212J51655K33740K4159o2210K52213J17621O9620R7492R3866K1268
$$ y = [74556817, 73643687, 72616381, 71309802, 69826567, 68107272, 66031941, 63860257, 61481319, 59256672, 56805744, 54630403, 52740733, 50766400, 48961937, 47191264, 45428793, 44034460, 42638314, 41389605, 40178757, 39186843, 38186194, 37407077, 36494303, 35488247, 34799575, 34059180, 33390792, 32761226, 32032987, 31152098, 30675921, 30034479, 29304891, 28612120, 28100149, 27465514, 26849363, 26206770, 25719295, 25086968, 24395532, 23837982, 23425275, 22980987, 22633674, 22171002, 21752714, 21553872, 21224445, 21005985, 20860828, 20544973, 20558070, 20405887, 20333721, 20439255, 20637715, 20827765, 20870399, 20919451, 20753212, 20904867, 21138607, 21162766, 21100556, 21352769, 21470390, 21540010, 21637502, 21731368, 21752636]
3548B1752636n7756j60861j40521L7963p5036K7464o6915r4591r0723n4902m7133
3537B1029625l37849m6710l10149j89562l23935j33900k75552k28241q6371l50049
3527A8747307l14006j56002j9755k41938M2029j28559p9627O4485o4096N2742
3517A7902580J94306J55285Q1900K04126L32000L91500J91707M54823N06093P35165
3507B1149485N24726N89941P19930R55468P46741P39960R75585P50728Q15840
3498B7968404O46301Q38504P13483P77050P73355M41897J81108j355k31281k76545
3488C1830921m08604k46401l41681m05443m43782k53923j27697r9418l3543K73438
3478B9743867J952O0742J47756K54093M43825N53964M90534O17305O99034O90984
$$ y = [21752636, 21694880, 21534019, 21393498, 21431461, 21356425, 21383889, 21316974, 21222383, 21131660, 21076758, 21029625, 20691776, 20645066, 20334917, 20145355, 19821420, 19687520, 19411968, 19183727, 19097356, 18747307, 18433301, 18277299, 18257544, 18015606, 18057635, 17929076, 17849449, 17913934, 17849838, 17902580, 18096886, 18252171, 18334071, 18538197, 18870197, 19261697, 19453404, 19908227, 20414320, 21149485, 21674211, 22264152, 22984082, 23939550, 24686291, 25426251, 26401836, 27152564, 27968404, 28614705, 29453209, 30166692, 30943742, 31717097, 32158994, 32340102, 32338747, 32107466, 31830921, 31422317, 31175916, 30834235, 30428792, 29985010, 29731087, 29603390, 29503972, 29470429, 29743867, 29745819, 29806561, 29954317, 30208410, 30652235, 31206199, 31696733, 32314038, 33013072, 33704056]
3468C3704056N73402R95273J011294R50063J161463J231452J288483J421882J959412
3459D4296780J997993J994597K563295K830516K792509L008916L387929L777262
3451F6649797M039238M278536M242739M666098M571773M646835M401898L913012
3443A01409926L604850L307602K398150J879498J434806P92212K06584O2997q8619
3434A15008006m80994m02958l47545j18491k89289j7513M6249j58430j35405l8656
3424A13064974o1347m87619q17995j084839j666976j966177k445024k804004l131379
3415I8599614l383989l574775l876739l737554l441289l359530l534337l171724
3407G0519677l256243k826866k258660k477901k243448j919089j970717j525298
$$ y = [33704056, 34277458, 35272731, 36284025, 37234088, 38395551, 39627003, 40915486, 42337368, 44296780, 46294773, 48289370, 50852665, 53683181, 56475690, 59484606, 62872535, 66649797, 70689035, 74967571, 79210310, 83876408, 88448181, 93095016, 97496914, 101409926, 105014776, 108322378, 110720528, 112600026, 114034832, 114827044, 115033628, 115096625, 115008006, 114527012, 114124054, 113776509, 113658018, 113368729, 113351216, 113397465, 113239035, 113103630, 113064974, 113003627, 112516008, 111698013, 110613174, 108946198, 106980021, 104534997, 101730993, 98599614, 95215625, 91640850, 87764111, 84026557, 80585268, 77225738, 73691401, 70519677, 67263434, 64436568, 62177908, 59700007, 57456559, 55537470, 53566753, 52041455]
3399E2041455j443986j651955j466059p66408j159250j305044q30333o69513p61357
3390D1987550q19970l61339l12521n69408l92211m09338j71701J41389J85738
3381C9278189m8442J51451N68100L60064O28192N86693O99983P00669O04584P67231
3371D4296714O19227M95170O36426N00189M70964L19714K12386L69966J04119
3362D8024875Q4427J42766l3632J4198Q3972L4039j94197J10205P0092N3346Q4021
3351D8474112k43167P5718K41475K80729J20795P4919J52125K84933J90015J35261
3341D9786915N3415j02142M69891L19811L42324L55715L19421N13746N76336M97421
3331E3132853P58345P30784P51645R97164R01915P89944J267611J406931J375161
$$ y = [52041455, 50597469, 48945514, 47479455, 46713047, 45553797, 44248753, 43418420, 42748907, 41987550, 41167580, 40806241, 40493720, 39924312, 39532101, 39122763, 38951062, 39092451, 39278189, 39229747, 39381198, 39949298, 40309362, 40937554, 41524247, 42224230, 42924899, 43529483, 44296714, 44915941, 45411111, 46047537, 46547726, 47018690, 47338404, 47550790, 47920756, 48024875, 48109302, 48252068, 48218436, 48232634, 48316606, 48350645, 48156448, 48266653, 48336745, 48390091, 48474112, 48230945, 48306663, 48548138, 48828867, 48949662, 49024581, 49176706, 49461639, 49651654, 49786915, 49840330, 49738188, 50208079, 50527890, 50870214, 51225929, 51545350, 52059096, 52635432, 53132853, 53891198, 54621982, 55373627, 56370791, 57272706, 58062650, 59330261, 60737192, 62112353]
3322F2112353J744972J804851K140940K165146K506975K617411K937153L231042
3314H1260843L452114L570454M090899M439402M483219M926804N404882N321167
3306A16949784N413712N451526N264000M888600M480096M278453L357345K824460
3298A52907976K223714J917463J391955O91360M84269j15060k74475q01357j119679
3289A57306166j571525j865094k386349k805386l333071l920381l974401m589897
3281A32860062m775591n164093n186626n252252n244454m987879m780934m593580
3273I2874653m178048m194559l789940l517164k942820k671180k706081k471375
3265F6403486k135869j766786j688332j573999j274665j409642j340633r87974
$$ y = [62112353, 63857325, 65662176, 67803116, 69968262, 72475237, 75092648, 78029801, 81260843, 84712957, 88283411, 92374310, 96813712, 101296931, 106223735, 111628617, 116949784, 122363496, 127815022, 133079022, 137967622, 142447718, 146726171, 150083516, 152907976, 155131690, 157049153, 158441108, 159132468, 159616737, 159501677, 159227202, 158425845, 157306166, 155734641, 153869547, 151483198, 148677812, 145344741, 141424360, 137449959, 132860062, 128084471, 122920378, 117733752, 112481500, 107237046, 102249167, 97468233, 92874653, 88696605, 84502046, 80712106, 77194942, 74252122, 71580942, 68874861, 66403486, 64267617, 62500831, 60812499, 59238500, 57963835, 56554193, 55213560, 54225586]
3257E4225586o83764r46165p09037p25065o05990q86749p40803r13255j274966
3248D6739792q79522j098900j266939j287022q81860j086698r08432p81916o62076
3239C7886427r23863p05890n22765n82824n35361o27490q14161l73420k76619
3230C2524034n77384o22198l54906k68378k95728m98028m33998l81070n63847
3221B8528497m48775l48166m28356k85201n89867m09000j45085l25102j66587
3212B5382358k02136k06718k28786l6448J5950j52261j06000N0403J79292R1203
3202B4786857N0957J87902K72064K50941K27811K63380L64748M84847M69762M75080
3192B7834349O17169P06296Q75255P10719L97790P20267Q35351P69996R14633
$$ y = [54225586, 53541822, 52595657, 51886620, 51161555, 50555565, 49668816, 48928013, 48014758, 46739792, 45860270, 44761370, 43494431, 42207409, 41325549, 40238851, 39330419, 38548503, 37886427, 36962564, 36256674, 35733909, 35151085, 34615724, 33988234, 33174073, 32800653, 32524034, 31946650, 31324452, 30969546, 30701168, 30405440, 29907412, 29473414, 29092344, 28528497, 28079722, 27731556, 27303200, 27017999, 26428132, 26019132, 25874047, 25548945, 25382358, 25180222, 24973504, 24744718, 24708270, 24724220, 24571959, 24465959, 24516362, 24695654, 24786857, 24837814, 25025716, 25297780, 25548721, 25776532, 26039912, 26404660, 26889507, 27359269, 27834349, 28451518, 29157814, 30033069, 30743788, 31141578, 31861845, 32697196, 33467192, 34381825]
3183C4381825Q91617J020869R28990J2786r43973j433967j424702r88694o01867
3174C1842884m87727j8099m9472K38197M70941N60865O92456Q36142P59885Q32799
3164C5678871J388011J340867J218763J737731J606841K110113K035816K046713
3156D9163726K511225K584335K614456K355393J652650Q33374O89266P00465J346503
3147F4451393J921471K457757K669208L194957L253010L498824L403125L527424
3139H8377169L387571L271496K893532J965418J333050P92744l34276j181148
3131A00505556k053569k919919l546878m063764m380095m791863m781141m486501
3123F9481826m309468m101213l969518l424158l079229k812696k473886k174191
$$ y = [34381825, 35273442, 36294311, 37223301, 37236087, 36292114, 34858147, 33433445, 32444751, 31842884, 31355157, 31337058, 31287586, 31525783, 31996724, 32557589, 33250045, 34086187, 34846072, 35678871, 37066882, 38407749, 39626512, 41364243, 42971084, 45081197, 47117013, 49163726, 51674951, 54259286, 56873742, 59229135, 60881785, 61715159, 62404425, 63104890, 64451393, 66372864, 68830621, 71499829, 74694786, 77947796, 81446620, 84849745, 88377169, 91764740, 95036236, 97929768, 99895186, 101228236, 102020980, 101686704, 100505556, 98451987, 95532068, 91985190, 87921426, 83541331, 78749468, 73968327, 69481826, 65172358, 61071145, 57101627, 53677469, 50598240, 47785544, 45311658, 43137467]
3115D3137467j968494j602606j451739j299305q96008q16582n90299m53049l84533
3106C3674852k39299K19430J38889M63882L11334O40928M74701m46943j431233
3097C3806541j819123j971110j460506j157760r86740j041932q85725o30890m15074
3088B3437681o87463o99834j45711m37803k40468p6024j33912J4699J09439P5771
3078B1216375K97606L10924N16295M94883M91394N12886M57578k86283j514668
3069B2496990j839410j868953j274365q77275q91935n18559n00173n51647n98499
3060A3576174l47990k79772l40739l83208j26548l52764l68331j96299k28426
3051A0952097k52751j62610k6836k54700N4751j36826j76530r4592o0857j87795
$$ y = [43137467, 41168973, 39566367, 38114628, 36815323, 35919315, 35102733, 34512434, 34059385, 33674852, 33435553, 33654983, 33793872, 34257754, 34569088, 35210016, 35684717, 35237774, 33806541, 31987418, 30016308, 28555802, 27398042, 26411302, 25369370, 24483645, 23852755, 23437681, 22750218, 22050384, 21904673, 21466870, 21226402, 21150378, 21016466, 21031165, 21140604, 21216375, 21513981, 21824905, 22341200, 22836083, 23327477, 23840363, 24297941, 24011658, 22496990, 20657580, 18788627, 17514262, 16636987, 15745052, 15226493, 14726320, 14174673, 13576174, 13228184, 12948412, 12607673, 12224465, 12097917, 11745153, 11376822, 11180523, 10952097, 10699346, 10536736, 10509900, 10255200, 10309951, 10173125, 9996595, 9902003, 9841146, 9653351]
3041I653351j50462j30990k68173n7933l3167O4834k10116l3226j40154j18778
3031H575186n7369q0153m7471J12214Q5348j81107R1118p962j43145k64076k4232
3020H058351R1360N9432j19299n6466j0581K39312j88383j50624J41460m4059
3010H020503K66249p7704j41515M7898j4976N9105J17997j92475j56394Q5054
3000H013742M9493M0070m093K23689K36956j46454q6333Q1658Q8403m8296R3548
2989H542383J32002P0715J19975J00782r3961J40769K16633P0650K5442j4105
2979I311285J65046J02131O8505P2676J87773L7441K53328J16015P3260p7352
2969A0310108J25305K50195J0225K33576L82596J75557L75319K29478O8614L80998
$$ y = [9653351, 9502889, 9371899, 9103726, 9045793, 9012626, 9077460, 8867344, 8834118, 8693964, 8575186, 8517817, 8437664, 8390193, 8502407, 8587755, 8406648, 8497766, 8489804, 8346659, 8082583, 8058351, 8149711, 8209143, 8089844, 8033378, 8022797, 8262109, 8073726, 7923102, 8064562, 8020503, 8286752, 8209048, 8067533, 8115431, 8100455, 8159560, 8277557, 8085082, 7928688, 8013742, 8063235, 8103305, 8099212, 8322901, 8559857, 8413403, 8327070, 8408728, 8497131, 8448835, 8542383, 8674385, 8745100, 8865075, 8965857, 8871896, 9012665, 9229298, 9299948, 9325390, 9311285, 9476331, 9578462, 9646967, 9719643, 9907416, 9944857, 10198185, 10314200, 10387460, 10310108, 10435413, 10685608, 10695833, 10929409, 11312005, 11487562, 11862881, 12092359, 12160973, 12541971]
2959A2541971L80793K11268L60535M83801K50156M46940Q2695M81335L78695M62833
2949A6081022N79872L26108P11756O85862M34166K88676J61840P13438N52978
2940B0535718N54948O70422N55493O31938P16612O90585R77472Q57767Q71050
2931B7062005O99890O56990Q14812R92075P78574J009669J220609J129181J301874
2922C5665679J524375J674951J638116J492605J881896J979958J795831K199879
2914D9853290K400978K859210K733561K879803K807993K810339K933977K864271
2906G2143422K397921K264209J906696K138521K161483K465134K466226K526744
2898I0470356K955092L310758L874282M440217M821427N218521N630405N981141
$$ y = [12541971, 12922764, 13134032, 13494567, 13978368, 14228524, 14675464, 14758159, 15239494, 15618189, 16081022, 16660894, 16987002, 17698758, 18384620, 18818786, 19107462, 19269302, 19982740, 20535718, 21090666, 21761088, 22316581, 22948519, 23665131, 24355716, 25333188, 26190955, 27062005, 27761895, 28418885, 29233697, 30225772, 31004346, 32014015, 33234624, 34363805, 35665679, 37190054, 38865005, 40503121, 41995726, 43877622, 45857580, 47653411, 49853290, 52254268, 55113478, 57847039, 60726842, 63534835, 66345174, 69279151, 72143422, 74541343, 76805552, 78712248, 80850769, 83012252, 85477386, 87943612, 90470356, 93425448, 96736206, 100610488, 105050705, 109872132, 115090653, 120721058, 126702199]
2890A26702199O192502O405650O618420P055572Q158355R505016J0794648J2500076
2882A93932438J3936430J4904801J6210611J7793004J9310156K0622767K1517056
2875C18227263K1908025K0231295J5227710O603417n060317j7076914k6258135
2868C33802344l0458375l0322059k7855018k4237175k0601775j7499121j5005476
2861A67823345j2858839j1142900r679644q521740p513042o740627n628270m786942
2853A00951341m305264l559749l084214k500154k146259j563238j284214j251493
2845H1256756j295301j625908k029123k795224l066252l275954l436859l238960
2837F0493175k932757k545207k683913k358840k077832j822648j872354j472785
$$ y = [126702199, 132894701, 139300351, 145918771, 152974343, 161132698, 170637714, 181432362, 193932438, 207868868, 222773669, 238984280, 256777284, 276087440, 296710207, 318227263, 340135288, 360366583, 375594293, 382197710, 377137393, 360060479, 333802344, 303343969, 273021910, 245166892, 220929717, 200327942, 182828821, 167823345, 154964506, 143821606, 134141962, 125620222, 118107180, 111366553, 105738283, 100951341, 96646077, 93086328, 90002114, 87501960, 85355701, 83792463, 82508249, 81256756, 79961455, 78335547, 76306424, 73511200, 70444948, 67168994, 63732135, 60493175, 57560418, 55015211, 52331298, 49972458, 47894626, 46071978, 44199624, 42726839]
2829D2726839j505333j475246j423944j419910j434800j226295j205319j005051
2821C2030941r78426p69601n98810r35963p87599n77502m87323o54773o27409
2812B5613535o58366n30907m63027p70003n62427o22616o58709o72190m77215
2803B0198075o98607n76696m02570n93741m63578m05106l25484n33177m9969m50437
2793A5698710m96147l89959n61808k94027l55065l1599m43440n36221k68044l67877
2783A1954523l20227j29301k17132l10260j88200k84246k96397j65528l29683
2774I713549l80686j90960k97880j23081k11899j73062j27066n7259j703k66417
2764G883536l44125k666k81040Q7364R6561k10516j77276j95516o8257k44739
$$ y = [42726839, 41221506, 39746260, 38322316, 36902406, 35467606, 34241311, 33035992, 32030941, 31052515, 30282914, 29684104, 28748141, 27960542, 27383040, 26895717, 26240944, 25613535, 24955169, 24424262, 23961235, 23191232, 22628805, 22006189, 21347480, 20675290, 20198075, 19499468, 18922772, 18520202, 17926461, 17462883, 17057777, 16732293, 16199116, 16149147, 15698710, 15202563, 14812604, 14250796, 13956769, 13601704, 13570105, 13126665, 12590444, 12322400, 11954523, 11634296, 11504995, 11287863, 10977603, 10789403, 10505157, 10208760, 10043232, 9713549, 9332863, 9141903, 8844023, 8720942, 8509043, 8335981, 8208915, 8151656, 8149953, 7883536, 7539411, 7536745, 7255705, 7343069, 7439630, 7229114, 7051838, 6856322, 6788065, 6543326]
2754F543326r0144J55183q5156l19782r5016j778j74693q277k25694j52752j17004
2743E428213j66861O1888J100k09472j9445j46649Q311K2282j58745j65331j43181
2732D512110L2151J832J835j27089j53138j25058p7680r396m0621k28121j29608
2721C657217N454N8180o7594K9757m4906l4802N2154K749l83542k47339K48677
2710C276005J7374j46802o5262r681j19471o1319J24797O2749k34750k12286J98447
2699B829801N795O22j24699k19525R4872l7804N7149n3773O8179K1015q1296J9325
2687B579661j12621l9369q8672q4436O2841j81046p8770p1753j43859N2440N5349
2676A949765R8658P121j61505r9542L2672P024j30803n6516J44002j91049q9803
$$ y = [6543326, 6453182, 6608365, 6523209, 6203427, 6108411, 6106633, 5931940, 5923663, 5697969, 5545217, 5428213, 5261352, 5323240, 5324340, 5114868, 5095423, 4948774, 4957085, 4979367, 4820622, 4655291, 4512110, 4544261, 4546093, 4547928, 4420839, 4267701, 4142643, 4064963, 4055567, 4014946, 3786825, 3657217, 3662671, 3720851, 3653257, 3683014, 3638108, 3603306, 3655460, 3658209, 3274667, 3027328, 3276005, 3293379, 3146577, 3081315, 3071634, 2952163, 2890844, 3015641, 3078390, 2843640, 2631354, 2829801, 2835596, 2836218, 2711519, 2491994, 2586866, 2549062, 2606211, 2552438, 2620617, 2641632, 2560336, 2579661, 2467040, 2427671, 2338999, 2254563, 2317404, 2136358, 2057588, 1985835, 1841976, 1894416, 1949765, 2048423, 2055544, 1894039, 1794497, 1827169, 1834193, 1703390, 1646874, 1790876, 1599827, 1510024]
2665A510024m8044N9929q231q641J04389p1352n1147m0375j3356n4570J65225
2654A543851J44747j13722K07398j7632j37725r481q6247j71511k8101J47544
2644A479121k3111o1364J34838Q254j12487P5933q478R125j94755p2105j44149
2633A090822J33969K6644r3357L4691j31019N6191J84274J25627Q102j84445O6562
2622A318061J12212j01870J3857j5567m1568k5118p2149p8797L31511q2153n0578
2611A307841O3110k4265j19504J22607o686r176K18396J77495k18164L3369K79250
2600A824273j1182R4831O378k9592J67163J4509K5871J26758J48195N1521J89409
2589B608134M574j78108O7574r4010j17769l94548k78053P956j9677Q9670j64224
$$ y = [1510024, 1461980, 1521909, 1513678, 1505037, 1609426, 1538074, 1486927, 1446552, 1433196, 1378626, 1543851, 1688598, 1574876, 1782274, 1764642, 1626917, 1617436, 1531189, 1359678, 1331577, 1479121, 1456010, 1394646, 1529484, 1537738, 1425251, 1501184, 1492706, 1501831, 1307076, 1234971, 1090822, 1224791, 1251435, 1158078, 1192769, 1061750, 1117941, 1302215, 1427842, 1435944, 1251499, 1318061, 1430273, 1328403, 1342260, 1326693, 1285125, 1260007, 1187858, 1109061, 1440572, 1358419, 1307841, 1370951, 1346686, 1227182, 1349789, 1343103, 1333927, 1552323, 1729818, 1511654, 1545023, 1824273, 1813091, 1907922, 1914300, 1884708, 2051871, 2066380, 2092251, 2219009, 2367204, 2418725, 2608134, 2612708, 2434600, 2502174, 2408164, 2290395, 1895847, 1617794, 1625750, 1606073, 1695743, 1531519]
2578A531519k49677j56759L596K29928o2929j34907l4385J06058J26327j05017
2568A253754o7078j32663k34389o9601m9769n0866M3669J749K09519J35572m3771
2557I96126k453m4323j27314k04373q8942j13655K41263R5362J18919j13118j37642
2546F19850j72487k6884O5448J16608o3672j91016L330m5730J0058N2803M6021
2535D14329J4110l4656J4124J25852j5266n0217p4376k26324N763K8713K40133
2524D42185J53243P7215j37521j96439p1576J68209L9772L6296p1239m737j19168
2513C16240q2922P475P5224M9959M7026J61209m2500j63144q9844P1178k2569
2502C27332k50373P8335L8869j38025J08893K36309k7107k03489j16926N0352
$$ y = [1531519, 1281842, 1125083, 1128679, 1358607, 1295678, 1160771, 1126386, 1232444, 1358771, 1253754, 1186676, 1054013, 819624, 750023, 700254, 649388, 693057, 694806, 904325, 1039897, 996126, 993673, 949350, 822036, 617663, 528721, 415066, 656329, 751691, 870610, 757492, 619850, 447363, 420479, 485927, 602535, 538863, 347847, 351177, 305447, 315505, 368308, 414329, 428439, 393783, 407907, 533759, 518493, 468276, 393900, 167576, 173339, 202052, 442185, 595428, 672643, 535122, 338683, 267107, 435316, 475088, 511384, 440145, 435408, 316240, 233318, 240793, 316017, 365976, 413002, 574211, 531711, 368567, 278723, 349901, 327332, 76959, 155294, 194163, 56138, 165031, 401340, 374233, 170744, 53818, 104170]
2492A04170R2083J61231M1956k3292k42911k68861K85661N9757R4686Q5613O1382
2481D51475p3238k6282l961j25308r6773P4621k00547K4415J4975J49367n1888
2470A36856J9865l4566J18292p137n6474K6715K02869j41483k31199J12451j43535
2459B654n6928K09665J0599n9957M5512J91672k9585J033j84894m5297N527K1911
2447A11912k34873J05138K17411m3203p8394j86367r9902K04251J56772j29737
2437B3008J12617r266O2637j36526N5047j0833R7692n9977N9242q7814O802J63792
2425B76421K6731k1266k9672j16637j71025K55676R0970l8489n4523N0361j29195
2414A39352o830j73781Q2451K84899o7871J28696j95049o5894L0508J4571k9396
$$ y = [104170, 196253, 357484, 399440, 376148, 133237, -135624, 150037, 209794, 304480, 390093, 451475, 378237, 351955, 347994, 222686, 125913, 200534, -13, 24402, 39377, 188744, 136856, 156721, 122155, 240447, 233310, 176836, 203551, 406420, 264937, 33738, 146189, 2654, -54274, 155391, 165990, 106033, 151545, 343217, 313632, 314665, 129771, 84474, 90001, 111912, -122961, -17823, 199588, 156385, 77991, -108376, -208278, -4027, 152745, 23008, 135625, 126359, 188996, 52470, 107517, 96684, 194376, 134399, 193641, 105827, 112629, 276421, 303152, 281886, 252214, 135577, -35448, 220228, 311198, 272709, 218186, 268547, 139352, 132522, -41259, 41192, 326091, 258220, 386916, 191867, 125973, 156481, 171052, 141656]
2403A41656P4909p7052o6359j12017o4541n0267k31550K1553J25549J77072J12191
2392E1144j03028J5758J72023j33079N1127K01477k1304j06177N1329n187n3611
2381A20472o7798R3260M1957O5861O0509n9516P3365Q4032n4073j72199R7745
2370B83615J25o7389q5678j388l5960j33111J88369J33636j73246j7995j3832
2359G7146J30011r0664k00471J93862k01263q4260L5809l2396M7417q4383J05946
2348a03246O022J4665K9276l983j11441J72250J26447r9141L0985j6028J7255
2337F3061l2310J0279J87819j7381l7303j22851J22592m5693j70293m0496j511
2326h4087j78969J40281J46930k3005L8488O7335P982n9566j5222K8023j55630
$$ y = [141656, 216565, 139513, 73154, -38863, -103404, -153671, -385221, -363668, -238119, -61047, 51144, -51884, -36126, 135897, 2818, 53945, 255422, 234118, 127941, 179270, 174083, 120472, 52674, 145934, 187891, 253752, 314261, 254745, 328110, 412142, 358069, 185870, 283615, 283740, 216351, 130673, 129285, 93325, -39786, 148583, 282219, 108973, 90978, 77146, 207157, 116493, -83978, 109884, -91379, -175639, -139830, -172226, -124809, -209192, -103246, -97224, -82559, -53283, -57266, -168707, 3543, 129990, 30849, 61834, 45806, 63061, 30751, 41030, 228849, 211468, 174165, 51314, 173906, 128213, -42080, -82576, -84087, -263056, -122775, 24155, 1150, 39638, 106973, 114955, 55389, 40167, 68190, -87440]
2315h7440P5367p230Q6176L9933o9755J55797J13141J5571j92546l658K5984j40100
2303A1240J5790O1585k22052M1618N7932O0713k4240L7698k9664j03315J26350
2292C3655j21561K52061J23024l6166J5668j07477M1966n2284j98053j16925O8115
2281i7977k17499K05778J72454l29162O8179M36216j64556j62832K42282o0855
2271I2028l2528p779N755L1646r2984j1348O7131J31854o2073Q232J4887k9270
2259A15551J93585K2565j73186k9475L4416R8134j47665j39793P5391K1745K2686
2248I3954P237N4225q6550j25743O548k4653K26645r2452J27833k1978Q612N6720
2236B30398k5618j87431J99725m9578J07444J01559J87915j55514l00140j26160
$$ y = [-87440, -12073, -19303, 66873, 106806, 37051, 192848, 305989, 321560, 129014, 125356, 151340, 11240, 27030, 88615, -133437, -91819, -33887, 26826, 2586, 40284, 10620, -92695, 33655, -87906, 164155, 287179, 251013, 266681, 159204, 201170, 148886, -49167, -166092, -97977, -315476, -109698, 62756, -266406, -198227, 237989, 73433, -89399, 152883, 92028, 59500, 51721, 57476, 89122, -3862, -15210, 51921, 183775, 121702, 129934, 144821, 115551, 309136, 331701, 158515, 129040, 163456, 261590, 113925, -25868, 49523, 71268, 93954, 101191, 155416, 68866, -56877, -50329, -74982, 151663, 59211, 187044, 165066, 173678, 230398, 204780, 17349, 217074, 167496, 274940, 376499, 564414, 408900, 108760, -17400]
2226a7400J75019Q6284k0918M2694R2002R0016j0915N554j25677o0639R5698J5240
2214C66958J04471l3570n3595K29804Q3593k16r9408j34174l9789M6349j08239
2203C62184M1106J94825k9051K510J30679l2740k896j16624Q3885M4687J70445
2192H49010j47787O2298J4112J8088M8532K11674r0163L0338J09871K06200o8335
2181A243838r2905R8044j7329N0036R9042J48885p8400m7791l1985J9114K1156
2170A411705J66752K55574k1592n521L8150K9897J19025J74787j34309J91924
2160B226392J77213J6095m9849K4879J32552L11916J82865m3797J7466K46220
2150C241952J55405m0872M4537K16957K63840Q8951M4110J98595J22310K27131
$$ y = [-17400, 157619, 243903, 222985, 265679, 357681, 447697, 436782, 442336, 316659, 256020, 351718, 366958, 471429, 437859, 384264, 614068, 697661, 697445, 598037, 463863, 424074, 470423, 362184, 403290, 598115, 569064, 571574, 702253, 669513, 666617, 549993, 633878, 678565, 849010, 701223, 763521, 777633, 795721, 844253, 1055927, 965764, 996102, 1105973, 1312173, 1243838, 1150933, 1248977, 1231648, 1281684, 1380726, 1529611, 1451211, 1403420, 1371435, 1390549, 1411705, 1578457, 1834031, 1812439, 1806918, 1845068, 1874965, 1993990, 2168777, 2034468, 2226392, 2403605, 2419700, 2369851, 2394730, 2527282, 2839198, 3022063, 2978266, 2995732, 3241952, 3397357, 3356485, 3401022, 3617979, 3881819, 3970770, 4014880, 4213475, 4335785, 4562916]
2140D562916K76556L23752K30403J30148M17473K33703M55465P03900M04337L03078
2130H041731P58894P72855R83675J093461R79434J340433J317397J317980J691561
2121A8297421K142637K546711K930395L513292M317084M623401M959948N673679
2113D9004568P111343Q388629J1045493J0179963J817342j1147108j6988454j2970083
2105D6441693q813943o152155m517746l283660k603902j962129j672642j121087
2097A6314429r85588q04193p89143r81429r86436j135994q40142o17945p50978
2088H422581l83114l31303j24198l76803l95909l98717n36318k24905j30518j94894
2078E325902k6226l29693k62925j65761j01030k65856p6920j32503k83847j35588
$$ y = [4562916, 4839472, 5163224, 5393627, 5523775, 5941248, 6174951, 6630416, 7334316, 7738653, 8041731, 8800625, 9573480, 10557155, 11650616, 12630050, 13970483, 15287880, 16605860, 18297421, 20440058, 22986769, 25917164, 29430456, 33747540, 38370941, 43330889, 49004568, 56115911, 64504540, 75550033, 85729996, 87547338, 76400230, 59411776, 46441693, 37627750, 31475595, 26957849, 23674189, 21070287, 19108158, 17435516, 16314429, 15328841, 14524648, 13735505, 12754076, 11767640, 10631646, 9791504, 9173559, 8422581, 8039467, 7708164, 7583966, 7207163, 6811254, 6412537, 5876219, 5651314, 5520796, 5325902, 5299676, 4969983, 4707058, 4541297, 4440267, 4174411, 4097491, 3964988, 3681141, 3545553]
2068C545553k18784k03610j472p2375n3183l15900J2540J66099K274r450k12214
2057B639478M0302O1652k52323l60777Q893J23672o0566j36261J52908o5892L4039
2046B185125j09496k1001j24055k49543L5939l1588j68790o301n6804j99870O0056
2035A313672M7976K04884m3994n8597J17867O8496l15003j98062M5235k19085
2025I63389k76917K9167L45529J15082j8946r3094L9492q0854j58579l7699p2286
2014G54284M894R2935j43936O599J22198N2240k27185j71012J10436J50267O7489
2003H19209k68787q0369Q6531l7658j29720J07109Q3032J7902n5660J9099M1011
1992F01699k57027J16920j55644j6803O7363K53415M0098j97402J57187r8669
$$ y = [3545553, 3326769, 3123159, 3121687, 3049312, 2996129, 2680229, 2692769, 2858868, 2861142, 2851692, 2639478, 2679780, 2741432, 2489109, 2128332, 2137225, 2260897, 2200331, 2064070, 2216978, 2151086, 2185125, 2075629, 2054628, 1930573, 1681030, 1716969, 1685381, 1516591, 1510290, 1453486, 1253616, 1313672, 1361648, 1566532, 1522538, 1463941, 1581808, 1650304, 1335301, 1137239, 1182474, 963389, 686472, 715639, 1061168, 1176250, 1157304, 1064210, 1103702, 1022848, 864269, 826570, 754284, 759178, 852113, 708177, 714776, 836974, 889214, 662029, 491017, 601453, 751720, 819209, 550422, 470053, 556584, 518926, 389206, 496315, 579347, 597249, 541589, 560688, 601699, 344672, 461592, 305948, 289145, 356508, 609923, 650021, 452619, 609806, 511137]
1982E11137K9063K8576R177j75152K09635k34045k1130M4822J7906J06050J26958
1971F52997j57458j59923P9661P4571J21459k8690o8241O142r548k2597j84509
1960C03864j04189J51844L0547j4430j11475Q3825k0716k74538Q8L28066m6383
1949C26503r9419J51103o3409j27708R4883k6330j47340j55246J25765L2557M2586
1938A53945k58021o2591j2970M06736K5303J1896R4496j39669m8444L5016n9083
1927A46614k0756p3856J23526N375j13351Q0033K9952o4044j65358j74836N4151
1916a72550o7043L1682K207J63587J56870p5417N1310m0543m3770N5410q2878
1905b1135j26744R6573j7712Q8746P8705l5989n837K3688J31423j85272l54265
$$ y = [511137, 540200, 568776, 577953, 402801, 612436, 378391, 357261, 402083, 419989, 526039, 652997, 495539, 335616, 415277, 489848, 611307, 582617, 514376, 520518, 510970, 488373, 303864, 199675, 351519, 382066, 367636, 256161, 339986, 319270, 44732, 44820, 372886, 326503, 227084, 378187, 314778, 187070, 281953, 255623, 108283, -46963, 78802, 111359, 153945, -104076, -166667, -179637, 227099, 252402, 264298, 358794, 219125, 170681, 205697, 146614, 125858, 52002, 175528, 180903, 67552, 147585, 177537, 113493, -51865, -226701, -172550, -239593, -207911, -205704, -42117, 114753, 39336, 90646, 50103, 6333, 61743, -21135, -147879, -51306, -69018, 19728, 98433, 62444, 56607, 80295, 211718, 26446, -327819]
1894c27819L54864O9101k20031J70233j2679Q5381L8372j95535k64577Q3931J98911
1883a9848p8122j60655J10757J17069j90941N1945R3115P5905J58717p0380j07139
1872a9577M6365m4106N9492j05439K14311k31713n8800K03137J96125j78519j09345
1861b8069Q3443L460L2425L9150J84798l09958n6024J84713L1913n1701J8282
1850A32432r227K12222j25471j32960k3273J55496j253j62337K87095J31944J0920
1839D75588m3701P7553l7083j24286j71080J47837l23746J38057j84953J16381
1829G0567j02090k20805J4725K62475O6641j68010K1260l9294L2566L54315j78260
1818A14090J796r7720j54938J51864o0579K5720l1951o7385p6444J80221J1073
$$ y = [-327819, 27045, 96146, -123885, 46348, 33669, 119050, 157422, -38113, -302690, -218759, -19848, -97970, -258625, -147868, -30799, -221740, -169795, -76680, -775, 157942, 87562, -19577, 26788, -17318, 42174, -63265, 151046, -80667, -139467, 63670, 259795, 81276, -28069, 55374, 58834, 91259, 130409, 315207, 5249, -50775, 133938, 165851, 114150, 132432, 123205, 335427, 209956, 76996, 53723, 209219, 207966, 45629, 332724, 464668, 475588, 431887, 509440, 472357, 348071, 176991, 324828, 1082, 139139, -45814, 70567, -31523, -252328, -237603, 24872, 91513, -76497, -55237, -94531, -61965, 292350, 114090, 115886, 18166, -136772, 15092, -45487, -19767, -51718, -119103, -195547, -15326, -4253]
1807d253j65892J56722m5136o3627J5553K386N5659l2185K24981k99651J52615
1796b828K7000j33009L9648J05784P7409J54767l57594J8329R1604p2588J78932
1785A27454O9823j73166m9925j16483J78889J11032j26639q0883j3155o645r8736
1774a78434j15281m3019J67794J04507L2040N9688l1806j40542j16502J414l794
1763b63935J64070R5996Q9988n3523O5436k7371k64252Q6457K15048R8182k2785
1752A83311l4856j46336r407J68139J28416n8374k74774J10250j37347p0472K02938
1741F1488O0869M5408j47727l1071J16877n6261r9041J8984J32835j23073j52173
1730a72885P1969J37723N5341p7194J17712j9857k16206Q0712K09345k69807J13282
$$ y = [-4253, -170145, -13423, -58559, -122186, -106633, -104247, -48588, -80773, 144208, -155443, -2828, 24172, -108837, -69189, 36595, 114004, 268771, -88823, -70494, 21110, -51478, 127454, 197277, 24111, -25814, -142297, 36592, 147624, 20985, -59898, -73053, -79698, -178434, -293715, -336734, -168940, -64433, -32393, 27295, -4511, -145053, -261555, -260141, -263935, -99865, -3869, 86119, 32596, 98032, 70661, -193591, -107134, 107914, 206096, 183311, 148455, 2119, -7288, 160851, 289267, 230893, -43881, 66369, -70978, -141450, 61488, 122357, 167765, 20038, -11033, 105844, 49583, -49458, -30474, 102361, -20712, -172885, -100916, 36807, 92148, 14954, 132666, 112809, -103397, -22685, 186660, -83147, 30135]
1719C0135K08443j39871j98914L712J07939n8116O6044L2619k5697j86792J02049
1708e8449l2316j36114J30487J13337k3401q7558M2190Q1043M0752J35998j13608
1697I2361j68644R6564R8129J42239m2753j94465o378M962k1564l8608o422m7905
1685i2484J40330J95476J9311j41778p905k2092j27479k6175j68441K1910Q0301
1674a29026l3740O3352J68150j74937K0918K41385R0019k29189j22529L9869N8828
1663f900o0085J90253m1756p6269J71224M998k70820q9456p7349j9042N9343P3802
1651a42057J44883n2646o2079M7877J7843k0447M8050J81624L1823n9364o4581
1640G0926m1841j70699O7226m7234K0198J86662n2665j08715L3411l4271j37220
$$ y = [30135, 238578, 98707, -100207, -96495, 11444, -46672, 19372, 51991, 26294, -160498, -58449, -90765, -226879, -96392, 16945, -6456, -94014, -51824, 29219, 69971, 205969, 92361, -76283, 20281, 118410, 260649, 217896, 23431, 17053, 22015, 451, -38157, -44579, -92484, 47846, 243322, 262633, 120855, 112950, 90858, -36621, -62796, -231237, -209327, -129026, -162766, -99414, 68736, -106201, -85283, 156102, 246121, 16932, -105597, -65728, -6900, -66985, 123268, 81512, 5243, 176467, 181465, -89355, -178811, -256160, -275202, -215859, -142057, 2826, -49820, -111899, -64022, -46179, -66626, -18576, 163048, 194871, 135507, 70926, 29085, -141614, -74388, -121622, -101424, 85238, 32573, -76142, -42731, -77002, -214222]
1629b14222M7586L4033R6230l1993j68632p779J09950k5318R6106J40661m7374
1618B9248l4099J65906r1141j28031P310L6027L3609m0350k0539L3646L01329
1607B92915j69259k51650L6640J14666m2285l5828l0108j36816J64643Q9896j73365
1596a40551M7793J41280n5269n5653j16618K128J99547J50521j91864J8062q7381
1585h8005M9822j39448o8377j9340j10847L7586J14816Q718J9331R3698q5051
1574a87097n3459k3534Q7442R2624K1663j08714O3713J50108j13506r8116N2382
1563a16494o0703r3350J46909o4648j47176K24673O484q0702R9290P139P4576
1552d002K30470m6594k47611j77518R5939J05168j35447J54195j28970J55055
$$ y = [-214222, -166636, -132603, -36373, -68366, -236998, -244777, -134827, -160145, -64039, 76622, 29248, -4851, 161055, 69914, -58117, -50807, -14780, 18829, -21521, -42060, -8414, 292915, 123656, -127994, -91354, 23312, -18973, -54801, -84909, -221725, -57082, 32814, -140551, -92758, 48522, -6747, -62400, -179018, -176890, 22657, 173178, -18686, -624, -88005, -38183, -177631, -246008, -265348, -376195, -338609, -223793, -215075, -195744, -102046, -187097, -240556, -264090, -176648, -84024, -62361, -171075, -107362, 42746, -70760, -168876, -116494, -177197, -270547, -123638, -188286, -335462, -110789, -104305, -185007, -85717, -78578, -4002, 226468, 179874, -67737, -245255, -149316, -44148, -179595, -25400, -154370, 685]
1542F85M1836L3202j4933k21245L3805N7826J37269j31831k8335k2635Q7685J11826
1530H5155k17533K7965P2038J35194j86873j10738k6278N5934m8843J9230J98520
1519C771N7539N5421k40431P0241K47568J44127m18732p2746p707P7281r9513
1508a83181R7050Q3513j75553N3651q6720J17617n1233K948O2423j66297L7847
1497b07935K3490l5246P7622l4921o0518K28515N1800k61276J19852N9508r5828
1486a34937j31945J72779j00492O0093J53249j30601J92184k43955q7133R1400
1476a59358Q4871O0567l0214l20150J60222L08907j67491q7881j04182J82389
1466g2320j45037p6368N3927M3927o3355J73522K01087l5843j50370J3000K32161
$$ y = [685, 42521, 75723, 60790, -160455, -126650, -68824, 68445, -63386, -91721, -114356, -26671, 85155, -132378, -104413, -32375, 102819, -84054, -194792, -221070, -165136, -213979, -194749, 3771, 61310, 116731, -123700, -53459, 194109, 338236, -80496, -153242, -160949, -83668, -183181, -86131, -2618, -178171, -124520, -211240, -93623, -144856, -141908, -79485, -245782, -207935, -184445, -219691, -142069, -176990, -237508, -8993, 42807, -218469, -98617, -39109, -134937, -266882, -94103, -194595, -134502, 18747, -111854, 80330, -163625, -250758, -159358, -74487, -13920, -44134, -364284, -204062, 104845, -62646, -150527, -254709, -72320, -217357, -293725, -239798, -195871, -259226, -85704, 115383, 79540, -70830, -57830, 174331]
1455A74331r8498j72266j04827L9015j14253M5093J70041j03399P4103k54970
1445c45630K7488J05857O9993K3562k3975K03978j30437p0637N7460o6062J21552
1434b6851j35504m5872Q678O8264K79628j9595N8391k72989J16626q5348M3690
1423a0882M5690k15282Q658K53693M6460J3075M9127k63983r8122J26288k7903
1412g3181J17885p2829J4123R1064l24982J86096l1368J1387K8543j29222j8500
1401b00984J27983J01025j72221P4394P2743r045j15257J16096m4563L8125l198
1390a4902j3939M9737M8117K4278j52738R7660L59j49458J23211r0015l18917
1379c96607O9561K40384J13514P6473Q0859l20970k201Q7886R1117J8927O9731
$$ y = [174331, 75833, -96433, -201260, -162245, -276498, -231405, -61364, -164763, -90660, -345630, -318142, -212285, -142292, -118730, -142705, 61273, -69164, -139801, -82341, -148403, -26851, -162355, -208227, -199549, -131285, 148343, 128748, 187139, -85850, 30776, -54572, -10882, 34808, -180474, -171816, 81877, 128337, 141412, 190539, -73444, -171566, -45278, -73181, 44704, -28125, -14002, 77062, -247920, -61824, -93192, -81805, -53262, -182484, -200984, -73001, 28024, -144197, -69803, 2940, -6105, -121362, -5266, -49829, -11704, -14902, -28841, 20896, 69013, 93291, -59447, 38213, 38572, -110886, 12325, -77690, -396607, -327046, -86662, 26852, 103325, 184184, -136786, -138987, -51101, 40016, 58943, 128674]
1368A28674j73398n5660M8953k519J59369j48045k2437L4407Q9l9353K4131P2041
1356B6252j9062p6102J42027o8897J96973n6914k29130j6847o0983J53554K2331
1345A3202j44930Q3665K35443j48074o413j0084J6218J67857j51115p6062j93338
1334b13631K17854R1807j23819j88155R8402J07897p1845K7400j30922q7411J07292
1323a65131K47365J84000k9500q4751k38946P2062p2736j370J10293o5100Q8041
1312D4227j75156M1003m6941k57M8336J90005o2633q1245j33800M8136N4796K9762
1300d3767J5765P8102k54634J14587J33565l4720p75J08557r2032k310j14694
1289i2356p6835o227J25973K49722j12916j81837J60370P9195j70124j94381N189
$$ y = [128674, -44724, -100384, -51431, -53950, 105419, -42626, -65063, -30656, -30567, -69920, -45789, 26252, 7190, -68912, 73115, 4218, 201191, 144277, -84853, -101700, -162683, -9129, 13202, -131728, -48063, 187380, 39306, 32893, 22809, 39027, 206884, 55769, -20293, -213631, 4223, 96030, -27789, -215944, -117542, -9645, -81490, -54090, -185012, -272423, -165131, 82234, 266234, 236734, 151983, -86963, -14901, -87637, -89007, 21286, -43814, 44227, -130929, -89926, -136867, -137124, -88788, 101217, 38584, -42661, -176461, -128325, -73529, -43767, -28002, 50100, -204534, -89947, 43618, 8898, 8123, 116680, 24648, 22338, -92356, -169191, -175418, -49445, 200277, 87361, -94476, 65894, 145089, -25035, -219416, -214227]
1278b14227K01179N3725J14301K517l4571L712j03650j23807j27230J46758J9928
1267f1365J05355K75535k39244k24453j1102R8448J29318j12968P2294m4120M3253
1256C0951J29259j00093K0779J9717J94709j65256Q053Q9321q6139l2326j26593
1245a7618p4083l33O9491J39082q9452O2190p381L3944j04235R7852R6368j99967
1233E858k0932j9294n5458P3509M4334L1045l7657q0338J3466j0073J02653L4871
1221H1984m18983R540K80569n5709j30179J70613P089Q4091J43574L2394k6169
1210A78814j13545q1464m3035P5607o7708n7928J08141j18259K6320J3308O0395
1199a9354m110j24537Q7231N561l0598J2627o49L6227J59488J38755p3151j05108
$$ y = [-214227, -13048, 40677, 154978, 157495, 122924, 126636, 22986, -100821, -228051, -81293, -61365, 43990, 319525, 80281, -144172, -155274, -56826, 72492, -40476, 31818, -12302, 30951, 160210, 60117, 80896, 100613, 295322, 130066, 138119, 227440, 141301, 108975, -17618, -91701, -92034, -22543, 116539, 27087, 89277, 81896, 115840, 11605, 109457, 205825, 5858, -15074, -34368, -89826, -16317, 28017, 59062, 21405, -58933, -45467, -55540, 47113, 81984, -336999, -327459, -46890, -102599, -232778, -62165, -55076, 29015, 172589, 204983, 178814, 65269, -16195, -59230, 16377, -51331, -109259, -1118, -119377, -93057, -79749, -19354, -23464, -148001, -60770, -55209, -85807, -73180, -73829, -37602, 121886, 260641, 187490, 82382]
1187H2382L2572j75905p8970P078n061k1487j38131K54710L5217P8764l3754k63077
1175b25662K20657o6180k69906J47816J35360P6907l2980J2835k25942m0423O6996
1164b00522J97399M229j55743K0243n1055J9622M4339P4771M4755M1861j13399
1153g3500Q7147J7351J9651l07272K0625J46068L1718K23866j60877R1800n8284
1142C8293l60266J96000L4095N4002o1271r4983J07615J02206K03167r63o4011
1131A53884j0394j67942o7448J02824P6756L0782K6759P7493j57404k35038p3356
1120b43084K2914O8187o2274J65509J40100O384j93692j15708O1108O7550O1882
1109b1124q4231l4919K609p9186J79487L5429j17346K00887R6395k06914j82518
$$ y = [82382, 114954, -60951, -139921, -132843, -137904, -159391, -297522, -42812, -7595, 71169, 37415, -225662, -5005, -71185, -341091, -193275, -57915, 18992, -13988, -1153, -227095, -267518, -200522, -3123, 1106, -154637, -134394, -185449, -165827, -121488, -46717, -1962, 39899, -73500, 13647, 30998, 50649, -256623, -235998, -89930, -58212, 165654, 4777, 96577, 38293, -321973, -125973, -91878, -37876, -99147, -194130, -86515, 15691, 218858, 217895, 153884, 143490, -24452, -91900, 10924, 87680, 118462, 145221, 222714, 65310, -169728, -243084, -220170, -151983, -214257, -48748, 91352, 97736, -95956, -211664, -150556, -83006, -21124, -105355, -140274, -137665, -216851, -37364, -1935, -119281, 81606, 178001, -28913, -211431]
1098b11431J04512P2651n5187j58528K28148K1340j1264J14111J8579m4898r6047
1087a8014P6042j11379J29823r4640j67603N623J79180L2353K09813j76743j49813
1076h5358m0225J22116Q9476R8478N3395k72237J15454R3334j36130J31018r7382
1065G1939r4591r9235l9695J06371K24608j92703l0658J21272m162J9595j77017
1054i4276J0112J08352Q6555j46999p2640R137P2285q6165J75445r6374j24030
1043a58598R8922M7540M4020p7622r4410K5940K2618q3026O4815n289J29112j2426
1031A596k32908K88712L9193q5448J5836J05958l2823r1766j9707O8559k1508
1020C5694m5718J2290n4237q4599J44779j57939J32991J04329j28488J27019J12082
$$ y = [-211431, -106919, -34268, -89455, -247983, -19835, 1505, -9759, 104352, 122931, 78033, -18014, 58028, -53351, 76472, -18168, -185771, -180148, -968, 31385, 241198, 64455, -85358, -125583, -3467, 86009, 184487, 237882, -34355, 81099, 174433, 38303, 169321, 71939, -22652, -121887, -161582, -55211, 169397, -23306, -53964, 67308, 63146, 82741, -94276, -84164, 24188, 110743, -36256, -108896, -99759, -27474, -113639, 61806, -34568, -158598, -59676, -12136, 31884, -45738, -140148, -114208, -91590, -174616, -109801, -115090, 14022, 1596, -231312, 57400, 96593, 11145, 26981, 132939, 100116, 8350, -11357, 57202, 35694, -10024, 2266, -51971, -136570, 8209, -149730, -16739, 87590, -40898, 86121, 198203]
1009A98203k89999n7034K27665k25151O4852K05315m0007j04712j3937Q7998j19629
998f6436m7882J00867m8346M0602L9249j5652J0523p0920J56502j51796R5844
987D2555k9996p9266m0959J47979O4995n8191j5688p9750n8118n6212P918M8527
975a06206L19765p8067j7567k291j41608k4376J61221n3519k2790M7504j9514
964F2552J11286k5594j17564Q370j6248j16645J29162M3164Q9578o1825j05994
953B42k8616N056j31108l0290J37129J53682n2952K73k1481R1192L0527n2988
941A00666p1847K2325N9463p5281P8232J05500j05977j11094Q8130j49620m779
930f4282j1234L3279J79366Q6345m0070p120L5773J88388j68879R284k3654j47997
$$ y = [198203, -91796, -148830, 78835, -146316, -81464, 123851, 83844, -20868, -34805, 53193, -66436, -114318, -13451, -61797, -21195, 18054, 2402, 12925, -57995, 98507, -53289, 42555, 12559, -66707, -107666, 40313, 105308, 47117, 31429, -48321, -106439, -162651, -154733, -106206, 213559, 135492, 117925, 115634, -25974, -50350, 110871, 57352, 34562, 82066, 62552, 173838, 148244, 30680, 39050, 22802, -93843, 35319, 78483, 168061, 106236, 242, -28374, -23318, -154426, -184716, -47587, 106095, 53143, 53416, 31935, 123127, 153654, 100666, 28819, 51144, 110607, 35326, 113558, 219058, 113081, 1987, 90117, -59503, -64282, -75516, -42237, 137129, 223474, 183404, 176284, 212057, 400445, 231566, 240850, 217196, 69199]
918F9199k48577N3449Q7752Q7304P9943j29637k47143N5846J6584J20048K22890
907A67658l6619K133J1225k55439N2410j15318j8143K57011j05151n6191J78441
896H2017j42162N0430J51148j8189m4816k16361O8262L1818R8972P4249P9842
885B15210j3728K3466J5815l25492J10821o3912P8494L8985p0129N0267J77147
874B36944j598k34551l7371K06508n794k0494k1486p8086n112j61089J517l2428
862a53040J32732P3780J0749N551j40709K9938q4924J8976p0544l2170J60266
851d9395j08617R0167Q5033P6694j31791j56492Q4665k1780P8915J06037J9940
840G3376L6033j85853N3494N3868J9511k2040k8739j13917M9494o8833J48370
$$ y = [69199, -179378, -125929, -38177, 49127, 129070, -567, -247710, -191864, -175280, -55232, 167658, 131039, 133172, 144397, -111042, -58632, -173950, -192093, 64918, -40233, -96424, 82017, -60145, -9715, 141433, 123244, 78428, -137933, -69671, -37853, 61119, 135368, 215210, 201482, 224948, 240763, -84729, 26092, -37820, 40674, 79659, 9530, 59797, 236944, 235346, 795, -36576, 169932, 164138, 143644, 122158, 44072, 38960, -122129, -120612, -153040, -20308, 53472, 64221, 69772, -70937, -40999, -125923, -106947, -177491, -209661, -49395, -158012, -67845, 17188, 93882, -37909, -194401, -109736, -131516, -52601, 53436, 73376, 109409, -76444, -22950, 30918, 50429, 28389, -350, -114267, -64773, -133606, 14764]
829A4764r7844J41898K06813j59935J29691k5757q8877k2003k1149j66940Q5607
818c732J3781q0173n7721J12462J3362j77202P7399j4530K20P5808J7236q4620
806a07710J68735J22344p1898L8418R456j30452R8951K5177k4127k24970J60946
795F4870O2076J18893q4058n7732j21300q8631K9461N6161P8897L1121k1946j5632
783E2180O9880r0770L2264j11199j86133J41655l0881j26790J84065o943m274
772g6946J44776j41379K1064J732J0067J02331P7506l2972j07124k1859Q5719
761F2915j04101L0730k655k36913J37880J76308l0188j64745J31389q9607m3952
750a32939K2175j5079J12483K3171l6286Q7018r8931J8513j5329K51331r5718
$$ y = [14764, -83080, 58818, 265631, 105696, 235387, 209630, 120753, 98750, 77601, -89339, -3732, 10049, -70124, -127845, -15383, -2021, -179223, -101824, -116354, -116134, -40326, -23090, -107710, 61025, 183369, 111471, 149889, 159345, 28893, 127844, 153021, 128894, -96076, 64870, 126946, 245839, 161781, 104049, -17251, -105882, -76421, -20260, 58637, 89758, 67812, 52180, 122060, 31290, 63554, -47645, -233778, -92123, -123004, -249794, -65729, -72672, -76946, 67830, -73549, -52485, -50753, -40686, 61645, 139151, 106179, -945, -22804, 62915, -41186, -10456, -13111, -250024, -112144, 64164, 33976, -130769, 620, -88987, -132939, -110764, -125843, -13360, 9811, -26475, 60543, -38388, -19875, -35204, 216127, 120409]
739A20409k65186J8411R6680L3610J8705j45778L2669M6026N9104J36670K2739
728A74059j62891l3400L9799l9953L8798N7113l5684j3494J22299M938k45264
717i3680k8502J37701J58954O4262j30193k51809J78900R1905j56987J13496M1509
706A25556j70848q6121M5411J42054J12007m8689l4026K307j82336m1543M2266
695i3962K49254Q2483j90294J53180p7338l7469J4998p1694R0152j22038O6164
684F3436K5776j82015k6268p5427J61941O4611l225j0452l9009p3457L6740l7797
672i5146n0857q9112O2630O7616k3051J09010j56756N0333L1898J30927n5846
661a8354k02347K31498N3047j34164K01647K2018o7394k6207j67427o1663K45803
$$ y = [120409, -144777, -126366, -29686, 3924, 22629, -123149, -90480, -44454, 14650, 151320, 174059, 11168, -22232, 17567, -22386, 16412, 73525, 37841, 24347, 146646, 151584, -93680, -122182, 15519, 174473, 238735, 108542, -143267, 35633, 127538, -29449, 84047, 125556, -45292, -131413, -86002, 56052, 168059, 119370, 85344, 87651, -94685, -136228, -93962, 155292, 237775, 47481, 200661, 123323, 85854, 100852, 29158, 119310, -2728, 63436, 89212, -92803, -119071, -194498, -32557, 32054, 28829, 18377, -20632, -94089, -57349, -95146, -146003, -235115, -172485, -104869, -127920, -18910, -175666, -125333, -93435, 37492, -18354, -220701, 10797, 63844, -70320, 131327, 153345, 85951, 59744, -107683, -169346, 76457]
650G6457J53242j09251k61645J60086J9200l15035J27810J47142J53611j29255
640B2362J04236k7199l3138Q655J47041k13366j10241J42428P2391k9267M184
629H8086j05296P8950k5573q0054J9205N7925R6910J6189L3334j05890o9339L5014
617C9461R3496q108L1627j32398j70981K36978J12965r3404p2674R39j38432o8789
605a69320J85943P4230Q0837n8628J42051j31916j28327J75384o8853j28480P183
594a9896L3966j37470o3488J40461l2973k4743K3846J44460j39359J22152P6501
583A23457q0698J31647L6937P2259j13937j32156j74571K67836O2581o7528j36179
572a0352j2975P5519j53942J56161J01340j9177R913K0027j41053p8724j1599
$$ y = [76457, 229699, 120448, -141197, 18889, 38089, -276946, -149136, -1994, 151617, 22362, 126598, 99399, 66261, 74916, 221957, 8591, -101650, 40778, 113169, 83902, 88086, -17210, 61740, 36167, -43887, -24682, 33243, 130153, 146342, 179676, 73786, 4447, 39461, 132957, 124849, 156476, 24078, -146903, 90075, 203040, 109636, 36962, 37901, -100531, -169320, 16623, 90853, 171690, 113062, 255113, 123197, -5130, 170254, 101401, -27079, -19896, 14070, -123400, -186888, -46427, -79400, -104143, -80297, 64163, -75196, 46956, 123457, 42759, 174406, 211343, 283602, 169665, 37509, -137062, 130774, 193355, 125827, -10352, -23327, 52192, -101750, 54411, 155751, 136574, 146487, 166514, 25461, -53263, -64862]
561f4862L77187O520j27745n7417j31061q8362j468R3001j42446j5490J1722J0022
549a30399Q5257L0915k464k4495m8998J55074j5700j38557q9141N2641O4876L59349
537B98358n3611j39170J57511l3221k26945n5573P4302p9804J75422J05614j16191
526A06692q7360O6994J81476k876l18711L0134K47197n0732j1264l7629M1766
515A65687j35722j9943P3953P0392J4541m7729K08694p3480j19840q4884j51135
504i9466J54796J67510j37992k27299J10122Q9215k28337J66878J61981q8619
494F8789J7787K84608j63686n3807m4808j23422K84687j97594k8026Q1885j05354
483B1059P8170k02768M0087O7493N8975j26798n8856o5985J03701J76630N9822
$$ y = [-64862, 312325, 318845, 191100, 133683, 2622, -85740, -87208, 5793, -136653, -152143, -140421, -130399, -45142, -14227, -16691, -41186, -90184, 64890, 49190, -89367, -178508, -125867, -60991, 298358, 244747, 105577, 263088, 229867, 2922, -52651, 21651, -58153, 117269, 222883, 106692, 19332, 86326, 267802, 264926, -53785, -23651, 223546, 172814, 161550, 123921, 165687, 29965, 10022, 83975, 154367, 168908, 121179, 329873, 256393, 136553, 51669, -99466, 55330, 222840, 84848, -142451, -32329, 56886, -171451, -4573, 157408, 68789, 86576, 371184, 207498, 153691, 108883, -14539, 270148, 72554, 44528, 126413, 21059, 99229, -103539, -63452, 4041, 63016, -63782, -122638, -188623, -84922, 91708, 151530]
472A51530l6957j21406j62183P8591J75235q6981l50375P7540L08162J6051j2964
461C6243K26675Q812l20916J43729j40275l85234J40735K34435j8238N8695J11960
450I6621j1620q5852m6572j13641O4719J25157L629N0265n44j71878L5188J2007
438d2521J16809Q3160k94313R6983J41293Q329l3308K2322m6679j95951j98248
427c42124K36445J03221q8723K08395M3874j14763j17697j35833P4105Q985J44794
416B0679K8556k4050K21944j82748q6051P4925j6770Q834J61633k32267N29K47378
404B22592j55395P223p8449j50097J59896p5501l9662R8359K23907n0136M0479
393B03216j36096l878L8739J08824j07079J07240k06307m8331J7733J87474p7010
$$ y = [151530, 114573, -6833, -169016, -90425, 84810, -2171, -352546, -275006, 33156, 49207, 36243, 262918, 271730, -49186, 94543, -45732, -430966, -290231, -55796, -74034, -15339, 96621, 85001, -851, -47423, -161064, -96345, 28812, 32441, 82706, 82162, -89716, -54528, -42521, 74288, 157448, -136865, -39882, 101411, 109740, 76432, 98754, 52075, -143876, -342124, -105679, -2458, -91181, 117214, 161088, 46325, -71372, -207205, -133100, -124115, 20679, 49235, 25185, 247129, 64381, -21670, 53255, 36485, 45319, 206952, -25315, -24786, 222592, 67197, 74420, -4029, -154126, 5770, -69731, -109393, -11034, 212873, 162737, 203216, 67120, 63242, 101981, 210805, 103726, 210966, 4659, -43672, -25939, 161535, 84525]
382H4525k1079J68215m0840O8738N8259k77225R2792J47096j06402K02956k44027
371A33008q2648N0420J12616j86628j0646n842m9479R1255O6112K6547L0730k8182
359A47263j11522R9974M0599k8354k6084j01374l2573L9368k7862J36510l4597
348A01348k61320J58843j2944L6809j8307j38085j4521J957J23170K76964j31181
337A22733j92244O9627K26843q5734j7590j44812J4704L7901n4355Q5355J60159
326B22587L541j04737r4654P7099j02554N5682J34521O6889k4935q6013p4959
315G2467J2267j057J91137l6520j81209j31126r459J04947p5524M500P0423J4533
303C5379O5121R1646M9969l8732j25428J48138P2049L0773P8249j05196p3646
$$ y = [84525, 63446, 231661, 190821, 259559, 317818, 40593, 133385, 280481, 174079, 377035, 133008, 50360, 100780, 213396, 26768, 16122, 10280, -39199, 52056, 118168, 144715, 175445, 147263, 35741, 135715, 176314, 147960, 121876, 20502, -12071, 27297, -565, 135945, 101348, -159972, -1129, -14073, 22736, 4429, -133656, -148177, -146220, -23050, 253914, 122733, -69511, 116, 226959, 141225, 123635, -21177, -6473, 31428, -22927, 62428, 222587, 226128, 121391, 26737, 103836, 1282, 56964, 191485, 258374, 233439, 147426, 72467, 84734, 83677, 274814, 238294, 57085, -74041, -83500, 21447, -54077, -49577, 20846, 35379, 100500, 192146, 242115, 203383, 77955, 226093, 298142, 328915, 407164, 301968, 228322]
292B28322l5979k0886M9238o3633m756j95779K6519R5316j52822j3487k0527J25409
280A6935J12791r3413j7745R3652P8518j16260k1399O8414j84515j78141K29659
269a1504m2826P888l4087j44251J4633L87505j30950m1741J43352p0834q921J23852
257A92116p9667K923J19438q0086o7607j471j34118p714J45637l9693n7736n2228
245f0206K81092j04432q6449J9216J22896o7453l8917K57185j17310j11657j98790
234a04825J35899m9546j10731L6649Q7918K56594O1435j52359N5578P7415j81434
223A12593o7218k6894p7822J14075J51075K0556J9408j21804P6593j16353j62430
212g8221q4004J5375K50617j36056J38987L2314k8939K8056k7217l5764j0735
$$ y = [228322, 192343, 171457, 220695, 157062, 152306, -43473, -16954, 78362, -74460, -87947, -108474, 16935, 129726, 36313, 18568, 112220, 190738, 74478, 53079, 121493, -63022, -241163, -11504, -54330, -46442, -80529, -224780, -210147, 177358, 46408, 4667, 148019, 77185, 68264, 192116, 112449, 115372, 234810, 154724, 87117, 85646, -48472, -56186, 89451, 49758, -7978, -60206, 220886, 116454, 30005, 49221, 172117, 104664, 65747, 322932, 205622, 93965, -104825, 31074, -18472, -129203, -92554, -4636, 251958, 313393, 161034, 216612, 294027, 112593, 45375, 18481, -59341, 54734, 205809, 226365, 245773, 123969, 200562, 84209, -78221, -162225, -146850, 103767, -32289, 106698, 139012, 110073, 138129, 110912, 75148, 64413]
201F4413P1441K8871O291j43385O4493p006p4100L4902O2567n6568R4565J12760
189B59244j11504j16563J84445n6935J8249N229Q4207p717K6069k36157M6027
178I4594j3548j05391Q9097J63776j65951m0136p751j41285Q659O6566K39994
167A88624m8528o1651n3848m3011J76632Q5345j50144n3812R5334J34484j97352
156G2073r3495J50891N0403l91900J26325K8721J56121R1294o4143M443J8285
145A49018p0131o1417p4535J44166J58410r685l03570k9019J59596N8960P3259
134A95052m6463j4316p768r552l7561q2584J0082J19034k2256R7246M0356N5280
122B96550j12881j54929J26390P3310j54951k8038J3559Q4548Q4327r774j15011
$$ y = [64413, 135854, 164725, 171016, 27631, 92124, 85118, 11018, 45920, 108487, 51919, 146484, 259244, 147740, 31177, 215622, 158687, 176936, 182165, 266372, 258655, 284724, 48567, 94594, 81046, -24345, 64752, 228528, 62577, 22441, 14690, -126595, -117936, -51370, 188624, 140096, 78445, 24597, -18414, 158218, 243563, 93419, 39607, 134941, 269425, 72073, -21422, 129469, 179872, -212028, -85703, -56982, 99139, 190433, 126290, 130733, 149018, 78887, 17470, -57065, 87101, 245511, 235826, -67744, -96763, 62833, 121793, 195052, 148589, 134273, 126505, 116953, 79392, -3192, 6890, 125924, 103668, 200914, 241270, 296550, 183669, 28740, 155130, 228440, 73489, 45451, 59010, 143558, 227885, 218111, 103100]
111A03100L7028j41579J18540o9266j71057J11467J68338q292p5524l0366j04943
100f2554j00682L7255J45821K811j24154J13968O0463j10747J7320R5540L828
89G8869J2425j7284r0302N3241O9004q177k5165J5141j9497M1773k5246r163L8187
76A13806k6421N7101j6927N1803j0309L4282N8821j52996k0231l0217m6274K7331
64C9769Q1478J97513j10907j88785m2681O4044m9373K2866J2726J4052P4727M10
52A15839j11863m8580K19096L2546j2692n7996O3352j46055Q2867J8647l9793
41A15368j08028P454K1083M1992o3020J13196p2859O4855p01k24567M4486K54699
29A93958J9276j22498Q1500J1125m6946j3290j0631p0713M6616J7244q9091R67
$$ y = [103100, 140128, -1451, 117089, 47823, -123234, -11767, 156571, 148279, 72755, 42389, -62554, -163236, -125981, 19840, 22651, -101503, 12465, 72928, -37819, -20499, 75041, 78869, 91294, 74010, -16292, 36949, 105953, 97776, 72611, 87752, 68255, 110028, 84782, 75619, 113806, 87385, 144486, 127559, 179362, 169053, 203335, 262156, 109160, 88929, 58712, 12438, 39769, 121247, 318760, 207853, 19068, -23613, 40431, -8942, 13924, 26650, 40702, 115429, 115839, 3976, -44604, 174492, 207038, 194346, 136350, 199702, 53647, 136514, 155161, 115368, 7340, 14794, 35877, 77869, 14849, 128045, 55186, 120041, 119340, -105227, -60741, 193958, 213234, 90736, 172236, 183361, 136415, 123125, 112494, 41781, 88397, 105641, 16550, 17517]
17A7517P5706Q163j2644K00626P348k31562J21244p338m5704j63889N2251K2599
5D4317j14287M2539L2467Q5261M9228
0A39525
$$ y = [17517, 93223, 101386, 88742, 289368, 296716, 65154, 186398, 179060, 133356, -30533, 21718, 44317, -69970, -27431, 5036, 90297, 139525]
$$ Imaginary data points
##PAGE= N=2
##DATA TABLE= (X++(I..I)), XYDATA
16383b431406P3647m1848j7697Q8437J05710K9569n5189k1116K01737m928J15891
16372a957193L663O8215R584J4181L5950q2646q058M9284J06563o9948P2109J37515
16360a620781r2924O3657L0656R1927K14929j48596J79498j8094k7093J20865
16350a205956P1723Q3598p2176Q1264m699J30222J41542k36008O6868J16636k9785
16339h56771o5629K19228J08105j16179L1302j402K3162r1839J76638K6775k5129
16328e71739O3740J14309M3208k6216R9824J93922N3883j36694m55m2317j74667
16317c83202k4395J13155J85451q5217R3588L1307L6577R1254j56J13846N0678
16306B22886J09842q8201k1590O9677M6843L3827J7858O0622J34598J5352o7892
$$ y = [-2431406, -2357759, -2399607, -2417304, -2328867, -2223157, -2193588, -2248777, -2269893, -2068156, -2073084, -1957193, -1953530, -1885315, -1875731, -1861550, -1825600, -1908246, -1916304, -1867020, -1760457, -1830405, -1758296, -1620781, -1713705, -1650048, -1619392, -1527465, -1312536, -1461132, -1281634, -1299728, -1326821, -1205956, -1134233, -1050635, -1122811, -1041547, -1046246, -916024, -774482, -1010490, -943622, -826986, -856771, -922400, -703172, -595067, -711246, -679944, -681346, -658184, -750023, -573385, -546610, -571739, -507999, -393690, -350482, -376698, -276874, -82952, -29069, -165763, -166218, -208535, -383202, -407597, -294442, -108991, -194208, -100620, -69313, -32736, 58518, 58362, 172208, 222886, 332728, 244527, 222937, 292614, 339457, 373284, 391142, 451764, 586362, 601714, 533822]
16295E33822J36251j21442N1818r900M0890J2963J468J3145j51334J37934O5184
16284G10799J75218n1942M3526l9414q8767J68584l1666L8003M6724J54632P5414
16273A201111l7961j04127M1907J48462Q6768l161O4374M9525j32054Q7532L6430
16262A438806k3908q7086R0177m8583j43963K34499J22385j27337k01547J21952
16252A375395J05754J1948K4068m8942j622Q8247J19768K4871R6142L0624p0024
16241A756229M8606m1902O5927M9914J5232J9411q574J1637J54717K3497l2224
16230B062470Q6736j30684L16J71228L2007J230K1758n2132Q3678k34264m3093
16219A999250O5509P7009J74613j1730j75193L8618J7686j14293J28332J16512
$$ y = [533822, 670073, 548631, 600449, 590549, 631439, 644402, 645870, 659015, 507681, 645615, 710799, 886017, 834075, 877601, 838187, 749420, 918004, 886338, 924341, 971065, 1125697, 1201111, 1163150, 1059023, 1100930, 1249392, 1336160, 1332999, 1397373, 1446898, 1314844, 1402376, 1438806, 1414898, 1327812, 1417989, 1369406, 1225443, 1459942, 1582327, 1454990, 1253443, 1375395, 1481149, 1493097, 1517165, 1468223, 1466601, 1554848, 1674616, 1699487, 1795629, 1826253, 1756229, 1804835, 1762933, 1828860, 1878774, 1894006, 1913417, 1904843, 1916480, 2071197, 2094694, 2062470, 2149206, 2018522, 2018838, 2190066, 2222073, 2223303, 2245061, 2192929, 2276607, 2042343, 1999250, 2064759, 2141768, 2316381, 2304651, 2129458, 2168076, 2185762, 2071469, 2199801, 2316313]
16209B316313K0349n5299j52521q3302K97649q5069K4436J60046J34523n9235
16199B517890R6383O081q9681l9472M1048P5421j00187k6933j6479k7556M5848
16188B482363Q6126L6760J60562L199o1330Q8119J92655j60710j42408m9219J33338
16177B769455o3069J56104r8532j05329N5292J11626L3555L0119J48702m3620
16167B994303q6518j36320j42747j04810J39735J00614J08073J35573j7157j21281
16157B869465l2445o7019j929n2436k0637K17803p6829o3679K08484q2157j41207
16146B757414J25376R5650j37131q9953L87912r7673Q9512j3487j43799j6010
16136B957811J08442p0962l7030j2651K13181K43408k35589j85606K3163J08053
$$ y = [2316313, 2336662, 2281363, 2128842, 2045540, 2343189, 2258120, 2282556, 2442602, 2577125, 2517890, 2614273, 2620354, 2530673, 2491201, 2532249, 2607670, 2507483, 2480550, 2464071, 2436515, 2482363, 2568489, 2605249, 2765811, 2769010, 2707680, 2795799, 2988454, 2827744, 2685336, 2636117, 2769455, 2706386, 2862490, 2763958, 2658629, 2713921, 2825547, 2859102, 2889221, 3037923, 2994303, 2907785, 2771465, 2628718, 2523908, 2663643, 2764257, 2872330, 3007903, 2990746, 2869465, 2837020, 2770001, 2768072, 2715636, 2694999, 2912802, 2835973, 2772294, 2980778, 2898621, 2757414, 2882790, 2978440, 2841309, 2751356, 3139268, 3041595, 3131107, 3117620, 2973821, 2957811, 3066253, 2995291, 2958261, 2945610, 3158791, 3402199, 3166610, 2981004, 3004167, 3112220]
16126C112220k01909K09262P0129M5054j1646k5079R1994j08341m3937p5730j08004
$$ y = [3112220, 2910311, 3119573, 3189702, 3234756, 3223110, 3198031, 3290025, 3181684, 3137747, 3062017, 2954013]
$$ [...]
##END NTUPLES=NMR SPECTRUM
##END=
