##TITLE=1H_EC-3269(21)
 CDCl3
 8 sc, 
 17.11.2021
##JCAMPDX= 6.0         $$ Bruker NMR JCAMP-DX V2.0
##DATA TYPE= NMR SPECTRUM
##DATA CLASS= NTUPLES
##ORIGIN= UXNMR, Bruker Analytische Messtechnik GmbH
##OWNER= root
$$ XWIN-NMR		Version 3.5
$$ Wed Nov 17 12:13:07 2021 Russian Standard Time (UT+4h)  she@DPX200
##.OBSERVE FREQUENCY= 200.131346
##.OBSERVE NUCLEUS= ^1H
##.ACQUISITION MODE= SIMULTANEOUS
##.ACQUISITION SCHEME= undefined
##.AVERAGES= 8
##.DIGITISER RES= 18
##SPECTROMETER/DATA SYSTEM= spect
##.PULSE SEQUENCE= zg30
##.SOLVENT NAME= Acetone
##.SHIFT REFERENCE= (INTERNAL, Acetone, 0, 15.716)
##AUDIT TRAIL= $$ (NUMBER, WHEN, WHO, WHERE, WHAT)
$$ ##TITLE= Audit trail, XWIN-NMR		Version 3.5
$$ ##JCAMPDX= 5.01
$$ ##ORIGIN= Bruker BioSpin GmbH
$$ ##OWNER= she
$$ F:/spectra/data/she/nmr/H-F/1/pdata/1/auditp.txt
$$ ##AUDIT TRAIL=  $$ (NUMBER, WHEN, WHO, WHERE, WHAT)
(   1,<2021-11-17 12:11:17.62 +0400>,<she>,<DPX200>,
      <created by zg, POWCHK disabled, PULCHK disabled
       configuration hash MD5:
       00 E9 B6 7A A2 85 ED C7 34 08 36 98 17 FE 4E 26
       data hash MD5: 16K
       04 CF EF 0F 01 45 2C E7 E3 C6 96 1D CF 0C 52 5B>)
(   2,<2021-11-17 12:11:22.21 +0400>,<she>,<DPX200>,
      <Start of raw data processing
       efp BC_mod = 2 LB = 0.24 FT_mod = 6 PKNL = 1 PHC0 = -15513.08 PHC1 = 13.00081 SI = 16K 
       data hash MD5: 16K
       7F 0E 0B F2 5E 5F FA FB FC 48 19 51 2C 86 9E B8>)
(   3,<2021-11-17 12:11:39.81 +0400>,<she>,<DPX200>,
      <pk PHC0 = 3.776975 PHC1 = -5.4 
       data hash MD5: 16K
       CD C4 96 2C D3 2A E6 75 11 23 96 88 B8 2A 08 5A>)
(   4,<2021-11-17 12:11:43.03 +0400>,<she>,<DPX200>,
      <abs ABSG = 5 
       data hash MD5: 16K
       08 D0 F2 10 80 DA A8 FE CF CF 37 35 19 C3 24 F9>)
$$ ##END=
$$ 
$$ hash MD5
$$ BA 7E 89 9C EA 8D 94 58 C9 2C 46 09 7F 74 30 12
##$RELAX= 
##$RELAX= 
##$RELAX= 
##$RELAX= 
##$RELAX= 
##$RELAX= 
$$ Bruker specific parameters
$$ --------------------------
##$DU= <F:/spectra>
##$EXPNO= 1
##$NAME= <H-F>
##$PROCNO= 1
##$TYPE= <nmr>
##$USER= <she>
##$AMP= (0..31)
100 100 100 100 100 100 100 100 100 100 100 100 100 100 100 100 100 100 
100 100 100 100 100 100 100 100 100 100 100 100 100 100 
##$AQSEQ= 0
##$AQ_mod= 1
##$AUNM= <au_zg>
##$AUTOPOS= <>
##$BF1= 200.13
##$BF2= 200.13
##$BF3= 200.13
##$BF4= 200.13
##$BF5= 200.13
##$BF6= 200.13
##$BF7= 200.13
##$BF8= 200.13
##$BYTORDA= 1
##$CFDGTYP= 0
##$CFRGTYP= 5
##$CHEMSTR= <none>
##$CNST= (0..31)
1 1 145 1 1 1 1 1 1 1 1 1 1 1 1 1 1 1 1 1 1 1 1 1 1 1 1 1 1 1 1 1 
##$CPDPRG= <>
##$CPDPRG1= <>
##$CPDPRG2= <>
##$CPDPRG3= <>
##$CPDPRG4= <mlev>
##$CPDPRG5= <mlev>
##$CPDPRG6= <mlev>
##$CPDPRG7= <mlev>
##$CPDPRG8= <mlev>
##$CPDPRGB= <>
##$CPDPRGT= <>
##$D= (0..31)
0 1.2 0 0 0 0 0 0 0 0.06 0 0.03 0 0 0 0 0.0002 0 0 0 0 0 0 0 0 0 0 0 0 
0 0 0 
##$DATE= 1637136677
##$DBL= (0..7)
120 120 120 120 120 120 120 120 
##$DBP= (0..7)
150 150 150 150 150 150 150 150 
##$DBP07= 0
##$DBPNAM0= <>
##$DBPNAM1= <>
##$DBPNAM2= <>
##$DBPNAM3= <>
##$DBPNAM4= <>
$$ [...]
##$SUBNAM2= <"">
##$SUBNAM3= <"">
##$SUBNAM4= <"">
##$SUBNAM5= <"">
##$SUBNAM6= <"">
##$SUBNAM7= <"">
##$SUBNAM8= <"">
##$SUBNAM9= <"">
##$SW= 18.0517287032376
##$SWIBOX= (0..15)
0 0 2 0 0 0 0 0 0 0 0 0 0 0 0 0 
##$SW_h= 3612.71676300578
##$TD= 16384
##$TD0= 1
##$TE= 0
##$TE2= 300
##$TE3= 300
##$TEG= 300
##$TL= (0..7)
0 120 120 120 120 120 120 120 
##$TP= (0..7)
150 150 150 150 150 150 150 150 
##$TP07= 0
##$TPNAME0= <>
##$TPNAME1= <>
##$TPNAME2= <>
##$TPNAME3= <>
##$TPNAME4= <>
##$TPNAME5= <>
##$TPNAME6= <>
##$TPNAME7= <>
##$TPOAL= (0..7)
0.5 0.5 0.5 0.5 0.5 0.5 0.5 0.5 
##$TPOFFS= (0..7)
0 0 0 0 0 0 0 0 
##$TUNHIN= 0
##$TUNHOUT= 0
##$TUNXOUT= 0
##$USERA1= <user>
##$USERA2= <user>
##$USERA3= <user>
##$USERA4= <user>
##$USERA5= <user>
##$V9= 5
##$VALIST= <valist>
##$VCLIST= <CCCCCCCCCCCCCCC>
##$VD= 0
##$VDLIST= <DDDDDDDDDDDDDDD>
##$VPLIST= <PPPPPPPPPPPPPPP>
##$VTLIST= <TTTTTTTTTTTTTTT>
##$WBST= 1024
##$WBSW= 4
##$XGAIN= (0..3)
0 0 0 0 
##$XL= 0
##$YL= 0
##$YMAX_a= 57152
##$YMIN_a= -101196
##$ZGOPTNS= <>
##$ZL1= 120
##$ZL2= 120
##$ZL3= 120
##$ZL4= 120
##$ABSF1= 15.72485
##$ABSF2= -2.327
##$ABSG= 5
##$ABSL= 3
##$ALPHA= 0
##$AQORDER= 0
##$ASSFAC= 0
##$ASSFACI= 0
##$ASSFACX= 0
##$ASSWID= 0
##$AUNMP= <proc_1d>
##$AZFE= 0.1
##$AZFW= 0.1
##$BCFW= 0
##$BC_mod= 2
##$BYTORDP= 0
##$COROFFS= 0
##$CY= -3
##$DATMOD= 1
##$DC= 0
##$DFILT= <>
##$DTYPP= 0
##$F1P= 0
##$F2P= 0
##$FCOR= 1
##$FTSIZE= 16384
##$FT_mod= 6
##$GAMMA= 0
##$GB= 0
##$INTBC= 1
##$INTSCL= 0
##$ISEN= 128
##$LB= 0.24
##$LEV0= 0
##$LPBIN= 0
##$MAXI= 10000
##$MC2= 0
##$MEAN= 0
##$ME_mod= 0
##$MI= 1.114404
##$NCOEF= 0
##$NC_proc= -9
##$NLEV= 6
##$NOISF1= 3.799351
##$NOISF2= 2.8
##$NSP= 0
##$NTH_PI= 0
##$NZP= 0
##$OFFSET= 15.71604
##$PC= 1
##$PHC0= -15509.3
##$PHC1= 7.60081
##$PH_mod= 1
##$PKNL= yes
##$PPARMOD= 0
##$PSCAL= 0
##$PSIGN= 0
##$REVERSE= no
##$SF= 200.13000710694
##$SI= 16384
##$SIGF1= 3
##$SIGF2= 2
##$SINO= 5.538805
##$SIOLD= 16384
##$SREGLST= <1H.CDCl3>
##$SSB= 0
##$STSI= 16384
##$STSR= 0
##$SW_p= 3612.71676300578
##$SYMM= 0
##$S_DEV= 0
##$TDeff= 16384
##$TDoff= 0
##$TI= <>
##$TILT= no
##$TM1= 0
##$TM2= 0
##$TOPLEV= 0
##$USERP1= <user>
##$USERP2= <user>
##$USERP3= <user>
##$USERP4= <user>
##$USERP5= <user>
##$WDW= 1
##$XDIM= 16384
##$YMAX_p= 365355118
##$YMIN_p= -2606863
$$ End of Bruker specific parameters
$$ ---------------------------------
##NTUPLES= NMR SPECTRUM
##VAR_NAME=  FREQUENCY,     SPECTRUM/REAL,   SPECTRUM/IMAG
##SYMBOL=    X,             R,               I
##VAR_TYPE=  INDEPENDENT,   DEPENDENT,       DEPENDENT
##VAR_FORM=  AFFN,          ASDF,            ASDF
##VAR_DIM=   16384,         16384,           16384
##UNITS=     HZ,            ARBITRARY UNITS, ARBITRARY UNITS
##FACTOR=    0.220516191357247, 1,           1
##FIRST=     3145.25112836699, 0,            0
##LAST=      -467.465634638787, 0,           0
##MIN=       -467.465634638787, -2606863,    0
##MAX=       3145.25112836699, 365355118,    0
$$ Real data points
##PAGE= N=1
##DATA TABLE= (X++(R..R)), XYDATA
$$ [...]
9842 -357703 -473468 320439 126183 272827 -57756 331037 236146 279880 325608 692983
9832 692983 280027 211944 277868 449471 -178346 -126443 -432716 -365600 452332 1424337
9822 1424337 710401 442683 1105841 82472 160973 366830 1339252 1098088 1042858 1503756
9812 1503756 471600 -377812 -630363 -935088 -366238 215491 332488 597713 825341
9803 825341 731600 71416 125262 535896 221561 -236136 75941 524920 392043 410118
9793 410118 147071 818489 506222 709289 159638 92152 312561 608271 396003 101374
9783 101374 533376 602685 656672 464508 736304 816827 1401959 1977295 1743413 1779770
9773 1779770 1745404 1558477 1334386 1243936 2699073 3089498 3102681 3106823 3365435 4576807
9763 4576807 4834099 5492610 6816892 7688015 8350067 8828517 8726177 7579767 5742172
9754 5742172 4579528 4003016 3951974 3302461 2436314 1693356 1534405 2105655 2451425 2271320
9744 2271320 1542025 1793185 1636527 1354924 1584131 736463 1305194 1519687 1568423 719282
9734 719282 -325566 -346222 -117382 1234385 1970173 1617829 1160488 734564 871786 1107470
9724 1107470 1122458 895026 771063 590142 794149 313318 231969 206031 -266726 -308132
9714 -308132 24724 216657 478242 -32687 2306 654957 816391 103142 933345 241096
9704 241096 17413 639804 555121 951437 -125543 125410 -63956 787533 231071 103753
9694 103753 -467581 -485165 262997 515705 1003540 457007 422355 -253748 267867 -89074
9684 -89074 593605 454470 339316 1264461 1282042 952713 1003570 1466032 601601 1204556
9674 1204556 972860 579984 -351257 23596 304800 306553 387382 279237 457715 -175592
9664 -175592 -563533 394771 1229496 816877 671587 635561 1449851 2034466 1572699 1480204
9654 1480204 1159905 991866 710848 1701093 1378886 1646850 1973835 2590386 3548834 2918735
9644 2918735 1950403 2154622 1603516 589677 548037 961696 897954 815057 789830 577085
9634 577085 523322 421412 388243 -186984 -96137 423308 134177 -212954 277064 486616
9624 486616 451551 256618 574317 -317085 -369262 -388397 -498503 384920 555583 442835
9614 442835 127205 -274237 -34004 615020 244613 152963 -520630 383530 732691 377941
9604 377941 53425 572229 1783820 1823524 995954 719394 1088792 741140 1857993 2001409
9594 2001409 2526726 2487110 2694760 2359894 2083535 1902186 2469947 1907553 1048185 1262279
9584 1262279 1147556 789433 389946 647299 212578 960225 1200374 1670833 1153501 625871
9574 625871 397669 240815 657214 802304 862050 477620 1052936 1142544 747825 987771
9564 987771 1335464 479812 -308978 27154 636152 1507485 1491869 908820 1175126 113723
9554 113723 -31168 544211 1009613 294323 141453 220165 352085 663409 978971 829789
9544 829789 929325 908292 507905 608458 1221777 1260662 933152 1256870 422424 680207
9534 680207 847693 283463 913769 1206838 803364 561196 609216 327130 565632 546965
9524 546965 1093619 1535772 1255832 671537 1196365 1819255 1423032 1410494 762614 794312
9514 794312 459400 494382 441582 1180786 1288214 1054696 235052 476306 653634 113289
9504 113289 199128 470217 606920 1278187 456162 590460 1053754 1058055 604517 678684
9494 678684 1446646 715022 1062964 676906 591359 748753 1055930 2041408 1848458 1652081
9484 1652081 1869355 2242442 2850128 2990877 3069001 3689813 4744368 5440138 5410041 4020936
9474 4020936 3224896 2601269 2735684 2264841 1981835 2026878 1967567 1330311 1554454 1770883
9464 1770883 2120517 2023065 2261328 2446952 2518519 2802358 1933786 1626883 1144717 1486964
9454 1486964 948369 1576263 2364889 2507673 1280689 1948513 2199585 1901067 2053691
9445 2053691 1638152 1598950 1974004 2485733 2016720 2048243 1433390 1010208 1051840 1229264
9435 1229264 1057821 1684966 2331057 2467600 1880554 2195083 2684733 1939255 1898022 2464793
9425 2464793 2182319 2079101 2590997 2121603 2080434 1951525 2333365 1949483 2425654 2888708
9415 2888708 2753932 1952509 2031992 3013504 2843417 3718791 3454488 3170194 2990916 4121435
9405 4121435 4341832 4746895 5353053 5135360 4491367 4449020 5451983 5408073 4634972 4929863
9395 4929863 5786723 5835391 5389322 5237541 5229521 3956905 3473017 4258873 4428065 4030777
9385 4030777 3565224 3431875 4157816 3532289 3658029 3644043 3591834 3629921 3639281 3362269
9375 3362269 2807089 3028552 3008118 2739218 2640375 3055338 3357637 3401702 3621602 4718980
9365 4718980 4519001 4501134 3807343 3767202 4546136 4896666 4707458 5027099 5890951 5741781
9355 5741781 4817616 5235397 5722495 5637068 5736581 6011331 6583719 5900652 5933255 6169865
9345 6169865 6302318 5973965 6211427 6381571 6664542 6747315 6567550 6783667 7506615 7322067
9335 7322067 6800305 6739531 5951423 6181090 6256441 6346414 6504709 6838052 7380291 6586323
9325 6586323 6348266 6897674 6839977 6378555 6231566 6734554 7401740 7173239 7389076 7525981
9315 7525981 8149613 8366757 8781375 8663754 8355452 8481328 7822402 7505868 8280256 9431836
9305 9431836 9591841 8879676 8654903 8232809 8099709 8316207 8265197 7958107 7999943 7450545
9295 7450545 7697854 8339906 8176276 7688562 7714056 7005780 6577838 7114808 6851238 7051811
9285 7051811 6895123 6810601 6217051 7016139 7746102 7408293 7787561 7773453 8653023 8727977
9275 8727977 7830266 7656037 7752571 7469246 7219984 7499441 7492295 6751814 6754298 6520700
9265 6520700 5794131 5795389 5558968 5064826 5096344 5674546 5199137 4970996 5071404 4706719
9255 4706719 4487666 4791567 5171335 5384526 5612024 5535933 5225427 5255747 5359099 5928464
9245 5928464 5697546 5755612 5633119 6066370 5884533 6307906 5599186 5709743 5530443 5356957
9235 5356957 4976524 4775536 5144363 5617224 5068354 5277433 4954094 4477450 4664603 4630612
9225 4630612 4382026 4280998 3947989 4046417 4548032 4433643 3711045 3968464 4367064 4701729
9215 4701729 4357856 4087720 3925103 3022478 3193272 2888720 2110499 2839170 3689827 3682853
9205 3682853 3699085 2987405 3973967 4628274 3988899 3776408 4851524 4851089 4608243 4231301
9195 4231301 4959984 4753325 4600362 4563219 4845022 5424755 5349856 5075637 5599120 5714005
9185 5714005 5706759 5130146 4892485 5484405 5260774 4872777 4992102 5198377 5346355 5418673
9175 5418673 5998726 5332522 5491184 6058843 6485948 6531557 6257098 6454921 5685672 5444469
9165 5444469 6218399 6044442 5778480 6390471 6886190 7390352 7128859 6549565 6015494 6635138
9155 6635138 8296888 7809070 7983517 8296728 8420962 8817109 9142662 8923423 8579233
9146 8579233 8985615 9959512 9286390 8592351 9629132 10269945 10075969 9876470 10509094
9137 10509094 10710482 9530235 10603755 11342224 11720506 12533721 11881112 12096420 12351361
9128 12351361 12711689 14487540 15071861 15545291 16666439 16919943 17626701 18426444 19919811
9119 19919811 21226195 21605871 23134940 24541591 25593849 26578682 27765072 29767335
9111 29767335 31867982 32647077 33636469 34789198 35720372 37604048 38510420 40440594 42829493
9102 42829493 45677469 46690063 47597428 49856878 52501916 53378976 53506279 53387737 52794751
9093 52794751 53434489 54460924 54602857 54714168 54104571 52150566 50325651 48070612 46431276
9084 46431276 46604510 46442922 46028225 46650545 46899471 46845461 46986281 46849377 48483668
9075 48483668 49985909 51028731 51493149 51698269 52766529 54025223 54979912 56788626 58921327
9066 58921327 61070014 62921360 64401649 66571442 66911464 65767113 66155510 66311747 66692420
9057 66692420 65723807 64148094 62295344 61052636 59551195 57214723 54018737 48467403
9049 48467403 44422233 41276556 38077246 35907723 33795872 32785697 31936525 31030620
9041 31030620 30279690 29263549 28315757 27620334 26236209 25246697 23710400 21748167 21444650
9032 21444650 20543241 20406568 19115700 17912249 17252263 17564427 17131107 16941933 16373023
9023 16373023 16189127 16287284 15494796 15221559 14512715 15146000 13536903 13527604 13097814 12603084
9013 12603084 13055954 11938883 11867749 11812300 12463932 11593299 11195847 10910895 10716084 10662401
9003 10662401 10515463 10873096 11067056 12119730 10682155 9620646 10355375 10484290 9592325
8994 9592325 9823401 9406814 9168596 8815700 8748748 9213549 10342254 10348895 10035377 10134759
8984 10134759 8807529 8031663 9283585 9402631 8903884 9448233 8712318 8544707 8672847
8975 8672847 9507955 10030695 9922149 9623245 10531422 10041021 9395889 9618591 9799843 10266201
8965 10266201 9803868 9083494 9736634 10663562 10682809 10050045 9743305 10129044 10777374 10997006
8955 10997006 10290279 10121033 10519653 10693912 11654237 10822767 10853710 11155831 11461572 11225163
8945 11225163 11238013 11839355 12132496 11513971 11340049 10596705 10848882 11098340 11846140 11645970
8935 11645970 11955191 12017880 11190796 11781194 12012957 12854415 12571439 11874600 11426559 11424749
8925 11424749 11282221 11305500 12068773 12302120 12327158 12718255 12993713 13430668 14373907 14593811
8915 14593811 14109434 14409907 14217361 14501156 14890136 15425990 14774330 15353155 15209320
8906 15209320 14816882 15414750 15798377 16590318 16517821 16774743 16675355 16687412 17414189 18439720
8896 18439720 19015199 19545628 19751832 20288575 19727775 19523614 21386923 21227762 22061559
8887 22061559 22306021 21970173 22609489 24172119 25121280 25609620 27437256 28571577 30642549
8878 30642549 31128145 32427835 33985486 35584628 37611126 39058004 41077836 42617581
8870 42617581 43774109 45798883 47486319 47059113 46504793 46385065 46026509 45888576 45907813
8861 45907813 45868416 46122509 46136773 46244037 46226701 46048629 46663176 46558825 46530167 46953764
8851 46953764 47753769 48832082 50071856 52815086 54288376 55818687 58431057 60799002
8843 60799002 63459507 66663711 69450513 71862594 75013979 77165496 78075725 79642148
8835 79642148 79890775 81018169 79695136 78126388 76132708 75084375 73438058 72359715
8827 72359715 70917250 68067460 65446026 63180172 62432903 60594746 59530473 58948662
8819 58948662 58154107 57858317 57923286 58492488 57890606 58736719 61143457 62398703 65037126
8810 65037126 68257246 70238473 72240136 73637006 74267532 73992358 72231768 69844738
8802 69844738 69438932 69966115 70914027 71140614 68916701 66797262 64121113 61144696 58750392
8793 58750392 56393899 53534670 51194951 50376537 49094731 47431200 46567051 45379782
8785 45379782 44220640 43572841 43332302 43619781 43616025 43686765 43933468 44460983 45135479 45970464
8775 45970464 46080293 45195130 46333908 47307923 47643511 47482568 46498326 44469998 42547147
8766 42547147 40477670 38908813 37915823 36787013 35998557 35057279 33931770 33428147 33678234
8757 33678234 33277255 32449544 32881100 33241725 33131470 33300013 32766263 33389395 34650118
8748 34650118 35734078 36720682 37064257 37133606 37937717 40059679 39956833 41005402 42635892
8739 42635892 43615313 44339664 45507985 47586268 49891803 52365629 53890987 55704247
8731 55704247 57717869 60544165 64664157 69517944 75977743 83623713 91987733 100135987
8723 100135987 110313078 123175995 139490686 155706743 174196913 198698392 229915347
8716 229915347 267611596 297843663 283626136 239184881 196923074 164307006 141083104
8709 141083104 121754308 108414571 98560392 91363604 84946803 79246336 73806331 68537741
8701 68537741 65362879 62660120 59568495 58262988 56181511 54716169 54457395 53852404
8693 53852404 52796828 53435950 54587868 55186085 56036101 56370890 55995235 56853808 58275590
8684 58275590 58845192 59982794 60953582 60818183 60466514 58528418 56605920 55440888 52432411
8675 52432411 49416651 47740892 46528259 45319697 44145635 43588232 42211717 40900007
8667 40900007 39055015 38243637 37280457 37015900 36726926 36676311 37351775 37742634 37702865 38107017
8657 38107017 38477990 37651766 39311701 39875718 41408089 43501939 43776727 43701689 42989051
8648 42989051 42213005 40658848 40143544 38176536 36820148 35393048 34128189 33520679 32614056
8639 32614056 31431799 29418257 27878956 27406153 26450066 25048957 24220469 24027810 24103365
8630 24103365 23807085 22663944 22442961 22306018 22203608 21841808 21751286 22605307 22862978
8621 22862978 22072037 21745430 21730670 21597112 21902687 21539341 20884767 20786932 20329635 19552933
8611 19552933 18503117 18033038 17356451 16367990 15965331 15308232 15490507 14869962 13481599
8602 13481599 13513055 13154413 12865644 12667144 12079107 11828043 12100211 11988549 11295670 10637473
8592 10637473 10322812 9539822 9424195 9216372 9614345 10189348 9636317 9424560 9049004
8583 9049004 8676066 9570826 9766224 8978511 9566691 9456766 8999889 7412221 7507728 7837654
8573 7837654 7943839 6530878 6073428 6434913 6492095 6823825 6977748 6204909 6545345 6373669
8563 6373669 6053003 5950186 6577973 6036369 5878642 6367745 6130907 5638455 5270726 6147132
8553 6147132 5471841 5376187 5493446 5238021 5244500 4896226 4738559 4580141 4521751 4298827
8543 4298827 3796774 3713881 4048090 5013434 3967063 4232265 4704403 4372106 3551427 3110619
8533 3110619 2978661 2996137 3129565 3726544 3435522 3591338 4288826 4213890 3828498 3771999
8523 3771999 2910789 3111732 3661093 3149654 3547226 3249897 3196926 3228463 3664880 2621169
8513 2621169 2817368 3701432 2886120 2000424 2631849 2296438 2406364 2557612 2460985 2634696
8503 2634696 2138645 3298217 3371064 3003689 2813062 2314942 2592136 2717199 2351232 2300939
8493 2300939 2263693 2004302 2568885 2404631 2105790 1987475 1666841 2177561 1881909 1597793
8483 1597793 2592607 2137625 2522640 3048664 2758742 2709086 2842634 2803545 2107062 2159198
8473 2159198 2461059 2753389 3222908 3485602 2915677 2385146 2395098 1680462 2214964 2202494
8463 2202494 2314914 2211228 1650706 2413826 2318316 2485812 1737286 1449394 2159371 1807628
8453 1807628 2530504 2389677 2250273 1739059 1314213 1788053 1661768 800879 1288658 1965683
8443 1965683 2257388 1905380 1037962 1719449 2205695 1960479 988894 1806328 2311872 1918944
8433 1918944 2031094 2166687 1712823 1642834 1172492 1674780 1544419 1456826 1365992 833449
8423 833449 230489 778785 816157 527643 939846 763260 962350 739982 1363361 1787175
8413 1787175 1207887 411416 737666 426713 469172 1291509 1195186 1139168 1678295 2248625
8403 2248625 694418 1090596 1251214 834288 1087291 1371839 1624106 2305698 1959412
8394 1959412 964932 1090444 1059030 1421356 1015529 1299789 1230922 1211063 847153 1615227
8384 1615227 1875866 1802584 1935137 639676 1488126 1545825 2029207 1640274 876021 994454
8374 994454 989489 1694754 2355451 2227264 1994467 809283 739526 1126838 2030493 1786640
8364 1786640 2027532 2253427 1645072 1708393 1663412 1934398 1749888 1993449 2193440 2412793
8354 2412793 1982145 2408379 2392692 2170914 1721699 2380300 2850367 2822804 2662892 3009724
8344 3009724 3026587 2433483 2380880 2694905 2526776 1959288 1851872 2087365 2069803 2278218
8334 2278218 2289540 2393659 2296055 2851237 3160306 3914983 3623224 3663398 4253838 4040920
8324 4040920 4610713 4372492 4186406 5000369 5067636 5026930 5681445 6019724 5165169 4500144
8314 4500144 4833971 3589695 3369910 3220927 3292600 3133971 4049721 4279514 3909137 3354692
8304 3354692 2551547 2727498 2595139 2775117 3539891 3792924 4065460 3447571 3467891 5112467
8294 5112467 5056069 4763021 4308821 4690054 3985515 4060317 4374008 4963495 4305163 4362652
8284 4362652 4354882 5212110 5216968 4402075 4969454 4486961 4842347 4928109 5165039 6085946
8274 6085946 6947504 7135714 7310544 7812241 9086394 9713788 10871185 12423618 13154371
8265 13154371 13745994 16084453 18696071 20479627 23005146 26139409 29474869 29063359
8257 29063359 25348719 20853995 17333613 15986578 14167776 12791983 12546521 11582871
8249 11582871 11385791 10992555 11335277 11724792 11850349 12601356 12459834 13498302 13822418
8240 13822418 14890660 16756181 18358805 19839636 21523420 23457086 26609903 30052949
8232 30052949 32432404 29478999 24705667 20703641 18231698 15711532 13898184 13271404
8224 13271404 11447305 11171766 10782711 10769489 10843139 10588878 10120672 9698446 9795955 9750518
8214 9750518 9397471 9716956 9606177 9741287 10917343 12263664 13159487 13693607 14373866
8205 14373866 15561467 17116933 19040432 20337408 22785112 25075232 29819739 33668474
8197 33668474 34262013 29835534 26550493 23449958 22526430 17301274 8863552 10353896
8189 10353896 9521706 10080528 10311230 10443094 10045431 9421298 10349489 11915198 11984540
8180 11984540 12773420 13811071 14518298 16665936 17637539 19513140 22467116 25469779 29470052
8171 29470052 33340865 32199614 26220822 21833420 18156985 14773131 12911967 11207031
8163 11207031 9574236 7823742 7506574 7581236 7775435 6934348 6428070 5732344 5046915
8154 5046915 4836636 3983847 4479814 4037769 3642727 3945526 3746270 3513067 3536323 3124709
8144 3124709 2565955 3218605 3265652 3400110 3049511 3198606 2680566 2106445 2989270 2847357
8134 2847357 2763979 2525715 2734409 2640655 2225600 2026481 2094709 2687852 1933192 2486458
8124 2486458 1989204 1350013 1337168 1024206 1748670 1727150 1488864 836344 785037 1454388
8114 1454388 1629682 2389744 758602 736638 1085126 1003506 1720338 850546 662969 763075
8104 763075 1099954 965727 1228523 827823 991232 1059728 1709484 1500261 1377203 1516876
8094 1516876 861136 -273080 595095 571450 678657 1013761 639321 469012 171177 778071
8084 778071 898277 663723 864263 1378149 831234 939630 707206 1030963 739678 821938
8074 821938 988789 781197 1385818 1181612 155130 803893 1052674 903950 798231 872486
8064 872486 1153719 1474946 1089779 787674 159707 270688 437462 349387 614991 300602
8054 300602 -307803 40643 260796 376844 167080 -405666 -119270 -4976 -466051 -33675
8044 -33675 222417 -153309 113532 -439786 -55435 398213 105604 57510 1098661 662779
8034 662779 455875 172157 -122668 111336 486943 1242319 1547360 586734 104792 12596
8024 12596 -43944 -1111116 -538266 134541 -686943 210386 -97769 -389955 289681 -84794
8014 -84794 -925823 -167084 -547841 -267687 395165 -44731 500178 -30719 87616 358489
8004 358489 220056 -87403 -490668 350267 693210 310683 -58599 8906 42554 1428
7994 1428 890020 1128782 200400 -550839 -278809 181521 -456495 -203227 -451974 183443
7984 183443 570975 -6131 -304295 -884444 -255366 241989 747612 1024759 -113362 -639964
7974 -639964 -506350 176944 -323535 -432053 -485596 -462519 -240168 262152 1042613 658945
7964 658945 407332 505530 218269 208140 238002 -388476 -1063252 323987 760947 1067587
7954 1067587 746053 -516024 253685 -288263 -525642 -52731 -62528 -836366 -636233 -70408
7944 -70408 -704992 -925032 -241948 -525172 -665085 -70344 201520 85741 864625 694444
7934 694444 388885 257659 569886 519428 981942 525557 448959 121375 -277890 -86072
7924 -86072 -320297 963178 759800 738499 890878 400038 57071 -454823 73033 220958
7914 220958 144905 -85462 -307389 -98967 -665953 -113225 484861 272756 -356075 -497015
7904 -497015 -350669 -83603 217629 506559 640134 -66919 -199264 -19259 366122 610202
7894 610202 789295 227998 195807 714555 704709 74900 128375 545755 83875 -691635
7884 -691635 -612898 -238214 -299094 -869040 -514996 -1024624 -630056 -397283 -774313 -360028
7874 -360028 -504789 239077 179186 104401 -633224 -338305 -140557 -1059123 -844545 402973
7864 402973 -114209 127354 697430 357852 204737 -480739 109271 251336 373443 416042
7854 416042 -856502 -497217 -185860 -77200 105125 677305 597632 459252 309347 -156580
7844 -156580 -206775 -445962 -513985 -1190098 -468012 56630 -274456 -679314 -24763 129558
7834 129558 13495 601612 285646 -54057 -345190 -449239 -709783 -1004280 -878931 -427234
7824 -427234 209048 456270 -616854 -630077 -546352 -828142 -545515 -516789 -999601 -652921
7814 -652921 -1182797 -1208204 -758970 -513754 -883208 -907892 -289170 -418001 -255985 455148
7804 455148 44156 -306898 -182825 -347528 -976635 -792224 -1275495 -2606863 -488834
7795 -488834 1139923 874459 415945 252173 911075 495530 299137 -94600 -455665 -537927
7785 -537927 -563671 1011870 1213614 377514 -71333 -79604 -819558 -791423 -238919 805535
7775 805535 228817 596871 1090247 300037 -203062 -154343 11469 -615985 -427353 14394
7765 14394 -235206 -246134 4590 -98557 -239371 422450 172601 1022466 927212 -222031
7755 -222031 633997 851334 -23121 122566 314619 188492 241115 -206259 -196067 -1033912
7745 -1033912 -731303 -741788 -326750 165223 -416718 -711694 -788646 -588329 -69099 125965
7735 125965 107278 -28900 -292862 -197993 32084 -548738 -915886 -1082365 -266572 -137401
7725 -137401 276385 518381 374826 -198059 -533056 -180040 -494098 -401651 -728511 -813819
7715 -813819 -1232484 -986240 -475666 -363682 -417224 414271 216206 -94711 151249 -465489
7705 -465489 -1068591 -249421 658971 54533 -82604 -74186 -76582 -30539 -993806 -472003 57116
7694 57116 -177313 -66705 224409 104501 -131003 658067 -208060 -351883 -311170 153233
7684 153233 532389 -129310 440130 589769 90428 -12236 58598 22185 971864 152172
7674 152172 -639155 -97786 -190064 -458568 599878 713730 675175 905207 561944 184615
7664 184615 885813 1546635 343828 -109452 640804 1019188 153977 -467977 -599882 -686284
7654 -686284 -899940 -1206707 -771317 -352457 313088 763228 990198 688252 -62680 -174757
7644 -174757 300807 416757 13425 521774 186989 165009 -417644 225041 227532 -82295
7634 -82295 -129626 -161212 262647 435985 1399296 1253202 361881 -469541 212388 211343 181255
7623 181255 -388522 -455118 35869 208122 260746 159723 389820 -480288 -156459 -388781
7613 -388781 121407 815310 706031 412259 -317166 -519384 -327804 -483224 42869 101979
7603 101979 151875 566439 171451 57688 178892 275747 558413 770522 -37584 56239
7593 56239 333170 638998 1127858 1430558 1559463 1550422 656145 476952 452214 79642
7583 79642 -71152 204465 732144 1030446 490079 240442 -401285 -847319 177501 -93952
7573 -93952 -329232 -274427 -521806 95206 418939 155690 333244 -49951 480349 -102035
7563 -102035 389756 509805 294956 154510 382295 252039 -272320 -206288 -741215 27858
7553 27858 111574 -132790 647783 648765 -614824 -183584 702991 544765 177015 152626 -5508
7542 -5508 71417 -349006 239076 722198 2011945 1772169 844790 1131557 963742 670429
7532 670429 -296880 -338982 214128 924484 258988 -42584 731805 635728 89696 834610
7522 834610 1623785 1566042 1231994 982565 541309 1057794 895708 965546 577956 493787
7512 493787 -54571 699471 320660 241765 390965 371390 1270964 544278 488181 1022321
7502 1022321 542274 -396551 307469 656544 288510 -239982 237762 588938 799228 889808
7492 889808 695228 -129814 327361 347790 874378 607227 -311803 -803404 -834076 -368685
7482 -368685 -265358 -26162 456277 -132050 -106481 135444 -103262 281664 128850 -106786
7472 -106786 796342 56494 562677 929173 431252 698963 606193 331716 855744 692725
7462 692725 743059 294193 -482417 -191814 -221773 -416896 -139294 -135325 120119 426131
7452 426131 -305967 -132551 -1208521 -989238 -228082 -178913 -285519 -457136 66151 407430
7442 407430 -65297 328607 754974 1408324 843756 611546 372056 -28093 225925 863987
7432 863987 728243 405301 -575188 -47365 510534 431288 143239 519985 1032832 848542
7422 848542 808550 4138 88611 845608 1315385 1165967 570140 -46072 306977 -306950
7412 -306950 -912186 -220248 -352191 -40059 439774 387509 -86343 -614079 57531 1161593
7402 1161593 362142 -202478 -189658 -734906 31944 382128 282812 -229751 152184 210650
7392 210650 787691 486172 647496 983089 183538 38793 267883 853804 674631 -348866
7382 -348866 -547991 -931346 -332535 -293365 222896 631292 703261 -35016 -366497 10228
7372 10228 732018 644769 792364 511492 -8697 389002 -460469 -360972 -87397 575677
7362 575677 540896 379493 21969 210829 556225 1071959 298101 614446 -5301 130331
7352 130331 837797 196581 464372 -713444 -514317 697932 558938 1096986 620076
7343 620076 -533322 431385 604255 10274 499072 914017 1587210 2120191 1891445 1707369
7333 1707369 1263940 1468029 1537728 1659689 2048941 1802425 1129472 652928 433466 32338
7323 32338 941532 1377550 1570585 1511643 1330618 447019 225540 -248926 129114 566358
7313 566358 507126 963247 -169295 -122877 379088 797318 786203 216559 519924 880856
7303 880856 900351 803925 1134762 141978 321492 413759 280283 42516 -340841 458395
7293 458395 1170816 1546008 778821 415671 433649 -40853 360951 -47111 -351888 657926
7283 657926 622752 1443417 1292487 1364969 1592686 1356527 799026 595794 667583 1271850
7273 1271850 1411227 715075 324214 465291 644975 829281 1192246 1661109 1641722 1712823
7263 1712823 2582733 2663577 2060298 1631072 1002923 1247025 1406344 1695957 1376242 1543181
7253 1543181 1361741 697912 1537256 1414857 1654462 1827180 1878206 1579549 1166633 1100035
7243 1100035 1114966 863028 323174 965036 878736 473868 153602 94964 804532 583832
7233 583832 1135287 779679 685386 738255 373078 1312847 1006474 509275 860869 1213033
7223 1213033 1311437 1745229 1290816 1934084 2810961 1734174 1391138 1401448 1893380 1860591
7213 1860591 2100260 1922940 1560254 1906326 2340363 2787639 2664712 2623008 2449956 3226827
7203 3226827 3458639 2330096 1363700 1078962 1281763 2769761 2871960 3098760 3187218
7194 3187218 2612147 2620341 3098767 3095930 2666401 3434208 3561443 4021470 4944311 4747294
7184 4747294 4372613 4620393 3883987 3853523 4053520 4103973 4015300 4883751 5372985 5391533
7174 5391533 4835582 4785166 6005297 6463584 7268427 7903034 8426472 8614075 8746826 8739148
7164 8739148 8328427 7556489 7580199 7534434 5637523 5870785 5456287 5173266 6165810 5817770
7154 5817770 6185746 6546964 6282193 6166075 7399707 8147680 7852002 8399822 9782096
7145 9782096 9869889 9953379 10510795 10943709 12161004 13396808 13423681 14970432 15588212 16110788
7135 16110788 17606439 18763314 20172596 21420530 23445613 26463650 29129113 31704949
7127 31704949 36577419 40799294 45558481 48713617 49357140 47541562 44154618 40334670
7119 40334670 35856362 30893290 26811443 24012106 21498701 19552294 18022964 18164422
7111 18164422 17290486 16376565 16649927 15775786 14446890 14229800 13776986 14086010 14374887
7102 14374887 13540484 12999049 12368499 11707521 11242086 12351873 12307198 12531819 12264566
7093 12264566 12786030 14033838 14480052 15140902 15471518 16199936 17331264 19528677 20604795
7084 20604795 22257018 24280359 27504345 30122142 31917143 33850093 34869222 34636458
7076 34636458 32746533 30544832 27853945 24945255 21192840 18661953 16907926 15364951
7068 15364951 13502286 12135129 11321196 9871186 9785993 9573007 9113931 7456478 7550994
7059 7550994 7181897 7137883 7780869 7280474 6939218 5656536 5224725 5667424 5601929 5750425
7049 5750425 6085814 5911231 6138909 6170693 6616546 7126742 7605316 6898811 6053236 5579918
7039 5579918 5449889 5578966 4759752 4882976 4597588 3375639 3334530 3745957 4042813 3135923
7029 3135923 3517779 3577472 2933912 3671184 3589999 3382932 4198138 3824894 3467713 3825090
7019 3825090 3763863 3948124 4161499 4265795 4175304 3136055 2792756 3902939 3971256 3525870
7009 3525870 2811557 2220820 2301466 2623952 2141667 2378000 2129537 1651987 1778402 1187079
6999 1187079 1613272 2136596 2409702 2694216 2219744 1774617 2404649 2647815 2855317 2383814
6989 2383814 1778018 1851571 1786825 1812337 2495346 2794190 2035546 1813325 2752968 2737403
6979 2737403 2147318 1565057 2171929 2591970 2170165 2425701 2722841 2753224 1895486 2506293
6969 2506293 2480680 2855467 3110159 3322133 3880990 3425100 2959520 3517210 4584633 4218517
6959 4218517 3031895 2545709 2284099 1808688 1526523 2738236 2913509 2287227 1834451
6950 1834451 1768212 2158098 2263650 2167439 1045197 868795 2230693 2142515 2020822 2075273
6940 2075273 1574282 1645240 1923093 1724236 1507392 1029772 1222842 1667900 907666 919383
6930 919383 1205785 2144520 1891513 1669270 1407318 1630338 2094090 1626463 2320153 2475973
6920 2475973 2709506 2691834 3034991 3062343 2906891 2445083 2551208 2709399 2866213 3494106
6910 3494106 3603585 3000927 1629611 1247169 1852989 2733507 2623493 1868227 2152625
6901 2152625 1944393 1325072 1951930 2396408 2147596 2165657 1877246 1920687 2534938 2188319
6891 2188319 2526089 2884134 3176235 2703540 2277344 3105478 4093662 3501181 2514537 2278432
6881 2278432 2904899 3104600 3535071 3612074 3002113 1892726 1440070 1467074 2492391 2510277
6871 2510277 1884691 1900727 1950707 2676002 2352804 2040581 2546611 1834400 1972648 2570645
6861 2570645 2243183 1845866 1029395 1505855 1647023 1263013 1540825 1557560 1540045 1567839
6851 1567839 2197157 2725848 2022577 1872493 2113960 2244315 1404613 1645884 2201310 2532210
6841 2532210 2682335 2832847 2600275 2818643 2470330 2443735 2571392 2763137 3391651 3056212
6831 3056212 2932611 2268052 2739433 2922371 3657165 4273296 4270592 3814825 3392782 2768137
6821 2768137 3662410 4052527 3928119 4731441 4135356 4345131 5135821 5208848 5335038 5796963
6811 5796963 5270000 4898429 4372135 4776762 5636100 5120076 5985388 6637914 7237076 7366145
6801 7366145 6790339 7497041 7547739 8492445 9103078 9814905 11011579 12364972 13363915
6792 13363915 14548826 16445950 18855124 21361797 22545832 25560234 29764974 33332780
6784 33332780 37233596 37368007 33690638 29798201 27965407 26687757 26726929 27594399 28730820
6775 28730820 29788570 33276649 37630441 39359208 36265995 29958120 25419973 21245800
6767 21245800 18225011 16528973 14847406 13107487 12345877 11602077 10828833 10083476 10038803
6758 10038803 9907517 9864760 8933598 8357679 8009757 8608064 9126838 8439487 7920749 8121326
6748 8121326 8196044 8524378 8324818 8380136 8385505 9109899 9826955 9392833 9065929 9344049
6738 9344049 9459665 10779335 11506723 11674238 12351904 13133663 13413862 14323041 16196232
6729 16196232 17569383 19615394 20567717 22790609 25616000 30333795 33925120 36146717
6721 36146717 34022158 29420655 27270314 25548026 23812165 24089992 25042077 26862505
6713 26862505 29627507 33020938 36081395 35362818 29869264 25218540 21156658 17150943
6705 17150943 15570311 14131654 12277485 11221132 10711258 9581450 9054734 8620442 8238506
6696 8238506 7847502 7052776 6879261 6602449 5450810 5652724 6001837 6101585 6543502 5527311
6686 5527311 5295962 5643132 5329481 5819881 5876152 5238685 4662378 4388363 4791637 5340918
6676 5340918 4663227 4574268 4301492 4543884 4935934 3841160 2893084 3294728 3281993 3341862
6666 3341862 2591546 2831875 2825088 1819062 1629554 2393401 3038104 2935837 2486964 1471402
6656 1471402 2528667 2247096 2707188 2336990 2321317 2677099 2413669 2842213 2521392 2867138
6646 2867138 2183654 2200343 2082193 2516955 3017047 2858976 2981194 2766692 2632430 2618532
6636 2618532 2727315 2350504 2405206 1589778 2407283 2182436 1528777 2045396 2086201 1781325
6626 1781325 2015530 2004238 2026478 2740671 2744705 2589023 2346381 2103037 1433117 1742018
6616 1742018 1713597 1981654 1999323 2558442 2614537 3054802 2731533 3078437 3019772 2169077
6606 2169077 2435291 2373463 2722005 2206872 2092839 2372105 2508403 2942578 2871983 3300006
6596 3300006 3998777 3992650 3297558 3495578 3675957 3542300 3410974 4030923 3996809 4136252
6586 4136252 4006297 4726857 4268626 3125022 3607074 3783046 4581129 5277814 4893535
6577 4893535 5217651 5625119 5363629 5360252 5582513 5983218 5633149 6261512 6476388 6551947
6567 6551947 6805533 6557998 6507564 6765460 7156109 8062950 9531249 10028544 10125348 10099210
6557 10099210 10676582 11583767 12811605 13901442 14405945 16420997 17309741 17814361 18725278
6548 18725278 20173321 20680405 21011553 21251785 22015873 21534293 21550719 22537826 22396283
6539 22396283 22562274 24214019 26564814 27971749 29882327 32997149 37507040 42575705
6531 42575705 45652567 42962104 38292225 33920370 31664697 30046124 30330635 30800098
6523 30800098 32116475 35177499 38525872 42548318 42976472 38621767 33862595 30518485
6515 30518485 27014290 24800009 24981538 25521642 26541196 27607121 28436781 31470564 34753599
6506 34753599 39093612 42039480 42629482 39330777 34142622 30561440 28942736 27861033
6498 27861033 27534256 27444702 29173673 30931890 33569028 36141744 34922390 29823240 25437546
6489 25437546 21832341 18303124 15378321 14693291 13284509 12147014 10688374 10569206
6481 10569206 9886793 9170623 8996469 9128293 8267040 7635460 7681037 6530014 6179992
6472 6179992 5519647 5617574 5217159 5351493 4885037 4779669 4144934 4633859 4266017 4313108
6462 4313108 4902648 4663431 4274809 4385226 4747153 4027955 3800483 3679378 2721251 3202389
6452 3202389 3651453 3853856 3520426 3602115 2248789 1791853 2908720 3416785 2736482
6443 2736482 1577536 2155265 3605805 3740897 3653884 2885001 3801616 3386364 3030657
6434 3030657 2887433 2509847 2501409 2290847 2330454 2305482 2378340 2410641 2083128 1803217 2327771
6423 2327771 1945528 2178022 2004134 1730321 1972583 1739813 1194268 1326718 1728844 2020655
6413 2020655 2216590 2010981 1408084 2518923 2911256 2901428 2812045 2766856 2348866 2150047
6403 2150047 2396310 1673786 2086025 1497664 1965290 2711720 2702462 2461239 3225931 2853181
6393 2853181 1860836 1906659 2065894 2650419 3056585 3691670 3688171 3163946 3395108 3614087
6383 3614087 3124281 2887974 3216795 4389755 4051948 3967597 4367408 4858595 4421966 3715728
6373 3715728 4252828 4346179 4264111 3285999 2689230 1981431 2466717 2170393 2061891 2069887
6363 2069887 1047577 1183584 1560914 1883808 2594294 2562055 2203869 2291854 1878078 2213397
6353 2213397 1662062 1530311 1304114 1483385 1113963 17703 461562 1075673 1734291
6344 1734291 1425750 964547 395689 1075541 1476296 488907 1078446 1462747 836098 1266171
6334 1266171 1330341 1367375 1297170 1311731 1424524 1069597 916386 1381946 2337837 1480204
6324 1480204 1412950 1369266 1326800 542194 872599 1744086 1655138 1662850 1987894 1949163 1045267
6313 1045267 474719 -169719 819258 1850523 2011370 984275 412164 1104117 1127295
6304 1127295 1807433 2197359 1930459 1126004 1730980 1170505 333429 771335 1553134 1418869
6294 1418869 1377361 1333292 1171956 1546487 1884066 1623906 1099137 807207 545899 1606803
6284 1606803 1598943 1358807 1120069 181819 -10035 599509 1535018 1272660 1220238 1334506
6274 1334506 1435391 1315732 628179 -234559 8804 -4625 232723 298021 631233 264370
6264 264370 219901 856123 312289 -536201 -354641 455611 902649 1023827 1037176 582443
6254 582443 1239885 946961 450852 189635 430350 1082834 827415 625633 1106264 1636998
6244 1636998 -179663 500655 1314608 1018135 828718 1063872 1001296 957874 428323 69010
6234 69010 239975 832473 1064661 905954 780915 1401623 749306 737699 1035621 148840
6224 148840 -285517 589996 648748 279981 329877 590405 306459 881975 397426 759716
6214 759716 1569071 1869861 1424539 917667 1176942 964814 384020 680467 827312 -174024
6204 -174024 214972 257329 319681 1367146 2112031 743311 -76307 -262422 901574 818860
6194 818860 829066 2126061 1921054 1572898 1351893 1260053 733640 601001 1303100 1277795
6184 1277795 795224 974658 1639550 968127 706299 679657 872085 812569 1151806 1363083
6174 1363083 1539788 1432913 1324915 1395303 1329989 1932938 1391202 1453675 1021670 1229516
6164 1229516 1544370 1904825 1527921 1665178 2010006 1945146 1383005 1677299 2030832 1716341
6154 1716341 1323674 1267425 1019469 303393 395718 656041 900554 1155569 2106956 1331542
6144 1331542 477958 1291265 1351215 1855374 2069694 1921581 1670444 1124531 1671765 1839890
6134 1839890 1053244 1523172 2103583 2021158 1771709 1575309 1253697 1009152 1192757 1336373
6124 1336373 1897897 1704467 1902178 2177012 2380440 2588686 2373927 1425683 1296686 1172219
6114 1172219 1375189 1758790 915947 1207735 1413277 2006298 2276659 1838514 1303067 1365784
6104 1365784 1761104 2036473 1777241 1215045 1351260 1247005 1879132 2315839 2427766 2169872
6094 2169872 1725353 1621893 1908023 1889135 2314686 2557490 2693603 2228117 2832477 2319815
6084 2319815 1796421 2273516 2091468 2411669 2733628 2807139 3336802 3504616 4471597 3775502
6074 3775502 3012684 3342052 3765423 2840100 3526704 4126459 3982537 4476470 4765417 4916919
6064 4916919 4415809 3995189 4768193 5356642 5012023 5940444 6758128 6389951 6651195 6044740
6054 6044740 6435460 6083674 6164976 5581575 5500401 5702847 5057324 5380558 5582668 6069055
6044 6069055 6533604 6527786 6351665 7238474 7933108 7583958 8170400 9120686 9270385 8927883
6034 8927883 9397660 10455751 10705696 11474335 11123074 10319389 9804866 10113547 8943642
6025 8943642 8774370 8283539 7968461 8275077 7999677 7404299 7648444 7211296 7855167 8817557
6015 8817557 9205328 8557744 8906470 9482914 9940730 9265449 9620005 10881607 11311288
6006 11311288 11004527 12112362 12098009 12298541 12543937 13090239 12802261 11681882 11526092
5997 11526092 11658187 10453496 10475583 11589668 12151754 11945635 12274704 13400880 13324222
5988 13324222 13101561 13828630 15332029 16091812 17085499 18396802 20170596 21924226 23361321
5979 23361321 25397957 28093521 29935902 31240372 30061700 28082271 26600576 24699092
5971 24699092 22718424 22308119 21665309 20209228 20892117 20234395 19616776 19115122 18261863
5962 18261863 19339686 20080991 21640530 22654339 23164998 24735922 25976550 28067299
5954 28067299 31419146 34538950 38098377 42675993 47138683 50288595 50974399 47776882
5946 47776882 43165833 38333703 34617191 31323305 29558555 27918554 26326328 25469589
5938 25469589 25016430 24214725 23979153 23641801 23319790 22887969 22394985 22119650 23257174
5929 23257174 23679447 23460408 24678763 26020204 27323075 29000037 31396604 34221792
5921 34221792 35399037 35639726 33582774 30597931 29369971 28580446 27730115 28135463 27899647
5912 27899647 26554963 25125583 23865782 22788674 22307238 21633720 20714641 18533037 16941326
5903 16941326 16953647 16805776 16866252 17147972 16879538 15980488 15402818 15394748 15077855 14250132
5893 14250132 15080780 15949564 15966213 16166610 16114892 16709986 17189777 16418744 15868676 16823430
5883 16823430 17298806 16104980 15427453 15414503 14393458 13556029 13620742 13263562 13437429
5874 13437429 12536787 13584149 13617858 13199232 13394621 13392554 13208147 12613041 13624432 13932611
5864 13932611 14489540 14953342 14774099 14353821 14012698 14258421 14519854 15223507 15998107
5855 15998107 17049791 16705924 16725830 17046399 18044225 18516867 18697048 19490849 20662136
5846 20662136 21090125 22431085 23962648 24572183 25221759 26346955 27243964 29118731 31314416
5837 31314416 33503476 35449003 36968179 39197468 40606863 42998650 45011422 47069128
5829 47069128 50186059 53468926 57784783 63840810 71017560 78787993 81331124 78553017
5821 78553017 71289499 63058609 56907020 52651831 49265782 47153008 47023236 46181155
5813 46181155 45859639 47286528 48834370 48894592 50701302 52350814 53473474 55202183 54739321
5804 54739321 53776935 53729645 55408586 56260862 57845206 59330278 59183554 56870661 52320222
5795 52320222 47318643 42872541 39973193 37211325 35627181 33981383 33164501 33084846 32307752
5786 32307752 31547276 30744187 29415192 29421018 29475139 29203873 28478509 28507416 26896193 25695784
5776 25695784 25248267 23318874 22608257 22130444 21475226 20129103 18732005 18316887 18949925
5767 18949925 18192514 17742768 16980182 16688569 16938497 16143229 15756401 15481927 15752401
5758 15752401 14572877 13129428 12700760 13039307 13316562 13350218 13279667 12217175 11811185
5749 11811185 11556000 11515482 11185600 11458265 12378157 12300128 11247107 11115039 11467768 11352380
5739 11352380 11078410 11544326 10761158 10789309 10667754 11070102 10603036 9323288 9347561 9524696
5729 9524696 10653228 10120448 9738667 9524859 8572085 7685117 7809572 8098593 8798222
5720 8798222 8902779 8496296 8770764 8818473 8354785 8254422 8662240 8970820 8926704 9479639
5710 9479639 9289760 8518865 9065905 8481144 8346184 8602976 8008468 8031353 8499119 8366126
5700 8366126 7370136 7561233 7466509 7435316 7465379 7516465 8194679 7673133 7465636 8207929
5690 8207929 8764780 8521723 7767050 7634208 7866771 8036098 9007205 9516150 9290984 8681471
5680 8681471 7943886 7721347 8494311 8802255 8448757 8851862 8659401 8295861 8673417 8980866
5670 8980866 8875793 8365775 8882202 9010185 8876905 9815078 9467264 10045274 11033230 11044038
5660 11044038 10822354 11081265 11197652 11006561 10858335 10492330 9629212 10208863 10205310 9981396
5650 9981396 9789141 10084471 10532944 10630324 10139096 9920416 9859408 9779748 10708263 11664883
5640 11664883 11502258 12363380 12214066 12506575 12668273 12460450 13194087 13430530 13566289
5631 13566289 13402598 13965492 13614445 14045910 14080412 13301501 13848247 14345513 13448341 14170470
5621 14170470 15116766 15452956 16205059 17000399 17290233 18248066 17808357 18855614 20701152
5612 20701152 22089893 24025250 24990057 25677787 27370515 29719372 32695840 33773570
5604 33773570 34649949 34055408 33658201 32427268 31206859 30580440 29703683 30082786 30810542
5595 30810542 31873984 32815295 33197086 34224992 35291628 36825418 39828934 42742250
5587 42742250 46988310 51819618 56045327 62263439 68589609 76570389 85025652 94600150
5579 94600150 106428946 119594543 133172467 140932571 137607629 122868086 104586420
5572 104586420 87949565 76346578 66846504 58973895 53044786 49885077 46715872 44506920
5564 44506920 43488236 41751392 41298382 41244848 40007144 39822407 41063419 42099856 43622036
5555 43622036 46246828 48037939 51342375 54928877 57835067 60869951 64120362 66330002
5547 66330002 69879782 74180062 76430276 75210094 68703052 60292320 52344960 46114331
5539 46114331 42487425 40206483 37942566 34906862 33175755 31805117 30038778 28119584
5531 28119584 26584758 24920465 24317460 23883834 22203087 21466516 21909730 21855974 21829824
5522 21829824 20702335 20110278 19407503 18788145 18707066 17576169 18099323 18010851 19055267
5513 19055267 19072302 18559971 17996837 17776077 17614685 16847944 16850019 17591443 17819455 17266234
5503 17266234 17120555 17901072 19342926 20020490 20420771 20410927 18673749 17223127 16798669
5494 16798669 16588909 15505121 14651545 14241860 14413334 14004701 12532979 11290938 11282396
5485 11282396 12005601 11670890 11004635 12119058 11746827 11117357 11408226 11991848 12186653
5476 12186653 12367295 12083204 11561382 11095728 10652576 10547675 9261203 10007253 10449183
5467 10449183 10266407 10913613 11361734 10398189 10632991 10435728 10041161 10074525 10129301 11114828
5457 11114828 10653502 10159927 10589460 11814873 12108818 12506270 12942471 14488064 15573520
5448 15573520 16006855 14319612 14243981 15206052 14160214 12660767 11949020 12101634 12179407
5439 12179407 11381162 10290794 9643888 9098276 9596175 8494245 7969746 8043034 8726486
5430 8726486 8317382 7554897 7172236 7696366 7849588 7915785 7672536 8200918 8085975 8173884
5420 8173884 8368910 8084265 8261175 8217640 8226261 7960183 8092021 7808737 7731268 8165419
5410 8165419 7710751 7118379 7134824 7437711 7799328 7608372 7497453 8170696 8051535 7943703
5400 7943703 8022440 7866932 7361184 7590884 8066767 7689379 7339060 8038325 8378322 8630559
5390 8630559 9351878 9074067 8566823 7927093 8435059 9440772 9300765 8949730 8322139
5381 8322139 8082338 8229768 8514180 8046138 7978263 8268033 8707297 9581447 10188323 10401273
5371 10401273 9924904 10399590 11087128 11448202 11753907 11471832 11344750 12209168 12306217 12696679
5361 12696679 12724494 12775340 12467570 11551639 10926984 10709965 11003968 10274083 10216429 10816045
5351 10816045 10110241 10217362 9861565 9962704 10387535 9964008 11448583 12122525 12373479
5342 12373479 13603054 13991103 14881494 15356114 16070144 16761226 17036136 17252191 18158893
5333 18158893 17717266 17178553 16226547 15449001 14388192 13341707 12829937 12532233 11620556
5324 11620556 11085631 10870791 10507463 10694560 10622987 11005008 11157771 10700334 11217819 10666640
5314 10666640 11240971 11497375 11875832 13041304 12834156 13034048 13359060 14511114 15669427
5305 15669427 15475819 14844021 13735281 12748646 12471163 13047267 13344043 12752523 12392725
5296 12392725 12019678 11572672 11121821 11823921 12233274 11940816 11632238 12185352 11893470
5287 11893470 12057484 11928108 10961025 11043756 11417967 11481304 12287761 12748149 13025945 13481280
5277 13481280 14352849 14830927 14403032 14296302 14084654 14598324 15566021 15852890 16549402
5268 16549402 17923831 18924021 20685481 23053377 24719007 27163226 30352167 33125241
5260 33125241 35724931 39596441 44672026 51685265 58322307 59775098 53399466 44398910
5252 44398910 36596885 31967454 28573110 25510100 22569581 21072576 19638958 18277776
5244 18277776 17717457 18095409 18079158 17245633 16718388 17135690 17214823 17230971 17612362 17785310
5234 17785310 16523559 16492966 16765475 16816864 16412664 15134314 14612189 13482174 12579290
5225 12579290 12582923 12301686 11099867 10333550 10037290 9904853 10433029 10517688 10032149 9755411
5215 9755411 9327094 9142035 9480214 9708477 9250672 9329491 9134021 8704609 7628027 7972958
5205 7972958 8609080 8055155 7878679 8499880 8046110 7707097 7714604 7363707 7944163 8096839
5195 8096839 7735215 8369372 9324976 8925911 9177098 10275079 10845152 11106222 11342576
5186 11342576 11252975 10470146 9762892 9123806 8736811 8292192 8295913 8040107 7396880 7154175
5176 7154175 7536233 7195532 6700455 6761472 7284005 7579063 7588707 7066939 7102421 7028004
5166 7028004 5938527 6228530 7106670 6644873 6591698 6537755 7653227 8403705 8171881 7490236
5156 7490236 6823250 6059961 6435022 5904509 5910772 5581662 5255449 5781698 5464986 4679458
5146 4679458 4876236 5538194 5654958 5548528 5303001 4637144 4654902 4514322 4698179 4145046
5136 4145046 4128376 4940201 5275495 5118914 5098911 4623862 4732238 4266676 3772933 3853382
5126 3853382 4589706 5179598 4425683 4331040 4627475 4660020 4711545 4724339 4222199 4279269
5116 4279269 4521951 4919990 5859057 6185261 5382415 5578808 5992585 5085059 4845186 4478553
5106 4478553 3904172 4920836 4928072 5677260 5300616 5763606 5597228 5563564 5260150 5437096
5096 5437096 4740671 4526708 3957961 4811980 4477153 3735292 4284050 4345088 4953268 4425331
5086 4425331 4388571 4152523 3703999 2995852 3513766 4039349 3841578 3858591 4076882 4397361
5076 4397361 3623031 3638124 3697674 3800591 3966950 4045955 3746703 3668571 4560727 4473725
5066 4473725 3629924 3508342 3289246 3189690 4176452 4440774 4226605 4790847 4563394 4102723
5056 4102723 3901186 3550766 4270201 4526206 4318628 4520744 4437973 4785505 4783690 4539600
5046 4539600 3561367 3628354 3889605 3883027 4087542 4217752 4358936 4560992 4419376 3889355
5036 3889355 3558858 3408775 4393127 4182530 4426973 4935501 4469171 3851015 4824410 4609930
5026 4609930 4576519 4542432 4690202 4869293 4719620 5143593 4111209 4145147 3946119 4148118
5016 4148118 4809366 5308266 5576265 6472803 6377461 5336126 4772440 5393590 5344393 5142133
5006 5142133 5641168 5976752 5837182 5447545 5640713 5491605 5190456 5946865 6808065 7664170
4996 7664170 7708818 7266865 6985506 6579988 7580373 7271581 7601471 7208844 7559429 8667064
4986 8667064 8347938 8625447 8891981 8988574 9602606 9852382 9332201 9633740 10313259 11126051
4976 11126051 11379403 11439325 11604560 11518796 11017181 11096567 10651313 10611876 10843911 11197187
4966 11197187 11692300 12284611 13798831 13715115 12828338 13077314 13136212 13909374 14862798 15351684
4956 15351684 16391712 15993408 16510345 16455343 16851363 18183439 19272250 19978474 21150421
4947 21150421 21978418 23560879 23814634 26415127 28153566 29421581 30051789 30868907 32276908
4938 32276908 34875111 37846844 39863887 41889339 44776472 48173060 51411737 56368466
4930 56368466 61715291 67461141 75169213 83998844 94668973 105240659 118129275 134374507
4922 134374507 154601397 175696163 199690932 229827197 270316867 318879359 365355118
4915 365355118 361623578 303205552 241247562 193342256 158285035 130323956 110670486
4908 110670486 95202703 84694432 76064738 69803934 63405558 57753483 52905597 49455972
4900 49455972 45069003 42511411 40615790 38027163 35641169 34645649 33382457 32617161
4892 32617161 30815454 30020115 29557759 28907601 27801354 26762796 25776477 24969902 24357946
4883 24357946 24087896 23879030 23871900 23115942 22298241 21070688 21285209 20950017 19793213
4874 19793213 19807653 19137674 19088610 19318159 18679116 18123013 17280865 17219610 16934884 16691910
4864 16691910 16007810 16103487 15308819 15277425 15476422 15004682 15243032 15505627 15942500 16600438
4854 16600438 15822537 16371868 16552656 15589856 15911677 15926401 16259778 16328165 17145069 17021624
4844 17021624 17841337 18156649 19761977 19731987 20877423 22272407 23780903 26948076 29473512
4835 29473512 31240272 34155646 39010703 44394151 46305066 41846466 35407227 30078975
4827 30078975 25126344 22674397 20265234 18636977 17726415 17032015 17134189 17243181 17393442
4818 17393442 17399440 16641597 16362655 15133251 14327872 14208833 13719852 13900506 13822679 13394910
4808 13394910 13244580 13983709 13121875 12562165 12469045 12066988 12645102 12592130 11928980 11727394
4798 11727394 11385267 10700423 11271995 11471370 10838077 11364729 11609195 10674265 9641522
4789 9641522 8783287 9396614 8041393 7813452 7368711 7237790 7344526 7436346 7830962 7982543
4779 7982543 7533358 6939495 6742597 5723770 6029866 6679642 7184849 7066674 7355960
4770 7355960 7219597 7576552 7532198 6561959 7472216 6846941 6007188 7085043 7670518 6665727
4760 6665727 5874583 5744494 5987013 6427052 5849182 5772047 5514827 5371323 4728424 5464438
4750 5464438 6195346 6268095 5804409 5605880 5817233 5499798 5688722 5325844 5163394 4947751
4740 4947751 5044649 6074709 6897313 6412062 6661622 6838937 5732097 5221815 5719215
4731 5719215 6532709 5939742 6001440 6137916 5696474 5893175 5958469 5302976 5631516 5878981
4721 5878981 6020007 5535487 5170959 5757883 5829408 5365870 4810010 4633108 4389975 4364019
4711 4364019 4295987 3753602 3952440 4681377 4892173 3981719 4677812 5057844 4876969 4787644
4701 4787644 5249372 5109439 4850976 4734795 4436737 4917728 5149242 4955808 5029017 4853391
4691 4853391 4462897 5145112 5480385 4783349 4754222 4800447 4450281 3799148 4147548 4397875
4681 4397875 4166844 4619259 3982931 3838299 4160360 4165361 4453592 4049351 4320233 4889747
4671 4889747 5242197 5081619 5048981 5206819 3757039 3871622 3926715 3954506 4693888 4605918
4661 4605918 4298692 3995921 3236549 4258458 4892878 5000868 4994400 4976847 4913977 4710057
4651 4710057 5214167 5691997 5011705 5349193 5672494 5246360 5505394 6208359 6990720 6706441
4641 6706441 6389544 6645742 7411598 7046402 7019856 7127924 6382751 6556896 6579183 6851452
4631 6851452 7006416 6809308 7195975 7267188 6833045 6923096 6836469 6972508 6551158 6865503
4621 6865503 7435636 7469893 7518995 6688256 7310034 7801159 7550169 7527877 8267120 8045539
4611 8045539 8323651 7626992 7532214 7789113 8544012 9092177 8759416 8801618 9027026 9230390
4601 9230390 10424170 10976712 10911188 11015550 11011475 11818137 11124268 11427128 11752927 10750011
4591 10750011 10236302 11170567 11480260 11495574 11429672 11874226 12007594 12931763 12592088 12913509
4581 12913509 11994039 11909240 12330217 12315483 12886922 13604407 13134456 13595094 13738099 13472085
4571 13472085 14091912 14761186 14277054 14098499 14847742 14683356 15482726 15635618 15695916 15696325
4561 15696325 15681519 15968504 16668194 16367428 16968913 15996441 16186121 17310896 17889517
4552 17889517 17743937 17523176 17256807 16869019 16572012 16961317 17365466 17544901 17488576 17632931
4542 17632931 17625266 17713594 17435548 16749289 17461023 17435639 16635322 15863286 16138075 15697719
4532 15697719 15462703 15671487 14709973 15262080 14573481 15091558 14687504 14847698 14915736 14366626
4522 14366626 14463546 14160017 13967150 14786804 14581428 14276218 14379853 14231023 14141812 13497783
4512 13497783 13788572 13255838 12891628 12703515 13034122 12603440 12148365 12088854 11691454 11245416
4502 11245416 10908261 10625954 10635436 10845764 10604565 9218522 8859914 9310542 9551810 9894427
4492 9894427 10176304 10246611 9453432 9067124 9319039 8122921 8088157 7680826 7736207 7740760
4482 7740760 8057949 8371824 7827141 7358462 7423269 7738371 7474197 7469711 7671909 8116574
4472 8116574 8322430 7689488 8051903 7936711 7663442 7811828 7539475 7428607 7955095 7721591
4462 7721591 6883040 6967071 7618580 7379290 7592678 7464665 7118901 6585953 6119788 6781502
4452 6781502 6842568 6389250 6306195 5695735 5616031 6117276 5853513 5274685 5403912 5750673
4442 5750673 5381058 5877474 5681265 5945014 5476736 5425595 5363998 5544027 5986257 5433637
4432 5433637 4819132 4845652 5445825 5840012 5858132 6365893 5699593 5574972 5828906 5347528
4422 5347528 5172761 5827581 6133751 6289739 5850201 5665361 5124144 5276288 6526741
4413 6526741 7000906 5998948 6450671 7126736 6750622 6596549 6361692 6847958 5882158
4404 5882158 5526698 6286517 6798428 5968750 5773858 6030981 6644032 6734413 7373236 7212748
4394 7212748 6617533 6064564 6092578 6653194 6516085 6600264 6508690 5567445 5510662 5126805
4384 5126805 4768987 5557331 6362749 6174393 5314047 5738030 6270528 6454875 5868399 5310451
4374 5310451 5664712 5897425 5051411 4782680 5633988 6234350 5983041 6607533 5487517
4365 5487517 5266341 6277185 6380053 5874204 5327962 5775140 6257286 5527404 5229681
4356 5229681 5940997 6179665 5291931 5124627 5428627 5869109 5665097 5264025 5682411 5322732
4346 5322732 5500075 5535173 4899132 5124510 5115403 5564760 5436893 6025451 6959083 6748025
4336 6748025 6474838 5585306 5443684 5570658 5213783 5520681 6011225 6056577 5432761 5713578
4326 5713578 6140631 6162994 6517021 5805549 5769696 6535724 7278739 7346621 7677842 7242742
4316 7242742 6884988 7427244 7112706 7287259 7180135 7465383 7517070 7197832 7930717 7860520
4306 7860520 9321940 9619548 10018888 9995236 10519042 10343871 11219224 11808073 12437691 12835662
4296 12835662 12057069 11139963 11162579 10498899 9756143 9470524 9523199 8917896 8815827 9301617
4286 9301617 10381585 10674668 9991812 10285238 10120871 10127009 10101153 10113457 10377736 10343854
4276 10343854 10687222 11196173 10805413 11628909 11251568 11418632 11649601 11428876 11684614
4267 11684614 11951747 12712693 13790059 13693492 13589103 14425475 15409068 15810802 15713252 16495370
4257 16495370 16930150 17850657 18427499 19195195 19384529 18708679 18792092 18986730 19015731 18821599
4247 18821599 18708798 19071140 19741919 18503765 18809894 18335649 18499942 18776607 19658126
4238 19658126 19855241 19709856 19098500 20347577 20575141 20897314 21131396 21484900 21369795
4229 21369795 22242939 22853108 22638523 22561480 23233434 23536194 23773968 24741378 25295745 25968927
4219 25968927 26205784 26572407 28306069 29435209 30270966 31545525 33014635 35267188 37021167
4210 37021167 39084793 41018907 43317034 44254377 45507475 48168809 51545639 54218468
4202 54218468 57858706 61357795 64788229 69229816 73425416 78580921 84174155 90692434
4194 90692434 98764092 108402453 118401977 129638774 144754751 161599649 180301937 202227245
4186 202227245 227625329 256254847 283801298 301380502 304450313 295142057 280243556
4179 280243556 258545979 232908488 204231652 177410737 155514584 137277569 123021879
4172 123021879 111975752 101548930 94042860 87369692 82048604 77699405 73466383 70270219
4164 70270219 68371182 65790336 64538909 62582012 61154707 60415678 59697667 58956677 56970869
4155 56970869 55602498 53502762 52262684 50874261 50469924 49509683 48767583 47302495 46985746
4146 46985746 46603514 46481790 45569218 43896926 43022665 41815266 41522985 40564607 39866928
4137 39866928 39614382 39525008 39490032 40110781 40694737 40766425 40927867 41842397 41735886 40624327
4127 40624327 41324198 40355703 38968007 37748797 37019021 36414353 35933667 36179640 36227554
4118 36227554 35798627 35027979 34773160 34162775 34135544 33505431 33332637 32996867 32861848 32472787
4108 32472787 31938214 31689685 31160211 31710023 32328284 31873221 32456115 33120574 33960307
4099 33960307 34426959 34498815 33173349 32940721 33975926 34181990 34256883 34736899 35243450
4090 35243450 34195917 33761202 32780657 32164207 31804092 31667601 31763490 31825109 30750283
4081 30750283 29883691 29834148 29258298 29654874 30533311 30631885 31167015 30226212 29652435 29039840
4071 29039840 28494950 28808796 28743176 27890132 27629570 27750327 28068048 28053922 28314371 27913303
4061 27913303 28551180 28231294 27402189 27501283 28027950 28108884 27674022 27590395 27742976 27584052
4051 27584052 27595050 27677687 27743132 28391932 28352518 28438141 29307251 29294743 29220896 29541412 30178229
4040 30178229 30866575 31859191 31726247 32161864 32363554 32742608 34658007 36457594 36175299
4031 36175299 35418966 35965971 36309876 37509106 37525755 38300522 38682368 38300690 37544931
4022 37544931 37032496 36886845 36947543 35987819 35764144 36250344 36693013 37054809 37743778 39233107
4012 39233107 40841112 42049126 43234917 45241013 48128813 50066422 50910985 50698517
4004 50698517 47334345 44617362 43266365 42590428 42047794 41557271 40978116 41178730 40992059
3995 40992059 41456958 42297837 42566376 43100388 44261309 44371240 43787100 44440902 44326368
3986 44326368 43603467 45305132 46814234 48227567 50182758 52870196 56264165 57086596
3978 57086596 55773592 53235660 50391504 47021721 44916271 43017619 41820119 40256049
3970 40256049 40608260 41106399 41906056 41447747 40895046 40085566 38291543 36461162 35372891
3961 35372891 34995623 34830782 34470346 34122933 34811922 36350114 36739712 38381012 39179328
3952 39179328 40260125 41112199 39416497 37251403 34297611 31818737 30451029 28477938
3944 28477938 27960476 27532679 26396678 26515569 26485657 26212853 26433452 26030306 24724622
3935 24724622 23738125 23355948 24064772 24056065 22739876 22267642 22598136 23571274 23670459 23895430
3925 23895430 24811438 25150400 25098212 24739328 24348337 24280273 23880961 23157590 22511822 21231180
3915 21231180 21866699 21935701 21922494 22179650 21521308 22537775 23024212 22379963 22294855 22291419
3905 22291419 21864978 21402509 21025188 20822400 21450850 21000218 21097156 21390352 21216416 20392591
3895 20392591 20689224 20849024 21417604 20994321 20021445 19531460 20270369 20485777 21143730
3886 21143730 20110398 19743722 19471462 19169439 19122112 19274811 20167449 19904486 19982899 19797851
3876 19797851 19447600 18885044 19103115 19821219 19627550 19728079 20326295 20043496 20515848
3867 20515848 21356018 21032992 21357024 21552841 21700783 22267469 23289948 23551591 23156897
3858 23156897 22842406 24109720 25460050 25566582 25945673 26080774 25984291 26675920 27079420
3849 27079420 26867580 26730980 26587290 25956917 26616943 26137700 26017378 26176391 25747694
3840 25747694 26090788 25822161 26463727 26752668 27187930 27779078 29044241 28521362 28646021
3831 28646021 28704626 28703627 29289274 29332815 29489622 29841534 30952794 31531563 32415722 33206034
3821 33206034 32781715 33405031 34175412 35352301 35334468 35550957 36100313 37031308 37391000
3812 37391000 37922155 38977766 39273110 39716451 40875331 41271198 41802368 42301652 42918267
3803 42918267 42968626 43427341 44032422 43617671 43470237 43455329 43552057 44106896 44664947 44468555
3793 44468555 44563649 43461528 42919205 43256132 43184969 43031168 43264050 42485012 42284217 42262637
3783 42262637 41762818 41039448 39932615 39391034 38542641 38773047 39213563 39154643 39118806 40153239
3773 40153239 39782290 39656398 39480431 39632954 39432669 39538691 40043292 39311977 39829221
3764 39829221 40032045 40361637 39926347 40698998 40759229 40990966 41449684 41869618 41945049 41920891
3754 41920891 41936398 42630672 43963025 44730532 45272831 45383851 46402688 47420651 48434960
3745 48434960 48599838 48989254 49417979 49238413 49092707 49774911 49576804 48776550 48187548
3736 48187548 47969867 48112136 47996744 48010340 47052592 47045496 47872881 48291043 47331894 47583804
3726 47583804 47530596 46691531 47305952 47741891 47905062 47450797 46537723 46384290 45696192 45559629
3716 45559629 45711438 45805479 45138433 44878815 44579265 43147411 42693396 42594957 42576635 42554929
3706 42554929 41761918 40568928 40555175 39832428 39338402 39007472 39229880 39429966 38844153
3697 38844153 37923476 37245980 37901651 38213162 37643590 38403319 37879605 37920273 37252092 36680106
3687 36680106 36154272 35170803 35505097 35393872 34579763 34667704 34532971 34582852 34409052 34714635
3677 34714635 35243150 34988614 34768729 34209440 33737492 32658818 31711371 31938669 32408014
3668 32408014 32191020 31333899 31373339 31940629 32581767 32281604 31496909 30907249 30764208 31301874
3658 31301874 31588311 31675046 31263013 31630072 31854253 32239225 32273627 32118126 32107944 33121802
3648 33121802 33565196 34027790 33747690 34455747 34513936 35183700 34841523 35186031 35231933 35256310
3638 35256310 35763264 36094062 36542459 37373096 38375807 38504780 38783472 39801167 40226807
3629 40226807 39875046 39772023 39741961 39260217 38416006 38086515 37256655 36566723 36042038 36338588
3619 36338588 36290897 35413658 34428157 34338069 34593315 35237740 35236351 35292657 35402686 35318187
3609 35318187 35100151 34459575 34024071 33095288 32190067 31240186 30481270 29935235 29292486
3600 29292486 28995424 28134885 27528990 27236541 25299426 25127946 25938738 25522524 25020629
3591 25020629 23522185 22319283 22577615 22571200 20936184 21322021 21634396 21029989 20521660
3582 20521660 20544515 20982681 21439816 20736748 20494550 20986779 21017637 20619700 20293604 19796701
3572 19796701 20160335 19700215 19456970 21119873 20722348 20523014 21095263 21424117 21741483
3563 21741483 22077327 22346755 22046011 22550722 23313339 23646649 23844670 24162628 25014004
3554 25014004 25366212 27004574 27767027 28402947 30214092 31972186 32419679 33881526 35463675
3545 35463675 36531650 37642154 38192770 38380973 39001860 39220976 38342664 37062565 37040019
3536 37040019 37396779 36361317 36009115 34560238 33045085 32226292 31807670 31237746 30417916
3527 30417916 28957684 27400227 26974095 26968961 26614454 25762886 24647292 24771605 24471887
3518 24471887 24531732 25135655 25032852 24510958 24883123 25054030 24804445 23951993 22894853
3509 22894853 22375502 22789096 22822713 22596118 21506082 21498177 21667608 21351768 22016686 21261181
3499 21261181 21454673 21415731 20910711 21798605 21465233 21248440 21065713 21505029 22691055
3490 22691055 22901409 22858382 22159957 21022261 21570035 22583028 22874144 22517660 22333927
3481 22333927 22723808 22736751 22934132 22654213 22767826 22958756 23088564 23467341 23794228 24013510
3471 24013510 24338782 24093675 24327041 24126692 24799471 26132469 26577724 27086808 27178283
3462 27178283 27812618 28743465 29271762 30031683 31628403 32588032 33661737 34651582 35064596
3453 35064596 36090102 36509002 37186447 36968065 37251062 38204747 38012522 38162805 38576744
3444 38576744 39136162 38644101 38704643 38155419 37448380 37492941 37500737 38229172 38591290 39306080
3434 39306080 38321958 37186409 35916236 35571405 35872737 35072201 34064619 33807362 33695931
3425 33695931 33042242 32517962 31002000 30978421 30952207 30558599 30571022 29552583 29292349 28351798
3415 28351798 28637706 29092850 29155433 29194522 28558761 28688761 28487784 28251683 28231326 27855896
3405 27855896 29003727 28769377 28635648 28205565 28344226 28793395 28624894 27947694 27902409
3396 27902409 28211678 27782462 27582626 28484065 29319584 29295396 29821884 29806611 30488230 30744989
3386 30744989 30833212 31218336 32039961 32623024 32946645 33316217 34544119 34662757 34987401
3377 34987401 35997224 36898451 37603782 38494019 39907786 41509710 43515761 44928967 46188028
3368 46188028 47025231 48343639 49994912 51462505 53691946 55773505 57889360 60467909
3360 60467909 61783760 62377537 63501133 65719375 66983244 67784788 68885445 70472557
3352 70472557 72772073 75233596 76360561 76773841 76936767 76625449 76342404 76204667 75216086
3343 75216086 74607490 74263138 73075531 72020942 71424867 71197667 69895004 69105726 68160585
3334 68160585 67367229 66096820 65549651 64652639 62743154 61458865 60643283 58773502 57242362
3325 57242362 56632792 56347654 56840026 56859737 56803268 56532383 56085226 56189723 56914789 57077648
3315 57077648 57083551 57966653 58357522 59417106 59804462 60395476 60983945 60215178 59969335 59817149
3305 59817149 60123581 60436273 61295753 62611562 62975127 63839165 65337590 68655753 69781674
3296 69781674 70763922 71465732 71844843 73056945 74161504 76272180 78217600 78749756 79498177
3287 79498177 79610622 80756301 81436507 82529160 84211447 85564404 87863720 88579368 89586251
3278 89586251 90980850 91582887 92126734 93417502 94590710 95836270 96300920 97478802 99198830
3269 99198830 101693497 104479175 107552686 111384415 114806350 118090854 119205823 119899194
3261 119899194 120618088 121328060 121205846 119904061 117945529 116865810 114581248 111232932
3253 111232932 108554521 106306021 105322319 103748953 102448307 101249449 101475685 100775622
3245 100775622 100403102 99989626 99376980 100267015 102217831 102752666 104103469 105263494 106704315
3236 106704315 107781733 107769925 106271231 105052694 104322632 104037677 103678008 102642293 101545744
3227 101545744 99598943 98872427 97511831 96078692 94867389 94694312 94544736 93800426 92726028
3218 92726028 91272370 90022916 88095911 86817239 83792873 81894114 79909665 77884486
3210 77884486 76093500 73384875 72488954 71046139 69545036 68480844 67820109 68213165 67689786
3201 67689786 66604851 66162744 66074025 65861678 66001587 66083240 66241848 66675880 66702046 67410088
3191 67410088 67588350 67542186 67927844 67114611 66627473 65608402 65562268 64975489 63619195
3182 63619195 62871417 61162045 60296303 59346577 58323853 57211002 56436853 55625214 55812500
3173 55812500 55457561 55257970 55367965 55704375 57169233 58467934 59663726 61405414 64104238
3164 64104238 66513208 66383170 63316998 58516055 53470692 49716306 47325043 45682495
3156 45682495 43965384 43169995 42233941 40530983 40292425 39906800 39471015 39889366 39754038
3147 39754038 39419218 40544585 40611657 41619972 42737402 44598742 46351643 47893947 50992891
3138 50992891 54129014 57037751 60109614 60641067 57407574 53673621 50133112 47966681
3130 47966681 46214578 45047702 43612161 42697112 41763237 40723948 40259417 40180912 39508137
3121 39508137 39013448 39187901 37921871 36638461 36611651 35961429 34909538 34980211 34012212
3112 34012212 33103799 31833317 31185533 31443270 31214394 30534475 29401684 28946807 28209960
3103 28209960 27926514 27641530 27118937 26198946 26061804 25970628 26659677 27167495 27039298 27097342
3093 27097342 26745724 26725539 26497361 27232008 27479689 27161675 26400003 26453276 27709999 27310174
3083 27310174 27124582 28032438 27324686 26580875 25678416 25474434 25584462 25018110 25771527
3074 25771527 25509679 24960015 24513819 24241479 24044998 22632613 21904794 21805608 22153781
3065 22153781 22525907 22576539 21885869 21942437 21347685 21090946 21568409 21030301 20513640 20922131
3055 20922131 20426782 20773910 20295089 21256342 21838763 21353941 22248307 21167598 21566833
3046 21566833 22136594 22421310 22002425 21918748 21336361 21096558 21599503 20825694 20245738 19835259
3036 19835259 19758462 19433065 18479899 17231572 17835427 17464361 17244757 17181111 16767807 16342196
3026 16342196 14872094 15359212 15834188 16297941 16098244 16163190 15205834 14802766 15181790
3017 15181790 14866374 14953766 15292539 14875945 14892854 15042186 14752600 14751739 15198585 15590194
3007 15590194 15761391 15660817 15440458 15800208 16013164 15662937 15805966 15854285 15911624 16151365
2997 16151365 16494992 17124471 17008524 17281807 17299820 17998673 18187047 18465288 19089673 19319960
2987 19319960 19708664 19583765 19706279 20223071 20117610 19589540 20002522 19775508 20331501
2978 20331501 21117798 20714511 20789995 21364191 21776860 22017937 23173431 24903509 24599162
2969 24599162 24345965 25538741 25889965 26471779 28263651 29716434 31073995 31713611 32985722
2960 32985722 34627356 36592516 38379583 40518326 41607726 41491807 41635103 41700350 41914610
2951 41914610 41610117 42247077 43788032 46252623 48525636 51119115 54265233 57240992
2943 57240992 61284757 64997865 70258335 76435613 83160433 91927263 98777615 103629467
2935 103629467 104098228 101446507 99395182 97668331 96735552 95035185 92058010 88447729
2927 88447729 84149323 81160628 79098028 77799398 77493434 79015451 82052835 84634812
2919 84634812 87620750 90030876 89015076 85692126 80408902 74355077 70354517 67455180
2911 67455180 65493627 64224645 63508494 64291689 65481484 66013552 66602140 67439073 67771916
2902 67771916 69431702 71826661 74885274 78071282 81628986 84002180 84896515 83991302
2894 83991302 80965739 79732491 78478489 77417841 77721163 78052122 78048080 79029918 79575619
2885 79575619 81016424 83960998 86900701 88193339 88667706 87932956 85018873 82066551
2877 82066551 78421539 74737075 71326780 67934085 64320917 63126249 62743049 62250023
2869 62250023 62080561 61270626 59831716 58630102 56725708 55272944 54311591 53430615 52079005
2860 52079005 50335320 48311150 46861797 45584695 44905810 44733982 43262346 43220981 43134846
2851 43134846 42065758 41127422 40667750 40118939 40286993 40000566 40324228 40812252 40981081
2842 40981081 41910761 43005369 44755929 46070985 47677212 49535570 51287894 52742992
2834 52742992 55063622 58742651 61816597 64884638 68572260 73082550 77614639 82068635
2826 82068635 86009244 89691508 93497348 93432611 91116216 88592401 83480384 78651143
2818 78651143 73796481 67211304 61675350 57192231 52942860 49765794 46869883 44569277
2810 44569277 41217457 37892173 36044304 34685791 33519575 30746470 29485285 28254735
2802 28254735 27343436 25986749 23912135 22442168 22112771 21304558 20570422 20456619 18887457
2793 18887457 18477970 18535639 17904739 17230921 16948649 16368022 15404928 15377829 15241419 15222381
2783 15222381 14118674 12939399 13079711 13014594 12666825 12655754 11535571 10921133 11272089
2774 11272089 10965131 10374714 10560350 11246322 10686443 9162123 8865440 9990878 9365099
2765 9365099 9519927 9349539 9621028 8943928 8065082 8241718 7754644 7498689 7625759 7211687
2755 7211687 7473398 7231206 6973672 7385746 7278894 6678128 6184503 5794039 5749523 5359828
2745 5359828 6128255 6186379 6319576 6422095 5582886 4973154 5187898 5057276 5270565 4564287
2735 4564287 4989638 5460650 4997483 4697817 4777184 4668013 4699589 4495831 4004990 5046424
2725 5046424 5298554 4376237 4050436 4347555 4449152 3831741 3317719 3762010 3696940 3783064
2715 3783064 3671065 3618149 3121785 2981928 3385922 2918229 2971092 3267441 2281515 2436956
2705 2436956 3504543 3618203 3187701 3139621 3057078 2566487 1969898 3163957 2959112 2266655
2695 2266655 2170997 2617962 2308557 3154594 2610017 2572426 2195457 2586259 3248842 2656209
2685 2656209 2324438 1868879 2781609 2586469 2347909 2195645 2195996 1908957 2487160 2469720
2675 2469720 1936246 1880373 1527280 1770234 857788 1209016 1959997 2302161 953562 1213663
2665 1213663 1807046 1874645 1808797 1043918 1549091 2101295 1634590 1124361 1574111 1040644
2655 1040644 1889693 2332896 1105422 1553309 1377769 1515393 765373 1147863 2445020
2646 2445020 2436416 1490576 1050824 1959864 1330293 1215725 1846810 2524173 2348267 2577359
2636 2577359 2533353 2073084 1908171 1596183 1342447 1189386 1110409 1508959 1828434 1674600
2626 1674600 1071894 1144309 1050228 958609 1246234 503759 697121 1285845 129860 992797
2616 992797 1394190 1070258 1359102 855925 679637 1337873 942883 1019455 1266874 1271929
2606 1271929 530149 881980 1107939 810547 1353762 1274019 1422339 1232138 1000540 1457743
2596 1457743 506627 828188 1137910 880457 998275 1072294 1202512 843227 421291 470159
2586 470159 697682 401668 635017 517821 892180 1246982 1032919 919311 442096 557010
2576 557010 906095 52541 533768 529797 762582 1304217 1245149 1662282 1493105 488733
2566 488733 -96605 174592 736244 1418658 1253287 953126 1305258 993909 953155 707850
2556 707850 871319 1371346 1373329 395956 -162290 520100 376366 444832 691781 1456844
2546 1456844 537016 651636 734448 638977 764694 966122 525180 1540646 1391564 250881
2536 250881 210981 80130 647431 19189 223020 777315 1234392 1073154 2022558 1453107
2526 1453107 547178 911537 398533 -68332 525857 355888 474440 -87553 -217778 581307
2516 581307 -87564 -274708 808030 736883 764478 445359 -128941 415478 181677 224590
2506 224590 19836 -526130 -133487 291988 458121 562234 408575 -313332 -189491 -112574
2496 -112574 -175629 -29533 192111 410282 434819 979969 1504296 729670 -34401 -13996
2486 -13996 596666 489474 314853 -156529 -467786 223183 -14166 224453 427960 769924
2476 769924 1141570 1079880 461332 756105 819182 693303 361492 -41243 579959 -401739
2466 -401739 -377565 287965 -57684 200706 -493222 162322 299905 168031 57585 666789
2456 666789 1607777 949308 853329 564251 147640 -575785 144 -421374 249426 391532
2446 391532 8824 11318 207180 -24452 -316844 -113398 214362 554075 526484 4753
2436 4753 206455 -458502 -725644 324353 -507529 -705294 -1116397 -1070156 -504902 -310937
2426 -310937 287104 -264859 -52467 440832 2921 -429821 -393136 -263811 -382707 882102
2416 882102 930281 178180 343372 149195 -38679 152520 716482 1038915 941698 1010697
2406 1010697 758656 627099 -341305 1046359 689176 737145 663355 282454 637111 885221
2396 885221 708196 342631 367410 847536 801803 1135064 1844146 2178553 2515132 2667854
2386 2667854 1744447 840796 1502522 1239850 1093455 1536627 797176 533869 425010 539186
2376 539186 375124 668915 1169555 355525 -213789 118879 1115557 229143 -561160 -643448
2366 -643448 357030 316093 -405098 -317598 274099 1101129 1019989 1175684 1103347 865815
2356 865815 696716 615876 314138 562594 762625 451247 194260 882704 1013214 532043
2346 532043 992642 713886 341581 -276468 184319 10167 -910019 -371290 -429977 -353560
2336 -353560 382810 91158 1113150 1201453 670765 763899 543447 717628 642754 37485
2326 37485 636093 937094 561673 305765 21024 -784710 68273 714947 703135 721417
2316 721417 619834 577668 1512752 1064094 98419 1166508 1247456 1185159 827204 133170
2306 133170 301007 188140 189567 476468 914459 669218 -253240 336704 348247 186323
2296 186323 699828 1181405 1283255 1294458 1585456 998827 426841 768501 178996 1469710
2286 1469710 2096436 1562266 1227760 1067493 1368198 415375 506772 671460 861662 673961
2276 673961 1505452 706436 436186 -222483 -61670 173013 -255196 -465967 -596682 -150015
2266 -150015 508672 659932 880375 1246502 1703770 1722513 1929771 2360316 1295176 867589
2256 867589 484985 716460 946791 367967 465876 696938 246042 826133 1429868 1294420
2246 1294420 1128092 1986660 1978801 1349572 1153822 1235161 1112803 1200753 1219039 1367335
2236 1367335 1195586 1613512 1154768 640265 1340672 2507036 2046391 2024118 2004780 2160129
2226 2160129 1867876 2108942 1800629 1638947 1966323 1770170 2420600 2215154 2561605 2795448
2216 2795448 2114676 2416816 2659663 3850141 4125533 3632295 3116176 3151730 3578764 3536466
2206 3536466 2867263 3624662 4227085 4526134 4121144 4238246 5311352 5163611 5123980 5491477
2196 5491477 5495717 4887297 5009913 6213135 6043002 5906030 5790691 6020854 6207541 6053292
2186 6053292 6894050 6961174 8030909 7982158 7800128 7882807 8480592 8785313 8869907 9388217
2176 9388217 8828289 9211020 9204171 8616038 8869654 9475567 9545275 9591510 9870774 9759366
2166 9759366 9852288 10301545 10671096 11341906 11523881 11312265 11395155 12061557 12760277 12710789
2156 12710789 13940384 15244832 15473632 15834568 17080744 17870546 19358788 21099116 21840673
2147 21840673 22848548 24229864 25142771 26841267 29395674 31071618 33004492 36045589
2139 36045589 38374591 41263682 45121152 48445761 53255274 57344215 59786787 65946252
2131 65946252 73625878 82792895 91454196 103070970 117185016 134862796 153349002 174101742
2123 174101742 198298010 233394084 276111117 309806903 293034916 239780881 190240722
2116 190240722 154098643 128272139 106240965 90601678 79120554 71852515 64611018
2109 64611018 58747525 54005893 50501548 47004361 44502430 41718299 38072499 34053251
2101 34053251 32248083 29705013 27770424 26718448 25212946 24221341 22170978 20227808
2093 20227808 20209784 19020874 18482482 18396162 18292414 17360573 16848828 16386898 16170922 15670659
2083 15670659 14757223 13818978 13344091 13354758 12821344 12158966 11934843 11513017 10863388 9839156
2073 9839156 10706035 10314335 9979632 8589115 7743670 8667671 8459320 7562533 7280939
2064 7280939 7155247 7559570 7268504 6562578 6934166 6889774 7069604 7580800 7030560 6622054
2054 6622054 6258745 5540705 5507518 5679751 5638843 5146224 4701170 4214089 4035000 4895728
2044 4895728 4859558 4857313 3859777 3309865 3680162 4252115 4253124 4196054 3909882 4266400 4139472
2033 4139472 3818380 4066779 4124866 3169595 2987357 3654796 2821405 3157503 3863568 2830344
2023 2830344 1708062 2563613 2165114 2361664 2537969 1219210 1875279 3394840 2356882
2014 2356882 1085682 1950553 2242111 2201007 2811980 2470296 2650202 1466351 1462158 1558024
2004 1558024 2033162 1763050 1553994 2033257 2171559 1577532 1533246 1881747 1958509 1887114
1994 1887114 2306939 2166969 2173790 1968815 1764311 1926138 1802149 1588839 1631615 1279263
1984 1279263 1128359 1734396 1200724 903338 1229194 1207201 1016905 1516971 1491047 1544461
1974 1544461 2348064 1700440 1156162 1197254 724795 648155 862371 1316122 1254693 529018
1964 529018 687253 1165726 730793 770510 677714 988912 1026583 819384 1077406 700483
1954 700483 918198 1226378 1674520 1207887 629519 505791 211598 325538 483513 1077548
1944 1077548 790702 642932 594675 1033204 666864 -349348 223105 -301205 -248413 -31762
1934 -31762 101339 -211414 274614 828410 34740 -129081 -356152 137253 -525592 -435064
1924 -435064 111309 563150 1083978 1169311 253974 605950 1041970 808456 -218588 -474641
1914 -474641 140888 744367 315801 -198758 597482 683135 212268 24488 552606 847984
1904 847984 249733 575756 454437 605463 9185 -304492 149176 -818657 -486430 -950823
1894 -950823 -412986 37707 940273 1049580 434878 82012 184159 1090802 883395 967720
1884 967720 118330 -190312 635234 169226 117758 327812 1603448 827885 501675 320050
1874 320050 821578 803669 1095133 649901 244166 1267499 1278614 1293858 329817 -153410
1864 -153410 -137805 664684 518429 84776 -688509 220850 1006149 855538 736884 1158078
1854 1158078 1628827 1538600 779712 740122 1171362 974459 1084257 1547022 1327349 379180
1844 379180 -539681 -246968 -280115 -40711 -291117 5558 282111 -394818 -913243 -1164847
1834 -1164847 31662 835091 -406882 -732501 -365336 117350 -380888 -839268 -472544
1825 -472544 -520731 -192022 -27052 408478 125285 379908 281209 -72012 47746 1437632
1815 1437632 1371824 423441 12423 -106304 87287 450590 1148731 702991 293859 816764
1805 816764 533743 3250 -201148 274287 217670 -221886 131653 725351 361712 156877
1795 156877 -183041 -142623 343842 116141 158877 484970 241027 121931 237388 486023
1785 486023 680273 631496 662346 404648 119116 -582448 -235406 -255842 -117761 -57038
1775 -57038 -16482 148680 406333 603599 321795 -400763 108106 415918 127454 -160680
1765 -160680 655829 48981 -1071945 -716532 -267079 176518 -333580 54346 210989 -129157
1755 -129157 -530170 -1081790 -552016 -389489 -653057 115214 20684 -500440 258276 556964
1745 556964 629023 -598508 -1596997 -1477510 -832448 211535 123200 -697936 -436209 -19476
1735 -19476 -544980 -409860 -474347 228726 -133451 66803 143029 150404 -463900 -690416 -119160
1724 -119160 168795 -257944 -366841 -184225 -615 -58364 218478 275940 -311712 296613
1714 296613 -28156 -321978 -152037 -89537 -280652 -303746 -443336 -236219 -532491 -1007501
1704 -1007501 -933338 -949272 -887045 -364702 -327324 -441665 -203907 -95881 -73216 -632988
1694 -632988 13025 148240 -69095 -38871 311815 577231 -226563 -672661 -345063 -155904
1684 -155904 -407554 -238854 38527 430084 784189 -123286 153836 179870 146110 398669
1674 398669 -530727 -377750 -633053 -710742 -499897 15010 -340724 -407347 130162 -3421
1664 -3421 -81434 -467928 -545070 -581429 -604694 -503673 69622 528124 286679 -838532 -1128990
1653 -1128990 -209850 -584297 -947054 -735735 -1442267 -1680293 -1340643 -923462 335529
1644 335529 538904 147022 -335824 84393 -202925 -240756 -333311 187017 348500 -108322
1634 -108322 -334186 199553 655254 418790 440579 -125755 -88615 400038 439462 -389031
1624 -389031 -290764 -604782 -559705 -248186 40030 -401136 -705089 -677048 -456041 -458695 -259579
1613 -259579 -430270 -738916 -76636 -164316 -228192 -287748 -258596 -362609 519685 552151 -542776
1602 -542776 -229013 231005 229717 110404 702596 855627 1100404 198333 -1162272 -1043310
1592 -1043310 -700767 -920070 -590945 -408501 -614874 -184133 -540959 -256805 31062 -64674
1582 -64674 -526140 -993459 -666925 -556609 -775070 -677919 -648947 -125831 133436 127872 -30215
1571 -30215 32842 -10081 -337660 546447 72999 102902 91471 -195173 174918 996351 357355
1560 357355 -263846 273201 720427 619257 220038 467420 354000 576771 -439506 -885471
1550 -885471 -429336 -352210 -338746 -283706 267862 674242 176142 -112755 -181896 322535
1540 322535 471459 -182099 -22968 -41657 -645499 -311519 349702 -9278 53037 511530
1530 511530 869062 685565 -53981 -299306 -555584 -945002 -789552 -171587 -176578 -81855
1520 -81855 -274349 407792 -296527 263968 -348473 -1239204 -820702 -59405 279653 -610788
1510 -610788 -590115 -254509 -312214 -573821 -836695 -1243217 -446271 136901 150134 25669
1500 25669 -556245 -697100 -279334 -10197 732363 142080 -724412 -756773 -104760 -306999
1490 -306999 -519609 -599504 -506081 24019 -224674 44048 236923 -694526 -553056 -822159
1480 -822159 -939041 -81561 466173 192637 716262 436491 -536501 -511831 -633629 -1059638
1470 -1059638 -596279 154363 -350354 -150690 -191226 -351038 -933319 -457532 171070 -111671
1460 -111671 -78398 -733302 -239871 -479443 -638631 -779443 -545093 -748911 -471059 339596
1450 339596 29847 -485930 -492852 -1060341 -1171040 -618992 -192398 101296 -856723 -293667
1440 -293667 15155 -592247 -954208 -515596 -345864 -612651 -616941 -233161 224891 -361134
1430 -361134 -403306 -129240 662091 438751 -262918 -389721 -1177786 -1084903 -377081 -919158
1420 -919158 -1219875 -659638 -837058 -250848 577949 -435128 -915715 -1352553 -1366380 -407167
1410 -407167 -286211 -83727 290891 672320 777484 345503 -376201 318386 497259 489243
1400 489243 408375 -112879 -195852 74813 -607218 -425043 517089 327280 -741582 -539320
1390 -539320 -695178 -387799 -147556 -356581 182819 -171780 594259 -344743 -580867 414206
1380 414206 172826 -104293 -621049 -891863 -214584 -304308 -240354 -73083 -895806 -855570
1370 -855570 -380853 -369428 -1196987 -1174157 -1051730 -439009 -985350 -483444 -516715 -609518
1360 -609518 -419005 -834633 -176246 -388703 79754 185842 -99374 -127698 812977 826421
1350 826421 382117 145048 560140 1034938 914575 1221634 893983 799843 -699520 -1074087
1340 -1074087 -805820 -958024 -855873 -1225512 -301665 -293753 -277318 -513566 -404793 -394515
1330 -394515 -138733 -485164 242128 185736 151173 -90320 -240979 259100 559571 590595
1320 590595 453002 847089 574971 4988 26700 460241 623032 88 17951 1056610
1310 1056610 176483 -8214 549471 -96492 -63214 -93707 -419375 -789529 -304896 430578
1300 430578 102000 -318516 -615075 -885858 -943282 247545 -95049 -620580 -1230169 27276
1290 27276 112288 230715 -454192 -1106322 -406350 -76129 -385407 61070 554027 308000
1280 308000 472835 353998 198036 68060 40194 -737466 -1055087 -175257 43898 -110913
1270 -110913 -671774 -792640 -804735 -780779 -605540 -539502 -290514 -68261 -129657 -95688 185127
1259 185127 128210 -112628 349435 478690 153712 440708 228171 909400 819739 608837
1249 608837 -172735 -753055 -419662 -123796 112182 124936 271386 258660 915842 903676
1239 903676 96495 -563768 -487969 113671 -131452 -22307 6944 267317 391473 -439889
1229 -439889 -867512 -257124 -284740 -57488 -140613 -182071 -82653 -275728 -167146 143556
1219 143556 -117481 722106 676802 248518 -506221 -269821 -748266 -890994 -1536678 -1468884
1209 -1468884 -1106264 -338783 -23790 105965 372569 417132 973539 -16919 -367602 -142280
1199 -142280 203129 102485 782876 639404 106869 -8007 844142 172448 -391408 -218468
1189 -218468 -510012 -203935 27273 -762473 -327802 659067 98377 224829 358053 -416354
1179 -416354 -359941 -629267 -208114 150984 -888286 -1244386 -941114 -421993 -230348 370748
1169 370748 493624 -146658 -402867 43835 218537 -603633 -417148 122458 91786 143741
1159 143741 -250221 -248814 581951 241528 -380619 58259 539010 453547 702340 685904
1149 685904 404715 -47431 -321475 137314 87988 -789726 -599780 -73384 60429 -314984
1139 -314984 -458101 -554715 161950 -625687 -634552 46848 69190 261819 117113 -94343
1129 -94343 -163470 341953 394303 460020 580456 147335 88734 -568525 -629903 -43100 -376935
1118 -376935 124019 159370 -638436 -424103 -1062758 -445584 -306243 -737278 -337932 291563
1108 291563 178953 -294373 194821 -675567 -418476 422383 514249 486325 128250 -224106
1098 -224106 -425701 -759266 -385580 704 -131720 -348165 -372557 -701959 -467308 -424421
1088 -424421 -264070 288291 678120 -444823 -264969 -346348 -6658 13988 252037 -204469
1078 -204469 366198 648690 998797 877925 560353 751405 218914 247681 381948 1056800
1068 1056800 316814 -414094 -318463 -337313 -1001798 -632963 -576062 -87991 153729 134270
1058 134270 -652641 -326970 427178 69530 -472759 -497105 76173 -119572 -702681 -687732
1048 -687732 -553517 402858 791448 746892 714342 378983 -31219 441550 500667 38882
1038 38882 -470993 -68786 -464807 -567531 144669 -176307 -727391 -1030390 -65582 -598528
1028 -598528 -917164 -614441 37291 -61654 -258888 256627 255436 348837 101398 72004 -872975
1017 -872975 -405744 257621 -264999 -324878 189478 942537 405778 340570 200432 -792727
1007 -792727 -396334 957235 538975 -176146 -533706 -615245 -778569 -774811 -166458 183546
997 183546 -421022 332249 483986 100683 356520 -742943 -990652 -842657 -254819 205974
987 205974 277785 727335 -128788 -484539 -21753 -65125 333184 439116 42309 -150530
977 -150530 -380038 359173 977890 399470 -238468 316266 450827 -180541 -202408 -1072597
967 -1072597 -1203313 -251470 -252731 -72357 872132 446739 -961948 -1159887 -207330 -84243
957 -84243 156962 -282635 -812007 -133429 572321 -663635 -876693 275393 -368688 -574987
947 -574987 -1097989 -462029 -12513 89447 107223 291284 251225 -72427 509212 738133
937 738133 320665 -248151 13717 -666250 -661593 -519919 -833912 -394269 -657712 -135863
927 -135863 71747 -81407 77897 555416 775030 648048 216231 -227896 210591 153171
917 153171 247163 10913 101732 -53168 -722050 -163514 397535 57559 161172 654851
907 654851 924681 511350 618357 371622 78983 783239 979153 824725 413919 338869
897 338869 354612 691636 209021 294581 85666 -291738 -736631 464951 951327 408117
887 408117 134645 365123 429625 184845 235051 254871 1008747 629808 653897 357642 139668
876 139668 198314 -115581 -353906 -196029 134385 375230 -179038 340231 1084843 539467
866 539467 433582 -159272 -169456 169635 -128905 409989 654563 513875 -476975 -335485
856 -335485 -152829 99496 -59443 -149204 -815267 -549981 -401300 -1067314 -798372 -466870
846 -466870 -122073 442208 723188 730729 472314 383271 150421 -53302 -360711 -1131726
836 -1131726 -118165 -73148 215482 811739 -5577 -288592 -956635 -442712 -725653 -784302
826 -784302 -1008886 -616456 -177961 -92771 -152163 242967 -238829 -588765 -1121115 -924761
816 -924761 -119862 -259138 192605 507712 220116 -315837 359763 -468632 -372798 -601698
806 -601698 -216798 736641 -117408 36511 596114 145983 395440 415837 -27793 -150012
796 -150012 521276 348942 255051 400572 -34564 -278078 95423 -47867 180517 95511
786 95511 -91036 65977 546849 -31992 -322986 -470922 -186148 -170387 452739 -107040
776 -107040 440468 310348 319413 48049 -159511 506469 477720 698403 1460948 1039776
766 1039776 -552915 -620120 -405635 -227256 -613235 -236522 213030 657773 347851 387122
756 387122 40794 78220 499478 -19258 -177678 -3241 251322 184594 -316781 -594837
746 -594837 -141109 -445628 -283598 -662375 -1308111 380187 687162 839372 1173526 1276908
736 1276908 816880 908537 204083 3500 462957 846944 1347339 286344 -449870 -536472
726 -536472 372341 202649 -128186 -757999 -465510 468228 58937 31256 518471 460845
716 460845 433514 360397 725635 820763 1201949 698047 -99245 320720 12693 -424497
706 -424497 -421330 56269 14765 20419 -195564 -734629 -357271 -171995 -409787 464275 264816
695 264816 -235028 -940080 -701436 576014 785753 697441 -30470 -372938 263909 -157995
685 -157995 479093 287579 -525763 206277 518571 439154 795641 296602 205908 123105
675 123105 89262 48149 432125 343269 -99356 -587683 -686274 -455942 -502130 -700333 127176
664 127176 -347035 -501002 -267781 -475183 -5090 327926 -318208 48563 -339146 -778326
654 -778326 388539 697508 913285 466600 551516 706378 -443027 -946597 -337594 -357733
644 -357733 -860529 -429894 -416210 -423975 -636668 -335434 425118 194793 761580 1172228
634 1172228 610693 -138175 -427833 -414657 205998 -123511 61910 -193327 -820965 70769
624 70769 681642 425924 357210 -241284 191588 -138315 -64306 181345 208568 242429 -282032
613 -282032 -786206 -79588 155848 114142 -62646 232861 772912 388065 249963 199562
603 199562 -294591 -280092 -64692 -176747 -594981 386651 566629 649857 675476 159884
593 159884 -72315 375397 454445 123878 -97248 242012 540233 -261268 777264 470544
583 470544 -173198 401298 -321924 -480592 458653 467662 350852 -105573 -402851 -815331
573 -815331 -1212529 -735571 -41760 291053 161032 -743561 -626381 -373473 -50948 41591
563 41591 -435700 -216915 -379849 -337364 -131803 -151213 51057 -77075 -585371 -662367 -215602
552 -215602 241159 189835 45028 245256 341205 193962 414312 540882 89603 -1769
542 -1769 -402509 -729249 -98877 142087 335826 295668 -354617 -260359 397969 811401 102918
531 102918 -614589 217451 -222592 -425708 -585627 -912257 232225 422362 691496 767550
521 767550 -83507 -757353 -519739 -43649 -190833 -23252 599387 245897 475531 402316
511 402316 363244 -419006 -986870 -1010317 -409225 -198072 -942616 -454700 226662 672214
501 672214 161386 178932 -426849 -470675 -253305 -742810 187381 534403 -613883 -954429
491 -954429 -128364 1119973 434307 295993 234355 -215458 392952 342143 -340336 650541
481 650541 1152831 985136 1637806 430000 37697 547289 1016872 214254 536798 -311006
471 -311006 -74847 580310 142083 367898 -21748 -45163 567119 154404 -315411 50099
461 50099 -215673 -465657 -304405 -198198 159309 542300 116120 -207293 18258 -355581
451 -355581 440302 480526 561592 636890 -194334 205697 791231 1000976 -154911 760130
441 760130 214016 -494725 42784 151505 17620 261742 179923 293546 -172712 -130607
431 -130607 401218 193979 -584441 -406373 -429221 -922779 -119086 -728620 -480295 -25964
421 -25964 332736 -8756 83654 106283 -61239 196932 314793 177040 -310790 -703460
411 -703460 -790051 -616674 -244748 -13729 26707 -648689 -687146 -203135 -865590 -892800 788059
400 788059 927540 986338 1196552 857515 1145874 533037 64190 -154576 -89531 -529520
390 -529520 -293148 -408332 -193258 -430113 -785545 -1268231 -820430 -776652 -698384 -1198396
380 -1198396 -508637 297786 1264269 1198111 77768 138253 10089 29059 37466 -284982
370 -284982 -404189 -72848 206614 1053233 311294 -121293 407245 830479 -197028 -86753
360 -86753 -140949 -131723 -336612 756988 87410 -361583 -429515 -709580 -708654 338058 1353112
349 1353112 330669 -534970 -465361 23844 -299121 -316205 -234321 -338902 -994712 -307263
339 -307263 677304 573155 -485966 -542129 -1213026 -693166 -405164 -331099 -200916 -30557
329 -30557 -339922 -349527 -164257 275306 203537 -76679 916945 623172 8468 -481346 -406120
318 -406120 461178 847891 159174 -40074 -270080 282363 593941 347392 39692 -56168
308 -56168 313081 265178 -99542 -227687 492214 364494 -244302 -347780 -826201 -547585
298 -547585 -303675 -509454 -30963 -322963 -534211 -276419 -497265 -86578 -206269 -735784
288 -735784 -574014 -842340 -640976 49109 241224 -22925 -580207 334659 134438 -82719
278 -82719 216226 -333127 -236707 358892 -87729 -331282 44729 -956249 -790461 -1034487
268 -1034487 -1320937 -252205 -909543 -671412 214335 753251 602819 351732 64742 -494768
258 -494768 220090 -40599 -351821 -32344 68756 448419 454190 2261 204221 546776
248 546776 183029 746486 222113 -519946 -41199 -70346 362288 -63634 288797 326484
238 326484 1250281 869214 754360 1034803 245724 -380875 -208727 -248138 -327690 -621935
228 -621935 -527614 -53441 -20170 69495 120570 518795 401922 232199 3181 -907285 -1376195
217 -1376195 -542896 -407078 -431997 -327714 -114361 -339042 -203581 416458 1074534 593163
207 593163 859954 264099 -628437 -468196 341606 -89437 -159099 60513 -438906 -701707
197 -701707 234032 -465065 -714730 -150604 -303383 -404131 52158 296949 -23170 381739
187 381739 312023 576483 97969 -1265279 -1400683 -695103 -851164 -898931 -351333 -231376
177 -231376 -944385 -340607 112535 -521500 -1017394 -308454 89937 -202928 -211811 -209351 325380
166 325380 528661 393931 -232721 -515839 57507 838546 177661 -83425 -9205 258513
156 258513 685446 -572451 -1030792 -861443 -591252 -466812 -522684 -572671 -941138 -270485
146 -270485 207213 -219641 203831 143210 13007 -273436 570394 363376 -73325 -650696
136 -650696 -541648 -209399 2701 67053 30236 525797 546986 -411154 -79424 159127
126 159127 -143747 -174237 -760410 -710090 -768393 -121281 448859 276700 745268 285991
116 285991 -235501 42542 -26221 -130106 -431529 -362150 34944 54222 -46374 -70127 80199
105 80199 506958 17393 -160165 421415 809521 469145 -101132 136114 -33008 -122329
95 -122329 -427429 -1243138 -673148 91960 469511 247009 -257193 -1078047 -930871 -182434
85 -182434 -715130 -621652 -15099 166799 253210 -155693 -419972 -173216 332564 -45604
75 -45604 210074 -156498 -332847 -388911 -759716 -476346 128548 -40211 221610 321539 221636
64 221636 -544747 -617424 -455360 -707477 -302055 205192 55883 -70395 -6240 153881
54 153881 56289 -175024 -108318 -353659 -305317 -10828 -254144 -336742 -319560 -157545 519311
43 519311 612480 -156854 -262770 -104471 -343413 -395614 -701723 40658 379963 221831
33 221831 -145707 -218551 -400469 -636794 -314538 461525 392340 541255 -128323 -285201
23 -285201 -121403 -284978 -581396 -238806 361133 510829 67364 -8654 -130019 98201
13 98201 -165362 -971412 -426140 -197208 470213 67128 -646032 -424340 -186444 -61097
3 -61097 -396220 -374155 -94505
0 -94505
$$ Imaginary data points
##PAGE= N=2
##DATA TABLE= (X++(I..I)), XYDATA
16383 -3291800 -3206351 -2894533 -2982895 -3002084 -2637680 -2809854 -2779127 -3061730 -3410350 -2449068
16373 -2449068 -2402384 -2362208 -1932710 -2393856 -3033893 -2410170 -2513234 -2970675 -2534332 -2273743
16363 -2273743 -2225729 -1680277 -2282289 -1885559 -1506389 -1874292 -1773703 -2011816 -1983449 -1457841
16353 -1457841 -1320065 -1277314 -1345544 -1514268 -1786414 -2251455 -2128773 -1649000 -1747015 -1411982
16343 -1411982 -1513084 -1571757 -930288 -610852 -1161245 -1360938 -1029558 -1572202 -1565267 -1054213
$$ [...]
##END NTUPLES=NMR SPECTRUM
##END=
