##TITLE=1H_EC-3269(2)
 CDCl3
 8 sc, 
 16.11.2021
##JCAMPDX= 6.0         $$ Bruker NMR JCAMP-DX V2.0
##DATA TYPE= NMR SPECTRUM
##DATA CLASS= NTUPLES
##ORIGIN= UXNMR, Bruker Analytische Messtechnik GmbH
##OWNER= root
$$ XWIN-NMR		Version 3.5
$$ Tue Nov 16 12:09:48 2021 Russian Standard Time (UT+4h)  she@DPX200
##.OBSERVE FREQUENCY= 200.131346
##.OBSERVE NUCLEUS= ^1H
##.ACQUISITION MODE= SIMULTANEOUS
##.ACQUISITION SCHEME= undefined
##.AVERAGES= 8
##.DIGITISER RES= 18
##SPECTROMETER/DATA SYSTEM= spect
##.PULSE SEQUENCE= zg30
##.SOLVENT NAME= CDCl3
##.SHIFT REFERENCE= (INTERNAL, CDCl3, 0, 15.7282)
##AUDIT TRAIL= $$ (NUMBER, WHEN, WHO, WHERE, WHAT)
$$ ##TITLE= Audit trail, XWIN-NMR		Version 3.5
$$ ##JCAMPDX= 5.01
$$ ##ORIGIN= Bruker BioSpin GmbH
$$ ##OWNER= she
$$ F:/spectra/data/she/nmr/H-F/1/pdata/1/auditp.txt
$$ ##AUDIT TRAIL=  $$ (NUMBER, WHEN, WHO, WHERE, WHAT)
(   1,<2021-11-16 12:08:16.75 +0400>,<she>,<DPX200>,
      <created by zg, POWCHK disabled, PULCHK disabled
       configuration hash MD5:
       00 E9 B6 7A A2 85 ED C7 34 08 36 98 17 FE 4E 26
       data hash MD5: 16K
       E0 D3 CD 88 C4 B4 70 EE B0 57 7F C8 19 4C A8 0D>)
(   2,<2021-11-16 12:08:19.98 +0400>,<she>,<DPX200>,
      <Start of raw data processing
       efp BC_mod = 2 LB = 0.24 FT_mod = 6 PKNL = 1 PHC0 = -15518.41 PHC1 = 18.80081 SI = 16K 
       data hash MD5: 16K
       85 61 39 EE EF C5 94 BA 7E CA 86 73 2F F0 22 8E>)
(   3,<2021-11-16 12:08:48.57 +0400>,<she>,<DPX200>,
      <pk PHC0 = 0.6807972 PHC1 = -0.2000001 
       data hash MD5: 16K
       9D 96 58 D8 B8 96 8C 67 62 76 8B E5 D8 25 FE 92>)
(   4,<2021-11-16 12:08:52.07 +0400>,<she>,<DPX200>,
      <abs ABSG = 5 
       data hash MD5: 16K
       7E 41 4B 51 89 BC 99 B7 B8 52 00 78 6B 84 21 9A>)
$$ ##END=
$$ 
$$ hash MD5
$$ A2 D7 CC 7A 64 21 5A 5B FF 37 B4 54 1F A4 59 76
##$RELAX= 
##$RELAX= 
##$RELAX= 
##$RELAX= 
##$RELAX= 
##$RELAX= 
$$ Bruker specific parameters
$$ --------------------------
##$DU= <F:/spectra>
##$EXPNO= 1
##$NAME= <H-F>
##$PROCNO= 1
##$TYPE= <nmr>
##$USER= <she>
##$AMP= (0..31)
100 100 100 100 100 100 100 100 100 100 100 100 100 100 100 100 100 100 
100 100 100 100 100 100 100 100 100 100 100 100 100 100 
##$AQSEQ= 0
##$AQ_mod= 1
##$AUNM= <au_zg>
##$AUTOPOS= <>
##$BF1= 200.13
##$BF2= 200.13
##$BF3= 200.13
##$BF4= 200.13
##$BF5= 200.13
##$BF6= 200.13
##$BF7= 200.13
##$BF8= 200.13
##$BYTORDA= 1
##$CFDGTYP= 0
##$CFRGTYP= 5
##$CHEMSTR= <none>
##$CNST= (0..31)
1 1 145 1 1 1 1 1 1 1 1 1 1 1 1 1 1 1 1 1 1 1 1 1 1 1 1 1 1 1 1 1 
##$CPDPRG= <>
##$CPDPRG1= <>
##$CPDPRG2= <>
##$CPDPRG3= <>
##$CPDPRG4= <mlev>
##$CPDPRG5= <mlev>
##$CPDPRG6= <mlev>
##$CPDPRG7= <mlev>
##$CPDPRG8= <mlev>
##$CPDPRGB= <>
##$CPDPRGT= <>
##$D= (0..31)
0 1.2 0 0 0 0 0 0 0 0.06 0 0.03 0 0 0 0 0.0002 0 0 0 0 0 0 0 0 0 0 0 0 
0 0 0 
##$DATE= 1637050096
##$DBL= (0..7)
120 120 120 120 120 120 120 120 
##$DBP= (0..7)
150 150 150 150 150 150 150 150 
##$DBP07= 0
##$DBPNAM0= <>
##$DBPNAM1= <>
##$DBPNAM2= <>
##$DBPNAM3= <>
##$DBPNAM4= <>
$$ [...]
##$SUBNAM2= <"">
##$SUBNAM3= <"">
##$SUBNAM4= <"">
##$SUBNAM5= <"">
##$SUBNAM6= <"">
##$SUBNAM7= <"">
##$SUBNAM8= <"">
##$SUBNAM9= <"">
##$SW= 18.0517287032376
##$SWIBOX= (0..15)
0 0 2 0 0 0 0 0 0 0 0 0 0 0 0 0 
##$SW_h= 3612.71676300578
##$TD= 16384
##$TD0= 1
##$TE= 0
##$TE2= 300
##$TE3= 300
##$TEG= 300
##$TL= (0..7)
0 120 120 120 120 120 120 120 
##$TP= (0..7)
150 150 150 150 150 150 150 150 
##$TP07= 0
##$TPNAME0= <>
##$TPNAME1= <>
##$TPNAME2= <>
##$TPNAME3= <>
##$TPNAME4= <>
##$TPNAME5= <>
##$TPNAME6= <>
##$TPNAME7= <>
##$TPOAL= (0..7)
0.5 0.5 0.5 0.5 0.5 0.5 0.5 0.5 
##$TPOFFS= (0..7)
0 0 0 0 0 0 0 0 
##$TUNHIN= 0
##$TUNHOUT= 0
##$TUNXOUT= 0
##$USERA1= <user>
##$USERA2= <user>
##$USERA3= <user>
##$USERA4= <user>
##$USERA5= <user>
##$V9= 5
##$VALIST= <valist>
##$VCLIST= <CCCCCCCCCCCCCCC>
##$VD= 0
##$VDLIST= <DDDDDDDDDDDDDDD>
##$VPLIST= <PPPPPPPPPPPPPPP>
##$VTLIST= <TTTTTTTTTTTTTTT>
##$WBST= 1024
##$WBSW= 4
##$XGAIN= (0..3)
0 0 0 0 
##$XL= 0
##$YL= 0
##$YMAX_a= 193491
##$YMIN_a= -286576
##$ZGOPTNS= <>
##$ZL1= 120
##$ZL2= 120
##$ZL3= 120
##$ZL4= 120
##$ABSF1= 15.71825
##$ABSF2= -2.333599
##$ABSG= 5
##$ABSL= 3
##$ALPHA= 0
##$AQORDER= 0
##$ASSFAC= 0
##$ASSFACI= 0
##$ASSFACX= 0
##$ASSWID= 0
##$AUNMP= <proc_1d>
##$AZFE= 0.1
##$AZFW= 0.1
##$BCFW= 0
##$BC_mod= 2
##$BYTORDP= 0
##$COROFFS= 0
##$CY= -3
##$DATMOD= 1
##$DC= 0
##$DFILT= <>
##$DTYPP= 0
##$F1P= 0
##$F2P= 0
##$FCOR= 1
##$FTSIZE= 16384
##$FT_mod= 6
##$GAMMA= 0
##$GB= 0
##$INTBC= 1
##$INTSCL= 0
##$ISEN= 128
##$LB= 0.24
##$LEV0= 0
##$LPBIN= 0
##$MAXI= 10000
##$MC2= 0
##$MEAN= 0
##$ME_mod= 0
##$MI= 1.114404
##$NCOEF= 0
##$NC_proc= -7
##$NLEV= 6
##$NOISF1= 3.799351
##$NOISF2= 2.8
##$NSP= 0
##$NTH_PI= 0
##$NZP= 0
##$OFFSET= 15.72816
##$PC= 1
##$PHC0= -15517.73
##$PHC1= 18.60081
##$PH_mod= 1
##$PKNL= yes
##$PPARMOD= 0
##$PSCAL= 0
##$PSIGN= 0
##$REVERSE= no
##$SF= 200.13000468257
##$SI= 16384
##$SIGF1= 3
##$SIGF2= 2
##$SINO= 5.538805
##$SIOLD= 16384
##$SREGLST= <1H.CDCl3>
##$SSB= 0
##$STSI= 16384
##$STSR= 0
##$SW_p= 3612.71676300578
##$SYMM= 0
##$S_DEV= 0
##$TDeff= 16384
##$TDoff= 0
##$TI= <>
##$TILT= no
##$TM1= 0
##$TM2= 0
##$TOPLEV= 0
##$USERP1= <user>
##$USERP2= <user>
##$USERP3= <user>
##$USERP4= <user>
##$USERP5= <user>
##$WDW= 1
##$XDIM= 16384
##$YMAX_p= 327183114
##$YMIN_p= -806349
$$ End of Bruker specific parameters
$$ ---------------------------------
##NTUPLES= NMR SPECTRUM
##VAR_NAME=  FREQUENCY,     SPECTRUM/REAL,   SPECTRUM/IMAG
##SYMBOL=    X,             R,               I
##VAR_TYPE=  INDEPENDENT,   DEPENDENT,       DEPENDENT
##VAR_FORM=  AFFN,          ASDF,            ASDF
##VAR_DIM=   16384,         16384,           16384
##UNITS=     HZ,            ARBITRARY UNITS, ARBITRARY UNITS
##FACTOR=    0.220516191357247, 1,           1
##FIRST=     3147.67671533179, 0,            0
##LAST=      -465.040047673992, 0,           0
##MIN=       -465.040047673992, -806349,     0
##MAX=       3147.67671533179, 327183114,    0
$$ Real data points
##PAGE= N=1
##DATA TABLE= (X++(R..R)), XYDATA
$$ [...]
5704D661831J56577L41333N47690J17895K34128J34401k60423o32337o54898n34994
5694D111203m53645k70722l06261j29868P3843R7469q8124k48044k31187o402
5684B548262j7637L3333k43654N3282j58781j68986J04273O9534L9616j45318
5674B113924Q864j34618q9121o2135j86439o8871M5910j10340O7102J85428j18672
5663A651032l1961k9746j36716M7965J43950m0403j1123j75757Q3914J34884k1407
5652A614632K69824j08694r624o0869L02178P235L2978m3395k7403p7328m7703
5641A851831L0557j89545M3556k7206J9933K4603M4374j03019o6385j30936j4228
5630A483535L7687K46208j01086r0481j9510O3142M2713j8141j9932N949J12439
$$ plain form
5704 4661831 4818408 5159741 5707431 5825326 6059454 6193855 5933432 5301095 4646197 4111203
5694 4111203 3657558 3386836 3080575 2950707 3024550 3122019 3033895 2785851 2554664 2548262
5684 2548262 2530625 2563958 2320304 2373586 2214805 2045819 2150092 2219626 2259242 2113924
5674 2113924 2122788 1988170 1899049 1836914 1650475 1581604 1627514 1517174 1584276 1769704 1651032
5663 1651032 1619071 1589325 1452609 1500574 1644524 1604121 1592998 1417241 1501155 1636039 1614632
5652 1614632 1884456 1775762 1766138 1705269 2007447 2014682 2047660 2004265 1976862 1899534 1851831
5641 1851831 1882388 1692843 1736399 1709193 1729126 1753729 1798103 1695084 1628699 1497763 1483535
5630 1483535 1521222 1767430 1666344 1575863 1556353 1619495 1662208 1644067 1624135 1630084 1742523
5619A742523j85356O272J06042p1526J06155m8999j31352R8063N3317J72143M2917
5608A890199P5488N3265J28802J07831j83806k11173J75471J63492l0540j32667
5598B036362K63982K49154J19232j24114k01955L13552O3611J60602J72370R5288
5588C148084K90640J63202K70398J80529M46111M05034K55774M38110L89080K12666
5578F199628O58262P56504O73354R25400R87962R23972J245198J605832J936255
5569A5912367K058654K330532K541687L043341L554566L509910J526864k509416
5561C1968505n386257n788800m171347k757919j863410j333500p62260n90603
5553I314409m43279k52737m77208l57772o3166l75772j50334j04998j85047j74356
$$ plain form
5619 1742523 1557167 1563439 1669481 1597955 1704110 1655111 1523759 1621822 1675139 1847282 1890199
5608 1890199 1965687 2018952 2147754 2255585 2071779 1860606 2036077 2199569 2169029 2036362
5598 2036362 2300344 2549498 2668730 2544616 2342661 2656213 2719824 2880426 3052796 3148084
5588 3148084 3438724 3601926 3872324 4052853 4498964 4903998 5159772 5597882 5986962 6199628
5578 6199628 6857890 7614394 8287748 9213148 10201110 11125082 12370280 13976112 15912367
5569 15912367 17971021 20301553 22843240 25886581 29441147 32951057 34477921 31968505
5561 31968505 26582248 20793448 16622101 13864182 12000772 10667272 9905012 9314409
5553 9314409 8871130 8618393 8141185 7783413 7720247 7344475 7194141 7089143 6904096 6729740
5543F729740j423M1166K11401J28293J10990J27245L18150J82356K63522N85825
5533H697265K89779n0442l59872l57269j91041k68812J14801L33475L21067L35360
5523H864311P54182O07115O88418O54217P67155R59139p8200j419125j436440
5514A0360772j305963p61983m13175p32018k66747j82866L2913L9800p6243Q6017
5504F780507K54545K67009R1689L22186L81356N35920R08424R67344J027070J217943
5494A2753993R81609J396140J700640J578029K219996K416429K478793K761138
5486B8286767K379351n73390l679750m848957l937266k689792j958926j343320
5478A1634717q42148m59240m48731m01724j76890k07814k58239n2465J2743K81560
$$ plain form
5543 6729740 6728317 6769483 6980884 7109177 7220167 7347412 7665562 7847918 8111440 8697265
5533 8697265 8987044 8936602 8576730 8219461 8028420 7759608 7874409 8207884 8528951 8864311
5523 8864311 9618493 10225608 10914026 11568243 12335398 13294537 13216337 11797212 10360772
5514 10360772 9054809 8292826 7879651 7147633 6880886 6698020 6730933 6770733 6694490 6780507
5504 6780507 7035052 7302061 7393750 7715936 8097292 8633212 9541636 10508980 11536050 12753993
5494 12753993 13735602 15131742 16832382 18410411 20630407 23046836 25525629 28286767
5486 28286767 30666118 30092728 26412978 21564021 17626755 14936963 12978037 11634717
5478 11634717 10792569 10333329 9884598 9482874 9305984 9098170 8839931 8787466 8800209 9081769
5468I081769M54599P24870O20452P15725P47847J003827J173753J309544J776428
5459A7608814J780117J923908K392190K904069K887821K087354j253047m080232
5451B6250994n333934m142302k884798j613186j341497j057494q27716o64223
5443H385844m46194m99864l90436j53625M3255j46463L7117r5843m4007N9474
5433F749258J51991J88353K58822L58457M69395M13194O92280N83901N10974Q04047
5423A1180672R52231L80591p25390j477929j810072j238868j192721o58998l30472
5414E079044k92031j81903l43815j65272n7820k75892l82761m8239q9724j35448
5404C106139j18819j71985L2387j24449o4761N0109j44445l7473J39657J04859
$$ plain form
5468 9081769 9536368 10261238 10881690 11597415 12345262 13349089 14522842 15832386 17608814
5459 17608814 19388931 21312839 23705029 26609098 29496919 31584273 30331226 26250994
5451 26250994 20917060 16774758 13889960 12276774 10935277 9877783 9050067 8385844
5443 8385844 7939650 7439786 7049350 6895725 6938980 6792517 6829634 6733791 6689784 6749258
5433 6749258 6901249 7089602 7348424 7706881 8176276 8589470 9281750 9865651 10376625 11180672
5423 11180672 12132903 12513494 11788104 10310175 8500103 7261235 6068514 5409516 5079044
5414 5079044 4787013 4605110 4261295 4096023 4038203 3762311 3379550 3331311 3241587 3106139
5404 3106139 2987320 2815335 2847722 2723273 2658512 2708621 2564176 2526703 2666360 2771219
5394B771219j52101j94493k37485J03379o806j15345N3790O3439K2924j65647
5384B142874J07333k3163k18791Q3632M1639L30535r0783K3945r0556o0408Q5100
5373B331357j09816j18022K19404L0733j29427q7872J99033j00164l4464K0441
5363B221203P1300J19580n9815n7670K35155M8859n8549j09879R5031P2141j85911
5352B391445L77401r273j04529J6092R3833q2257p4295J3345r3170J49557l2641
5341B645508K4549J26450K88681K16287n8724p8367o0360l4875l986K63876k3898
5330C305141K53634J83272n7912J39981K70162O3666L3509j66097K3329J75010
5320D223695j5298j72097k07012J9649j27291J55377p851j60296J26988L34851
$$ plain form
5394 2771219 2619118 2424625 2187140 2290519 2283713 2168368 2222158 2285597 2308521 2142874
5384 2142874 2250207 2227044 2008253 2091885 2133524 2464059 2373276 2397221 2306665 2246257 2331357
5373 2331357 2221541 2103519 2322923 2353656 2224229 2136357 2335390 2235226 2200762 2221203
5363 2221203 2292503 2412083 2352268 2294598 2529753 2578612 2520063 2410184 2505215 2577356 2391445
5352 2391445 2768846 2759573 2655044 2671136 2764969 2682712 2608417 2621762 2528592 2678149 2645508
5341 2645508 2670057 2796507 3085188 3301475 3242751 3164384 3104024 3069149 3065163 3329039 3305141
5330 3305141 3558775 3742047 3684135 3824116 4094278 4157944 4191453 4025356 4048685 4223695
5320 4223695 4208397 4036300 3829288 3848937 3721646 3877023 3869172 3708876 3835864 4170715
5310D170715O8215q3931J66605M1984R7274P9824j01788j5055J13356J81741j78145
5299D540795O3017K21495L07739p1437p6994N0575Q9002P3743q4078J23523J66295
5288E403675J53310J91257J64832j34573K35103L03720K97953K57330K06851N9636
5278G139094K89100K22224K46050K91638K15619L07940M29168O70195O23394N67692
5268A1002114L61746Q06040Q17292O53660O97331J141474J224815J534305J861954
5259B0100731K261982K690909L417599L815765M174371M517044N499379O648011
5251E3125791O859053Q314863R614563J0498238J1940627J2796045M21202j4953488
5243I8616894k2283191j8788163j1755542q122437n440542m169283l084061k407412
$$ plain form
5310 4170715 4238930 4154999 4321604 4363588 4460862 4540686 4438898 4423843 4537199 4718940 4540795
5299 4540795 4603812 4825307 5133046 5061609 4984615 5035190 5124192 5197935 5113857 5237380 5403675
5288 5403675 5556985 5748242 5913074 5778501 6013604 6317324 6615277 6872607 7079458 7139094
5278 7139094 7428194 7650418 7896468 8188106 8403725 8711665 9140833 9811028 10434422 11002114
5268 11002114 11363860 12169900 12987192 13640852 14338183 15479657 16704472 18238777 20100731
5259 20100731 22362713 25053622 28471221 32286986 36461357 40978401 46477780 53125791
5251 53125791 59984844 68299707 77914270 88412508 100353135 113149180 113570382 98616894
5243 98616894 76333703 57545540 45789998 37667561 32227019 28057736 24973675 22566263
5235B2566263k060873j775695j414921j229018j188467j034024p85901o97449
5227A2379915o17036o12890m34540n09278n57367l15023p6306m36235k93498m71759
5217H055983m24495k21379k33801j20241l42087j96097j50233k18462k61908j84313
5207E702967P4062k50009k08873j52550m3599j32186k37028k11902j12242k09895
5197D218745N5380j86510k84756m6139J5127k43837j95161k6114p2430j18131
5187C116174j46148j0477k0854o7587R4250j6758k09924J70106J81756j11659
5177B978879J39101j84134j01939j46766o758k57032j72468p7200K77631j23114
5167B326200r4891L1198L7162J6483j15427j65543l6482k0413n154j71961j42255
$$ plain form
5235 22566263 20505390 18729695 17314774 16085756 14897289 13863265 13077364 12379915
5227 12379915 11762879 11149989 10715449 10206171 9648804 9333781 9257475 8821240 8527742 8055983
5217 8055983 7631488 7410109 7176308 7056067 6713980 6517883 6367650 6149188 5887280 5702967
5207 5702967 5777029 5527020 5318147 5165597 5121998 4989812 4752784 4540882 4428640 4218745
5197 4218745 4274125 4087615 3802859 3756720 3771847 3528010 3332849 3306735 3234305 3116174
5187 3116174 2970026 2959549 2938695 2871108 2965358 2948600 2738676 2908782 3090538 2978879
5177 2978879 3117980 2933846 2831907 2685141 2678383 2421351 2248883 2171683 2449314 2326200
5167 2326200 2231309 2262507 2299669 2316152 2200725 2035182 1998700 1978287 1973133 1801172 1658917
5156A658917O911R772j38264j93046q7217o1196J31140L4709p3532o0658J25493
5145A353029j7613k5700q5808k962p4171q6323j57427J53061l4614k65973o2360
5134F93139L35441p7387q5712J02710J64107q5988j09199j51962P9437j50665
5124G13921n5148K07532p8650J06344l5007R4080R7785l0522M1193p1470L7575
5113A027633j36121l5435j9827k27204l9237K64054j50756r942J03859j69129
5103F07895j31565P9162N764P5909p7940j55960k48594J99639O8113j46101O6613
5092C42935j3632J78171j01774j47778L8354J14232J03006p730J2599q1669j82885
5081B53829q5217m8747K5742K67974j25533P0644Q8993l6858n1641N3251j05012
$$ plain form
5156 1658917 1665828 1675600 1537336 1344290 1257073 1195877 1327017 1361726 1288194 1227536 1353029
5145 1353029 1335416 1309716 1223908 1220946 1146775 1060452 903025 1056086 1021472 755499 693139
5134 693139 1028580 951193 865481 968191 1132298 1046310 937111 785149 864586 713921
5124 713921 658773 866305 787655 893999 858992 953072 1050857 1020335 1061528 990058 1027633
5113 1027633 891512 856077 836250 609046 569809 833863 683107 673165 777024 607895
5103 607895 476330 555492 561256 637165 559225 403265 154671 354310 422423 276322 342935
5092 342935 329303 507474 405700 257922 296276 410508 513514 505784 518383 436714 253829
5081 253829 168612 119865 145607 413581 288048 358692 447685 410827 359186 412437 307425
5070C07425j20332q6602j04056J91602j71194m4382P09J22185R9037q9587j64584
5059e9779J41835R8586K4995o040Q9741j38563k15644J52341J24098L4685m5578
5048B00677q7036m9447q960o4859J6564Q4427j39849M2217m541R562O8373J06597
5036A73725p0557m0192o3580P1700j26426O1730N1836j41816j29487M7322K80497
5025A14752n6862J5140j86924O2273J39339j00200R1399o3461J92538J04479J37021
5014D49494m6978k02110O6478m8708m5560J58227l41391m2789K85495J87053k56324
5003A62887J67119J14155N5304j67116k88580Q5970K5524K6577J3959j37559J67930
4992B26170P2780J24104O5969m8359L3082k4743j2064p4959p4650J13029J62497
$$ plain form
5070 307425 187093 100491 -3565 188037 16843 -27539 -26830 95355 194392 104805 -59779
5059 -59779 82056 180642 205637 199597 289338 150775 -64869 87472 211570 246255 200677
5048 200677 113641 64194 55234 -9625 6939 91366 -48483 -6266 -10807 -1245 67128 173725
5036 173725 103168 62976 -604 71096 -55330 6400 58236 -83580 -213067 -165745 114752
5025 114752 57890 73030 -113894 -51621 87718 -12482 78917 15456 207994 312473 449494
5014 449494 402516 200406 266884 218176 172616 330843 -10548 -53337 232158 419211 162887
5003 162887 330006 444161 499465 332349 43769 129739 155263 181840 195799 58240 226170
4992 226170 298950 423054 489023 440664 473746 449003 436939 361980 287330 400359 562856
4981E62856k869l8876m6958k74406K1199N54602k3546K900r6887j1293n2299p5860
4969E18563r4228K63318o4649J1173R3612J41190j28698J48894r6272L1839J06230
4958I30972R2825r6246k00642k1032J84093K5334j61872J35966M41235N9565j70806
4947A219392q0739K5104N6147k3736J10670L4580J09563l187M8682K39793J91
4936A736460M6524J24077K12971p6393o9651J37434J0892j50073p7996K80279
4926B174524J63506J59784K34398P8904j31480j4249j06679r8040Q7449K6431
4916B574548J32551j3066K0566K84701O411L0874J85639J29354j96686K03033
4906C357925K88291Q110J87447K32637J07490j21250Q1043J32838R5877K35080
$$ plain form
4981 562856 559987 521111 474153 199747 220946 775548 752002 754902 658015 646722 594423 518563
4969 518563 424335 687653 623004 634177 727789 868979 740281 889175 792903 824742 930972
4958 930972 1023797 927551 726909 705877 889970 915304 753432 889398 1330633 1390198 1219392
4947 1219392 1138653 1163757 1219904 1196168 1306838 1341418 1450981 1447794 1496476 1736269 1736460
4936 1736460 1782984 1907061 2120032 2043639 1973988 2111422 2122314 1972241 1894245 2174524
4926 2174524 2338030 2497814 2732212 2811116 2679636 2665387 2558708 2460668 2548117 2574548
4916 2574548 2707099 2694033 2714599 2999300 3005711 3036585 3222224 3351578 3154892 3357925
4906 3357925 3646216 3654326 3841773 4074410 4181900 4060650 4141693 4274531 4370408 4605488
4896D605488K39786J55551n6182K24854L67417L68726J77195K65228K83457L43576
4886F975096J39218J49561K2992m6900J07116K20934J72147J69353M35770K37236
4876H582523L93851N09145N08555P3661O71171O54696N15118N73874O40496P50493
4866A3873583Q23351J002203R07275R46211Q62928Q43300Q89755Q64145L99969
4857B1412720L97199K60466m2003l34868k82879l02207l70348m71909l27677j936
4847A9936558J70928m9258J92843R6584l813M22520N55590M86851P30445Q34165
4837B3373413O50976Q08350Q55897Q78788J319613J123670J143973J131604J163155
4828C2449439R63812Q58248Q52986O90705N17423N3396k29267l40756p33085q15429
$$ plain form
4896 4605488 4845274 5000825 4944643 5169497 5536914 5905640 6082835 6348063 6631520 6975096
4886 6975096 7114314 7263875 7286867 7239967 7347083 7568017 7740164 7909517 8345287 8582523
4876 8582523 8976374 9485519 9994074 10067735 10738906 11393602 11908720 12482594 13123090 13873583
4866 13873583 14696934 15699137 16606412 17552623 18415551 19258851 20148606 21012751 21412720
4857 21412720 21809919 22070385 22028382 21693514 21410635 21108428 20738080 20266171 19938494 19936558
4847 19936558 20107486 20058228 20251071 20347655 20343842 20766362 21321952 21808803 22539248 23373413
4837 23373413 24024389 24832739 25688636 26567424 27887037 29010707 30154680 31286284 32449439
4828 32449439 33413251 34271499 35124485 35815190 36332613 36386009 36156742 35815986 35082901 34267472
4818C4267472o39102p54680p53896p05066r97066q02468r10738p34555m79026
4809B7490875l04364m93107j69200J83031J3801L4642K43102L71137N1671P1194
4799B7492782J95400K67650j12028J28174Q557J72931K33539K45464L21854J11988
4789B9066311L56978J59566k92449o06154r74865j028502j127801j083394j112487
4780B3357203j168127q11824r38481p71875o56052l93033m16087l47338k45323
4771A7609063n55005k34319j94393j96560m27954o33510p42449p71483o28147
4762A3225243o72399o15964l98282m27830l01751m34178j26210j75358k32993
4753I840278m50432j35040n8605j91610k04079k0753l50142j46062K5657j775
$$ plain form
4818 34267472 33628370 32873690 32119794 31414728 30417662 29615194 28704456 27969901 27490875
4809 27490875 27186511 26693404 26524204 26707235 26721036 26755678 26998780 27369917 27421588 27492782
4799 27492782 27688182 27955832 27843804 27971978 27980535 28153466 28387005 28632469 28954323 29066311
4789 29066311 29423289 29582855 29290406 28684252 27709387 26680885 25553084 24469690 23357203
4780 23357203 22189076 21377252 20438771 19666896 19010844 18617811 18201724 17854386 17609063
4771 17609063 17054058 16819739 16625346 16428786 16000832 15367322 14624873 13853390 13225243
4762 13225243 12552844 11936880 11538598 11110768 10809017 10374839 10248629 10073271 9840278
4753 9840278 9389846 9254806 9196201 9004591 8800512 8779759 8429617 8283555 8309212 8307437
4743H307437j55183j41155J38622j42226k9699M6464R6450j17468j73068j90489
4733G639685k48011k88753k39030k21612o0803k31818m61125K7276j6737K1576
4723E920648l09346Q018r1157k50179R6799k66507o9977K06218k38054k14074
4713D792389J22472m6275k36114Q2251J98491l53032r2993R2806J04214N2059
4703D716268j74017J4331J23028k29533K3637L4874m9016j09113n6806K98623
4693D592276k35192j82762K63767n401o7672o652j07439n9312P7831o3548M8363
4682D254259K12213Q8118N5861J04230J5661r4948J14053J17748N7953K41988
4672E167136L6940j5563J64356K34744J30722K24229J4473j17354J50538O4852
$$ plain form
4743 8307437 8152254 8011099 8149721 8007495 7977796 8024260 8120710 8003242 7830174 7639685
4733 7639685 7391674 7102921 6863891 6642279 6581476 6349658 5888533 5915809 5899072 5920648
4723 5920648 5611302 5619320 5528163 5277984 5374783 5108276 5038299 5244517 5006463 4792389
4713 4792389 4914861 4868586 4632472 4714723 4913214 4560182 4467189 4559995 4664209 4716268
4703 4716268 4542251 4556582 4679610 4450077 4473714 4508588 4459572 4350459 4293653 4592276
4693 4592276 4357084 4174322 4438089 4432688 4365016 4358364 4250925 4191613 4269444 4205896 4254259
4682 4254259 4466472 4554590 4610451 4714681 4730342 4635394 4749447 4867195 4925148 5167136
4672 5167136 5204076 5188513 5352869 5587613 5718335 5942564 5957037 5839683 5990221 6055073
4662F055073k6258j87364m173L654J92434L42503J37409J96611J995J26536m975
4651F833445j1008K33722Q0601n7177K00360L5658J09569J82265J66789J98420
4641G972644N3785J09640p8421L00798L69852K36975K18981K28480K41737n0345
4631I604126J34054J68454M56446M76889L19613M24069N04455L67363L22450K46613
4621A3024532M28001N28142M23121O57987N59235O16555P39053R42299R23567
4612A8842492Q16053Q95992J017425J453419J338339J604855J698835J936268
4604B9603678J598199J956029K465620K607681K971429L783188M457180N091320
4596E4534324O216936P525879Q387012R565342J1012001J2597138J4229643J5696914
$$ plain form
4662 6055073 6028815 5841451 5837278 5840932 6033366 6375869 6513278 6709889 6711884 6838420 6833445
4651 6833445 6822437 7056159 7136760 7079583 7279943 7315601 7425170 7607435 7774224 7972644
4641 7972644 8026429 8136069 8057648 8358446 8728298 8965273 9184254 9412734 9654471 9604126
4631 9604126 9738180 9906634 10363080 10839969 11159582 11583651 12088106 12455469 12777919 13024532
4621 13024532 13452533 13980675 14403796 15061783 15621018 16237573 16976626 17918925 18842492
4612 18842492 19658545 20554537 21571962 23025381 24363720 25968575 27667410 29603678
4604 29603678 31201877 33157906 35623526 38231207 41202636 44985824 49443004 54534324
4596 54534324 60751260 68277139 76664151 86229493 97241494 109838632 124068275 139765189
4588A39765189J7687646J9670823K1292682K2200426K1060375R854072j2574100
4581B38957113l1865449l8167261l2031373k3622590j7286157j2939132j0082009
4574G2963142q074234o642691n519910m567478l720354l455066l036771k626512
4566C5320126k141780j907246j745893j589810j446891j413493j208445j067225
4558B2799343o60137r40553q07914j046624q79859o82890p34056n59914m69350
4549A6018046n12024n36946o01103n59462n21463m35775l14964n25775n36785
4540A1473749j4260m19831o3789m23263m84527k10227J396n12547k31353k67879
4530H847469l85034k2674n7514r6799j94820j16337M89j44476k72616j81658j58893
$$ plain form
4588 139765189 157452835 177123658 198416340 220616766 241677141 251531213 238957113
4581 238957113 207091664 168924403 136893030 113270440 95984283 83045151 72963142
4574 72963142 64888908 58246217 52726307 48158829 44438475 40983409 37946638 35320126
4566 35320126 33178346 31271100 29525207 27935397 26488506 25075013 23866568 22799343
4558 22799343 22139206 21198653 20390739 19344115 18464256 17781366 17047310 16487396 16018046
4549 16018046 15506022 14969076 14367973 13808511 13287048 12851273 12536309 12010534 11473749
4540 11473749 11459489 11039658 10975869 10552606 10068079 9857852 9859248 9346701 9115348 8847469
4530 8847469 8462435 8439761 8382247 8285448 8090628 7974291 7974780 7830304 7557688 7376030 7217137
4519G217137j29599k7082l31j38549j01500j59214k13464o017j85057j03807q6394
4508F066123p2992k08933l11816J34450l1912l5186j99840j65521P7460j36175
4498E115658m5277J01444R2630m5793K4651J67072Q5784j76121J03653J21781
4488E545482J28049j76057l30458l54603j83072l3982m47994j49152l0591j51102
4478C816520p1070q9667K1368j85678k71946J03937j60170l0847Q9591n9766n2837
4467C109435k28467K5309J78600j0032R5614j14406r9740k2662k1473j53908J78488
4456B936758j71873J87208L4272o7594j2424K89646O5461L3366p863K37406K03018
4445C727381j08632k20572m6351k83844j64245j50309J31132r128j03872r7681
$$ plain form
4519 7217137 7087538 7060456 7060125 6921576 6820076 6660862 6447398 6441381 6256324 6152517 6066123
4508 6066123 5993131 5784198 5472382 5606832 5574920 5539734 5339894 5174373 5251833 5115658
4498 5115658 5070381 5171825 5264455 5218662 5243313 5410385 5496169 5320048 5423701 5545482
4488 5545482 5673531 5497474 5167016 4812413 4629341 4595359 4147365 3998213 3967622 3816520
4478 3816520 3745450 3655783 3677151 3491473 3219527 3323464 3163294 3132447 3222038 3162272 3109435
4467 3109435 2880968 2906277 3084877 3074845 3170459 3056053 2956313 2933651 2912178 2758270 2936758
4456 2936758 2764885 2952093 2986365 2918771 2906347 3195993 3261454 3294820 3286957 3524363 3727381
4445 3727381 3618749 3398177 3351826 3067982 2903737 2753428 2884560 2875432 2771560 2673879
4435B673879n2383m4441j81004J23940j40103j11720l6174M57530r5605j28590
4425B465329K36899j7910k933R3922o5689k43012K14164k8603j75655J03032k3659
4414B555885J17717Q1361j52773L8913r723r3152j51431m3015J45808O8268J71554
4403B729412n7405k02574j14943j20915q0920K25425k5631Q5869M0022P1623N8347
4392B608310j81422m766K21857J23544J02344k2254m2838P433J91576j4032q8735
4381B901017K1014J34767o8114J17141K11424m4397r746M647N8566L7448j35839
4370C227928K3670J46978K7043J76872m7109j1831L7431R1046j06510m7219J44506
4359C662805K43822L5931J62370J54576L8570J09778J61966P7889J27497n9268
$$ plain form
4435 2673879 2621496 2577055 2396051 2519991 2379888 2268168 2231994 2689524 2593919 2465329
4425 2465329 2702228 2684318 2681385 2775307 2709618 2466606 2680770 2652167 2476512 2579544 2555885
4414 2555885 2673602 2754963 2602190 2641103 2631380 2538228 2386797 2343782 2489590 2557858 2729412
4403 2729412 2672007 2469433 2354490 2233575 2152655 2378080 2352449 2438318 2478340 2549963 2608310
4392 2608310 2426888 2422122 2643979 2767523 2869867 2847613 2804775 2812208 3003784 2989752 2901017
4381 2901017 2922031 3056798 2988684 3105825 3317249 3272852 3263106 3267753 3326319 3363767 3227928
4370 3227928 3251598 3398576 3425619 3602491 3555382 3543551 3580982 3672028 3565518 3518299 3662805
4359 3662805 3906627 3942558 4104928 4259504 4298074 4407852 4569818 4647707 4775204 4715936
4349D715936P5470L20581J74768J59910P4915O5942K47653K8935M2589J62963
4339F069662J3504J16482K32695J73497K16960J90777L64352L42818K64024K11314
4329H196085L24710M89515K83217L15365L88110L57088K99123M53437M07426R5531
4319A1609607k9659L27724J95228n3949Q7504L43392J21850J24411K73106J30197
4309A3129411L85741P87395J90237M85850O31415P34110L42404O18830Q47264
4300A8152657O29399N64986O63981N87698O52013L94502M17407M96906J62241
4291B2721790j46885P5235N1401L197J58392K41061M5926P8941J96267J30143
4281B3555468L07205P4085K50433K07723J15747M26373K65854L36504K68434K38715
$$ plain form
4349 4715936 4791406 5111987 5286755 5446665 5521580 5587522 5835175 5864110 5906699 6069662
4339 6069662 6083166 6199648 6432343 6605840 6822800 7013577 7377929 7720747 7984771 8196085
4329 8196085 8520795 9010310 9293527 9608892 9997002 10354090 10653213 11106650 11514076 11609607
4319 11609607 11579948 11907672 12102900 12048951 12136455 12479847 12601697 12726108 12999214 13129411
4309 13129411 13515152 14302547 14492784 14978634 15610049 16344159 16686563 17305393 18152657
4300 18152657 18782056 19347042 20011023 20598721 21250734 21645236 22062643 22559549 22721790
4291 22721790 22574905 22650140 22701541 22704738 22863130 23104191 23150117 23229058 23425325 23555468
4281 23555468 23862673 23936758 24187191 24394914 24510661 24937034 25202888 25539392 25807826 26046541
4271B6046541J87589K56295M83453L58265L21373K84229q7554Q4869J58593J4537
4261B8108190O7705J42718K0999k7822j8987j64127n5971j76546j67209o40681
4251B7088269k51950l61124n88233n64782m82552l00225p5462j21643k24408j52979
4241B3964911K5326r3920J61263R0356J36965R4264k7465j44032m5420K63966
4231B4426214o9508k27328N4640j68557j79859l50978k61018l22486o86458m91588
4221B1723074k23042m94527n55270n49880k12314l26733l33979k47202k62810
4212A8517317j68486o5448O046m2697J76411J86793K54377j35305J84937L20828
4202A9234773L67418M00529Q4473n971J70514K72435k6349L47192K22794J63883
$$ plain form
4271 26046541 26234130 26490425 26973878 27332143 27653516 27937745 27850191 27935060 28093653 28108190
4261 28108190 28175895 28318613 28339612 28311790 28292803 28128676 28072705 27896159 27728950 27088269
4251 27088269 26836319 26475195 25886962 25322180 24839628 24539403 24463941 24342298 24117890 23964911
4241 23964911 23990237 23896317 24057580 24147936 24284901 24379165 24351700 24207668 24162248 24426214
4231 24426214 24356706 24129378 24184018 24015461 23835602 23484624 23223606 22901120 22214662 21723074
4221 21723074 21500032 21005505 20450235 19900355 19688041 19361308 19027329 18780127 18517317
4212 18517317 18348831 18283383 18289429 18246732 18423143 18609936 18864313 18729008 18913945 19234773
4202 19234773 19602191 20002720 20087193 20081222 20251736 20524171 20497822 20845014 21067808 21231691
4192B1231691L32473K32770L24250P11662P41609P69669O33533J047625J290558
4183B7315840J420876J733912J522922J948004J987491K106192K500708K955258
4175D3491203L421441L790530M758883N074630N516022N989971O377178O561597
4167H4981455P422585Q380232R486913J0473173J1494001J2984724J3837234J4236150
4159A73296467J0762633J719770j0978715k0766535k3265814k0093343j5216306
4152I5458157j1578051q624564o676602n421600m496795l582390k603666k270912
4144E0203577k045046j605146j282353j370582j143168j090048p05662m50523
4136D0511049l69400k76634j03318j28014j64311M8463N6723q7058j57988J74527
$$ plain form
4192 21231691 21564164 21796934 22121184 22832846 23574455 24344124 24977657 26025282 27315840
4183 27315840 28736716 30470628 31993550 33941554 35929045 38035237 40535945 43491203
4175 43491203 46912644 50703174 55462057 60536687 66052709 72042680 78419858 84981455
4167 84981455 92404040 100784272 110271185 120744358 132238359 145223083 159060317 173296467
4159 173296467 184059100 185778870 174800155 154033620 130767806 110674463 95458157
4152 95458157 83880106 75255542 68578940 63157340 58660545 55078155 52474489 50203577
4144 50203577 48158531 46553385 45271032 43900450 42757282 41667234 40961572 40511049
4136 40511049 40141649 39865015 39761697 39633683 39469372 39517835 39574558 39487500 39329512 39504039
4126C9504039J00405K12607L13050K2018K10821o78n5366m67400J37897J73517
4116D0150910J95121O4752J56428L82924J15611L11569L68018L27471J17799m3925
4106D2146678k96197o62109o17033q62140p35880n58889l44211n02305n28488
4097C7039426m89565m27626m14333o24261m40329o33296o12879q70676j029726
4088C1496735p78759o64510r80443q96145m32834o01347n73680m49008o24622
4079B5495387n56563p70026p80421m19427n36662o21251n38750m82843n30135
4070B0259309l81812l88695q63359q91680o96491n86349p02057n94780m87999
4061A4666087m50473l54304m48841l72413k86457l59472k95107j85050l49438
$$ plain form
4126 39504039 39604444 39817051 40130101 40152119 40362940 40362262 40306896 39839496 39977393 40150910
4116 40150910 40346031 40410783 40567211 40950135 41065746 41377315 41745333 42072804 42190603 42146678
4106 42146678 41850481 41188372 40571339 39709199 38973319 38414430 38070219 37567914 37039426
4097 37039426 36549861 36122235 35707902 35083641 34643312 34010016 33397137 32526461 31496735
4088 31496735 30717976 30053466 29073023 28176878 27744044 27142697 26569017 26120009 25495387
4079 25495387 24938824 24168798 23388377 22968950 22432288 21811037 21272287 20789444 20259309
4070 20259309 19877497 19488802 18625443 17733763 17037272 16450923 15748866 15154086 14666087
4061 14666087 14215614 13861310 13412469 13040056 12753599 12394127 12099020 11913970 11564532
4052A1564532k43827k95480r9808k06627j49371j54700L2079J1966l5766O5546
4042A0488544k14931l28295j35245m3017k86792l04762m81873j91558j73888N8043
4032H386226m34359k21195l7733j7454N823j77963j9449q2109L9999o5165o9447
4021G307174L1349J6027K5166k37577r8654l6437p9355J53932q1828n7321l8102
4010F904374k72207k16670j63873M4655K25366k99345k18372J08571J58811J07655
4000F378965j7186P2969J13396l4229m3360K39286J61024J63797j27J32564m7015
3989G120084J13659J94373k56915m73432k71937l62813k50416j83549p7112k26145
3979E325797L053j479O9841j09473j13067r7696K7251Q3508j26797J86925l2525
$$ plain form
4052 11564532 11320705 11025225 10925417 10718790 10569419 10414719 10446798 10458764 10422998 10488544
4042 10488544 10273613 9945318 9810073 9767056 9480264 9175502 8693629 8502071 8328183 8386226
4032 8386226 7951867 7730672 7692939 7675485 7681308 7503345 7483896 7401787 7441786 7376621 7307174
4021 7307174 7338523 7354550 7379716 7142139 7043485 7007048 6927693 7081625 6999797 6942476 6904374
4010 6904374 6632167 6415497 6251624 6296279 6521645 6222300 6003928 6112499 6271310 6378965
4000 6378965 6361779 6434748 6548144 6513915 6470555 6709841 6870865 7034662 7034535 7167099 7120084
3989 7120084 7233743 7428116 7171201 6697769 6425832 6063019 5812603 5629054 5551942 5325797
3979 5325797 5328850 5327371 5397212 5287739 5174672 5076976 5104227 5187735 5060938 5247863 5215338
3968E215338R6474J11236o4478R7220m9756q263j31824N2731J35577Q528j53130
3957E309653M7081O2338j08331j79643Q8401J30393N9194J33748J26135K39347
3947E908316K05170K43141j51642j79725m33418m80233l48295k28585q8997j62615
3937D283117J3278l2862K563K0212j67359k6431r0278o9809j48011q2924k46342
3926C455154j70154l2073q5438J38264k7315l30022k6686j14440P7202j03845
3916B780647J11023N0487J42561j10887l9075J39206L6144j53231M9068l4784
3906B971159K09301J36592p129j2535K4361r4039J29477J32039O9142J34605j46777
3895C546196j22432J86189K79160M3134k59623l34781R6325k71298j87896l6897
$$ plain form
3968 5215338 5311812 5423048 5358570 5455790 5406034 5397771 5265947 5318678 5454255 5462783 5309653
3957 5309653 5356734 5419072 5310741 5131098 5219499 5349892 5409086 5542834 5668969 5908316
3947 5908316 6113486 6356627 6204985 6025260 5591842 5111609 4763314 4534729 4445732 4283117
3937 4283117 4296395 4263533 4266096 4286308 4118949 4092518 4002240 3932431 3784420 3701496 3455154
3926 3455154 3285000 3252927 3167489 3305753 3278438 2948416 2921730 2807290 2884492 2780647
3916 2780647 2891670 2942157 3084718 2973831 2934756 3073962 3110106 2956875 3005943 2971159
3906 2971159 3180460 3317052 3309923 3297388 3321749 3227710 3357187 3489226 3558368 3692973 3546196
3895 3546196 3423764 3609953 3889113 3932247 3672624 3337843 3434168 3162870 2974974 2938077
3885B938077l6318Q9570J2303J82701K2127j23833J06620J82141P5648p1215P5318
3874C453139J08004O8165N5728J99417O5065L4194K6509J8535r6742r224r5822
3863C826968q687l9309k7989m2784p6442l2058K08977K58098k1040P3987J12519
3852D232240L3692J77242r016J80915J10538j1552q4515J97350L399K12269k0683
3841E021879n7657K00775j15799O3499J26169K14820j49563R1370J41177J68197
3831E704867k00585q2593J58005m0350j07947N7490Q8713N8460K39342J07999
3821E983401Q9719P0627K99521J59232J2113L1219K552P1176J30140N354N4201
3810F909255J52322K51629K36399L07391L8044K41823K57895K26150J27057J88246
$$ plain form
3885 2938077 2901759 2991329 3003632 3186333 3208460 3084627 3191247 3373388 3449036 3377821 3453139
3874 3453139 3561143 3629308 3685036 3884453 3949518 3983712 4010221 4028756 3932014 3922790 3826968
3863 3826968 3818281 3778972 3750983 3708199 3631757 3599699 3808676 4066774 4045734 4119721 4232240
3852 4232240 4265932 4443174 4434158 4615073 4725611 4714059 4629544 4826894 4830293 5042562 5021879
3841 5021879 4964222 5164997 5049198 5112697 5238866 5453686 5304123 5395493 5536670 5704867
3831 5704867 5504282 5421689 5579694 5539344 5431397 5488887 5577600 5636060 5875402 5983401
3821 5983401 6073120 6143747 6443268 6602500 6614613 6645832 6648384 6719560 6849700 6855054 6909255
3810 6909255 7061577 7313206 7549605 7856996 7895040 8136863 8394758 8620908 8747965 8936211
3800H936211L76893M09585M61599L18551K53644K60833M15337L89398P21099N32681
3790A3075831O44659M52202O92173M26976L87409M72493N66427N09640L33224
3781A7561034P7473K63295L37931K02405J42691J31254K01522J56586J19105L08519
3771A9501815K43812j3135j08306q9599J88301j25438m8272n2860k27716l8275
3761A9230327k01877j70922J86419J8972M3000J64623K55453J05470K38611J74375
3751B0044451L02832L89919O04993L96490M22074P05430N17750N38115J170944
3742B5092998J262688Q23098J260967J534647J161423J432626J719459J813721
3734C6101627K021268K176469K034362K303888J945497J866113K350924K151833
$$ plain form
3800 8936211 9313104 9722689 10184288 10502839 10756483 11017316 11432653 11822051 12543150 13075831
3790 13075831 13720490 14172692 14864865 15291841 15679250 16151743 16718170 17227810 17561034
3781 17561034 17638507 17901802 18239733 18442138 18584829 18716083 18917605 19074191 19193296 19501815
3771 19501815 19745627 19732492 19624186 19534587 19722888 19597450 19549178 19496318 19268602 19230327
3761 19230327 19028450 18857528 19043947 19062919 19105919 19270542 19525995 19631465 19870076 20044451
3751 20044451 20347283 20737202 21342195 21738685 22160759 22866189 23383939 23922054 25092998
3742 25092998 26355686 27178784 28439751 29974398 31135821 32568447 34287906 36101627
3734 36101627 38122895 40299364 42333726 44637614 46583111 48449224 50800148 52951981
3726E2951981J945400K072388J709314J581158J470837J167003Q48791O10423
3718F4357295O38034J57409j98523m73122n34372n92018o85217q62022r08630
3709F0898834r70914j022805j153943j631375j845488j869569k028257k153326
3701D8223157k171586k364867k236809k273182j998458k069989j941012j855905
3693C1311349j678679j489889j452518j291948j011583r61694j126715q17593
3685B1480730q66493n61103n18121n48172p78710n60489m29484k29426l87788
3676A6600944l71051k41557j66915m23615m95736k14559j21316l01617j43816
3667A4120762j83134o5503j49024O047j88888j69110l30365j35187L1965j00283
$$ plain form
3726 52951981 54897381 56969769 58679083 60260241 61731078 62898081 63746872 64357295
3718 64357295 64995329 65152738 64954215 64481093 63946721 63354703 62669486 61807464 60898834
3709 60898834 59927920 58905115 57751172 56119797 54274309 52404740 50376483 48223157
3701 48223157 46051571 43686704 41449895 39176713 37178255 35108266 33167254 31311349
3693 31311349 29632670 28142781 26690263 25398315 24386732 23425038 22298323 21480730
3685 21480730 20614237 20053134 19535013 18986841 18208131 17647642 17218158 16988732 16600944
3676 16600944 16229893 15988336 15821421 15397806 14902070 14687511 14566195 14264578 14120762
3667 14120762 13937628 13872125 13723101 13729148 13540260 13371150 13040785 12905598 12937563 12837280
3657A2837280j43631j61937p4056n3007J5803K5226N2639k38186j71887K9272
3647A2117516K42945J18164K24452k1500K8912J48658J55018o7771J69827J86261
3637A3302482M8902J77811j17676o5168o844K0727K5556R1377m62k04393o7764
3626A3204548Q1377k7013j0990N4006j02167O5897Q6969Q3265l1105j11536L37710
3615A3630961J99465l6589J44738J98272K90432K31953j3585J00423L12205K61319
3605A5319594L02430L02144M11387N19391N31262K93707M39086M64484O52228
3596A9235713P50766Q77608N29715N60861P08569P24262P38019O03873O96303
3587B5425689R15952R89139Q57680O98184R70541R36824N63226Q48767P94008
$$ plain form
3657 12837280 12693649 12531712 12457656 12404649 12420452 12445678 12498317 12260131 12088244 12117516
3647 12117516 12360461 12478625 12703077 12681577 12710489 12859147 13014165 12946394 13116221 13302482
3637 13302482 13351384 13529195 13411519 13346351 13339507 13360234 13385790 13477167 13476705 13272312 13204548
3626 13204548 13285925 13258912 13247922 13301928 13199761 13265658 13352627 13435892 13404787 13293251 13630961
3615 13630961 13830426 13793837 13938575 14136847 14427279 14659232 14645647 14746070 15058275 15319594
3605 15319594 15622024 15924168 16335555 16854946 17386208 17679915 18119001 18583485 19235713
3596 19235713 19986479 20864087 21393802 21954663 22663232 23387494 24125513 24729386 25425689
3587 25425689 26341641 27330780 28188460 28886644 29857185 30794009 31357235 32206002 33000010
3578C3000010Q66870Q02072Q24195L55403O07350P57974O04431P24783P76323
3569C9319411M42782O60095N55590M35588K24228k7784P9480J78746j36705j60914
3559D1570517l6890j03264q5616k01109N2041j18562J43362K55393M30288M97319
3549D2403479L85650P08648Q69080O32703Q79545P23325J015548J234010J065536
3540D9917524R35242P36395P67873O98487P18510R66844O34560P70274R60732
3531E7106441J032979J141675J568162J530019J839164K064184J977139K448279
3523G0708042K583909K483306K504249K441019K353084J760979J449872R56787
3515H7241247L63575J82742p47648j078298j317868j528402j799217j762798k081855
$$ plain form
3578 33000010 33866880 34668952 35493147 35848550 36455900 37213874 37818305 38543088 39319411
3569 39319411 39762193 40422288 40977878 41413466 41637694 41609910 41689390 41868136 41731431 41570517
3559 41570517 41533627 41430363 41344747 41143638 41195679 41077117 41220479 41475872 41906160 42403479
3549 42403479 42789129 43497777 44366857 44999560 45879105 46602430 47617978 48851988 49917524
3540 49917524 50852766 51589161 52357034 53055521 53774031 54740875 55375435 56145709 57106441
3531 57106441 58139420 59281095 60849257 62379276 64218440 66282624 68259763 70708042
3523 70708042 73291951 75775257 78279506 80720525 83073609 84834588 86284460 87241247
3515 87241247 87604822 87787564 87039916 85961618 84643750 83115348 81316131 79553333 77471478
3506G7471478j797353j796013j611240j220884r70483l99119m30992l44417n4790
3497F8846187J55304M17347N37081O28450M21301L08567K64773J34880j20218
3488G1593672p67976q74980j199860j271069j690270k041998j906554k373057
3480E9467908k375849k466470k116902k079423j847514k058962j916846j819568
3472D2786374j550890j529326j469013j163997r67590j043251j236304p79279
3464C3046724o25741p05930o11404p24110m71252k64157o52120l78819n71579
3455B8041612k78028n9512j8614M6283K41657k3208M04885L86948M35016M33624
3445B9610663O75994O48979O36217P52373R08193P24793M43506L83510J78088
$$ plain form
3506 77471478 75674125 73878112 72266872 71045988 70075505 69676386 69245394 68900977 68846187
3497 68846187 69001491 69418838 69955919 70584369 71005670 71314237 71579010 71713890 71593672
3488 71593672 70825696 69950716 68750856 67479787 65789517 63747519 61840965 59467908
3480 59467908 57092059 54625589 52508687 50429264 48581750 46522788 44605942 42786374
3472 42786374 41235484 39706158 38237145 37073148 36105558 35062307 33826003 33046724
3464 33046724 32420983 31715053 31103649 30379539 29908287 29644130 28992010 28613191 28041612
3455 28041612 27763584 27704072 27685458 27731741 27973398 27950190 28355075 28742023 29177039 29610663
3445 29610663 30286657 30935636 31571853 32324226 33232419 33957212 34400718 34784228 34962316
3436C4962316K78613k38044n28539n65756o19643o64184p15824p82562p37135
3427C0389242n72932m73818n12189m59699l34967l25206j67661m7330j40522K59772
3417B7614690L24809J6316M05711L38739M56475L55484N95979O76141P20765J079952
3407C2585061Q94910N80747M17834K93565m28080m15023n64476o80283p81868
3398C1902387n80293j20110l74767j86818j11545j5310K7213k27727l62m1656
3388C0271012J4709J31004L68099J64811K81481L05764M81826L52369M93161N85468
3378C3449704L72766M55298M19117N28597O14632L31418N38524L61963R2775M46993
3368C7611787K08697K21998O44270O93349O18349N60420Q84936Q95502J253263
$$ plain form
3436 34962316 35240929 35002885 34474346 33908590 33288947 32624763 31908939 31126377 30389242
3427 30389242 29816310 29342492 28830303 28370604 28035637 27710431 27542770 27495440 27354918 27614690
3417 27614690 27939499 27955815 28361526 28700265 29156740 29512224 30108203 30784344 31505109 32585061
3407 32585061 33479971 34060718 34478552 34772117 34344037 33929014 33364538 32684255 31902387
3398 31902387 31322094 31201984 30827217 30640399 30528854 30513544 30540757 30313030 30312668 30271012
3388 30271012 30285721 30416725 30784824 30949635 31231116 31536880 32018706 32371075 32864236 33449704
3378 33449704 33822470 34277768 34696885 35225482 35840114 36171532 36710056 37072019 37164794 37611787
3368 37611787 37820484 38042482 38686752 39380101 39998450 40558870 41443806 42339308 43592571
3359D3592571J087989J034538J212054J424394J278993J524977J773969J859026
3351E4788511K077824K182760K518244K456496K814055K772489L026678L240811
3343G5877868L352635L443976L598667L394688L764936L581720L260364L263921
3335A03538775K852562K925361K512152K413343K290087J968353J780871J726219
3327A22007723J632011J537154J181108R11280N36162J46933l05745j017432j228402
3318A25400792j934792k174493k660135l002577k815464l205455l134516l093438
3310A03379922l236398k939957l134127l458657l161511l229428l352864l281929
3302G7585051l490926l249339l074863l054111k984342k707382k716742k580545
$$ plain form
3359 43592571 44680560 45715098 46927152 48351546 49630539 51155516 52929485 54788511
3351 54788511 56866335 59049095 61567339 64023835 66837890 69610379 72637057 75877868
3343 75877868 79230503 82674479 86273146 89667834 93432770 97014490 100274854 103538775
3335 103538775 106391337 109316698 111828850 114242193 116532280 118500633 120281504 122007723
3327 122007723 123639734 125176888 126357996 127269276 127805438 127952371 127646626 126629194 125400792
3318 125400792 123466000 121291507 118631372 115628795 112813331 109607876 106473360 103379922
3310 103379922 100143524 97203567 94069440 90610783 87449272 84219844 80866980 77585051
3302 77585051 74094125 70844786 67769923 64715812 61731470 59024088 56307346 53726801
3294E3726801k398135j929336j819648j679885j626703j438403j190833j077863
3286D0565995o13633o09481q34227o95113m95507l24543l59025m34654m12783
3277C5787029k80569j89316l8225J41005K78124K81904L75694M57423O05695O56296
3267C8075060R49804J021307Q12754J037940J620963J494818J582302K249614
3259D8844562K394817K506561L049247J793034j869385m647335n380860l546569
3251D3144072k565978j732282j298185r91074p17899o43541m39407l25730l16039
3242C4113937k26365O5073Q3031M48480N27139R21625J265367J439363J736776
3233D0374426J965482K487983L028898L441489L937139M442203N148624N748087
$$ plain form
3294 53726801 51328666 49399330 47579682 45899797 44273094 42834691 41643858 40565995
3286 40565995 39952362 39342881 38508654 37813541 37318034 36993491 36634466 36199812 35787029
3277 35787029 35506460 35317144 35278919 35419924 35698048 35979952 36355646 36813069 37418764 38075060
3267 38075060 39024864 40046171 40858925 41896865 43517828 45012646 46594948 48844562
3259 48844562 51239379 53745940 56795187 58588221 56718836 52071501 46690641 43144072
3251 43144072 40578094 38845812 37547627 36556553 35838654 35195113 34755706 34429976 34113937
3242 34113937 33887572 33952645 34035676 34484156 35011295 35932920 37198287 38637650 40374426
3233 40374426 42339908 44827891 47856789 51298278 55235417 59677620 64826244 70574331
3225G0574331O770965K566010m997331r365259r213640o013389l704186k502466
3217D4115035j378378q81801k72715r007l95906r39364j650680j441329q45083
3208C6300772m38320j50049L10941O35799P98934R08962J145043J467060J800711
3199D2779853K132721K260003K936193L043247L588742L976196M246097K286286
3191F7249338j235954k900000k616182p87360K91981J038328Q43439k2788m15861
3182F1444941j03231M59956M18143J40392L53797O52774Q27931J189208J557476
3173F6941387J832641K029920K174789K545532K621904K561431K681367K619790
3165H6008761K047906J730020J140684O19340j0346n37006j314178j950273k650848
$$ plain form
3225 70574331 77345296 79911306 74913975 65548716 56335076 50321687 46617501 44115035
3217 44115035 42736657 41854856 41582141 41573134 41177228 40237864 38587184 37145855 36300772
3208 36300772 35862452 35712403 36023344 36659143 37458077 38367039 39512082 40979142 42779853
3199 42779853 44912574 47172577 50108770 53152017 56740759 60716955 64963052 67249338
3191 67249338 66013384 63113384 60497202 59709842 60001823 61040151 61883590 61860802 61444941
3182 61444941 61341710 61801666 62219809 62360201 62713998 63366772 64194703 65383911 66941387
3173 66941387 68774028 70803948 72978737 75524269 78146173 80707604 83388971 86008761
3165 86008761 88056667 89786687 90927371 91546711 91536365 90999359 89685181 87734908 85084060
3156H5084060l142809l467403l677701m088656l797686m019075l975488m010836
3148E4904406l604303l162816k819833k548477k445999k211456j975845j708353
3140C4427324j756248j604270j043367r78442q95391p23040q60483r08147r26171
3131B4731765m02552l81255q60857q73269p86091o23780o98612m57957o61160
3122A8986232n29078l81960n44302o18128l35496k67196m57846j6682k65754k80044
3112A5289746l29729l11673m1663q117j27767K1160k37253J53632J07330o0596
3102A4455070j87778k17299k23320m2439O2653L9047J41521k40790m22459l91400
3092A2972806m14354l75557m46624o5263n35235k36900l71674k78755j64259m5299
$$ plain form
3156 85084060 81941251 78473848 74796147 70707491 66909805 62890730 58915242 54904406
3148 54904406 51300103 48137287 45317454 42768977 40322978 38111522 36135677 34427324
3140 34427324 32671076 31066806 30023439 29044997 28149606 27426566 26566083 25657936 24731765
3131 24731765 24329213 23947958 23087101 22213832 21427741 20803961 20105349 19647392 18986232
3122 18986232 18457154 18075194 17530892 16912764 16577268 16310072 15852226 15835544 15569790 15289746
3112 15289746 14960017 14648344 14606681 14598564 14470797 14491957 14254704 14408336 14515666 14455070
3102 14455070 14267292 14049993 13826673 13784234 13846887 13885934 14027455 13786665 13364206 12972806
3092 12972806 12558452 12182895 11736271 11671008 11135773 10898873 10527199 10248444 10084185 10038886
3082A0038886k69082o4386M7802j71106k17919L2439N8367q8379M6924o3718M8819
3071I398647M6030j06252J28523J89247K03603k50342n22961l88366j26629k22828
3061H348672q1116K39424l59469k39281K5091o0137j15024q6697J07464m6798
3051G732129p8202N357m3506J91361j36810M6403k7498K5696K0406J96359p6755
3040G854940k96107j4870L6588j00503q5118j19087J62399J28395N4608k0826
3030G600419j2336K04988j36226j51481K40993o9465q8081J85931q8830O8625
3020G754537J65038J09049r9786K15101O5975L566l0946r1166Q8624K90849R3723
3009H564564j78091R4359K56503P5198j02056J24719K57325R7138J11015J72268
$$ plain form
3082 10038886 9769804 9705418 9753220 9582114 9364195 9396634 9455001 9366622 9413546 9349828 9398647
3071 9398647 9444677 9338425 9466948 9656195 9859798 9609456 9086495 8698129 8571500 8348672
3061 8348672 8267556 8506980 8147511 7908230 7933321 7873184 7758160 7671463 7778927 7732129
3051 7732129 7653927 7659284 7615778 7807139 7670329 7716732 7689234 7714930 7735336 7931695 7854940
3040 7854940 7558833 7543963 7580551 7480048 7394930 7275843 7438242 7566637 7621245 7600419
3030 7600419 7588083 7793071 7656845 7505364 7746357 7676892 7588811 7774742 7685912 7754537
3020 7754537 7919575 8028624 7928838 8143939 8209914 8213480 8182534 8091368 8179992 8470841 8564564
3009 8564564 8386473 8480832 8737335 8812533 8710477 8835196 9092521 9189659 9300674 9472942
2999I472942O3316P7020K00035M23888J04666L02268K85242J30529L12678J27112
2989A1499696J40135J74575K65874L99256L55886K32652J42174J43233L8009K58491
2979A3649981L54177K74301J25480L34906K19706Q8935L10027J75880K36155L45725
2969A6115273J48370M10009M87218N59974N24460K91949O85335N14982M17860
2960B0155430O58664O17680O58614M15318Q08681P11731Q64877Q54786J284331
2951B7030112J083871R33847J011221J246337J086037J214925J221750J168328
2943C5996428J808704J682241J772035J882115J950444J674122J917963J772690
2935E0456742K251333K629276K808070K868685L417659M067973M521559M633322
$$ plain form
2999 9472942 9536258 9613278 9813313 10237201 10341867 10644135 10929377 11059906 11372584 11499696
2989 11499696 11639831 11814406 12080280 12479536 12835422 13068074 13210248 13353481 13391490 13649981
2979 13649981 14004158 14278459 14403939 14738845 14958551 15047486 15357513 15533393 15769548 16115273
2969 16115273 16263643 16673652 17160870 17720844 18245304 18537253 19222588 19737570 20155430
2960 20155430 20814094 21431774 22090388 22505706 23314387 24026118 24890995 25745781 27030112
2951 27030112 28113983 29047830 30059051 31305388 32391425 33606350 34828100 35996428
2943 35996428 37805132 39487373 41259408 43141523 45091967 46766089 48684052 50456742
2935 50456742 52708075 55337351 58145421 61014106 64431765 68499738 73021297 77654619
2927G7654619N329234N681926N957772O525031O812122P052909P273563P495592
2919A29782768P743029Q112090P837106P886014P217010O682824O390237O571628
2911A88222706P481105R154801J1128645J2988342J4502496J6021259J6660366
2904B76159720J6580472J5662292J2227458O553172o14230q399501j5992619k1198851
2896B80977913k3714503k4175619k2819966k0458182j7637930j5348448j2968130
2889A43855135j1143340r895444q434944p336612o388163n691724m844858m587751
2881H5532299m104182l614592l513208l405764k915093l027610k812248k572431
2873E9567171k435169k600568k341662k271811k030701k053704j663866j814998
$$ plain form
2927 77654619 82983853 88665779 94623551 101148582 107960704 115013613 122287176 129782768
2919 129782768 137525797 145637887 153474993 161361007 168578017 175260841 181651078 188222706
2911 188222706 195703811 204858612 215987257 228975599 243478095 259499354 276159720
2904 276159720 292740192 308402484 320629942 327183114 326568884 318169383 302176764 280977913
2896 280977913 257263410 233087791 210267825 189809643 172171713 156823265 143855135
2889 143855135 132711795 122816351 114381407 107044795 100656632 94964908 90120050 85532299
2881 85532299 81428117 77813525 74300317 70894553 67979460 64951850 62139602 59567171
2873 59567171 57132002 54531434 52189772 49917961 47887260 45833556 44169690 42354692
2865D2354692j780274j330557j425227j149758j339196j214319r62381j223131
2857C1929849j000580p01769r19600p71212n90544q85277q21284n66023q85986
2848B4787574n89879p39358n76402n45688m47205o82401n61773l48313l69973
2839A9926582k75217l99469k80195l18538m52954m80466l37873j70766m99262
2830A6711842l63626l56100l08591j83895k11069j85873m29488m65227K5409k04266
2820A4029116m86389k24580j62806j51420l23080j43639L2732n5704k52252k05259
2810A2056719k33110k78455k64945l27856m09564k44358k26700k81780k88466
2801I501485p8741k99138j87569j06177l90032k28991l5460j26185l71680j31298
$$ plain form
2865 42354692 40574418 39243861 37818634 36668876 35329680 34115361 33152980 31929849
2857 31929849 30929269 30227500 29307900 28536688 27946144 27060867 26239583 25673560 24787574
2848 24787574 24197695 23458337 22881935 22336247 21889042 21206641 20644868 20296555 19926582
2839 19926582 19651365 19251896 18971701 18653163 18200209 17719743 17381870 17211104 16711842
2830 16711842 16348216 15992116 15683525 15499630 15288561 15102688 14673200 14207973 14233382 14029116
2820 14029116 13542727 13318147 13155341 13003921 12680841 12537202 12569934 12514230 12261978 12056719
2810 12056719 11823609 11545154 11280209 10952353 10542789 10298431 10071731 9789951 9501485
2801 9501485 9422744 9123606 8936037 8829860 8439828 8210837 8175377 8049192 7677512 7546214
2791G546214M6171k59219l15444l45223j72297p0066r7719j57793k67945J2727
2781E919406l8939k06540p5539K58418j75837j48210J26846j92073o2598j3218
2771E391716N5524j28250l83673Q094K66884k65429j93267J52141J15226n998
2761E012968m21848j98028q2721k2836j24445K184j67782j77273R5423J01152
2751D016794q395l01111L9698R0678k17133Q6987J38892M4587k03314j69799J26404
2740C644288j14570j43637j16146N3414P9771j53653J08997J67175k52616R3921
2730C366944o4144j5234j41949p5180J63231j06247j38985r4634j78808k20472
2720B494522O4045R9396j67961j0329Q8467k27184j71781K6117J8885p5412r5564
$$ plain form
2791 7546214 7592385 7333166 7017722 6672499 6500202 6430136 6332417 6174624 5906679 5919406
2781 5919406 5880467 5673927 5598388 5856806 5680969 5532759 5659605 5467532 5404934 5391716
2771 5391716 5447240 5318990 4935317 4943411 5210295 4944866 4751599 4903740 5018966 5012968
2761 5012968 4591120 4393092 4310371 4287535 4163090 4165274 3997492 3820219 3915642 4016794
2751 4016794 4008399 3707288 3746986 3837664 3620531 3707518 3846410 3890997 3687683 3517884 3644288
2740 3644288 3529718 3386081 3269935 3323349 3403120 3249467 3358464 3525639 3273023 3366944
2730 3366944 3302800 3287566 3145617 3070437 3233668 3127421 2988436 2893802 2714994 2494522
2720 2494522 2558567 2657963 2490002 2479673 2568140 2340956 2169175 2195292 2214177 2138765 2043201
2709B043201Q5454J73274J186j18436J04681j641j34485N5720j61768Q0527J23858
2698B251571j22857L0786L961k27322j3931l6889j64604J62313P2112j03130j53883
2687A698127n4110J77773r0957j05217r4272J99875L9383P971K5871O3011j99927
2676A667528k27783J14346J88428k3694p1636N045j34519k07292J27299R9619
2666A537341J14170M2561j55961j54484J64638P0288j09200M6413p3668l6783
2656A445315n3850k5861O771p6088J91274M1429q0042J49648n130K5531j66312
2645A452685P5493J25313O7559L037j38093J38012n5179l2116J58554q7225O1417
2634A769457K4489J44843n4358j78797J67268J24806o0797m6327O7746K54706
$$ plain form
2709 2043201 2128655 2301929 2303115 2184679 2289360 2287719 2153234 2208954 2047186 2127713 2251571
2698 2251571 2128714 2159500 2163461 1936139 1922208 1885319 1720715 1883028 1955140 1852010 1698127
2687 1698127 1644017 1821790 1730833 1625616 1531344 1731219 1770602 1778573 1804444 1867455 1667528
2676 1667528 1439745 1554091 1742519 1718825 1647189 1652234 1517715 1310423 1437722 1537341
2666 1537341 1651511 1694072 1538111 1383627 1548265 1618553 1509353 1555766 1482098 1445315
2656 1445315 1391465 1365604 1372375 1296287 1487561 1528990 1448948 1598596 1593466 1618997 1452685
2645 1452685 1528178 1653491 1721050 1724087 1585994 1724006 1668827 1636711 1795265 1708040 1769457
2634 1769457 1793946 1938789 1884431 1705634 1872902 1997708 1936911 1890584 1958330 2213036
2624B213036j8773J0066M0195r3648Q2155J07239k1545K14880j43597l3016k05550
2613B151442j13713j63076j6513j10413K2222L7700k48526j69710q1831l7428
2603A270154l3939J10593l03497n8894K04908p5946j12362L6507J27629p1456
2593A093697j35582p2941M9897j1463L2819o1189k80648J34663p669k8056q581
2582G04947k2845Q9496M7744j73138p8926L8817O829J2952n5764N8389j88565
2571D39936J02078j58774J41229K8724k39428K09817P0977j0129P4326j44316
2561E14440q9644K28314j28407M783P058J61019J44859p7928k74069P6083k234
2550E64274n4822l13692N0538J25821K6893q6340j90038L37778P911j75043p0292
$$ plain form
2624 2213036 2194263 2204329 2244524 2150876 2233031 2340270 2318725 2533605 2390008 2356992 2151442
2613 2151442 2037729 1874653 1858140 1747727 1769949 1807649 1559123 1389413 1307582 1270154
2603 1270154 1236215 1346808 1043311 984417 1189325 1113379 1001017 1037524 1165153 1093697
2593 1093697 958115 885174 935071 923608 956427 895238 614590 749253 741584 713528 704947
2582 704947 682102 771598 819342 646204 567278 606095 612924 625876 570112 628501 439936
2571 439936 542014 383240 524469 553193 313765 523582 594559 584430 658756 514440
2561 514440 424796 653110 524703 529486 536544 697563 842422 764494 490425 566508 564274
2550 564274 509452 195760 246298 372119 399012 312672 122634 460412 468323 293280 222988
2539B22988J31174K95277j74232o0933j18947L0930L5241m1125M0694P290K06423
2528E74780l0468r5838J69420O0380p9447l4220j79770K37292O4414m15190J04181
2517C75534K5957J05061k7030o091q1378O0265J50462j14285k2052J09473j76230
2506C99686j9188l3504k65487L23653n4171j10028o4539j62402J57047J32347
2496C03414k31228O0133Q0953q5273K4216p0941J17701K68831J7985j09638j79967
2485A96186J3224j77759J4125K6052J41354J03983o053j6871K660j7027m896Q2978
2473C57956l9934P503M2231j1157j35956J193J26292l1818j67381k5148J79587
2462C03368O8040j68333m4406Q9781m7536j91942L5883N1274q0449j0245M10191
$$ plain form
2539 222988 354162 649439 475207 414274 295327 326257 361498 320373 361067 368357 574780
2528 574780 544312 448474 617894 678274 598827 564607 384837 622129 686543 271353 375534
2517 375534 401491 506552 479522 473431 392053 452318 602780 488495 466443 575916 399686
2506 399686 380498 346994 81507 405160 350989 240961 176422 14020 171067 303414
2496 303414 72186 132319 213272 127999 152215 81274 198975 467806 485791 376153 196186
2485 196186 209410 31651 45776 71828 213182 317165 311112 294241 296901 279874 274978 357956
2473 357956 318022 325525 367756 356599 220643 221836 348128 316310 148929 123781 303368
2462 303368 371408 203075 158669 248450 200914 8972 44855 96129 15680 5435 415626
2451D15626r6294j47454R944N5798R4353M7900q1678j2343J10773j20735p3864
2440B02026J08917j41717j12846J01884j39268J71883j08412N5913m1728N733
2430A02385L4257N967J03848j57755K2978J97295j23774o2713N686p6249O2205
2419A14130M6633K5011N3010j13785l4647J7496J95225R0578k17392k37186P0320
2408I393k3824M7728L0736J64648J14003j71635R0834q7704J0795O6166l1124
2397B20016o3151k5637J56614K38510k21666p5510Q8231l14383P0940J03423j42120
2386C5267M7927J02673M0391j30644J02577J93138P3741k1728J46744L0245M4445
2375F64776L8977p4018q8495l3307J5903l47093J07581K53190l00173j08146j3988
$$ plain form
2451 415626 319332 171878 181822 237620 331973 379873 298195 285852 396625 275890 202026
2440 202026 310943 169226 56380 158264 18996 190879 82467 138380 96652 102385
2430 102385 136642 142609 246457 88702 111680 308975 185201 122488 128174 51925 114130
2419 114130 160763 185774 238784 124999 90352 107848 303073 393651 176259 -60927 9393
2408 9393 -14431 33297 64033 228681 342684 171049 261883 174179 184974 251140 220016
2397 220016 156865 131228 287842 526352 304686 229176 317407 3024 73964 177387 35267
2386 35267 83194 185867 226258 95614 198191 391329 465070 443342 590086 620331 664776
2375 664776 703753 629735 541240 507933 523836 176743 284324 537514 237341 129195 115207
2364A15207J91283l3467j0108Q689r3376j6310m8902p2376j77192M6461K81611
2353A91520p2446O6829m7030p3639J09234j9280j35485Q2944o4892n1554L1478
2342A7679j40730P7926p349p0969R3845P8008J00087r5530Q5342o8181O0390k4874
2330A05644J7768J59597N0466m1935r0509m5267q1664q4109J7923j1692r5860
2319i9638J81692N9630l675m6903j13714J41156J16310j40244N5779j33435K2333
2308C9291K26842M8413r550J10736k35013M0100k28597L2644j01355l6229J72156
2297E9438K37756J78568p6484j42711m0242J86653J03150j86373P1512k29826
2287A61441m7038J23823J01012o3970K3953j15350j16514j13500Q1447L9805J4914
$$ plain form
2364 115207 306490 273023 262915 271604 178228 161918 113016 40640 -136552 -90091 191520
2353 191520 119074 185903 138873 65234 174468 155188 19703 102647 37755 -13799 17679
2342 17679 -123051 -45125 -52474 -123443 -29598 48410 148497 52967 138309 70128 130518 105644
2330 105644 123412 283009 333475 291540 201031 155764 74100 -10009 7914 -3778 -99638
2319 -99638 82054 141684 138009 91106 -22608 118548 234858 94614 150393 16958 39291
2308 39291 266133 314546 304996 415732 180719 220819 -7778 24866 -76489 -112718 59438
2297 59438 297194 475762 399278 256567 216325 402978 506128 319755 391267 161441
2287 161441 114403 238226 339238 275268 299221 183871 67357 -46143 35304 75109 90023
2276I0023r4993q4907J75778Q3263K00916o372j20927Q493k552K6518k0362q6604
2264A68274k9868r1339n5911P0683J30053K3802J0424P4989n3800j72879K38507
2253C12935M8201J07218L9722j25402o5566N722J80885K0856k14629q375L9087
2242C40654J07404m0565j54115n1465J36442p0414L20520L7698l5866R46q0649
2231E10590o9046o7440k5451K20192P4442k30454J26728K8452l51090M6933K75975
2220E39831l7935J23743k3328j28502J81681P2522L2749k20700J18619J39278
2210G97958m4582k00747Q4112J12331M1706J19709j91656j2189J04455K79434
2200A090531K5305j69582K17955l9929J03883J61356L5261k144R1418k27092j82369
$$ plain form
2276 90023 -4970 -89877 85901 169164 370080 363708 242781 251274 248722 275240 254878 168274
2264 168274 138406 47067 -8844 61839 191892 215694 226118 301107 247307 74428 312935
2253 312935 361136 468354 508076 382674 317108 322830 503715 524571 309942 301567 340654
2242 340654 448058 407493 253378 201913 338355 267941 588461 626159 590293 591239 510590
2231 510590 441544 374104 348653 568845 643287 412833 539561 568013 216923 263856 539831
2220 539831 501896 625639 602311 473809 655490 728012 760761 540061 658680 797958
2210 797958 753376 552629 636741 749072 790778 910487 718831 706642 811097 1090531
2200 1090531 1115836 946254 1164209 1124280 1228163 1389519 1424780 1422636 1514054 1286962 1104593
2189A104593L2372J32171K44862J56675n5122j32953p8885L987J29079J88214
2179A724993n1501j59396R4633L42761q3934l18725J40093J71227l6472J18202
2169A941881m978n3018k7335O1263J07675R8278K57260N6248j27370K70564J8144
2158B598612m4511J209j3993J54331M2966L64214L45330L9658N9164M8069J85965
2147C781014J051K7294L43137P2478L44114J02669R3748J83125M65216M18627
2137E832473K85204K85804N35501L67583P00036O95972O81385P69622N27703P80764
2127A1462047J161807R59035J431949J646690J507767J804608J923814K471260
2119B4368977L201803L392888M217192M931702N846064O421195P634114Q734601
$$ plain form
2189 1104593 1136965 1269136 1513998 1670673 1615551 1482598 1403713 1407700 1536779 1724993
2179 1724993 1673492 1514096 1608729 1951490 1867556 1548831 1688924 1860151 1823679 1941881
2169 1941881 1936903 1883885 1856550 1917813 2025488 2123766 2381026 2437274 2309904 2580468 2598612
2158 2598612 2554101 2555310 2541317 2695648 2738614 3102828 3448158 3487816 3546980 3595049 3781014
2147 3781014 3782065 3809359 4152496 4224974 4569088 4671757 4765505 4948630 5413846 5832473
2137 5832473 6117677 6403481 6938982 7306565 8006601 8702573 9383958 10153580 10681283 11462047
2127 11462047 12623854 13582889 15014838 16661528 18169295 19973903 21897717 24368977
2119 24368977 27570780 30963668 35180860 40112562 45958626 52379821 60013935 68748536
2111F8748536R368997J1504010J2244833m55366j4882294k0875449j5757127r129632
2103D0766508o490206m695289l550671k547708k392201j705543j445697q22537
2095A7116656q52642q14561j067868j036075j056448q54651r30952p43924n69453
2086I190082r0342o35644k77020k71555l28316l64263m23507l05463k74091k70148
2076E949733k58953k46178k18862k76868N6891j93582k16375k31014o6644p4737
2066D223411k21534j8042N8707r8876k46018j15863L5705k68864k1653k92482
2056C034491q5877p1105p2691Q1100p7875j77682q9310N0950j24668m3436J29583
2045B553480J92662j59287k93603J03004k3455k08876n5662L0918J34215o3379
$$ plain form
2111 68748536 78117533 89621543 101866376 101411010 86528716 65653267 49896140 40766508
2103 40766508 34276302 29581013 26030342 23482634 21090433 19384890 17939193 17116656
2095 17116656 16264014 15449453 14381585 13345510 12289062 11434411 10503459 9759535 9190082
2086 9190082 9099740 8464096 8187076 7915521 7587205 7222942 6799435 6493972 6219881 5949733
2076 5949733 5690780 5444602 5225740 4948872 5005763 4812181 4595806 4364792 4298148 4223411
2066 4223411 4001877 3983835 4042542 3943666 3697648 3581785 3617490 3348626 3326973 3034491
2056 3034491 2948614 2877509 2804818 2885918 2808043 2630361 2541051 2592001 2467333 2423897 2553480
2045 2553480 2746142 2586855 2293252 2396256 2372801 2163925 2108263 2139181 2273396 2210017
2035B210017k48264j9515j03570l2939L5441j00177j10531l3791J31160K1166
2025A748997l0505k87346j66099k1555L284N8143J38218J5709l33240L6359R3636
2014A255601k13690q2408J57868J40100O2974p2387K366M5302J8941j97166M1323
2003A158824q549q8107k36870J31300k4727j04050L0505m1874m3884j43302L5511
1992F64777L7246Q0570l2044j41457K6220p8262K1160O2920p9577R0168p711l0278
1980F13732j6129m1369L7261Q8364q3469m0044Q1559o5340M0039M3488p1650N8237
1968F44679j35722Q0840J73205K3440j46439j02808j3098O1740n5613N1263j15818
1957D65669j73902K49100Q1821p9603j65296k02287O3631p1313K7083J44429L3735
$$ plain form
2035 2210017 1961753 1942238 1838668 1805729 1841170 1740993 1630462 1596671 1727831 1748997
2025 1748997 1718492 1431146 1265047 1243492 1246776 1304919 1443137 1458846 1125606 1161965 1255601
2014 1255601 1041911 959503 1117371 1257471 1320445 1248058 1250424 1295726 1314667 1117501 1158824
2003 1158824 1150275 1062168 825298 956598 931871 827821 858326 816452 772568 629266 664777
1992 664777 702023 782593 750549 609092 635312 557050 578210 641130 561553 651721 644010 613732
1980 613732 597603 556234 593495 681859 598390 558346 639905 574565 614604 658092 586442 644679
1968 644679 508957 589797 763002 786442 640003 537195 524097 585837 530224 581487 465669
1957 465669 291767 540867 622688 543085 377789 175502 239133 167820 194903 339332 373067
1946C73067L908J08224j64963O0096J4738M3034J41473q6853k00187M0514O8231
1935D01282P3769r1545M4282K06868j65658k53923r3219J58504P5514k01091N0905
1924B05688J37656m5595q135J94121j35401j34128J22311P0561q4632J83047q2045
1913D23448p404j88089K1511J90331r718k92220L7244P7676n8030k7621r5655
1902G1473r9165M2282M11615n2510j77455j16189O8212j48042R6007q1118J2515
1891B7625L3256j23731P7684J27050l7162j20206L9423O8694K09807m5360j03687
1880A53393K1116J17145J20265j96534n2240J3187l4661n031o4845J58013l7035
1869A92773j21728K04465j27261k28871O9466R3840J76599l7206o2638j7748m987
$$ plain form
1946 373067 376975 485199 320236 380332 395070 438104 579577 492724 292537 333051 401282
1935 401282 475051 383506 427788 634656 468998 215075 121856 280360 355874 154783 205688
1924 205688 343344 297749 289614 483735 348334 214206 336517 407078 322446 505493 423448
1913 423448 416044 227955 249466 439797 430079 137859 175103 252779 194749 167128 71473
1902 71473 -27692 14590 426205 373695 196240 80051 148263 221 96228 15110 27625
1891 27625 60881 -62850 14834 141884 104722 -15484 23939 92633 302440 257080 153393
1880 153393 174509 291654 411919 215385 163145 176332 141671 136640 71795 229808 192773
1869 192773 71045 275510 148249 -80622 -11156 82684 259283 222077 159439 141691 136704
1858A36704m8334J1828K2857m7734J44052O8416l389L6246M129j15496n9337O1372
1846B11314L59081j34952j57002p204K01878J65160j18647r0890J28118j67631
1836C89225O9753r7070l3348o9005k52494Q5689j00545J54223j0968j03324K07964
1825B40100m8306R6151j9124k51715p6530Q2730j5763J87824j38554r4658Q9244
1814E1399j10982K00824j4800K6951l03992l6192J25210J28949J42050j48437
1804F0980o0276L6144J06493q5061M0032L010K9222j92170J06540q1589N5614
1793A8939O2249p5259j95068m8927j9025n0964N9308J56783J17070j01386P0778
1782e502p2867l5167p3156O5755J80486j17134k7467K03931k21356n8072O1603
$$ plain form
1858 136704 88370 100198 123055 75321 219373 287789 284400 320646 324775 209279 149942 211314
1846 211314 570395 435443 278441 271237 473115 638275 519628 428738 556856 389225
1836 389225 458978 361908 328560 259555 7061 92750 -7795 146428 135460 32136 240100
1825 240100 191794 287945 268821 17106 -59424 23306 7543 195367 56813 -37845 51399
1814 51399 -59583 141241 126441 153392 -150600 -186792 -61582 67367 209417 60980
1804 60980 704 36848 143341 58280 98312 101322 130544 -61626 44914 -36675 18939
1793 18939 81188 5929 -189139 -238066 -257091 -308055 -248747 -91964 25106 -76280 -5502
1782 -5502 -78369 -113536 -186692 -120937 59549 -57585 -85052 118879 -102477 -160549 -98946
1771i8946O3535J8083O6975o8207K1079Q3708j51034N8552O1100p4591N0828J77675
1759B08757j35438j31618J31359K5247K2656J31430n1490o6620j30397r8909K16317
1748A21294k5413J19479p4207N0480O7418q9975j43083j25050L424K07090p985
1737A03472K7032J94353p818k99501P5697J28932k19367J00173K8430q7957j61197
1726a17751R6152J28560o2991N7846N3912Q3941j40572k33104n7100P1889K36359
1715A17141j0974r4396P0126p381m2659j27934R6006n0891M1581m7654j4314Q6968
1703A5619O0477l3832j78901J12804j61281n699L19955J164r4424L5415r2168
1692b0871l33373J47983n8058R8880J75083J4601m1363L5789J49035j43263n7567
$$ plain form
1771 -98946 -35411 -17328 49647 -18560 2519 86227 -64807 -6255 54845 -19746 31082 208757
1759 208757 73319 -58299 73060 98307 120963 252393 200903 134283 3886 -95023 121294
1748 121294 95881 215360 141153 191633 259051 169076 25993 -99057 -95633 111457 103472
1737 103472 130504 324857 317039 17538 93235 222167 2800 102973 131403 43446 -117751
1726 -117751 -21599 106961 43970 101816 155728 239669 99097 -134007 -191107 -119218 117141
1715 117141 106167 11771 81897 74516 31857 -96077 -71 -50962 -9381 -57035 -71349 15619
1703 15619 76096 42264 -136637 -23833 -185114 -190813 129142 130306 35882 71297 -20871
1692 -20871 -354244 -206261 -264319 -165439 9644 24245 -17118 18671 167706 24443 -33124
1681c3124R3409m9934J9601p9691q2132k4326M4572K80485R5784j09952r1516
1670F3176Q1420j95653j46339J730K02142o2489j22337L3725J32672K8839n5638
1659c8752j91788P5613J03188K09694q1882p7982O3155Q328K08452k00204P4504
1648A52326k19412k76930q5613K83522J75688n8593n1666j2152R0407J70309r2994
1637G4892m3081j15512j76062J66653k2950J35872L6583J92859j49583j11048
1627a1377q9013j1108Q335K08814L1568J6726j23189N2097L7018j34392k6047
1616d0568M9282n9360k8967k347J26580O9017m8674O1526k7048O3243k61440o1366
1604a60122L1687M9975j59760l8991K8094J28062o1732O4519K32314J27769k69353
$$ plain form
1681 -33124 60285 10351 29952 -49739 -131871 -156197 -111625 168860 264644 154692 63176
1670 63176 144596 -51057 -197396 -195666 6476 -56013 -178350 -144625 -11953 16886 -38752
1659 -38752 -230540 -154927 -51739 157955 76073 -1909 61246 69574 278026 77822 152326
1648 152326 -67086 -344016 -429629 -146107 29581 -29012 -80678 -92830 -2423 167886 74892
1637 74892 31811 -83701 -259763 -93110 -116060 19812 56395 249254 99671 -11377
1627 -11377 -100390 -111498 -103163 105651 137219 153945 30756 82853 119871 -14521 -40568
1616 -40568 8714 -50646 -79613 -81960 44620 113637 64963 126489 99441 162684 -98756 -160122
1604 -160122 -128435 -78460 -238220 -277211 -249117 -121055 -182787 -118268 114046 241815 -27538
1593b7538k18878K53884j5759J54437j08251j80105L780r1196N8034J32001q706
1582d8297L9651j9546N838Q21J31036j17212j24031P6542Q3955M7849k10680n708
1570a39782K00596R5926J952j90311l6987j9008J9013R7152j19814O9165O1414
1559C9316j51829k32542k430J55139j0757J28476J57463j32855j06073Q3709J52533
1548H0150N7524N7336k07824o5160Q7068J19192k361k69459J28530N8542q5860
1537d2322r9806j05683R3267Q0241l439m1665n1833J25639q894P6809K8519o6256
1525a5423M432k05649K27768J81052j99924k60659J11175J19874r7258j01950
1515b36562J94546L6353J29382l1119r9107l3741J33818j41378k0228J3943N5918
$$ plain form
1593 -27538 -246416 7468 -8291 146146 37895 -142210 -138430 -229626 -171592 -39591 -48297
1582 -48297 -8646 -28192 -22354 -21533 109503 -7709 -131740 -55198 28757 76606 -134074 -139782
1570 -139782 60814 156740 158692 -31619 -68606 -87614 -68601 28551 -91263 -22098 39316
1559 39316 -112513 -345055 -347485 -192346 -203103 -74627 82836 -50019 -156092 -72383 80150
1548 80150 137674 195010 -12814 -77974 9094 128286 125925 -143534 -15004 43538 -42322
1537 -42322 -142128 -247811 -154544 -74303 -77742 -119407 -171240 -45601 -54495 22314 50833 -15423
1525 -15423 -10991 -216640 11128 192180 -7744 -268403 -157228 -37354 -134612 -236562
1515 -236562 -42016 -5663 123719 92600 -6507 -40248 93570 -47808 -68036 -54093 1825
1504A825p0923p4853m2859m2203Q8324q5684R8823J4791n4453r2887J27442J09912
1492b2745J89615J87420j79532j67814j5827n5339r129J8856N2549L1009Q8423
1481A17486j25253n8114J72573J21763j35981r1245N868L6968L1281m5869n2298
1470b2821J4770j46515J13701K3681J15409J30663m4966j65803J1860n608j59346
1459a34975K2483k3784j77335J39317k0959J36473O1565q6109j30777k04852J71372
1448b47581L3345K26615K02953k11304P1286j2834m275j06630j08427K996n6J37993
1436a5919j04316p0928M6600J89949j1824k8744N3764K29025j15281j34579M277
1425D2024J01315m4434J10173o9238P42k10999K8315K6729O135n1501l9718J23225
$$ plain form
1504 1825 -69098 -143951 -186810 -229013 -140689 -226373 -127550 -112759 -167212 -260099 -132657 -22745
1492 -22745 166870 354290 174758 6944 -8883 -64222 -73351 -54495 -1946 29063 117486
1481 117486 -7767 -65881 106692 228455 92474 1229 7097 44065 75346 29477 -22821
1470 -22821 -8051 -154566 -40865 -17184 98225 228888 183922 18119 29979 24371 -134975
1459 -134975 -112492 -136276 -313611 -174294 -195253 -58780 2785 -83324 -214101 -418953 -247581
1448 -247581 -214236 12379 215332 4028 75314 62480 58205 -48425 -156852 -153856 -153912 -15919
1436 -15919 -120235 -191163 -144563 45386 33562 4818 58582 287607 172326 37747 42024
1425 42024 143339 98905 209078 139840 140582 -70417 -42102 -15373 -9238 -60739 -100457 22768
1413B2768N350p1271j73352r2238J73990J92135J74142k899L7503k32030k48593
1402b14495J2539Q3428R3670o4904J67810J4993k5870m7920M6023o2166K6117
1391B9225l4303J7295j20410J5216j2677J38786M5580N2280k00516k21424J5987
1380b74961K36708Q1630M697K7200j69136j34552Q9947Q3149k73491R385K19346
1369a00078J59907j33613j53563K8231K12631J27381n681j33488l9148q1520l0876
1358a49817J42941j6355J51758n375k6204r2871l7810N6406R9974L2862k0899
1347A34610m7849n4543k679j67602Q3724J67277r2063K3093J35995K8746j00158
1336A08551o9320j90199J80859m3439o3820L8540j73861K366J68325j8389j16532
$$ plain form
1413 22768 28118 -43153 -216505 -308743 -134753 57382 231524 228625 266128 34098 -214495
1402 -214495 -201956 -118528 -24858 -89762 78048 93041 67171 19251 65274 3108 29225
1391 29225 -5078 12217 -108193 -92977 -105654 33132 78712 130992 -69524 -290948 -274961
1380 -274961 -38253 43377 48074 75274 -93862 -228414 -138467 -55318 -328809 -319424 -100078
1369 -100078 59829 -73784 -227347 -199116 13515 140896 135215 1727 -37421 -118941 -149817
1358 -149817 -6876 -23231 128527 123152 96948 4077 -33733 22673 122647 155509 134610
1347 134610 86761 32218 29539 -138063 -54339 112938 20875 43968 179963 208709 108551
1336 108551 39231 -150968 29891 -13548 -77368 -38828 -212689 -210323 -41998 -60387 -176919
1325a76919K6425J30650J21720j86290N6973j4980J71599P400k80646M8510J30599
1314C5041K0383j00299P4220L4964p7952K6916M6075J61245k7714j10111k4621
1303E8147j25806p4086J43910j96481O3911J09410L420n3313j24879R5467J07180
1292F880J9733R9259j47903n9737J98100k463o0294o9518j51182P5782r9343k1470
1280b12156J07737j1536N3827k4755J63197j02033k14955J86739K4880k21992
1270b51047J05176J79290l8437K9896J3012o1394j8253M7363m1843j20559O6003
1259i0793L5201O7682j20586J37032M9329q7300j63239K7502Q3386L2581o7027
1248i6232J87215Q7092q8472j12168j01706J21094J58598j91578k27928J70606
$$ plain form
1325 -176919 -150494 -19844 101876 -84414 -27441 -42421 129178 136578 -144068 -95558 35041
1314 35041 55424 -44875 29345 64309 -13643 13273 59348 220593 192879 82768 58147
1303 58147 -67659 -141745 2165 -194316 -130405 -20995 -17575 -70888 -195767 -100300 6880
1292 6880 26613 125872 -22031 -81768 116332 113869 53575 -15943 -167125 -91343 -190686 -212156
1280 -212156 -104419 -115955 -62128 -86883 76314 -25719 -240674 -53935 -29055 -251047
1270 -251047 -145871 33419 -5018 24878 37890 -23504 -41757 5606 -36237 -156796 -90793
1259 -90793 -55592 12090 -108496 28536 77865 -9435 -172674 -145172 -61786 -29205 -96232
1248 -96232 90983 178075 89603 -22565 -124271 -3177 155421 -36157 -264085 -93479
1238i3479J51222Q028Q8956L4204k16523j9259J86555J35467j39688l1093q3390
1227B1000L8680K1122j71084k961J00052l1792p411J74888j49396l88335K38087
1216a57150J05599K9015K11956n8258q7537p8021R6174l9290l9862O3634k08736
1205a62476Q8768P006j10240L2700j42524J56923J01080j16171Q1701L7768m2836
1194f8301q347K2660p7601L1025j8525K43825K06332l8597k35983j44327P1265
1183a6574J62673p8200K7429P2520j26938q9532R7023R0231j3364O928j52693
1172b0497j94403P6629J94102J90766o7395j3235n3374j67882N7407j09525j78
1161a07585K0946L093J33378q8513o6653O5495J2830k5353Q7607J98058q4387
$$ plain form
1238 -93479 57743 65771 154727 188931 -27592 -46851 139704 275171 135483 104390 21000
1227 21000 59680 80802 -90282 -93243 6809 -24983 -32394 142494 -6902 -395237 -157150
1216 -157150 -51551 -22536 189420 131162 43625 -34396 61778 22488 -17374 46260 -162476
1205 -162476 -73708 -66702 -176942 -144242 -286766 -129843 -28763 -144934 -63233 -25465 -68301
1194 -68301 -76648 -53988 -131589 -100564 -119089 124736 331068 292471 56488 -87839 -16574
1183 -16574 146099 67899 95328 167848 40910 -48622 48401 138632 125268 132196 -20497
1172 -20497 -214900 -138271 55831 246597 179202 165967 112593 -55289 2118 -107407 -107585
1161 -107585 -86639 -83546 49832 -38681 -105334 -39839 -27009 -52362 35245 233303 148916
1150A48916J5134p9732k20501L8901J10535k1634J50632l86650K2672K55339j8234
1139A5378o6163J4058J08380o9307K1256K22n9814L226l7695p8288q5793n2410
1127b86950R4366R957K03637K6142j12008j6708n3622J4018N1623J28102j36803
1116g8246O241k1045N5828R849k35160L83768O6881k09461m9322k07261K9160
1105b48768K67780J12386J31084q1521j17996j20358l9893j52751l1836K28272
1095e3601p2836J60368J00477q7052j64039J54733P3921j15648J0859j27343Q4588
1084c5573K3013k2824J24505P538o3010k44592O0099R1472P1280p9357o8889O740
1072a29598J82388m1962Q3327k663j04778Q527M6348j24034n0520l7329J4835
$$ plain form
1150 148916 164050 84318 -136183 -97282 13253 -8381 142251 -244399 -221727 33612 15378
1139 15378 -50785 -36727 71653 2346 23602 23824 -35990 -32764 -70459 -148747 -234540 -286950
1127 -286950 -192584 -182627 21010 47152 -64856 -81564 -135186 -121168 -69545 58557 -78246
1116 -78246 -72005 -93050 -37222 -27373 -262533 121235 188116 -21345 -70667 -277928 -248768
1105 -248768 19012 131398 262482 180961 62965 -57393 -97286 -250037 -281873 -53601
1095 -53601 -126437 33931 134408 47356 -116683 38050 111971 -3677 7182 -120161 -35573
1084 -35573 -12560 -35384 89121 96659 33649 -210943 -150844 -59372 11908 -67449 -136338 -129598
1072 -129598 52790 10828 94155 91492 -13286 -4759 41589 -82445 -132965 -170294 -155459
1061a55459Q882J73887J72098j30319k6691K752j80665k03229J95121P6915J7843
1050d8865r4128K68749o4209n4592j434r053P5098K09805N1520m76680j27118
1039b70907J85292m0586j097p2636L035L4501J12108o0742q3846K9393p1638K04862
1027c2261J00634p9036J80763o2064l09094J14273K3519j23915J51470n1001p682
1016i4394J51517q2407k68238k8752K29279j5911j95346k0274J45238Q9516J39000
1005D9228L1913j57075K9803J55895j14171K61677j21654O367m1621O7381j61585
994F158l9753j950j76020K48738j95028j1508P3575M4825J92638J9841j02954
983E8562n1935j95571Q3514p2076K12755P4993J43632j31659j44861O2580p7677
$$ plain form
1061 -155459 -146577 27310 199408 69089 42398 45150 -135515 -338744 -143623 -66708 -48865
1050 -48865 -142993 125756 61547 6955 5521 -3532 71566 281371 332891 -143789 -270907
1039 -270907 -85615 -126201 -127298 -199934 -196899 -162398 -50290 -111032 -194878 -165485 -237123 -32261
1027 -32261 68373 -10663 170100 108036 -201058 -86785 -63266 -187181 -35711 -86712 -94394
1016 -94394 57123 -25284 -293522 -322274 -92995 -108906 -304252 -324526 -179288 -89772 49228
1005 49228 81141 -75934 -46131 109764 -4407 257270 135616 141983 100362 167743 6158
994 6158 -33595 -35545 -211565 37173 -157855 -169363 -95788 -50963 141675 161516 58562
983 58562 6627 -188944 -105430 -177506 35249 110242 253874 122215 -22646 39934 -37743
972c7743j72450K03216J13720j15275j23428J34094N4170K6532j15825l4624k8132
961i5745p3621M7519r5321J03545j31132Q6507L04157K7712j3680j12147o5394
950a7600j54846o5880J67781O0298p4604J08556m9079p1403N6067k25969J92309
939g4370K33811k15854J19795j57465o7323J62058j40167P7378J70034N2591j61920
928a432q3007k09343K9588o8368l004J4445J43906m390j7225K2348R5759J56977
916G6254j7787q4990L0239j56038n2203K87152L8820j50883n8121O1135K49850
905B23428m6912n7466J01191j98935j14983K0761P9078K8632n3119O1997j5373
894B8299j1713j16859j2537J032J22543J4796m3441J41225j3696o9976l43563
$$ plain form
972 -37743 -210193 -6977 106743 -8532 -131960 2134 56304 82836 -32989 -67613 -95745
961 -95745 -169366 -121847 -217168 -113623 -244755 -158248 145909 173621 159941 47794 -17600
950 -17600 -172446 -238326 -70545 -10247 -84851 23705 -25374 -96777 -40710 -266679 -74370
939 -74370 159441 -56413 63382 -94083 -161406 652 -139515 -62137 107897 160488 -1432
928 -1432 -84439 -293782 -264194 -332562 -335566 -321121 -177215 -181605 -198830 -176482 -80723 76254
916 76254 58467 -26523 3716 -152322 -204525 82627 121447 -29436 -87557 -26422 223428
905 223428 176516 119050 220241 21306 -93677 -72916 6162 34794 -18325 43672 28299
894 28299 16586 -100273 -112810 -111778 10765 25561 -17880 123345 109649 39673 -303890
883c03890J17859L36823p3133N647j29946J2301M9132J00531l3739k2519j93832
872a34766R849J32071N162J12105j39189J27466l185n3062N2852l5438Q2301m34120
860b77954J62316J70827K942R8735K391J16057l27969j34126K8277P3425o3279
849a48358q2509L3981q9681m9109N6200J2842l7747J00296K3919J22286M3893
838a3987J36365R5121q3627j32062J07016M3347j7472j36996j78365p0582K6820
827b24422O3109l1451K98391J12446r1601p8410r5804j8511j6696j13157J52445
816d3661J13995k50628O8351K20392k1143r3839o889J14777k71119j20855J31787
805a58832J89940r65L8750p8294j07297j31452J45604K048k8859o0881N5606J56881
$$ plain form
883 -303890 -186031 150792 77659 83306 -46640 -34339 14793 115324 81585 59066 -134766
872 -134766 -124917 7154 12316 124421 -14768 112698 109513 56451 109303 73865 156166 -277954
860 -277954 -115638 55189 58131 156866 159257 275314 -52655 -186781 -158504 -85079 -148358
849 -148358 -230867 -196886 -286567 -335676 -279476 -266634 -304381 -204085 -180166 -57880 -13987
838 -13987 122378 217499 133872 1810 108826 152173 134701 -2295 -180660 -251242 -224422
827 -224422 -161313 -192764 105627 218073 126472 48062 -47742 -66253 -82949 -196106 -43661
816 -43661 70334 -180294 -111943 108449 87306 -6533 -13422 101355 -169764 -290619 -158832
805 -158832 31108 30143 68893 -9401 -116698 -248150 -102546 -100498 -129357 -190238 -134632 22249
793B2249L87343k51747k64010O2777r4246j30204K2856J62529K9823n6293P8063
782c0860l5399K8602r3883K1201l307q3781M9666j2789J40826L6278j21317K21203
770A16440J31226k64341J5058L5161k05562N2231P5291J55742P5473k0098k20600
759e3979p84j1037M4800Q8073M4986M8970l4938j13713j11546J82071K7328n7379
747E2852o4885P1603n3812l701j52932J26419o0592j4445k8612k3684m1026J23828
735f8987o7150l5882N1717K36036R6450j42952J2745M0538k1484j51461q9924
724a40354J21552J03486Q961p7073n1509q4372l4503P2460l3756l1551J38186
713h473J26611Q8822j24359J3143k94852K9873J33148k3601j06473M5643J30675
$$ plain form
793 22249 409592 157845 -106165 -43388 -137634 -267838 -244982 -82453 -52630 -108923 -30860
782 -30860 -66259 -37657 -131540 -110339 -113646 -197427 -147761 -160550 -19724 16554 -104763 116440
770 116440 247666 -16675 -1617 33544 -172018 -119787 -44496 111246 186719 166621 -53979
759 -53979 -54763 -65800 -21000 67073 112059 161029 126091 12378 -99168 82903 110231 52852
747 52852 -12033 59570 5758 2057 -150875 -24456 -85048 -99493 -128105 -151789 -192815 -68987
735 -68987 -136137 -172019 -120302 115734 212184 69232 81977 122515 101031 -50430 -140354
724 -140354 -18802 84684 93645 16572 -34937 -119309 -153812 -81352 -115108 -146659 -8473
713 -8473 118138 206960 82601 95744 -199108 -169235 -36087 -59688 -166161 -120518 10157
702A0157J01605O458k14341N6539R9692m5884R020P6891o0214j55139q1929L5948
690a61197J37911J20136j73785m3571P2061K18482p3306j57127j8240p1650j12232
679b62518J60378l8059P9355J30933j84794J6494Q5896j39906k3756P1690J34160
668B9873J44929J19220o5625k8390J42116j16356j61928J45121k18863q5745J08181
657A2533j6101j89182J34973K74426k924j27222k40327j14462J62600J49541j34333
646i0478J27246j22681j09429J29617J08338o056J5404l4005n3863p7640P6248
635c7299L278J82562j38384p5680j28031K52353N9177r6478J00249k5646k1304
624G4797j32834p8630M3807J05246q4673J83402j12630j8855J26769l7135k78284
$$ plain form
702 10157 111762 118220 -96121 -39582 60110 14226 23246 100137 39923 -115216 -197145 -161197
690 -161197 -23286 96850 -76935 -120506 -48445 170037 96731 -60396 -78636 -150286 -262518
679 -262518 -102140 -140199 -60844 70089 -114705 -98211 -12315 -152221 -175977 -104287 29873
668 29873 174802 294022 228397 200007 342123 225767 63839 208960 -9903 -95648 12533
657 12533 -3568 -192750 -57777 216649 213725 86503 -153824 -268286 -105686 43855 -90478
646 -90478 36768 -85913 -195342 -65725 42613 36557 51961 17956 -35907 -113547 -37299
635 -37299 -34021 148541 10157 -65523 -193554 58799 117976 21498 121747 96101 74797
624 74797 -58037 -136667 -92860 12386 -72287 111115 -1515 -20370 106399 69264 -209020
613b09020J90567L8229k31703J6980J92598O2092j41388J17989J08937r8294O716
602E3703p6106j99610N0014K47536R886j28639J57767K1884M2452j33767j97192
591a52072Q5688P0586r0137j50076m2032J15607M7250m1702J10246P6287O2663
580I2308q3110l1039J2689p6428r9056J5477L5602K2910K7266k12745j29072J52418
568b72780P1465J34077j9729J9798J25789m6187j41491J79266Q3451j58748l5856
557f0945o7048l53J33242q4949M5825L0549m2356L5944N8638J30808O8724k5385
545B22694k17730O2838J58372k39612k2181l5550k1817J44473m1875J0116L2922
534E2650n7692o8788j57093J10845L9450J1361j2073j6673J43575l3061J4577
$$ plain form
613 -209020 -18453 19776 -211927 -194947 -2349 59743 -81645 36344 145281 46987 53703
602 53703 -22403 -222013 -171999 75537 85423 -43216 114551 136435 178887 45120 -152072
591 -152072 -66384 4202 -85935 -236011 -278043 -162436 -115186 -156888 -46642 29645 92308
580 92308 9198 -21841 -9152 -85580 -184636 -169159 -133557 -110647 -83381 -296126 -425198 -272780
568 -272780 -201315 -67238 -86967 -67169 58620 12433 -129058 50208 133659 -25089 -60945
557 -60945 -127993 -128346 4896 -80053 -34228 -3679 -46035 -10091 48547 179355 248079 222694
545 222694 4964 67802 226174 -13438 -35619 -71169 -92986 51487 9612 19728 52650
534 52650 -5042 -73830 -230923 -120078 -80628 -69267 -81340 -98013 45562 12501 27078
523B7078J51129j0391o4320J92793O989k74842j22915r7615l648L6632J99839
512D0729l6614k05447J22992r7739m3375J02866M6321q0896J16754p2408l7654
501a44471K51420O8541k34703n4669N5038Q9521j61220q7167j15057N6089K87394
490A0716Q7560n4054K9907q9368j85714k19539J43079J98596J80355L1535r3841
479C9232L1281J63421k6924j29547N4117K5679k39944J31105K7841r3763L2531
468A5029N7424n0509j17627j1977j8807J18340o1794J05780J33890J0963j83738
457c026J42984p9044J9817N6002K2260k97210O0069K53920L8483k03662j09625
446i9032R4645J35595R8793J8893J31997k45245Q891n0908J04472j4350J7943
$$ plain form
523 27078 178207 167816 103496 296289 303278 28436 -94479 -192094 -195742 -159110 40729
512 40729 4115 -201332 -78340 -176079 -219454 -116588 -70267 -151163 -34409 -106817 -144471
501 -144471 106949 175490 -59213 -113882 -58844 30677 -130543 -217710 -332767 -276678 10716
490 10716 98276 44222 74129 -15239 -200953 -420492 -277413 -78817 101538 133073 39232
479 39232 70513 233934 207010 77463 131580 157259 -82685 48420 76261 -17502 15029
468 15029 72453 21944 -95683 -107660 -126467 -8127 -69921 35859 169749 180712 -3026
457 -3026 139958 60914 80731 136733 158993 -138217 -78148 175772 214255 10593 -99032
446 -99032 -4387 131208 230001 248894 380891 135646 144537 93629 198101 183751 201694
435B01694m3415k44527j0268m2368J26882J48927j261j19940j95930J34239J21786
424G5819N3648M0546l8349m7844n656J50140j37081k46211J2130J25393j31646
413a49111j99247M7619J27190J49779J69713J9377j28471k66819J85422N8597
403A4049o8960J64560J47648o290k16631j3538J26775q7933M4877j67171j33065
392a95679L0006L4619M3131j2843j67202m6429J8624o185J33335J7746O7349k9698
380a13226J38536k0200r0287j22588j8592J46868j02618J53633j0787J06560j99647
369a32348l3829K07372o0131O5512j90550P1891q467k1530p88P1486M9278m9865
357c1969M2010J29023N6335p0201j73881N9598R9290k81825J65152K20602o2411
$$ plain form
435 201694 158279 -86248 -96516 -138884 -12002 136925 135664 15724 -180206 -45967 75819
424 75819 129467 170013 131664 83820 78164 228304 91223 -154988 -142858 -17465 -149111
413 -149111 -348358 -300739 -173549 -23770 145943 165320 36849 -229970 -44548 14049
403 14049 -54911 109649 257297 251007 34376 20838 147613 59680 104557 -62614 -195679
392 -195679 -165673 -131054 -87923 -100766 -267968 -314397 -295773 -301958 -168623 -150877 -83528 -113226
380 -113226 25310 5110 -85177 -207765 -226357 -79489 -182107 -28474 -39261 67299 -132348
369 -132348 -166177 41195 -18936 46576 -143974 -72083 -80550 -102080 -102868 -31382 17896 -31969
357 -31969 10041 139064 195399 125198 -48683 10915 110205 -171620 -6468 214134 151723
346A51723M1731k70926m7731L9907R8111O8964K22931j37573j23985J76196n3631
335A65717j43498j56856N9054K66963O43k62501k3613J98224Q0317k10407k76959
324c02916n253K85731J41972j74963n7971n2221o8106J35642j6113J55711J3118
313E4631J2999q4026k49069J08774p0379R7234K7885k7371L2042l8762K37285
302A01243o2982l62270O4293K8208J01207J88034j8019L2866j08578N7550N3085
291G4637l8989J76612J6278n4436j57357J5084l499k0532n4352M7783J9842r8037
279g6966J26425J30040p6867p8459J13416k47036K1992N8872J38816K1130O9879
268B01242k90656r7380Q3559J73176j26089j33726L2329P9715J37674p2492m0601
$$ plain form
346 151723 193454 -77472 -125203 -85296 12815 81779 304710 167137 43152 219348 165717
335 165717 22219 -134637 -75583 191380 192023 -70478 -94091 104133 184450 -25957 -302916
324 -302916 -308169 -22438 119534 -55429 -113400 -165621 -233727 -98085 -114198 41513 54631
313 54631 67630 -16396 -265465 -156691 -227070 -129836 -101951 -129322 -97280 -136042 101243
302 101243 38261 -324009 -259716 -231508 -130301 57733 39714 72580 -35998 21552 74637
291 74637 35648 212260 228538 174102 16745 31829 28330 7798 -46554 1229 21071 -76966
279 -76966 49459 179499 102632 24173 137589 -109447 -87455 -28583 110233 131363 201242
268 201242 -89414 -186794 -103235 69941 -56148 -189874 -157545 -77830 59844 -12648 -53249
257e3249J47242R5944r3846l43881J73657o0779J2231J27281Q3484K3949N0783
246A62816K2898j83493m1663j49731Q26J57670R1492l0429j13869J70853m2411
235D4959j77846N2971R550K02496j43169r7602N7095R3776k7946j24612l668j45383
223b59379n1693K21953k4738J18233j82483N8459k522J7305J70218j51749K4676
212f1720m9755r2724O6813J76710N3822j77411J11594J6790l5095L264J40397
201A52685j5533N0719j2798J07540K4342j20580j38237M4503j04194Q4926J61942
190B35315J6737k53681R5191j54007L883J61533j35594l4496Q5174K5391q0673
179c5227J44928n5264j14237L364L5377J6770K041l545q0668P4997M3898K6416
$$ plain form
257 -53249 93993 189937 96091 -247790 -74133 -134912 -122681 4600 88084 112033 162816
246 162816 185714 2221 -39442 -189173 -188347 -30677 60815 30386 -83483 87370 44959
235 44959 -132887 -79916 -70366 132130 -11039 -108641 -51546 42230 14284 -110328 -113996 -259379
223 -259379 -311072 -89119 -113857 4376 -178107 -119648 -122170 -104865 65353 -86396 -61720
212 -61720 -111475 -204199 -137386 39324 93146 -84265 27329 44119 9024 12288 152685
201 152685 137152 187871 175073 282613 306955 186375 48138 92641 -11553 73373 235315
190 235315 252052 -1629 93562 -60445 -56562 104971 -30623 -65119 20055 45446 -35227
179 -35227 109701 54437 -59800 -56436 -21059 -4289 -2248 -5793 -86461 -11464 32434 58850
167E8850j07401j88454K03133J04456J29203P3793k82991n7045L7458j30568m9813
156b09379L8766R8791k7847J60781n2009M3981j26554K337Q2315r6884N9418K00194
144A73910n9013m8342M1490o945k23914R6264j2180l6950J03114l3462j00986
133a07014n0518P5071M9134J0053Q9478J68973k38515r3782Q1971P2450p2786
122a5485m5905R3976j51875L276j05988l2988L04751J46041j17582J7484l261
111I2444J46720k19447j73945J42398J1938p6967M9994J6299J94574l0436j16692
100C6880k52252l1783J29612Q8476M4778j1984Q859Q4402L2242J3456q4569M1154
88I9271L0145j40509M7608j76064J40747r4478k4937n7796J79872J19706l5550
$$ plain form
167 58850 -48551 -237005 -33872 70584 199787 273580 -9411 -66456 -28998 -159566 -209379
156 -209379 -170613 -71822 -99669 61112 9103 53084 -73470 -71133 11182 -85702 -26284 173910
144 173910 114897 66555 108045 101100 -122814 -26550 -38730 -75680 27434 -6028 -107014
133 -107014 -157532 -82461 -33327 -23274 66204 235177 -3338 -97120 -15149 57301 -15485
122 -15485 -61390 32586 -119289 -116013 -222001 -254989 49762 195803 78221 95705 92444
111 92444 239164 19717 -154228 -11830 108 -76859 -26865 -10566 184008 153572 36880
100 36880 -215372 -247155 -117543 -29067 15711 3727 12586 96988 129230 142686 58117 99271
88 99271 129416 -11093 36515 -139549 1198 -93280 -118217 -176013 3859 123565 88015
77H8015n5434j3601p3099P8940J14009q9150p8863k5445j09098m5680K03489J68610
65A62693j40796j21087O5801R8187J04108n779q6495m1388k4385M1602P2625j53492
53b8406j4922J00908k814N9996j2497m0414l7318R1492L9372j1056j61432j04206
41a21297J03073J47148o4906n5268j27749L9450J23691r8804J61580j31N4413
30A61200n5525j43720n5327l2830J189M9049R2700M5648N4423P3306l5736j37970
18A6407P5308p9108L427J09950j42241p0021J00798j5559K0883K2345j76998J9306
6a15503O7276N8433L1237M1141j24632O3740
0B1692
$$ plain form
77 88015 32581 18980 -54119 24821 138830 49680 -29183 -54628 -163726 -209406 -5917 162693
65 162693 21897 -99190 -33389 64798 168906 163127 76632 35244 10859 52461 125086 -28406
53 -28406 -43328 57580 54766 114762 102265 61851 24533 116025 155397 144341 -17091 -121297
41 -121297 -18224 128924 64018 8750 -118999 -79549 44142 -54662 106918 106787 161200
30 161200 105675 -38045 -93372 -126202 -125013 -75964 16736 62384 116807 190113 154377 16407
18 16407 91715 12607 16034 125984 -16257 -86278 14520 -1039 19844 42189 -134809 -115503
6 -115503 -48227 10206 41443 82584 -42048 21692
0 21692
$$ Imaginary data points
##PAGE= N=2
##DATA TABLE= (X++(I..I)), XYDATA
16383b111658K2330M1963k2813p6078L8891J49940K07181Q559r3127J13844Q3614
16372a637354k29863L6486L9017M0354P8562J4585Q8224j06123P7927k6411N1098
16361a573498J34719Q3049r6479O4803K4903J39861k8224r1654K8294J86608p9505
16350a207123J10619M8420m0371L8092L6859Q0028n840L2623J8576M590j25293
16339a008820J83985J37305R0065k21100l8227J05286J51154M3661O935J07317
16329d42439J3473K6712l6943l7279j2710Q0536J80937j0819J0101N5483O5506
16318a07442o0658m3889R7313N5955o9667J00699O2332j5226P7563J7181j12100
16307B061j6064k679J69025J72329q2309o9015J85113j3313r324l9342J99415
$$ plain form
16383 -2111658 -2089328 -2047365 -2070178 -2146256 -2107365 -1957425 -1750244 -1741685 -1834812 -1720968 -1637354
16372 -1637354 -1867217 -1830731 -1791714 -1751360 -1672798 -1658213 -1569989 -1676112 -1598185 -1624596 -1573498
16361 -1573498 -1438779 -1355730 -1452209 -1387406 -1362503 -1222642 -1250866 -1342520 -1314226 -1127618 -1207123
16350 -1207123 -1096504 -1048084 -1088455 -1050363 -1013504 -933476 -939316 -906693 -888117 -883527 -1008820
16339 -1008820 -824835 -687530 -597465 -818565 -856792 -751506 -600352 -556691 -549756 -442439
16329 -442439 -428966 -402254 -439197 -476476 -489186 -408650 -227713 -238532 -228431 -172948 -107442
16318 -107442 -168100 -211989 -114676 -58721 -128388 -27689 34643 19417 96980 114161 2061
16307 2061 -14003 -16682 152343 324672 242363 173348 358461 345148 335824 296482 495897
16296D95897j04987J85373j8524n1927J65021l0613l5600Q4418Q4337o386J09336
16285H76345j5083k4971J10868k1332j60878J30888J7575j6811Q3176k1585q825
16274I49367M8978n8899Q8889N0248l5002j7163J39752J39815j8875j94074j2199
16263A080837Q5111J33688p1115J90073p0437p9969Q1072P7261p693K38222k62284
16252A394766k25967J81043N14J76220J00356l469M2024m414q5923j02964J41699
16241A613885J53641n2208j02332K17987j36536j9786J80502J02418l5686J4444
16231A936329k02136j86118K01115Q8704n0921M557R6417J47398P3627N4138m1123
16220B121987J5415j22009M1237J25352R0064j01110q0143k7432j01803n2534
$$ plain form
16296 495897 390910 576283 557759 505832 670853 640240 604640 689058 773395 767009 876345
16285 876345 861262 836291 947159 925827 764949 895837 913412 896601 979777 958192 949367
16274 949367 998345 939446 1028335 1078583 1043581 1026418 1166170 1305985 1287110 1093036 1080837
16263 1080837 1165948 1299636 1228521 1418594 1348157 1268188 1349260 1426521 1418828 1657050 1394766
16252 1394766 1168799 1349842 1350356 1526576 1626932 1623463 1665487 1661073 1575150 1472186 1613885
16241 1613885 1767526 1715318 1612986 1830973 1694437 1674651 1855153 1957571 1921885 1936329
16231 1936329 1734193 1548075 1749190 1837894 1786973 1791530 1887947 2035345 2108972 2163110 2121987
16220 2121987 2137402 2015393 2056630 2181982 2272046 2170936 2090793 2063361 1961558 1909024
16210A909024j5991J40038j4493Q7798P6910Q56j13094K11147o4419r601J6153
16199B224328j18425n3295R5352O8141J4396L432R5319J43348j85920l1062J81532
16188B437146j03983j47398J812J43658J07007K3154M9246p3847J8148J03170
16178B558113l1689N168j40692Q8827Q7951K3968o863M4553O8074J20944j13263
16167B705091j15106q3764J43734J39199j06038K8057Q303q2106r4884q4576J30868
16156B588778J40557m2763p1463q3722R7966Q258j09848J80328n4033J11655L5568
$$ plain form
16210 1909024 1893033 2033071 2018578 2106376 2183286 2184142 2071048 2282195 2217776 2208175 2224328
16199 2224328 2105903 2052608 2147960 2216101 2230497 2233929 2329248 2472596 2286676 2255614 2437146
16188 2437146 2333163 2185765 2187577 2331235 2438242 2461396 2510642 2436795 2454943 2558113
16178 2558113 2526424 2531592 2390900 2479727 2567678 2591646 2584783 2629336 2697410 2818354 2705091
16167 2705091 2589985 2506221 2649955 2789154 2683116 2711173 2719476 2637370 2542486 2457910 2588778
16156 2588778 2729335 2686572 2615109 2531387 2629353 2637611 2527763 2708091 2654058 2765713 2801281
$$ [...]
##END NTUPLES=NMR SPECTRUM
##END=
