##TITLE=1H_EC-3269(1)
 CDCl3
 8 sc, 
 16.11.2021
##JCAMPDX= 6.0         $$ Bruker NMR JCAMP-DX V2.0
##DATA TYPE= NMR SPECTRUM
##DATA CLASS= NTUPLES
##ORIGIN= UXNMR, Bruker Analytische Messtechnik GmbH
##OWNER= root
$$ XWIN-NMR		Version 3.5
$$ Tue Nov 16 12:17:27 2021 Russian Standard Time (UT+4h)  she@DPX200
##.OBSERVE FREQUENCY= 200.131346
##.OBSERVE NUCLEUS= ^1H
##.ACQUISITION MODE= SIMULTANEOUS
##.ACQUISITION SCHEME= undefined
##.AVERAGES= 8
##.DIGITISER RES= 18
##SPECTROMETER/DATA SYSTEM= spect
##.PULSE SEQUENCE= zg30
##.SOLVENT NAME= CDCl3
##.SHIFT REFERENCE= (INTERNAL, CDCl3, 0, 15.7182)
##AUDIT TRAIL= $$ (NUMBER, WHEN, WHO, WHERE, WHAT)
$$ ##TITLE= Audit trail, XWIN-NMR		Version 3.5
$$ ##JCAMPDX= 5.01
$$ ##ORIGIN= Bruker BioSpin GmbH
$$ ##OWNER= she
$$ F:/spectra/data/she/nmr/H-F/1/pdata/1/auditp.txt
$$ ##AUDIT TRAIL=  $$ (NUMBER, WHEN, WHO, WHERE, WHAT)
(   1,<2021-11-16 12:16:13.06 +0400>,<she>,<DPX200>,
      <created by zg, POWCHK disabled, PULCHK disabled
       configuration hash MD5:
       00 E9 B6 7A A2 85 ED C7 34 08 36 98 17 FE 4E 26
       data hash MD5: 16K
       C7 3A 0E ED 89 08 CC EB 5E 6E F4 CE 92 D0 7C 17>)
(   2,<2021-11-16 12:16:15.60 +0400>,<she>,<DPX200>,
      <Start of raw data processing
       efp BC_mod = 2 LB = 0.24 FT_mod = 6 PKNL = 1 PHC0 = -15517.73 PHC1 = 18.60081 SI = 16K 
       data hash MD5: 16K
       2A CC 0B 9E 64 22 57 78 48 DB 75 F9 B8 53 D4 66>)
(   3,<2021-11-16 12:16:31.78 +0400>,<she>,<DPX200>,
      <pk PHC0 = 1.470395 PHC1 = -0.2 
       data hash MD5: 16K
       20 39 A3 52 3C 39 FB 53 85 E7 CA DD 57 07 AC 23>)
(   4,<2021-11-16 12:16:35.07 +0400>,<she>,<DPX200>,
      <abs ABSG = 5 
       data hash MD5: 16K
       3F 50 25 BD F6 66 9C 43 B8 9A 49 BC 4C CE B3 3D>)
$$ ##END=
$$ 
$$ hash MD5
$$ 96 12 A9 71 C7 DF 7B 67 90 8F B8 BA 85 8F 2B 5C
##$RELAX= 
##$RELAX= 
##$RELAX= 
##$RELAX= 
##$RELAX= 
##$RELAX= 
$$ Bruker specific parameters
$$ --------------------------
##$DU= <F:/spectra>
##$EXPNO= 1
##$NAME= <H-F>
##$PROCNO= 1
##$TYPE= <nmr>
##$USER= <she>
##$AMP= (0..31)
100 100 100 100 100 100 100 100 100 100 100 100 100 100 100 100 100 100 
100 100 100 100 100 100 100 100 100 100 100 100 100 100 
##$AQSEQ= 0
##$AQ_mod= 1
##$AUNM= <au_zg>
##$AUTOPOS= <>
##$BF1= 200.13
##$BF2= 200.13
##$BF3= 200.13
##$BF4= 200.13
##$BF5= 200.13
##$BF6= 200.13
##$BF7= 200.13
##$BF8= 200.13
##$BYTORDA= 1
##$CFDGTYP= 0
##$CFRGTYP= 5
##$CHEMSTR= <none>
##$CNST= (0..31)
1 1 145 1 1 1 1 1 1 1 1 1 1 1 1 1 1 1 1 1 1 1 1 1 1 1 1 1 1 1 1 1 
##$CPDPRG= <>
##$CPDPRG1= <>
##$CPDPRG2= <>
##$CPDPRG3= <>
##$CPDPRG4= <mlev>
##$CPDPRG5= <mlev>
##$CPDPRG6= <mlev>
##$CPDPRG7= <mlev>
##$CPDPRG8= <mlev>
##$CPDPRGB= <>
##$CPDPRGT= <>
##$D= (0..31)
0 1.2 0 0 0 0 0 0 0 0.06 0 0.03 0 0 0 0 0.0002 0 0 0 0 0 0 0 0 0 0 0 0 
0 0 0 
##$DATE= 1637050572
##$DBL= (0..7)
120 120 120 120 120 120 120 120 
##$DBP= (0..7)
150 150 150 150 150 150 150 150 
##$DBP07= 0
##$DBPNAM0= <>
##$DBPNAM1= <>
##$DBPNAM2= <>
##$DBPNAM3= <>
##$DBPNAM4= <>
$$ [...]
##$SUBNAM2= <"">
##$SUBNAM3= <"">
##$SUBNAM4= <"">
##$SUBNAM5= <"">
##$SUBNAM6= <"">
##$SUBNAM7= <"">
##$SUBNAM8= <"">
##$SUBNAM9= <"">
##$SW= 18.0517287032376
##$SWIBOX= (0..15)
0 0 2 0 0 0 0 0 0 0 0 0 0 0 0 0 
##$SW_h= 3612.71676300578
##$TD= 16384
##$TD0= 1
##$TE= 0
##$TE2= 300
##$TE3= 300
##$TEG= 300
##$TL= (0..7)
0 120 120 120 120 120 120 120 
##$TP= (0..7)
150 150 150 150 150 150 150 150 
##$TP07= 0
##$TPNAME0= <>
##$TPNAME1= <>
##$TPNAME2= <>
##$TPNAME3= <>
##$TPNAME4= <>
##$TPNAME5= <>
##$TPNAME6= <>
##$TPNAME7= <>
##$TPOAL= (0..7)
0.5 0.5 0.5 0.5 0.5 0.5 0.5 0.5 
##$TPOFFS= (0..7)
0 0 0 0 0 0 0 0 
##$TUNHIN= 0
##$TUNHOUT= 0
##$TUNXOUT= 0
##$USERA1= <user>
##$USERA2= <user>
##$USERA3= <user>
##$USERA4= <user>
##$USERA5= <user>
##$V9= 5
##$VALIST= <valist>
##$VCLIST= <CCCCCCCCCCCCCCC>
##$VD= 0
##$VDLIST= <DDDDDDDDDDDDDDD>
##$VPLIST= <PPPPPPPPPPPPPPP>
##$VTLIST= <TTTTTTTTTTTTTTT>
##$WBST= 1024
##$WBSW= 4
##$XGAIN= (0..3)
0 0 0 0 
##$XL= 0
##$YL= 0
##$YMAX_a= 148800
##$YMIN_a= -218448
##$ZGOPTNS= <>
##$ZL1= 120
##$ZL2= 120
##$ZL3= 120
##$ZL4= 120
##$ABSF1= 15.72816
##$ABSF2= -2.323689
##$ABSG= 5
##$ABSL= 3
##$ALPHA= 0
##$AQORDER= 0
##$ASSFAC= 0
##$ASSFACI= 0
##$ASSFACX= 0
##$ASSWID= 0
##$AUNMP= <proc_1d>
##$AZFE= 0.1
##$AZFW= 0.1
##$BCFW= 0
##$BC_mod= 2
##$BYTORDP= 0
##$COROFFS= 0
##$CY= -3
##$DATMOD= 1
##$DC= 0
##$DFILT= <>
##$DTYPP= 0
##$F1P= 0
##$F2P= 0
##$FCOR= 1
##$FTSIZE= 16384
##$FT_mod= 6
##$GAMMA= 0
##$GB= 0
##$INTBC= 1
##$INTSCL= 0
##$ISEN= 128
##$LB= 0.24
##$LEV0= 0
##$LPBIN= 0
##$MAXI= 10000
##$MC2= 0
##$MEAN= 0
##$ME_mod= 0
##$MI= 1.114404
##$NCOEF= 0
##$NC_proc= -8
##$NLEV= 6
##$NOISF1= 3.799351
##$NOISF2= 2.8
##$NSP= 0
##$NTH_PI= 0
##$NZP= 0
##$OFFSET= 15.71824
##$PC= 1
##$PHC0= -15516.26
##$PHC1= 18.40081
##$PH_mod= 1
##$PKNL= yes
##$PPARMOD= 0
##$PSCAL= 0
##$PSIGN= 0
##$REVERSE= no
##$SF= 200.130006667309
##$SI= 16384
##$SIGF1= 3
##$SIGF2= 2
##$SINO= 5.538805
##$SIOLD= 16384
##$SREGLST= <1H.CDCl3>
##$SSB= 0
##$STSI= 16384
##$STSR= 0
##$SW_p= 3612.71676300578
##$SYMM= 0
##$S_DEV= 0
##$TDeff= 16384
##$TDoff= 0
##$TI= <>
##$TILT= no
##$TM1= 0
##$TM2= 0
##$TOPLEV= 0
##$USERP1= <user>
##$USERP2= <user>
##$USERP3= <user>
##$USERP4= <user>
##$USERP5= <user>
##$WDW= 1
##$XDIM= 16384
##$YMAX_p= 423587807
##$YMIN_p= -975526
$$ End of Bruker specific parameters
$$ ---------------------------------
##NTUPLES= NMR SPECTRUM
##VAR_NAME=  FREQUENCY,     SPECTRUM/REAL,   SPECTRUM/IMAG
##SYMBOL=    X,             R,               I
##VAR_TYPE=  INDEPENDENT,   DEPENDENT,       DEPENDENT
##VAR_FORM=  AFFN,          ASDF,            ASDF
##VAR_DIM=   16384,         16384,           16384
##UNITS=     HZ,            ARBITRARY UNITS, ARBITRARY UNITS
##FACTOR=    0.220516191357247, 1,           1
##FIRST=     3145.69143281846, 0,            0
##LAST=      -467.025330187323, 0,           0
##MIN=       -467.025330187323, -975526,     0
##MAX=       3145.69143281846, 423587807,    0
$$ Real data points
##PAGE= N=1
##DATA TABLE= (X++(R..R)), XYDATA
$$ [...]
5870B5434125j122660j468610r88948m49692o08552m35915l18746j06970m88537
5861A9445495l81303j79774k72789K75231k19042n36737k68139r2716n55692l15983
5851A6898551K10897j22485k52750k25531o0918K37370J78003k63590j2607k26020
5841A6360920l73668P69133L1898K94584M36860K74290L97182j51045N07326J89520
5831A8737000K20254M75207K85782M51394J037016J040599J004556J475402K303677
5822B7030887K656658K832699K778377K328539n700k270992l661323m294596l250850
5813B4143699k322612j520706r37336p36866m48160o37306p25033k3863L0944
5804A6822761J3105Q548N6028l36494j20714O8259J89684j86971k87431j48759
$$ y = [25434125, 24311465, 22842855, 21853907, 21404215, 20795663, 20359748, 20041002, 19934032, 19445495, 19064192, 18884418, 18611629, 18886860, 18667818, 18131081, 17862942, 17770226, 17214534, 16898551, 17109448, 16986963, 16734213, 16508682, 16447764, 16685134, 16863137, 16599547, 16586940, 16360920, 15987252, 16756385, 16788283, 17082867, 17519727, 17794017, 18191199, 18040154, 18547480, 18737000, 18957254, 19432461, 19718243, 20169637, 21206653, 22247252, 23251808, 24727210, 27030887, 29687545, 32520244, 35298621, 37627160, 37621460, 35350468, 31689145, 27394549, 24143699, 21821087, 20300381, 19363045, 18626179, 18178019, 17540713, 16815680, 16791817, 16822761, 16835866, 16844414, 16900442, 16563948, 16443234, 16511493, 16701177, 16514206, 16226775, 16078016]
5794A6078016n01439l77157o75901l86861o36865n94259o41816r2974j21075n76711
5784A1472958r1648k65583J48828j81855o8724j56318K44186L96080n2150J21963
5774A1567737K34473O67011J45235k63401J05496J33628j87417p5298L16668O1883
5764A2706015j08104l7120M5866l50887o94655M27672l15121m07434K59067j67490
5754A1357809R1554n26655N78589L68911N14529M20175J52156O04947J04691L70286
5744A4036992O0555m27047R1205O8146j17047j34858J30165J74385K55567l40271
5734A3797792k63031k50377l91045l80881j79237j96958j1904j45090n18182k14890
5724A1246197K66608m32778J28219L51883L95487K05898j88723m56479M5392R8889
$$ y = [16078016, 15576577, 15199420, 14523519, 14136658, 13499793, 12905534, 12263718, 12170744, 12049669, 11472958, 11381310, 11115727, 11264555, 11082700, 11013976, 10857658, 11101844, 11497924, 11445774, 11567737, 11802210, 12469221, 12614456, 12351055, 12456551, 12590179, 12402762, 12327464, 12644132, 12706015, 12597911, 12560791, 12606657, 12255770, 11561115, 11988787, 11673666, 11266232, 11525299, 11357809, 11449363, 10922708, 11501297, 11870208, 12384737, 12804912, 12957068, 13562015, 13666706, 14036992, 14097547, 13670500, 13761705, 13829851, 13712804, 13577946, 13708111, 13882496, 14138063, 13797792, 13534761, 13284384, 12893339, 12512458, 12333221, 12136263, 12124359, 11979269, 11461087, 11246197, 11512805, 11080027, 11208246, 11560129, 11955616, 12161514, 11972791, 11516312, 11561704, 11660593]
5714A1660593m11513l9900m9880L44077O22209o0232k47794k3019N8424k48314
5704A1604651m25925k93216l27898j5146l23788J0721m17735N9618m03278j07469
5694I360535k30042P2100J99680k27431k09978k81128j3708k08945J44736K76359
5684H882178j93202j53685R3228O29061k76065m55058q5664l10100j82380P04636
5674H652949L05829j6917J96488p35420k16766K08157n76355o3713O3192l90263
5664G427181j39531k55335J49772q8135N06972O57852l49825M17164L35878M236
5654H666229J79136J01583L6590l598J74676M56036j06558l15602n4473k10301
5644H923718n1213k00638l57409J9845J043l92071K16330k0879m88161O5746m94847
$$ y = [11660593, 11249080, 11209180, 11159300, 11503377, 12125586, 12065354, 11817560, 11794541, 11852965, 11604651, 11178726, 10885510, 10557612, 10542466, 10218678, 10229399, 9811664, 9871282, 9468004, 9360535, 9130493, 9202593, 9402273, 9174842, 8964864, 8683736, 8670028, 8461083, 8605819, 8882178, 8688976, 8535291, 8628519, 9257580, 8981515, 8526457, 8440793, 8130693, 7948313, 8652949, 8958778, 8941861, 9138349, 8402929, 8186163, 8394320, 7817965, 7754252, 7817444, 7427181, 7287650, 7032315, 7182087, 7093952, 7600924, 8258776, 7908951, 8326115, 8661993, 8666229, 8845365, 8946948, 8983538, 8979940, 9154616, 9610652, 9504094, 9188492, 9134019, 8923718, 8872505, 8671867, 8314458, 8334303, 8335346, 7943275, 8159605, 8138726, 7650565, 7716311, 7221464]
5633G221464J13874k8454M11292L28516J68613q7456k53946l5188m94M68486J11093
5622H417800L15807k865j50262j50212l26288k18600L8475L9542K51420J07660
5612H322477R8626J01179n28796L07337L5952Q5851K69664O7576L97786j30608
5602I027044P6588k20773L65197N76670j28365m54124J98418O13144L38930J35212
5592A0527941J44916N11758O16708N95467Q12233O69785M77704Q58614Q89970
5583A6105096R29186R77810N47532J228744J843199J977320K121216K665390L500702
5574C1896195L840476M172881M412360L731963O73086l231384o105112o486917
5566C2903548m819991l723164k186017j427310n49116r53895q58312m73937j64010
$$ y = [7221464, 7335338, 7306884, 7718176, 8046692, 8215305, 8127849, 7873903, 7838715, 7838221, 8306707, 8417800, 8733607, 8730742, 8580480, 8430268, 8103980, 7885380, 7923855, 7963397, 8214817, 8322477, 8421103, 8522282, 7993486, 8300823, 8336775, 8422626, 8692290, 8759866, 9157652, 9027044, 9103632, 8882859, 9248056, 9824726, 9696361, 9242237, 9440655, 10053799, 10392729, 10527941, 10672857, 11184615, 11801323, 12396790, 13209023, 13878808, 14356512, 15215126, 16105096, 17034282, 18012092, 18559624, 19788368, 21631567, 23608887, 25730103, 28395493, 31896195, 35736671, 39909552, 44321912, 48053875, 48726961, 45495577, 39390465, 32903548, 28083557, 24360393, 22174376, 20747066, 20197950, 19244055, 18385743, 17911806, 17747796]
5557A7747796l08153o59543o75584l19631m00213k59556j88396j79648l86023
5548A4371049L68666N62147K69287M02645L46935P74783N51824O67632o72198
5539A7642770j211250q53573j326091q66634l88760l94836j29143J17564k26003
5530A2364044m79779m75517k59493j54341k92884j75506l35151m10506k48606
5521I532261j32421L25060j10287n47791j87534j64941L78224j55718M3681k90150
5511H690384K01887K42132J50096l26566k26029L87536Q5925L87638J38376Q0226
5501I811605K55276O22056M84819J46347K39158j01992J68516R82827N33236L72883
5491A3514731P75704P03720P05709j35365l27818l95559j011647p42318p46736
$$ y = [17747796, 17439643, 16780100, 16104516, 15784885, 15384672, 15125116, 14936720, 14757072, 14371049, 14739715, 15301862, 15571149, 15973794, 16320729, 17095512, 17647336, 18314968, 17642770, 16431520, 15577947, 14251856, 13385222, 12996462, 12601626, 12472483, 12590047, 12364044, 11884265, 11408748, 11149255, 10994914, 10702030, 10526524, 10191373, 9780867, 9532261, 9399840, 9724900, 9614613, 9066822, 8879288, 8714347, 9092571, 8936853, 8980534, 8690384, 8892271, 9134403, 9284499, 8957933, 8731904, 9119440, 9205365, 9593003, 9731379, 9811605, 10066881, 10688937, 11173756, 11320103, 11559261, 11457269, 11625785, 12608612, 13141848, 13514731, 14290435, 14994155, 15699864, 15564499, 15236681, 14841122, 13829475, 13087157, 12340421]
5482A2340421n92568L99870l06417M2316p5094Q6488j04998L41508M53487j05502
5472A2479511L31508r7738N93834M82494N62572J094798J053680J119901J308788
5463A8929348R34575J537137J649456K71707n5277q64159j960246j559216j830153
5454A7053172j714163r78654l35762m75784m62770r4207K0607K07385l57813j21452
5444A2740559J05204O00681j11311R9736J08661M11892N14108K14225J439870
5435A6123625K87663Q53355O53278N92012J42377m03899j275077j278295p79926
5426A4915113l36054m64383p85261j53981j45126m3218J64797l23549J27330N05429
5416A3461097J90590p7546J21726J3481J54942K65535J62863M18615k57228M4676
$$ y = [12340421, 11747853, 12147723, 11841306, 11883622, 11808528, 11895016, 11790018, 12131526, 12585013, 12479511, 12811019, 12713281, 13307115, 13789609, 14352181, 15446979, 16500659, 17620560, 18929348, 19863923, 21401060, 23050516, 23322223, 23266946, 22402787, 20442541, 18883325, 17053172, 15339009, 14360355, 14024593, 13548809, 13086039, 12991832, 13012439, 13219824, 12862011, 12740559, 12845763, 13446444, 13335133, 13434869, 13543530, 13955422, 14469530, 14683755, 16123625, 16411288, 17264643, 17917921, 18509933, 18652310, 18248411, 16973334, 15695039, 14915113, 14579059, 14114676, 13329415, 13175434, 13030308, 12987090, 13151887, 12828338, 12955668, 13461097, 13651687, 13574141, 13695867, 13709348, 13864290, 14129825, 14292688, 14711303, 14454075, 14498751]
5406A4498751m73276L28549J89726k20058L55435M65822K48872M27875N43974
5397A6365670M60202O6166K90773O53116Q24461J044415R32987J014658J182879
5388B2835327J378353J106602J112858J194397O04830R7438j35099o14695n10916
5379B7069095n39429j15932O5355Q47172J113666J651766J472871J393583K179831
5370C5137978K426095K302348K961914L976925M644625M944832M772082N975519
5362F7142318O233074N958577M226313J431329j056911l364460m650259n575036
5354G0344945n942735n095695m044998k290412j133980j042866j60186K70786
5346E0904859R94988K099244J966169L048562L885343M892183N555401O287341
$$ y = [14498751, 14025475, 14354024, 14543750, 14323692, 14679127, 15144949, 15393821, 15821696, 16365670, 16825872, 16892038, 17182811, 17835927, 18660388, 19704803, 20637790, 21652448, 22835327, 24213680, 25320282, 26433140, 27627537, 28232367, 28329805, 28194706, 27580011, 27069095, 26529666, 26413734, 26479089, 27326261, 28439927, 30091693, 31564564, 32958147, 35137978, 37564073, 39866421, 42828335, 46805260, 51449885, 56394717, 61166799, 67142318, 73375392, 79333969, 83560282, 84991611, 83934700, 80570240, 75919981, 70344945, 64402210, 59306515, 55261517, 52971105, 51837125, 50794259, 50634073, 50904859, 51899847, 53999091, 55965260, 59013822, 62899165, 67791348, 73346749, 79634090]
5338G9634090P818435Q726791R414863J0945598J0461669R138481M475960k109889
5330A38505998p260886j1153493j2209585j2317905j0783730r154830p322077
5323F8303492n167018l810579k722010k079123j261913o79039j036584L2420R21633
5314E2501279J203115K171735K497591K969112L664819M609406M990946N016995
5306G9624998M773988L975614R81519j587049m346435o422319o400404p479853
5298F3120059p151750n743494m453254l255973k502071j853119j685467j369186
5290C5105745j129818j674897j560305j040534o06903p03958n43890k76524o4114
5281B7504802J02599l64604J91394P13339O6655N61221N18447K48720J18110p10845
$$ y = [79634090, 87452525, 96179316, 105594179, 116539777, 127001446, 136139927, 140615887, 138505998, 131245112, 120091619, 107882034, 95564129, 84780399, 75625569, 68303492, 63136474, 59325895, 56603885, 54524762, 53262849, 52583810, 51547226, 51579646, 52501279, 53704394, 55876129, 58373720, 61342832, 65007651, 69617057, 74608003, 79624998, 84398986, 88374600, 89356119, 87769070, 83422635, 77000316, 70599912, 63120059, 55968309, 50224815, 45771561, 42515588, 40013517, 38160398, 36474931, 35105745, 33975927, 32301030, 30740725, 29700191, 29093288, 28389330, 27845440, 27568916, 27504802, 27607401, 27242797, 27434191, 28147530, 28214185, 28775406, 29293853, 29542573, 29660683, 28949838]
5271B8949838j434390j379312j102735l90427o75422q36784J29625L70130L24930
5262B3955453J26749j63838L16711j08802n1932L55707J92977Q87612J089303
5253B6599940M20190R0582j124524k034639j460810o58908p84789n72501m58778
5244B0015763m97582r2818n7641N7137l5148q15680l83889n65648r61263m81477
5234A6181754k32047n60234l99957q50610n79274j90943o21314l54259k45371
5225A2147745K4982j09630k01641l00086j79086j69903q3174K45420R47j28768
5215A1246806J95092J79428k80815m34713J07013k05534o86737k54612m68969
5206I396959j44937l05587l10568j69794q01828j78764J53747L72196q4815n77943
$$ y = [28949838, 27515448, 26136136, 25033401, 24642974, 23967552, 23130768, 23260393, 23630523, 23955453, 24082202, 23918364, 24235075, 24126273, 24074341, 24430048, 24623025, 25510637, 26599940, 27020130, 27110712, 25986188, 23951549, 22490739, 21831831, 21047042, 20474541, 20015763, 19518181, 19425363, 19367722, 19424859, 19389711, 18574031, 18190142, 17624494, 16663231, 16181754, 15949707, 15389473, 14989516, 14138906, 13559632, 13368689, 12747375, 12393116, 12147745, 12172727, 12063097, 11861456, 11561370, 11382284, 11212381, 11129207, 11374627, 11375574, 11246806, 11441898, 11621326, 11340511, 10905798, 11012811, 10807277, 10120540, 9865928, 9396959, 9252022, 8946435, 8635867, 8466073, 7664245, 7485481, 7639228, 8011424, 7926609, 7348666]
5196G348666j20503j41855r3091Q052L8514m3476l58484j22368l71137L78690
5186F523008K01101N2081l03345k45924k31856l29702l17564j83633j28328R1989
5176E127827L12030Q1931k96640j96424K66714k8327j97764j35012O6317l4090
5166D966562j33237M0707K66120n7079R3232Q2481n92581L83380M92473k37622
5156E304436Q5545k94826K53195O4237J58519j17222j97871k83046j05127j167
5146D866673k9603O5008J07513k87183Q2314O3021k44394j90533l0158N2132l12151
5135D142639M37695K0669k48884o4189k639j92382J21709J35776L67175O4466
5125D782035l17902k18203k54196J72376M27444o8479K17001q7462l0346k58177
$$ y = [7348666, 7228163, 7086308, 6993217, 7001269, 7039783, 6996307, 6637823, 6515455, 6144318, 6523008, 6724109, 6776190, 6472845, 6226921, 5995065, 5665363, 5347799, 5164166, 5035838, 5127827, 5439857, 5521788, 5225148, 5028724, 5295438, 5267111, 5069347, 4934335, 5000652, 4966562, 4833325, 4874032, 5140152, 5083073, 5176305, 5258786, 4666205, 5049585, 5542058, 5304436, 5389981, 5095155, 5348350, 5412587, 5571106, 5453884, 5256013, 4972967, 4867840, 4866673, 4837070, 4902078, 5009591, 4722408, 4804722, 4867743, 4623349, 4432816, 4402658, 4454790, 4142639, 4580334, 4601003, 4352119, 4287930, 4285291, 4092909, 4214618, 4350394, 4717569, 4782035, 4464133, 4245930, 3991734, 4164110, 4591554, 4523075, 4740076, 4652614, 4622268, 4364091]
5115D364091k7877L87546L80504J52035O7388M069K03235j17555K1960k81044
5105E154352l42579l95873j60078k80110j7051k04490K4519j14412J6731J91795
5095C872804M69748J35609n7108o03051m28883Q5089K29184j47601o6166J92119
5085C681744l1800J12200K45053Q838K07254K59599K8075q352n57425j14930k40512
5074C589744K85432k80302k73107j38511r801j32695K29750k63469M3432r0808
5064B959665N5610j78229J07317j40491J87122m52387q9804N5613l21438l80256
5054A802722K38204M11765J39953j78188o8405k75938J07909J23001j75412N77474
5044B703085M12005k0451j70217m00482J64470J72229k57418N6963J34183p2040
$$ y = [4364091, 4336214, 4723760, 5104264, 5256299, 5323687, 5327756, 5530991, 5413436, 5435396, 5154352, 4811773, 4415900, 4255822, 3975712, 3958661, 3754171, 3778690, 3664278, 3681009, 3872804, 4342552, 4478161, 4421053, 3818002, 3389119, 3474208, 3703392, 3555791, 3489625, 3681744, 3649944, 3762144, 4007197, 4016035, 4223289, 4482888, 4510963, 4502611, 3945186, 3830256, 3589744, 3875176, 3594874, 3321767, 3183256, 3173455, 3040760, 3270510, 3007041, 3050473, 2959665, 3015275, 2837046, 2944363, 2803872, 2990994, 2538607, 2448803, 2504416, 2182978, 1802722, 2040926, 2452691, 2592644, 2414456, 2346051, 2070113, 2178022, 2301023, 2125611, 2703085, 3115090, 3094639, 2924422, 2523940, 2688410, 2860639, 2603221, 2660184, 2794367, 2722327]
5034B722327k17271j93171M15120l45645j63696k5724m6168P9499j04787p0611
5024B049873N7016O717K42961J70595k78940J04999O2746K17818K69786j44277
5014B759294O3295M3269n4362n5316k3094j33060k44225l92213j46689L39591
5004B156490K45131L44076n21399J0267K96633R7046P6012l20091k43191J4705
4994B155679l62601j2486K13216J14247r4139J73330J47179k62855J69328j6919
4984B223979j68786L10806k87149k08580J96389L46879j84536l6818j96212n94830
4974A401142N52233M21191j40551J21938L066j91054J16461M4491K0206L93707
4964B742830r3989P0106K24530J22372M0019j16358m68646j51644J17326J14402
$$ y = [2722327, 2505056, 2311885, 2727005, 2381360, 2217664, 2191940, 2145772, 2225271, 2120484, 2049873, 2106889, 2113606, 2356567, 2527162, 2248222, 2353221, 2415967, 2633785, 2903571, 2759294, 2822589, 2865858, 2811496, 2756180, 2733086, 2600026, 2355801, 1963588, 1816899, 2156490, 2401621, 2745697, 2224298, 2234565, 2531198, 2628244, 2704256, 2384165, 2140974, 2155679, 1793078, 1780592, 1993808, 2108055, 2013916, 2187246, 2334425, 2071570, 2240898, 2223979, 2055193, 2365999, 2078850, 1870270, 2066659, 2413538, 2229002, 2192184, 1995972, 1401142, 1953375, 2374566, 2234015, 2355953, 2359019, 2167965, 2284426, 2328917, 2349123, 2742830, 2648841, 2718947, 2943477, 3065849, 3105868, 2989510, 2520864, 2369220, 2486546, 2600948]
4954B600948j98543K14422l43170n3428J30490j54135n7370K8614m9834K11652
4944B329646j52776k01593k84012j52422K52548L70574l30949J35637K23236L4126
4934B224015m255n0097N2870M7624k06649j61364K42974K48347J82511m30155
4924B145821K61070J12504j15589j38434k16637j48329p9180O8067l20392L97918
4914A966819L23897k82681j84324O310J49277L19586k10225m4371J6101N35996
4904B596385j00104M1527o8439J92612L3029J8788j65661n7332l8312L39786o8004
4893B724275m42676J7613J71803L05246j39050J03553r653K36293j75707K91730
4883C083427k25511K23392J94055J15451L2282K21102j54784L72585M68357M5354
$$ y = [2600948, 2402405, 2616827, 2273657, 2220229, 2350719, 2196584, 2139214, 2167828, 2117994, 2329646, 2176870, 1975277, 1691265, 1538843, 1791391, 2161965, 1831016, 1966653, 2189889, 2224015, 2219760, 2169663, 2222533, 2270157, 2063508, 1902144, 2145118, 2393465, 2575976, 2145821, 2406891, 2519395, 2403806, 2265372, 2048735, 1900406, 1821226, 1889293, 1568901, 1966819, 2290716, 2008035, 1823711, 1830021, 1979298, 2298884, 2088659, 2044288, 2060389, 2596385, 2496281, 2537808, 2469369, 2661981, 2695010, 2713798, 2548137, 2490805, 2452493, 2792279, 2724275, 2281599, 2299212, 2471015, 2776261, 2637211, 2740764, 2731111, 2967404, 2791697, 3083427, 2857916, 3081308, 3275363, 3390814, 3423096, 3644198, 3489414, 3861999, 4330356, 4375710]
4873D375710J54375N17817N37479O87668N29145P68366N81357J415203J137978
4864A0705098J210040J384430J438203O17534n16951j890218k036669j540844
4856I370623r81570j442822r17829l09580k23995l32407k82315l79937m33930
4847D066238p8732J19465j76039o8047j56024k0211k93145J68800K77445L9733
4837C879483j30614m64435P1440J24192l66287j14731N5249L03495p6953K99796
4827C580635L42187j22292M22701j60899P7794m12701j8921K1133j01479Q3404
4817C711562K47340k94779j1442J57373K36684J71495O2471L2077J18838j19331
4807D312288r0566j3116L35555k1693o28742n10185L59866M00362o9406r5138
$$ y = [4375710, 4530085, 5047902, 5585381, 6273049, 6802194, 7570560, 8151917, 9567120, 10705098, 11915138, 13299568, 14737771, 15355305, 14838354, 12948136, 10911467, 9370623, 8389053, 6946231, 6028402, 5718822, 5494827, 5162420, 4880105, 4500168, 4066238, 3987506, 4106971, 3930932, 3862885, 3706861, 3686650, 3393505, 3562305, 3839750, 3879483, 3748869, 3284434, 3355874, 3480066, 3113779, 2999048, 3054297, 3357792, 3280839, 3580635, 3922822, 3800530, 4223231, 4062332, 4140126, 3727425, 3708504, 3729637, 3628158, 3711562, 3958902, 3664123, 3652681, 3810054, 4046738, 4218233, 4280704, 4312781, 4431619, 4312288, 4221722, 4208606, 4544161, 4522468, 3893726, 3383541, 3743407, 4143769, 4074363, 3979225]
4797C979225k03525J3997J52250L73354k48763k5487P6301j33186J09230m4573
4787D048823J13727J54827j27273m00666J17787K98305J39059l91370M74594N7136
4777D484949k00154k70084k89091J64801N15926k2319j78929J39153j21094O1272
4767D284430J07767J13312J95774K26927l6111K5701r7928K00674k29589k10878
4757D580079K1677N4830J41517N94103N0887k51289J60734J46179k73287k21101
4747E004329M6640O6221M52543J66809j71656J79056K76218Q7587j22458r9009
4737E886280M68069L83063L82918k61738O2005r7773J39170J67582J58481K2912
4727G310969O6058J14767R3045N27105l55261k3197L74918J14160K76526k55450
$$ y = [3979225, 3775700, 3789697, 3941947, 4315301, 4066538, 4041051, 4117352, 3984166, 4093396, 4048823, 4162550, 4317377, 4190104, 3789438, 3907225, 4205530, 4344589, 3953219, 4427813, 4484949, 4284795, 4014711, 3725620, 3890421, 4406347, 4384028, 4205099, 4344252, 4223158, 4284430, 4392197, 4505509, 4701283, 4928210, 4892099, 4917800, 4819872, 5020546, 4790957, 4580079, 4601756, 4656586, 4798103, 5392206, 5443093, 5191804, 5352538, 5498717, 5225430, 5004329, 5050969, 5117190, 5569733, 5736542, 5564886, 5743942, 6020160, 6107747, 5985289, 5886280, 6354349, 6737412, 7120330, 6858592, 6920597, 6822824, 6961994, 7129576, 7288057, 7310969, 7377027, 7491794, 7584839, 8111944, 7756683, 7733486, 8108404, 8222564, 8499090, 8243640]
4717H243640J37718K63001m7944K13330N62313k9780K65533J10561M16282L32520
4707A0467174j79107j30284J17426l85823L03353N42812O54088L26031R01195
4698A2616865N61932N45569J32404j56201R93899N24388M05417M95033J019575
4689A7138881Q43006J360801J007726R40546J028961P85238P13137P80174L22232
4680B4920702J77410K08855P75751R63485J033060J602165J944285J895113J748197
4671C5269023K485373L106975K980756L684252M695810O207819O347008P379144
4663G2156160Q862192J0810534J2943797J4219855J5922325J7033090J7683266
4656A69631219J5701842Q840707k873911j7099644k4423375k3801424j9984014
$$ y = [8243640, 8381358, 8644359, 8596415, 8809745, 9372058, 9342278, 9607811, 9718372, 10134654, 10467174, 10288067, 10157783, 10275209, 9889386, 10192739, 10735551, 11389639, 11715670, 12616865, 13178797, 13724366, 13856770, 13700569, 14694468, 15218856, 15624273, 16119306, 17138881, 17981887, 19342688, 20350414, 21290960, 22319921, 23105159, 23818296, 24598470, 24920702, 25098112, 25306967, 26082718, 27046203, 28079263, 29681428, 31625713, 33520826, 35269023, 37754396, 40861371, 43842127, 47526379, 52222189, 58430008, 64777016, 72156160, 81018352, 91828886, 104772683, 118992538, 134914863, 151947953, 169631219, 185333061, 194173768, 191299857, 174200213, 149776838, 125975414, 105991400]
4649A05991400j5602380j1998335r502490p431217o157513m926660m282602l990367
4641D2099836l297877k840585k199943k412668j913397j169112j105498j447976
4633B5712780j034653q37188j311263m07344j253708r04102o19672o53292p94301
4624A7897257n06060o56431q9923m15337q71360p43394l65258j50035n27405k20317
4614A3351737k34266m85077n93000L1047P6095n36465l01528l5487m14323p49395
4604A0109338K2745J60246l83943m89375j04866l3848o67856j09494j55497J98694
4594H546144J21011l58764L03094j70254n66336k59511K29634j22204J43178R6894
4584G962886p29294O9262J2393l86032j446l18451o7620k16625J80199N7826k72527
$$ y = [105991400, 90389020, 78390685, 68888195, 61456978, 55299465, 50372805, 46090203, 42099836, 38801959, 35961374, 33761431, 31348763, 29435366, 28266254, 27160756, 25712780, 24678127, 23840939, 22529676, 22122332, 20868624, 19964522, 19344850, 18691558, 17897257, 17391197, 16734766, 16644843, 16229506, 15358146, 14614752, 14249494, 14099459, 13572054, 13351737, 13117471, 12632394, 12039394, 12070441, 12146536, 11610071, 11308543, 11273056, 10858733, 10109338, 10132083, 10292329, 9908386, 9419011, 9314145, 9280297, 8612441, 8502947, 8347450, 8546144, 8667155, 8308391, 8611485, 8441231, 7874895, 7615384, 7845018, 7722814, 7865992, 7962886, 7233592, 7302854, 7315247, 6929215, 6927769, 6609318, 6541698, 6325073, 6505272, 6563098, 6290571]
4573F290571L66172J3420m97585k72939L29159k22659n3680J48826k19438j99049
4563E682798j40144j74473k0845M30067J43654k24896L5963l45628L44217l14573
4553E416140O9345j94260r345J9605j29656o71374r6270j07023L33474m1765K02200
4542D791071J30445k45191j25431K64275K37404k48288O9307j71960j65249k08294
4532D328089l85829K58659K15247J13148K02013j06083o7002k5811m02645J37954
4522D267740J02342p2988J30702K11761N9629n05729K95832k33563k03055J84868
4512D237539K65359j54645m82648L21151J69172Q7652l8651k68831N19341j06340
4502D549099j80757K64134N22303k11959j55624k39917J21921L79873K8573K82572
$$ y = [6290571, 6656743, 6670163, 6172578, 5899639, 6228798, 6006139, 5952459, 6101285, 5881847, 5682798, 5542654, 5368181, 5347336, 5777403, 5921057, 5696161, 5732124, 5386496, 5730713, 5416140, 5485485, 5291225, 5281880, 5301485, 5171829, 4500455, 4404185, 4297162, 4630636, 4588871, 4791071, 4921516, 4676325, 4550894, 4815169, 5052573, 4804285, 4873592, 4701632, 4536383, 4328089, 3942260, 4200919, 4416166, 4529314, 4731327, 4625244, 4558242, 4532431, 4129786, 4267740, 4370082, 4297094, 4427796, 4639557, 4699186, 4193457, 4489289, 4255726, 4052671, 4237539, 4502898, 4348253, 3865605, 4186756, 4355928, 4443580, 4404929, 4136098, 4655439, 4549099, 4368342, 4632476, 5154779, 4942820, 4787196, 4547279, 4669200, 5049073, 5077646, 5360218]
4492E360218N87K67578N42898K48417l456k30140m93638j81287Q0135k66956K37972
4481E562328K48705K35671j63619o89819K3896K51048K43510K75952K36695k48250
4471E976117j49708M38030N46785n20499j33743J99971j82514j7030L096j76453
4461E984052n00904L57760k61121j22568r7385N5439m26691J7664J51789n30873
4451D627162O03464j7683Q4097r3156j42434L11797K54674J16035l36600K41174
4441E648530k83088L52539k51063J00643P9686J93435m4323l11413K91858M27280
4431F204084K53697o9363J1875J33857O83566J42002O04154R2037M19318J52656
4421H627883M18196m22765k29888l71839l54115m4077j3497L48398j33424o16288
$$ y = [5360218, 5360805, 5628383, 6171281, 6419698, 6416242, 6186102, 5692464, 5511177, 5591312, 5324356, 5562328, 5811033, 6046704, 5883085, 5193266, 5217162, 5468210, 5711720, 5987672, 6224367, 5976117, 5826409, 6264439, 6811224, 6290725, 6156982, 6356953, 6174439, 6157409, 6160505, 5984052, 5483148, 5840908, 5579787, 5457219, 5359834, 5415273, 4988582, 5006246, 5158035, 4627162, 5230626, 5212943, 5297040, 5203884, 5061450, 5373247, 5627921, 5743956, 5407356, 5648530, 5365442, 5717981, 5466918, 5567561, 5647247, 5840682, 5796359, 5484946, 5776804, 6204084, 6457781, 6388418, 6400293, 6534150, 7217716, 7359718, 7963872, 8055909, 8475227, 8627883, 9046079, 8623314, 8393426, 8021587, 7667472, 7623395, 7609898, 7958296, 7824872, 7208584]
4411G208584n6038J29108L0350K66196J28827O14381K35315N4060l022O66032
4401I273793L12625M69743R06779L00819K78869J62189O60053P30161N6673m8329
4391A3103375n22426k12275o22221q85848m88188l11921n36760k33364R0889M13314
4381I794575o5689k54279K8471k71829r4612M24216m5495M16688L17995J87278
4371A0437319O51052Q9162k0154M89493M40217O11861j41344L61059j10605m07805
4361A2400255k54601n69414l89954j42913j202m47556j38846m2324J46582k54049
4351A0305978l54626j94236o7688l9489J57851J23850j84209m18108m09647J20277
4341I039953M08857k6858J82407n52482K49748L5126k52505j5302R3913M9374
$$ y = [7208584, 7152546, 7281654, 7312004, 7578200, 7707027, 8321408, 8556723, 8610783, 8607761, 9273793, 9586418, 10056161, 10962940, 11263759, 11542628, 11704817, 12364870, 13095031, 13151704, 13103375, 12580949, 12368674, 11746453, 10860605, 10372417, 10060496, 9523736, 9290372, 9381261, 9794575, 9728886, 9474607, 9503078, 9231249, 9136637, 9560853, 9515358, 9932046, 10250041, 10437319, 11088371, 11177533, 11157379, 11646872, 12087089, 12698950, 12557606, 12918665, 12808060, 12400255, 12145654, 11576240, 11186286, 11043373, 11042171, 10594615, 10455769, 10413445, 10560027, 10305978, 9951352, 9757116, 9689428, 9649939, 9807790, 9931640, 9747431, 9329323, 8919676, 9039953, 9448810, 9421952, 9604359, 9051877, 9301625, 9336751, 9084246, 9068944, 9162857, 9212231]
4331I212231k51463L27509m6914Q0376N1922l74784K73256K67098m39025r5883
4321I004323O8848J41171l5551m30120k52181J62184k15019j16850L00051J44385
4311H771241Q5521j66998Q0032L42542j91593j22186j70990l62887q4042k87783
4301G892857O47508L26100m80251N1388L94244J5477J04875K16581M59140J24317
4291I752236L00501q1031k08466J52447p1689K68530J73055K68689J24338K01072
4281A0879682N65248j73376J82760K23713o9482M99545K75109J15238K41529Q58894
4271A3598860N27844K45039J62843o0753P75232M72661J66382N48493P81746L66021
4261A7584368K75515J39791L14949M19466K54436R7552R10710Q04473N82800K92094
$$ y = [9212231, 8960768, 9288277, 9241363, 9321739, 9373661, 8998877, 9272133, 9539231, 9100206, 9004323, 9073171, 9214342, 9178791, 8748671, 8496490, 8658674, 8443655, 8326805, 8626856, 8771241, 8856762, 8689764, 8769796, 9112338, 8920745, 8798559, 8627569, 8264682, 8180640, 7892857, 8540365, 8866465, 8386214, 8437602, 8831846, 8847323, 8952198, 9168779, 9627919, 9752236, 10052737, 9971706, 9763240, 9915687, 9843998, 10112528, 10285583, 10554272, 10678610, 10879682, 11444930, 11271554, 11454314, 11678027, 11608545, 12108090, 12383199, 12498437, 12739966, 13598860, 14126704, 14371743, 14534586, 14473833, 15249065, 15721726, 15888108, 16436601, 17218347, 17584368, 17859883, 17999674, 18314623, 18734089, 18988525, 19086077, 19996787, 20801260, 21384060, 21676154]
4251B1676154M24637K16095n09966N8454K7830J95167J30646k6731L63095O6505
4241B2621886P8294p0764J12628P02524N17645O38535Q5368L6973K13912L56583
4231B5293584P61297M56511O90110P54218R00009P94507N91115P13491J117407
4222C2072249J722459N57841J285463J388996J171570J717960J083922J628359
4214D2628819K089228J745322J917793K394079J725675J667138J840138J772154
4206E7780346K637239K771658L206609L624936L921772L988502N075302N950523
4198H8956887O065106O752209P741441R130867J0706386J2359025J4404099J7154161
4190A73270181J9799632K3834459K8750115L2160487L3687313L3426758L3220696
$$ y = [21676154, 22100791, 22316886, 21806920, 21865374, 21893204, 22088371, 22219017, 22192286, 22555381, 22621886, 22700180, 22629416, 22742044, 23444568, 23962213, 24600748, 24686116, 24723089, 24937001, 25293584, 26054881, 26511392, 27201502, 27955720, 28855729, 29650236, 30241351, 30954842, 32072249, 33794708, 34352549, 35638012, 37027008, 38198578, 39916538, 41000460, 42628819, 44718047, 46463369, 48381162, 50775241, 52500916, 54168054, 56008192, 57780346, 60417585, 63189243, 66395852, 70020788, 73942560, 77931062, 83006364, 88956887, 95021993, 101774202, 109515643, 118646510, 129352896, 141711921, 156116020, 173270181, 193069813, 216904272, 245654387, 277814874, 311502187, 344928945, 378149641]
4183C78149641K8500625J6937541n881294l0430835m7481878n0239085m2449135
4176B47105580l2940924k4483878j8623880j4921125j2069895r912792q414401
4169A25738685o966613n926981m366435l457095k325937k053196j305709j273241
4161I8063478j135580q95510p17059l56616m13606p54439j413368j920479k681626
4152H7775195k099931j315707j077787j243235j452071j164065j242995j695046
4144G6484358j118574p65484j042660j100419o14023O419O6935L22565O19968
4135G2859085J699957J792544J807120K384278K350522K864507K070000N64071
4127H8392084j523623l051757m006044m151715k803810k325645k204220j811880
$$ y = [378149641, 406650266, 423587807, 417706513, 387275678, 339793800, 289554715, 247105580, 214164656, 189680778, 171056898, 156135773, 144065878, 134153086, 125738685, 118772072, 112845091, 108478656, 105021561, 102695624, 100642428, 99336719, 98063478, 96927898, 96032388, 95315329, 94958713, 94545107, 93790668, 92377300, 90456821, 87775195, 85675264, 84359557, 83281770, 82038535, 80586464, 79422399, 78179404, 76484358, 75365784, 74600300, 73557640, 72457221, 71843198, 71849617, 71916552, 72239117, 72859085, 74559042, 76351586, 78158706, 80542984, 82893506, 85758013, 87828013, 88392084, 86868461, 83816704, 79810660, 75658945, 72855135, 70529490, 68325270, 66513390]
4119F6513390j011349m37667l40996o96756n62735k68949j60173n72813n26219
4110F1935733q73761j096633r98396l70687k51852l61833j34097J1848k80648
4101E7579674n20371n68830j147492j515535j747758j367965j458913j395335
4093D7857475o95017o21299j024103m56022j2068p32722q78681r34397r93239
4084D1509927q36988q27801j289518o31929k61772m25968k253m67085j46540j63776
4074C6456297m68345l98584q16686l57013k90637r9389j36800J74148K83762k02525
4064C4144228l02422K8918p10031l02725K06797l36298K1023M06629J02155L6525
4054C3294799K26993Q66315M99365R68484R44160J131686R99708P87945L20308
$$ y = [66513390, 65502041, 65064374, 64723378, 64026622, 63463887, 63194938, 63034765, 62461952, 61935733, 61061972, 59965339, 58966943, 58596256, 58344404, 57982571, 57848474, 57860322, 57579674, 57059303, 56490473, 55342981, 53827446, 52079688, 50711723, 49252810, 47857475, 47162458, 46541159, 45517056, 45061034, 45048966, 44316244, 43437563, 42503166, 41509927, 40672939, 39845138, 38555620, 37923691, 37661919, 37235951, 37233698, 36766613, 36620073, 36456297, 35987952, 35589368, 34772682, 34415669, 34125032, 34025643, 33888843, 34062991, 34346753, 34144228, 33841806, 33870724, 33160693, 32857968, 33064765, 32728467, 32749490, 33156119, 33258274, 33294799, 33521792, 34388107, 34887472, 35855956, 36800116, 37931802, 38931510, 39719455, 40039763]
4045D0039763L43398n95888r83549p45449n61208k86381l60158Q6428m7387j3770
4035C6875799l08641J41294K15551j7380K52094O88231O31144N72890M20474R49946
4025D0421402J199655J305529Q90638J428830J155936R87780k41558j363264j777696
4016D4007252j658503j149798r72230p24917k55920K16377K03433L73193N77554
4007D0616441J085933J144971J118858K178210K434037J616681K181986K779358
3999E5156475K523930K206969L001441L660667M232344M559575L333199J499440
3991H0174040j624427m325625n449754n412158l842287l467750k180208j568540
3983E2303291p79247k87155k60120j7461k36647O57512J385267K097370J829209
$$ y = [40039763, 40383161, 39787273, 38803724, 38058275, 37497067, 37210686, 36850528, 36936956, 36889569, 36875799, 36567158, 36708452, 36924003, 36906623, 37158717, 37846948, 38478092, 39050982, 39471456, 40421402, 41621057, 42926586, 43817224, 45246054, 46401990, 47389770, 47148212, 45784948, 44007252, 42348749, 41198951, 40226721, 39501804, 39245884, 39462261, 39665694, 40038887, 40616441, 41702374, 42847345, 43966203, 46144413, 48578450, 50195131, 52377117, 55156475, 57680405, 59887374, 62888815, 66549482, 70781826, 75341401, 78674600, 80174040, 78549613, 74223988, 68774234, 63362076, 59519789, 56052039, 53871831, 52303291, 51524044, 51236889, 50976769, 50959308, 50722661, 51380173, 52765440, 54862810, 56692019]
3974E6692019K435345L432552L252621L701999N519361N793815O483894P486916
3966I4798522O445278M831136J894710l436313o532369p107927p272143o761104
3958G6859790n202656n103359m109167l303857k932468k573145j985050j041736
3950E0608352n53231p16807n69283K59079N92183J082117J797711K427491K618102
3941E7545714L278420L175215L384884L473882K239509J39207k884643m856917
3933F5495271n476425n203406m492015l415788k236758j758359j736375j226653
3925C9949492j319951o14626k31678m33204n85471n00370l75600n74572p80133
3916C4533887l22931M4473j44267J51815M38200J94015O86709M88258l4859q56180
$$ y = [56692019, 59127364, 62559916, 65812537, 69514536, 75033897, 80827712, 87311606, 94798522, 101243800, 106074936, 107969646, 104533333, 98000964, 90893037, 83620894, 76859790, 71657134, 66553775, 62444608, 59140751, 56208283, 53635138, 51650088, 50608352, 50055121, 49338314, 48769031, 49028110, 49620293, 50702410, 52500121, 54927612, 57545714, 60824134, 63999349, 67384233, 70858115, 73097624, 73236831, 70352188, 65495271, 60018846, 54815440, 50323425, 46907637, 44670879, 42912520, 41176145, 39949492, 38629541, 38014915, 37783237, 37350033, 36764562, 36264192, 35888592, 35314020, 34533887, 34210956, 34255429, 34111162, 34262977, 34701177, 34895192, 35581901, 36070159, 36035300, 35179120]
3906C5179120j467719j493383j157839j312070j192035j103732j056371m40913
3898B5955058o17378m74013n52926l51254J03014n21226p14944l38230m28883
3889B2059218l80330q82778j45307j01396j61340l44663j93561K77426J1614k58170
3879A9880713o82438J79934J86707m51985j42566j04001J8238j29132L80612l73308
3869A8762774k94094m84558l37422k61835M671n0951p7758r7483m39039J19833
3859A6844138K35506M7154L0937N1727M06576L20079l33346j48089K46987P420
3849A7709089o1248j84616N5015k36933k55058K47034J68862j57839r742j50785
3839A7123779j55734J69361J47101m64624L26623L18294p7961J9167J33630K79327
$$ y = [35179120, 33711401, 32218018, 31060179, 29748109, 28556074, 27452342, 26395971, 25955058, 25337680, 24863667, 24310741, 23959487, 24062501, 23541275, 22826331, 22488101, 22059218, 21678888, 20796110, 20650803, 20549407, 20388067, 20043404, 19849843, 20127269, 20138883, 19880713, 19198275, 19378209, 19564916, 19112931, 18970365, 18866364, 18884602, 18755470, 19136082, 18762774, 18468680, 17984122, 17646700, 17384865, 17389536, 17338585, 17260827, 17163344, 16724305, 16844138, 17079644, 17126798, 17157735, 17209462, 17616038, 17936117, 17602771, 17454682, 17701669, 17709089, 17647841, 17463225, 17518240, 17281307, 17026249, 17273283, 17442145, 17284306, 17274564, 17123779, 16968045, 17137406, 17284507, 16819883, 17146506, 17464800, 17386839, 17406006, 17539636, 17818963]
3829A7818963J51741O9155J55535p3313J99731L03716K61323K40684j37388m62626
3819A8527521m8420R5392K93141k33623l74615K85498k30979j31701j08808J77972
3809A8251378L33468P1573K34397L76079P1077L54256M93277o6378J65776J58239
3799B0443142L02154Q32033K35365K15187N35487K46514J15798N57040L4279O5110
3789B3582109O1768j0258M28657M29720J03212M51110M71794K28485N97015M63008
3779B6806620N13929O62945P78562Q32319O58892Q96019J212688R12083J662792
3770C4936849K105922J653055J903045K243887K065771J995152K625106K619268
3762E2148055K857158K642648K735893K254943K395998J635895J409936O78429
$$ y = [17818963, 17970704, 18039859, 18195394, 18122081, 18321812, 18625528, 18886851, 19127535, 18990147, 18527521, 18479101, 18574493, 18867634, 18634011, 18259396, 18544894, 18313915, 18182214, 18073406, 18251378, 18584846, 18656419, 18890816, 19266895, 19337972, 19692228, 20185505, 20119127, 20284903, 20443142, 20745296, 21577329, 21812694, 22027881, 22563368, 22809882, 22925680, 23482720, 23516999, 23582109, 23643877, 23633619, 24062276, 24491996, 24595208, 25046318, 25518112, 25746597, 26343612, 26806620, 27320549, 27983494, 28762056, 29594375, 30253267, 31149286, 32361974, 33274057, 34936849, 37042771, 38695826, 40598871, 42842758, 44908529, 46903681, 49528787, 52148055, 55005213, 57647861, 60383754, 62638697, 65034695, 66670590, 68080526, 68758955]
3754F8758955O74274J20j45348l48940m43542n53672q51908n88706j23831p60587
3744F5616815q15434q49602r01621j463383j312571j481220k408933k353485k475762
3735E1554804k193612k506334k239362k388597j429762k151467j639718j203001
3727C5802951j038140j180864j631883q30988j648318j123580n92648p38570n87437
3718B6430523m33508m03052l16533n33794n48822l22520k85772m87459R730Q3285
3708B3192078n16016l61491l41693k0701k59854J39050m84015l07406Q1715j91611
3698B0930056j29185l68347j7454q8347r1981j43510o72196m12438n4320l67686
3688A8584592P9613l37244j78150J36099k87446l80342l07395n8812j36667q4808
$$ y = [68758955, 69433229, 69433349, 69288001, 68939061, 68495519, 67941847, 67089939, 66501233, 66377402, 65616815, 64801381, 63951779, 63050158, 61586775, 60274204, 58792984, 56384051, 54030566, 51554804, 49361192, 46854858, 44615496, 42226899, 40797137, 38645670, 37005952, 35802951, 34764811, 33583947, 31952064, 31121076, 29472758, 28349178, 27756530, 27017960, 26430523, 25997015, 25593963, 25277430, 24743636, 24194814, 23872294, 23586522, 23099063, 23108793, 23192078, 22676062, 22314571, 21972878, 21952177, 21692323, 21831373, 21347358, 21039952, 21121667, 20930056, 20800871, 20432524, 20415070, 20326723, 20234742, 20091232, 19419036, 19006598, 18952278, 18584592, 18664205, 18326961, 18148811, 18284910, 17997464, 17617122, 17309727, 17250915, 17114248, 17029440]
3678A7029440j36053J43993k6358o3227k24496j4473O2991n9111J96771k59633
3668A6649844l91337J62691j57862q7021M80357K26085K0756k85183p3863J43155
3658A6687622l99359m7147k91833J26388M55788M817K55634J75037M78111Q60288
3648A8305346l47315l16307r2637j01563R0948K98834L4755K40541J17180J27199
3638A8356981j23928K00795J57185M31526N13053L12067K64868N50767Q83614
3629B1546928M71600O10709N51237O52255Q36750P41968O56402Q24060N88822
3620B7480731M26100K11110L58549k71549k51488L8284l01750m49328n96427o50054
3610B5994178n21321k06170j60364m25589L4580K42416j59808j56588J00564k09353
$$ y = [17029440, 16893387, 17037380, 17011022, 16947795, 16723299, 16708826, 16771817, 16712706, 16909477, 16649844, 16258507, 16421198, 16263336, 16176315, 16656672, 16882757, 16903513, 16618330, 16544467, 16687622, 16288263, 16241116, 15949283, 16075671, 16531459, 16536276, 16791910, 16966947, 17445058, 18305346, 17958031, 17641724, 17549087, 17447524, 17538472, 17837306, 17872061, 18112602, 18229782, 18356981, 18233053, 18433848, 18591033, 19022559, 19535612, 19847679, 20112547, 20663314, 21546928, 22018528, 22629237, 23180474, 23832729, 24669479, 25411447, 26067849, 26891909, 27480731, 27906831, 28117941, 28476490, 28204941, 27953453, 27991737, 27689987, 27240659, 26644232, 25994178, 25472857, 25266687, 25106323, 24680734, 24715314, 24957730, 24797922, 24641334, 24741898, 24532545]
3600B4532545N89719O55047K68420K4230J0407P71928K38897J98785K08865P05225
3590B8204068J027844L59036O38283R75803J340414J217708J325757J750782J784781
3581C8624476J589532K071448K935256K634895K810313L011686L474341L677587
3573F0829534M150575M290330L708662L745219L637035L658563K922058K494991
3565H9436967J338754N31502O87038m61732j237936j014428r40726q14185k07993
3556H7317261m79226j152558l24014l887K1791N79995j22184J94362P8900m88026
3546H5622414n12539o92306j232299j887312j225838k301754l031745k603851
3538G2134770l092357l051766l050132l101790k838063k705724k477738k350908
$$ y = [24532545, 25122264, 25777311, 26045731, 26069961, 26080368, 26852296, 27091193, 27289978, 27498843, 28204068, 29231912, 29590948, 30229231, 31205034, 32545448, 33763156, 35088913, 36839695, 38624476, 40214008, 42285456, 45220712, 47855607, 50665920, 53677606, 57151947, 60829534, 64980109, 69270439, 72979101, 76724320, 80361355, 84019918, 86941976, 89436967, 90775721, 91307223, 91994261, 91532529, 90294593, 89280165, 88339439, 87525254, 87317261, 86838035, 85685477, 85361463, 85357576, 85379367, 85959362, 85837178, 86031540, 86110440, 85622414, 85109875, 84417569, 83185270, 81297958, 80072120, 77770366, 74738621, 72134770, 69042413, 65990647, 62940515, 59838725, 57000662, 54294938, 51817200, 49466292]
3530D9466292j953957k051157k474468j688774j700993j262091j257350j338775
3522C5738727r60387n35195j256052q03575n40474n26512q47098m72245m10534
3513B9386655j097957k20674q13170p654k79224N9971o09041J94765J72222j59000
3503B6626893j36369J84903K7435j53008P7231L10070L28900L16874K36673m2947
3493B7776655J85716J0300J85328j88028m29041k34787K21907n74033r54560q5876
3483B5913581n18893j067619m36834m9708m62112l61644p66326m51423k44450
3474B1554572m57681j02969j28872l88366l57830m44918K57116k57564j41602
3465A9531886M31972k6115j88243k63490o4460l77191J01389m10307L35618j90427
$$ y = [49466292, 47512335, 45461178, 42986710, 41297936, 39596943, 38334852, 37077502, 35738727, 34778340, 34243145, 32987093, 32183518, 31643044, 31116532, 30269434, 29797189, 29386655, 28288698, 28068024, 27254854, 27247200, 26967976, 27027947, 26418906, 26613671, 26785893, 26626893, 26490524, 26675427, 26702862, 26549854, 26627085, 26937155, 27266055, 27582929, 27819602, 27776655, 27962371, 27972671, 28157999, 27969971, 27540930, 27306143, 27528050, 26954017, 25999457, 25913581, 25394688, 24327069, 23890235, 23840527, 23378415, 23016771, 22250445, 21799022, 21554572, 21096891, 20993922, 20865050, 20476684, 20118854, 19673936, 19931052, 19673488, 19531886, 19963858, 19937743, 19749500, 19486010, 19421550, 19044359, 19145748, 18735441, 19071059, 18880632]
3455A8880632l14730k2073K32868L47054k39015L87631J51717N3379K82761M97598
3445B0257822M5233L43028q5123n20518M3218K40708k75061k88636M42515L88066
3435B0591252l747J33890L34617r3410K58495J63298R65078o4310Q1344K63921
3425B2630428K62751M79258J65997L72444N77326O60497J71996M53795P18243
3416B6492735O73119O39707M91948L93305K83238L15021J72887Q10610R3452M4555
3406C0410577J93373K10630O6645N14450M24307N09765K39652J77711L28473N77170
3396C3652753K08524l55597q3357l24732J23684o46329J84587l15701k94653K79508
3386C2428687P9935p0139j47279p1051K22657K33597M88592M49609N59171N03010
$$ y = [18880632, 18565902, 18543829, 18776697, 19123751, 18884736, 19272367, 19424084, 19477463, 19760224, 20257822, 20303055, 20646083, 20560960, 20040442, 20083660, 20324368, 20049307, 19760671, 20203186, 20591252, 20587505, 20721395, 21056012, 20962602, 21221097, 21384395, 22349473, 22285163, 22366507, 22630428, 22893179, 23372437, 23538434, 23910878, 24488204, 25148701, 25320697, 25774492, 26492735, 27165854, 27805561, 28297509, 28690814, 28974052, 29289073, 29461960, 30272570, 30366022, 30410577, 30603950, 30814580, 30881225, 31395675, 31819982, 32329747, 32569399, 32747110, 33075583, 33652753, 33861277, 33505680, 33422323, 33097591, 33221275, 32574946, 32759533, 32443832, 32149179, 32428687, 32508622, 32438483, 32291204, 32220153, 32442810, 32676407, 33164999, 33614608, 34173779, 34676789]
3376C4676789O62296P69586L17550R30172R91228Q56843J042611J366927J487357
3367D3101359J306663J693697K226802K373203K256361K254389K532648K477163
3359F0222285K418183K163219K444441K144269K485174K650161J807016J473439
3351G7808187J857131J552523J574731J362950J129405J441749J443559J115890
3343H9286125J689468J592773J177220J190472J120798N42210N51088N54145K80732
3334I7985031j26562k89085m38198k1785L22190n86852k66472n80141l74095o18288
3324I5005743m46093p25511m41801l30214n11869p55803q43551j180509j211257
3315H8559135q95771j253966j694102j957471k316338k051121j746109k009970
$$ y = [34676789, 35339085, 36108671, 36426221, 37356393, 38347621, 39204464, 40247075, 41614002, 43101359, 44408022, 46101719, 48328521, 50701724, 52958085, 55212474, 57745122, 60222285, 62640468, 64803687, 67248128, 69392397, 71877571, 74527732, 76334748, 77808187, 79665318, 81217841, 82792572, 84155522, 85284927, 86726676, 88170235, 89286125, 90975593, 92568366, 93745586, 94936058, 96056856, 96599066, 97150154, 97704299, 97985031, 97858469, 97569384, 97131186, 97109401, 97431591, 96844739, 96578267, 95998126, 95624031, 95005743, 94559650, 93834139, 93392338, 93062124, 92550255, 91794452, 90950901, 89770392, 88559135, 87663364, 86409398, 84715296, 82757825, 80441487, 78390366, 76644257, 74634287]
3307G4634287j988775k346076k497128k007072j893556k176454j693633j321644
3299E8709949j455282j053131j085106o75451q56525p25578p03961n22244k20922
3290E1411749m78093k39096K24159O5623k2844O5967N90533K98107R16386P65044
3280E3597535K40475N00831M77056P90118J080986P47467L93593P99925J303197
3271E9931183R60204J396374R31855J096868J596313J869561J917485K123936
3263G1823779J930132K040034K067643J264815J344659P58946j17222p34810r37814
3254G9440162j898139k104072k810213k365542k245263k961565k600688j451255
3246F1003425j829245j566689j391220j620337j331170j059408o18190o76076
$$ y = [74634287, 72645512, 70299436, 67802308, 65795236, 63901680, 61725226, 60031593, 58709949, 57254667, 56201536, 55116430, 54440979, 53584454, 52858876, 52154915, 51632671, 51411749, 50933656, 50694560, 50918719, 50984342, 50961498, 51027465, 51617998, 51916105, 52832491, 53597535, 53838010, 54338841, 54815897, 55606015, 56687001, 57434468, 57828061, 58627986, 59931183, 60891387, 62287761, 63219616, 64316484, 65912797, 67782358, 69699843, 71823779, 73753911, 75793945, 77861588, 79126403, 80471062, 81230008, 81112786, 80377976, 79440162, 77542023, 75437951, 72627738, 70262196, 68016933, 65055368, 62454680, 61003425, 59174180, 57607491, 56216271, 54595934, 53264764, 52205356, 51587166, 50911090]
3238E0911090r36755m65494n66282k21340j17072m84030m02293k21398n756j00624
3228D7390046l23273K52254J54422L11825J1741M97280O95035K58394P02465O26796
3218E0576985n9599K85399M19859r040L2595J58722P6974O5734M43900O32170
3208E2623699Q57999P13894J141195J693148J697318J510023J723096J756321
3200F3716693K279405L094270L131747L052718L460619L894266L947154L574770
3192I0151642K300382K314025K132567K137234L061687L690410L942973M395605
3184A14126525M850285M877350N113960N697782N301899N372385N033085N076494
3176A55449765N617340N488868N761620O814504Q019783R088097J1107605J3804820
$$ y = [50911090, 49974335, 49508841, 48942559, 48721219, 48604147, 48120117, 47717824, 47496426, 47490670, 47390046, 47066773, 47319027, 47473449, 47785274, 47797015, 48294295, 48989330, 49247724, 49950189, 50576985, 50517386, 50802785, 51222644, 51213604, 51246199, 51404921, 51481895, 51547629, 51991529, 52623699, 53481698, 54195592, 55336787, 57029935, 58727253, 60237276, 61960372, 63716693, 65996098, 69090368, 72222115, 75274833, 78735452, 82629718, 86576872, 90151642, 92452024, 94766049, 96898616, 99035850, 102097537, 105787947, 109730920, 114126525, 118976810, 123854160, 128968120, 134665902, 139967801, 145340186, 150373271, 155449765, 161067105, 166555973, 172317593, 179132097, 187151880, 196239977, 207347582, 221152402]
3168B21152402J7896136K2238242K5397093K7573996L2647079L4404093K6278435
3161D07587476N149976k8085112n2022829m9775124l8119216k6503312j8393773
3154A99838086j3085854r638353q369036o795194n272163l561036j669690N7229
3146A51503989J918790M707122O307742Q270993J0828522J3764367J7467678K1536661
3138B36305864K4356435K7880310L2735702L3322062K1569135k737313l7016002
3131C36416193n1839690m5223728l4681763k3503035j7033876j2597534j1265096
3124A40271471r695096q212778p237004o888925o449398o306524n751098n145829
3116H4584819m020798l471537k893310k340352k401230k509512k144598j812394
$$ y = [221152402, 239048538, 261286780, 286683873, 314257869, 346904948, 381309041, 407587476, 412737452, 384652340, 332629511, 282854387, 244735171, 218231859, 199838086, 186752232, 177113879, 168744843, 161949649, 156677486, 153116450, 151446760, 151503989, 153422779, 158129901, 164437643, 172708636, 183537158, 197301525, 214769203, 236305864, 260662299, 288542609, 321278311, 354600373, 376169508, 373432195, 336416193, 284576503, 239352775, 204671012, 181167977, 164134101, 151536567, 140271471, 130576375, 122363597, 115126593, 108237668, 101788270, 95481746, 89730648, 84584819, 80564021, 77092484, 74199174, 71858822, 69457592, 66948080, 64803482, 62991088]
3108F2991088j906261j551760j422699j586247j114190j231169j007885q56342
3100E2314535m18158l65370q24716p18973Q7732l47107o99917m05349j231031
3091D7391646k055639k059369j885683k112361j247764p82070q18547j365012
3083C5065201o33037q32664n78759k45694n01168r23389o24366o82782q68462
3074B9174880o47329m72749q0558k61590o25429p49298n27713J48356q4260K71535
3064B6145845n58669m94302n05408k63389n773m23528m56746m91554J88985l2283
3054B3103178J30950k14584l62764n31849j97516j88311o7924j44174m15298l39419
3044B0772289j24855k11797n09360n26570K77485p3231k07163j18245l34851m61093
$$ y = [62991088, 61084827, 59533067, 58110368, 56524121, 55409931, 54178762, 53170877, 52314535, 51896377, 51531007, 50706291, 49987318, 50075050, 49727943, 49028026, 48622677, 47391646, 45336007, 43276638, 41390955, 39278594, 38030830, 37248760, 36430213, 35065201, 34432164, 33599500, 33020741, 32775047, 32273879, 31350490, 30726124, 30043342, 29174880, 28527551, 28054802, 27974244, 27712654, 27087225, 26337927, 25810214, 25958570, 25874310, 26145845, 25587176, 25092874, 24587466, 24324077, 24318304, 23894776, 23438030, 22946476, 23135461, 23103178, 23234128, 23019544, 22656780, 22124931, 21927415, 21739104, 21671180, 21527006, 21111708, 20772289, 20647434, 20435637, 19926277, 19399707, 19677192, 19603961, 19396798, 19278553, 18943702, 18482609]
3034A8482609P3787k76857p3383K54003M69816n4833k34197K9268j01907k86083
3024A8282223l858K87068L2747J44188K6442L5305J75754K91295j00021n32878
3014A8638265r1874K34311M58370M00960j50113k11544K43945J60323J75672O9274
3004A9927589n7716K65728P9938J38297O83404Q67571k3746P3725M67402O49537
2994B3071729r518J02056J82067K08250j31246L58778M66646L95535J45444L73368
2984B5163109P31167P35230O17553J30949L36635L1871j55272K68558Q03095J038765
2974B9701660R0400J72089M03326L31065N04061M32087Q11335O24420K94114R55317
2964C4319874J068095P86122J147283J079445O86543O59016N80121L71350K00832
$$ y = [18482609, 18556396, 18279539, 18206156, 18460159, 18929975, 18875142, 18640945, 18670213, 18568306, 18282223, 18278365, 18565433, 18598180, 18742368, 18768810, 18804115, 18979869, 19271164, 19171143, 18638265, 18546391, 18780702, 19239072, 19640032, 19489919, 19278375, 19522320, 19682643, 19858315, 19927589, 19869873, 20135601, 20215539, 20353836, 21037240, 21904811, 21881065, 21954790, 22422192, 23071729, 23062211, 23164267, 23346334, 23554584, 23423338, 23782116, 24248762, 24644297, 24789741, 25163109, 25894276, 26629506, 27247059, 27378008, 27714643, 27746514, 27591242, 27859800, 28662895, 29701660, 29792060, 29964149, 30367475, 30698540, 31202601, 31634688, 32446023, 33070443, 33364557, 34319874, 35387969, 36174091, 37321374, 38400819, 39087362, 39746378, 40326499, 40697849, 40898681]
2955D0898681Q0370L19604N82592N62396L42790J255435P94619O58706J282455
2946D6777648J396832J436246J267279J334693J885076J940419J887213K064279
2938E9989685K279272K811522K703589L340763L555172M042819M391457M719443
2930H7833722N216960N745579P155753P390300Q074010R351880R921171J1140382
2922A51829757J2370965J3525428J4918540J5670314J6496674J7173183J6784127
2915B58768988J5166604J1643102N211253l135324j0689329j6780603j9468013
2908B40716678j9028717j7293024j4434016j1826289r989535r158853r461576
2901A49524668j0457532r963094r104690p853187o964386n322090m469291m166753
$$ y = [40898681, 40979051, 41298655, 41881247, 42443643, 42786433, 44041868, 44836487, 45495193, 46777648, 48174480, 49610726, 50878005, 52212698, 54097774, 56038193, 57925406, 59989685, 62268957, 65080479, 67784068, 71124831, 74680003, 78722822, 83114279, 87833722, 93050682, 98796261, 105952014, 113342314, 121416324, 130768204, 140689375, 151829757, 164200722, 177726150, 192644690, 208315004, 224811678, 241984861, 258768988, 273935592, 285578694, 290789947, 287654623, 276965294, 260184691, 240716678, 221687961, 204394937, 189960921, 178134632, 168145097, 158986244, 149524668, 139067136, 129104042, 119999352, 112146165, 105181779, 99859689, 95390398, 91223645]
2893I1223645l812520l897832l496468k917176k425814k134076k801885k226678
2885F7511196k448235k121445k105675k196138j834637k126929j526287j473728
2877E1678122j250796j155834j672728j735376j489354j417699j063471j071060
2869D0821804j039591j447902q89864p04619n40716r02140m24265m29730k04238
2860C4238739m72766m10361j1725k18425j817O7863q8661L63686L42124M01358
2850C4210015L898J09777K1782m18187q05638q76807r50173j099052q37198o77383
2840B8681034j081542j184623p21910p55940q30434j087665j027517n20448k04194
2831B1266761m15386j46737k55353j09445n23157n50597J05363j30931K47467
$$ y = [91223645, 87411125, 83513293, 80016825, 77099649, 74673835, 72539759, 69737874, 67511196, 65062961, 62941516, 60835841, 58639703, 56805066, 54678137, 53151850, 51678122, 50427326, 49271492, 47598764, 45863388, 44374034, 42956335, 41892864, 40821804, 39782213, 38334311, 37444447, 36739828, 36199112, 35296972, 34872707, 34442977, 34238739, 33765973, 33355612, 33343887, 33125462, 33123645, 33191508, 33102847, 33466533, 33808657, 34210015, 34213913, 34323690, 34345472, 33927285, 33121647, 32244840, 31294667, 30195615, 29358417, 28681034, 27599492, 26414869, 25692959, 24937019, 24106585, 23018920, 21991403, 21470955, 21266761, 20851375, 20704638, 20449285, 20339840, 19816683, 19266086, 19371449, 19240518, 19487985]
2822A9487985k26444n93017j10577m29585j75998R9805m58259o31407n65562n58274
2812A5838667l05588m44099n17721l66523q5486k56281k05443l57621l50027n54381
2802A2395497n08966l85606k02888k08753O1373l35772l22652J14427k16415Q41
2792A0391086k93762n62556J18917J25802q05360l14112L03596j77439r4641J91942
2782H883473k09211j19526q0043j50694Q963k62253r8426j79334P846j95450n856
2771G599489j18586k5466J35899N4049k97022j63811m37422k1193j29615j03762
2761F492560q9271J20175j71814j48044J50735j35376J3449l13224q5570J73605
2751F007225j69146j65768j9199K83433L5050j40991k88700j08523j81329j34720
$$ y = [19487985, 19261541, 18668524, 18557947, 18128362, 17952364, 18052169, 17593910, 16962503, 16396941, 15838667, 15533079, 15088980, 14571259, 14204736, 14119250, 13862969, 13657526, 13299905, 12949878, 12395497, 11886531, 11500925, 11298037, 11089284, 11150657, 10814885, 10492233, 10606660, 10390245, 10391086, 10097324, 9534768, 9653685, 9779487, 8974127, 8660015, 8963611, 8786172, 8691531, 8883473, 8674262, 8554736, 8474693, 8323999, 8332962, 8070709, 7972283, 7792949, 7800795, 7605345, 7599489, 7480903, 7455437, 7591336, 7645385, 7348363, 7184552, 6747130, 6725937, 6596322, 6492560, 6403289, 6523464, 6351650, 6203606, 6354341, 6218965, 6232414, 5919190, 5833620, 6007225, 5838079, 5672311, 5653112, 5936545, 5971595, 5830604, 5541904, 5433381, 5252052, 5117332]
2741E117332L33185l79467J96693k32123K43478n0912j54345K72216J63394l25827
2731E183624m21322J26458j18534l6743L4183l64007Q0159J53607n7116n7910
2721D522399j77890m13704J5876j90437p1954j52093M97820K68351k23430J75904
2711D250842l24306l09976K98796k28936j43094J82412l9566L77430J06500r6911
2701D073191L14125l63080k16111L16890n46504J30069p4260K26290J40908m83090
2691C518428m7838J28468K48o6194K01832l8461k789j53489q6862k02823j55447
2680C095073K98722k3825K48260j17407m56350J15690J40304r6797J01718J99262
2670C504650J3927j22366O3385J95648k4534K13050k17805l2323J24159k57874
$$ y = [5117332, 5450517, 5071050, 5267743, 5035620, 5279098, 5228186, 5073841, 5346057, 5509451, 5183624, 4762302, 4888760, 4770226, 4733483, 4767666, 4403659, 4483818, 4637425, 4580309, 4522399, 4344509, 3930805, 3946681, 3756244, 3684290, 3532197, 4030017, 4298368, 4074938, 4250842, 3926536, 3616560, 3915356, 3686420, 3543326, 3725738, 3686172, 4063602, 4170102, 4073191, 4387316, 4024236, 3808125, 4125015, 3578511, 3708580, 3634320, 3860610, 4001518, 3518428, 3470590, 3599058, 3599306, 3533112, 3734944, 3696483, 3693694, 3540205, 3453343, 3250520, 3095073, 3393795, 3369970, 3618230, 3500823, 3044473, 3160163, 3300467, 3203670, 3305388, 3504650, 3518577, 3396211, 3459596, 3655244, 3630710, 3843760, 3625955, 3593632, 3717791, 3459917]
2660C459917J07916K35545K50437j83264P3445J13842l94961j63222j41328q6728
2650C271599L57987M0898l12332L15932K86237M1549k65624l90710K76318N35320
2640D157174K95161j18884p6376K12096j30026J98370j68224J28767L38086P3209
2630D909353L59030j39627k99402j21098j09837j03762K07180k9996k88687J60610
2620D543764N6400k94021k79084o8846p6100l6606o4882J76583m8880j64391k16882
2609C527055M11038l109j39543L96289k62906K86070J34496k91322l85873k47208
2599C424987L77273L69061l41626j10454j57269J221k71313K67940l6531j26976
2589C396313r6516K08538L62948m65187k78971J59269K3374J3539J37309j30012
$$ y = [3459917, 3567833, 3803378, 4053815, 3870551, 3943996, 4057838, 3662877, 3499655, 3358327, 3271599, 3629586, 3670484, 3358152, 3674084, 3960321, 4001870, 3736246, 3345536, 3621854, 4157174, 4452335, 4333451, 4257075, 4469171, 4339145, 4537515, 4369291, 4498058, 4836144, 4909353, 5268383, 5128756, 4829354, 4708256, 4598419, 4494657, 4701837, 4671841, 4383154, 4543764, 4600164, 4306143, 4027059, 3958213, 3882113, 3845507, 3780625, 3957208, 3908328, 3743937, 3527055, 3938093, 3934984, 3795441, 4191730, 3928824, 4214894, 4349390, 4058068, 3672195, 3424987, 3802260, 4171321, 3829695, 3719241, 3561972, 3563193, 3291880, 3559820, 3523289, 3396313, 3299797, 3508335, 3871283, 3406096, 3127125, 3286394, 3309768, 3323307, 3460616, 3330604]
2579C330604j93237l8374L8842m5203L90895j7540N8609k41021q1316r5354J13552
2568C220457J77860k50463k4237j70888k07231K08899J07326k43080l8047o4162
2558B716434K32892j42325j23610J90181M06920l54085j54120j56227j1041o80251
2548A924768j08179L25726J09762J20255m7249M87345n54617k34448J23689J98145
2538B345197j57424K45896k31964j38559L08272j13689m27208N8K39228l67520
2528A702287K17757k83480j9111K00541k21809j05818J09228k8432j24782J88328
2518A634709L28884J24764k33783J43572j30139j66030K66940L57231j4552n33893
2508A777703k34026n0952k07895l8137M46437j31789l25122P6731j08627J36028
$$ y = [3330604, 3137367, 3098993, 3137835, 3092632, 3483527, 3465987, 3524596, 3283575, 3202259, 3106905, 3220457, 3398317, 3147854, 3123617, 2952729, 2745498, 2954397, 3061723, 2818643, 2780596, 2716434, 2949326, 2807001, 2683391, 2873572, 3280492, 2926407, 2772287, 2616060, 2605019, 1924768, 1816589, 2142315, 2252077, 2372332, 2325083, 2812428, 2257811, 2023363, 2147052, 2345197, 2187773, 2433669, 2201705, 2063146, 2371418, 2257729, 1830521, 1830579, 2069807, 1702287, 1920044, 1636564, 1617453, 1817994, 1596185, 1490367, 1599595, 1571163, 1446381, 1634709, 1963593, 2088357, 1854574, 1998146, 1868007, 1701977, 1968917, 2326148, 2311596, 1777703, 1543677, 1492725, 1284830, 1246693, 1693130, 1561341, 1236219, 1312950, 1204323, 1340351]
2498A340351j68184P9981L58582l63293o0044n2544J67893L2642K40832J76297
2488A752513K27280m3935l93346l20048l98127R1938J37446M46535L57111m08075
2478A449292K0204K03037p4240P121j13396L5862o5288L445j53344r4384L36584
2467A554893j15715j56692J29373j78973j21864m03M25425J9091l70135N6204
2457A241204J68843n82034j84766L75167q3231M32787K12325j95067l1917j66550
2447A186761J4403n8193j60458O6958M41454l72242J07999R5125k316J45880q1268
2436A384103j15923J21919J90684j33901m96019K97100J81615j21572Q4507k50783
2426A141730j32189K56897K86926r426j43188N3786k78854K08425k4328j96057
$$ y = [1340351, 1172167, 1252148, 1610730, 1247437, 1187393, 1134849, 1302742, 1335384, 1576216, 1752513, 1979793, 1935858, 1542512, 1222464, 824337, 916275, 1053721, 1500256, 1857367, 1449292, 1469496, 1672533, 1598293, 1605414, 1492018, 1527880, 1462592, 1466037, 1312693, 1218309, 1554893, 1439178, 1282486, 1411859, 1232886, 1111022, 1110619, 1536044, 1555135, 1185000, 1241204, 1410047, 828013, 643247, 1018414, 935183, 1367970, 1580295, 1385228, 1353311, 1186761, 1201164, 1142971, 982513, 1049471, 1490925, 1118683, 1226682, 1321807, 1319491, 1465371, 1384103, 1268180, 1390099, 1580783, 1446882, 950863, 1247963, 1429578, 1308006, 1392513, 1141730, 1009541, 1266438, 1553364, 1543938, 1400750, 1454536, 1175682, 1384107, 1359779, 1163722]
2416A163722l3635k19542J44740q2709l23937J7013N13275J98676N9036k43308
2406A193331N8592R3081j73917Q5756k10674j36262M2579N42446k96591K5950
2396A224291J82060J98809L9627k20122J26535J85488n25961N24639P41079k09590
2386B266855l09600N0879K85621j09796k12591m16918k40224m9998j63636Q0836
2376A181428M855K34313K42307n2853l23288k58632n751N0106M12917k54812K0087
2365A250677l20339K66975k87556K64171L61478p6509j69190j44463n16947M10319
2355A038616m1238J18820q1402l98801k99363M17349O4117L03993n9829k24292
2345H37970j79294K63861L25187j1549o2453k16013L7355K12998J37391K36963
$$ y = [1163722, 1130087, 910545, 1055285, 972576, 648639, 665652, 1178927, 1377603, 1436639, 1193331, 1251923, 1345004, 1171087, 1256843, 1046169, 909907, 952486, 1494932, 1198341, 1224291, 1406351, 1605160, 1644787, 1424665, 1551200, 1736688, 1210727, 1735366, 2476445, 2266855, 1957255, 2008134, 2293755, 2183959, 1971368, 1554450, 1314226, 1264228, 1100592, 1181428, 1186283, 1420596, 1662903, 1610050, 1286762, 1028130, 1022379, 1072485, 1485402, 1230590, 1250677, 930338, 1197313, 909757, 1173928, 1535406, 1458897, 1289707, 1145244, 628297, 1038616, 997378, 1116198, 1034796, 635995, 336632, 753981, 818098, 1122091, 1062262, 837970, 658676, 922537, 1247724, 1236175, 1173722, 957709, 995064, 1208062, 1345453, 1582416]
2335A582416m22345n45939L60064L41730k27026j97770K81830L65043n9895l11103
2325A167005Q9922K04060m85853J67399Q4787l34958L21783J47364k59224L257
2315A105542k043J09950K15555j17637j63838r4364K28840o02871J4477Q0175
2305G73786K37829J71422P8162J94929j33729n15140J78565J00141K67977L2016
2295A385958j05770l20186J33057m1325K28028n53468j7640N05018P2256J63644
2285A449572j01806j73469p2225N6012K75236j89113K01760J4529m0738M09325
2275A829083J99392k12349k54966j10366k75377L76054o2608k07702K4290j60739
2265A144712M97445K46192l28146k86056N20441M3525l23618K00935j95944M1212
$$ y = [1582416, 1160071, 614132, 974196, 1315926, 1088900, 891130, 1172960, 1538003, 1478108, 1167005, 1256927, 1460987, 975134, 1142533, 1227320, 892362, 1214145, 1361509, 1102285, 1105542, 1103499, 1213449, 1429004, 1311367, 1147529, 1053165, 1282005, 679134, 693611, 773786, 1011615, 1183037, 1261199, 1456128, 1322399, 807259, 985824, 1085965, 1353942, 1385958, 1280188, 960002, 1093059, 1051734, 1279762, 726294, 708654, 1213672, 1285928, 1449572, 1347766, 1174297, 1102072, 1158084, 1433320, 1244207, 1445967, 1460496, 1419758, 1829083, 2028475, 1816126, 1561160, 1450794, 1175417, 1551471, 1488863, 1281161, 1305451, 1144712, 1642157, 1888349, 1560203, 1274147, 1794588, 1838113, 1514495, 1715430, 1519486, 1560698]
2255A560698j02053O8988m3384q8990o1964J96139J81158j74452q8809K47177
2245A694508j63088R2577M6395m5158j4018K74011k20954l07564K28633J65269
2235A750611K18957j99695J02837J07062k75254J47943M56527l65910l85365L16786
2225A874499N75693p5581j95582m1650J03364j9060J36774J82381N2057l1294
2215B561601J70142j95743j77801J31095k09565m235L66365O87843K76374l3668
2205C572408j12209M5675l29051J29098M28448K27164J0207j4335p6712l39294
2195C541399J19577L38888R8869m98575L34305J14219R6212M64634L71831j72469
2185D808890j18640R9683k59231m2989J36705K46948K90878J83617j14210J54893
$$ y = [1560698, 1458645, 1527633, 1484249, 1395259, 1333295, 1529434, 1710592, 1536140, 1447331, 1694508, 1531420, 1623997, 1670392, 1625234, 1611216, 1885227, 1664273, 1356709, 1585342, 1750611, 1969568, 1769873, 1872710, 1979772, 1704518, 1852461, 2308988, 1943078, 1557713, 1874499, 2450192, 2374611, 2179029, 2137379, 2240743, 2221683, 2358457, 2540838, 2592895, 2561601, 2731743, 2536000, 2358199, 2489294, 2279729, 2275494, 2641859, 3329702, 3606076, 3572408, 3460199, 3505874, 3176823, 3305921, 3734369, 3961533, 3971740, 3957405, 3880693, 3541399, 3660976, 3999864, 4098733, 3600158, 3934463, 4048682, 4144894, 4609528, 4981359, 4808890, 4690250, 4789933, 4530702, 4487713, 4624418, 4871366, 5162244, 5345861, 5231651, 5386544]
2175E386544l69800N51417K94688M7224O1343l11190L33905r5774m6078N27479
2165F379758J11734L20854M66978M4523K96063M57482J09961K8383P64854j95243
2155H785347K60024M63199P15960O73618N86530M50750O13067K16826N22288R63744
2145A4251353R39394O49730R77256J261621O50862J164105J731803J853535K365196
2136B5844855K734646K994210K351483K747871K655005L008138M689057N474410
2128E2499675N967759P505469J0068907J2817519J5495744J6321987J8877353
2121A39554413K2837727K3560500J4507217m439784l0637900l4718429k6943483
2114A03720261j8757806j2567874r867302p313067n583521m556732l974452k809272
$$ y = [5386544, 5016744, 5568161, 5862849, 5910073, 5971416, 5660226, 5994131, 5898357, 5852279, 6379758, 6491492, 6812346, 7279324, 7323847, 7619910, 8077392, 8187353, 8215736, 8980590, 8785347, 9045371, 9508570, 10224530, 10898148, 11484678, 11935428, 12548495, 12765321, 13287609, 14251353, 15190747, 15840477, 16817733, 18079354, 18730216, 19894321, 21626124, 23479659, 25844855, 28579501, 31573711, 33925194, 36673065, 39328070, 42336208, 47025265, 52499675, 58467434, 65972903, 76041810, 88859329, 104355073, 120677060, 139554413, 162392140, 185952640, 200459857, 196020073, 165382173, 130663744, 103720261, 84962455, 72394581, 62527279, 55214212, 49630691, 45073959, 41099507, 38290235]
2106C8290235k194463k076751j850647k267628k226708j843821k213291j748781
2098B1868145j106453o83572j144590p77132q96929j145518p14445n87535o96722
2089A4115249m80647n0015p56403l91067q35220k62905l50018n64774l0015m08213
2079I985972m10928m46058r5344m37109k36727l98679J32199p57299R5556L0062
2069G461645k71810m08650M0276n14555l76391J56871K2037l98790m02747N8128
2059E366014K26796n6362j58845l79799K13090J08925J7475m58388n3959j90650
2049D634297n3766j44716J98444J97746n81031m11144K50517M34421j56858r5316
2039D272594k74136l74674m30416P42573Q6666k74714q4800m06318K5729k72785
$$ y = [38290235, 36095772, 34019021, 32168374, 29900746, 27674038, 25830217, 23616926, 21868145, 20761692, 20078120, 18933530, 18156398, 17259469, 16113951, 15399506, 14811971, 14115249, 13634602, 13584587, 12828184, 12437117, 11601897, 11338992, 10988974, 10424200, 10394185, 9985972, 9575044, 9128986, 9033642, 8596533, 8359806, 7961127, 8093326, 7336027, 7431583, 7461645, 7189835, 6781185, 6821461, 6306906, 5930515, 6087386, 6109423, 5710633, 5307886, 5366014, 5592810, 5536448, 5377603, 4997804, 5210894, 5319819, 5337294, 4878906, 4824947, 4634297, 4580531, 4435815, 4634259, 4832005, 4250974, 3839830, 4090347, 4524768, 4367910, 4272594, 3998458, 3623784, 3193368, 3935941, 4022607, 3747893, 3663093, 3256775, 3282504, 3009719]
2029C009719Q0072P6021l5379k30541j33617n0762M85439j45836r7777m56826
2019B500513K18655L22997m17634n46219J18959L61086K24990K84749m45683k9035
2009B593378q1831j77267R6351j34350l0631L8543j75244P9671j13817J14839
1999B209642J60189K8786j93609k5612K66203j0714J74427j08309j36024k92351
1989B072628j48438J73525l8002j93277j89330j1722n5937J22924J73539K21745
1979B127655m58675j53899k4012J28032J84064k39236j22182o1927J66883l9948
1969A506755j43265J29625L6154l8898J90092J37089j73276k38463l18331Q6975
1959A174457L12645J74258k44920L0678K13950P014J6060J92273l82615l6342
$$ y = [3009719, 3089791, 3165812, 3130433, 2899892, 2766275, 2715513, 3200952, 3055116, 2957339, 2500513, 2719168, 3042165, 2624531, 2078312, 2197271, 2558357, 2783347, 3068096, 2622413, 2593378, 2511547, 2334280, 2430631, 2296281, 2265650, 2304193, 2128949, 2208620, 2094803, 2209642, 2369831, 2398617, 2205008, 2179396, 2445599, 2434885, 2609312, 2501003, 2364979, 2072628, 1924190, 2097715, 2059713, 1866436, 1677106, 1665384, 1609447, 1732371, 1905910, 2127655, 1668980, 1515081, 1491069, 1619101, 1803165, 1563929, 1441747, 1379820, 1546703, 1506755, 1363490, 1493115, 1529269, 1490371, 1680463, 1817552, 1644276, 1405813, 1087482, 1174457, 1487102, 1661360, 1416440, 1447118, 1661068, 1668082, 1684142, 1876415, 1493800, 1457458]
1949A457458j74348J97649L35186l0062o6504j35194l36367k71353K40812N60229
1939A777506m71969k72351j4785j87659j46811N97970J01802j17538Q2304k69002
1929A079467k57531K78734J97721o56249L58074L50445j06342l70032K03986l189
1919A075084k18341n0406j67676L60571J3644m7798R9065N9767J45276J43454
1909A412640j01123r3857J62042Q6333k80906J84221L7769j97862k06068m9398
1899I53791r5908K13768N1180j32902j20748L81922k38311p5094M87616j57783
1889A267531K06452K12269r7117l39169P1352j02884l81639J10092J1742M1906
1879A000535k11100J61945K66722j15392q8541k13684N62922k4525q2028r3276
$$ y = [1457458, 1283110, 1480759, 1815945, 1785883, 1719379, 1584185, 1247818, 976465, 1217277, 1777506, 1305537, 1033186, 1018401, 830742, 683931, 1281901, 1383703, 1266165, 1348469, 1079467, 821936, 1100670, 1298391, 642142, 1000216, 1350661, 1244319, 874287, 1078273, 1075084, 856743, 806337, 638661, 999232, 1012876, 965078, 1064143, 1123910, 1269186, 1412640, 1311517, 1217660, 1379702, 1466035, 1185129, 1369350, 1407119, 1209257, 1003189, 953791, 857883, 1071651, 1122831, 989929, 869181, 1251103, 1012792, 937698, 1425314, 1267531, 1473983, 1686252, 1589135, 1249966, 1321318, 1218434, 836795, 946887, 958629, 1000535, 789435, 951380, 1218102, 1102710, 1014169, 800485, 1363407, 1338882, 1256854, 1163578]
1869A163578l13223l24013L72935Q7408J2696j02768j61223J41226l4229K47450
1859A089837l98301J80878K08197J63297N4747j11728N14754J70390p1984J69332
1849A969419J84470k0232m01215k14377o8220j21330j80085j13966j59105k16502
1839F58857L34380k77858L11974N1015j64383l46218m987L13334L44189j12169
1829A108134m58604L59268j58824o6197J88959p1316J40049m52495N5538Q3667
1819G28179M26370l62893k2184M48P5545k7782n5477J76677k22935o5662M9587
1808F99873M6517M65300j68923m64653L1891q1542K86563O233K27643j35790m67280
1797D45832J177K11332k7620l25512J1194O0267R9634J52387J77158o1155N46
$$ y = [1163578, 850355, 526342, 899277, 986685, 999381, 896613, 735390, 876616, 842387, 1089837, 691536, 872414, 1080611, 1243908, 1298655, 1186927, 1701681, 1872071, 1800087, 1969419, 2153889, 2133657, 1732442, 1518065, 1449845, 1328515, 1148430, 1034464, 875359, 658857, 993237, 715379, 1027353, 1078368, 913985, 567767, 562780, 876114, 1220303, 1108134, 649530, 1008798, 849974, 783777, 972736, 901420, 1041469, 588974, 644512, 728179, 1154549, 791656, 769472, 769920, 845465, 817683, 762206, 938883, 715948, 650286, 699873, 746390, 1211690, 1042767, 578114, 610005, 528463, 815026, 821259, 1048902, 913112, 445832, 447009, 658341, 630721, 305209, 316403, 376670, 476304, 628691, 805849, 744694, 745240]
1786G45240j70739J94455j3599m1626k28982K69142n723j2102L01680o05782j1693
1775D20271j15589j75735K92456L28605J06932l84816N1742K42983l68884J22663
1765E20628k70444J3504k17494K6898N8267K47023j99657K57158M07288l76751
1755D66420k39271J8595J91742J31532j3338l4955j28311K21950n1362r54j74786
1744C87262P0854K55830P2612m2239j51864m21958L45064k47880J78897L89685
1734H36263J59374o1758r7429k47855K14365n3612o6912j49185O0658l91108Q2731
1723B85532j0797j04709q3324J9597L53407l1332J61675l52065Q7841l06801J35215
1712A54239J80107m0205J87332N08825o16696N9320k61321K8731O42351p9043
$$ y = [745240, 574501, 768956, 755357, 713731, 484749, 753891, 748168, 736066, 1037746, 431964, 420271, 304682, 128947, 421403, 750008, 856940, 472124, 523866, 766849, 397965, 520628, 250184, 263688, 46194, 73092, 131359, 378382, 178725, 435883, 843171, 466420, 227149, 245744, 437486, 569018, 555680, 520725, 392414, 614364, 563002, 562048, 387262, 458116, 713946, 786558, 744319, 592455, 170497, 515561, 267681, 446578, 836263, 995637, 933879, 836450, 588595, 802960, 749348, 682436, 533251, 593909, 202801, 285532, 274735, 170026, 86702, 106299, 459706, 428374, 590049, 237984, 325825, 19024, 154239, 334346, 294141, 481473, 990298, 373602, 432922, 171601, 200332, 842683, 763640]
1702G63640q7049p2232l05079k79891K7856J06133P5055O6396K25283Q8011l65339
1691B42784n90514M22789M45588k71511q4908o4359j14377m6528O4561K29814
1681B33339L13558j26774N3376j30946K7146J02319L85121l54115o61849M96218
1671C37393K1242n33185j58432N52332J82268r7629m0808J29120M90241k63838
1661F18704j38242j52639L25083N7290l03583j46303L25733M3488J54258j19967
1651F63822M88105r4649n27733K02117K9896n5197n7360j14628Q3323M3186j44169
1640E16713L42612k40828k15872O624l78750M44654l6364k34887N30075o29706
1630A04271p1045J19669N7297j22141j66791K35440m0713M50695J36765M0338
$$ y = [763640, 676591, 604359, 299280, 19389, 47245, 153378, 228433, 294829, 520112, 608123, 242784, -347730, 75059, 520647, 249136, 164228, 99869, -14508, -61036, 3525, 233339, 546897, 420123, 473499, 342553, 369699, 472018, 857139, 503024, -158825, 337393, 358635, -174550, -332982, 219350, 401618, 303989, 263181, 392301, 882542, 618704, 480462, 327823, 652906, 710196, 406613, 260310, 586043, 629531, 783789, 663822, 1151927, 1057278, 529545, 731662, 761558, 706361, 649001, 534373, 617696, 660882, 516713, 859325, 618497, 402625, 409249, 30499, 475153, 438789, 203902, 733977, 104271, 33226, 152895, 210192, 88051, -78740, 156700, 115987, 566682, 703447, 743785]
1620G43785j19117n89361J09729K5182N5013N7615j05171k01942m5726L61579
1610B91586j7466m6178K14287J16751o6714R8630K52446j00794Q237m6988k46294
1599D57503k15518m6377Q8234j69585M1234J97027p5282L85789j21113n5267K3127
1588E09772N9950j08874L60578j92030l44880L72863k15184K58667j67701m27868
1578A05293r0819J00738R9491j824q749j98262o3646m5938K64295J01142L0391
1567B92112l10274N08746m475R7533M4119k69866K17434O3670l0164l6584j53057
1556D19194K72015l57160R3598l60270J92359K66042j07906K02659l19597M21790
1546G22724l05145l7652k44828j5704N41831N7065n80287L16426N7417k2135k43615
$$ y = [743785, 624668, 35307, 145036, 170218, 225231, 282846, 177675, -24267, -69993, 291586, 274120, 227942, 442229, 558980, 492266, 590896, 843342, 742548, 750785, 703797, 457503, 241985, 195608, 283842, 114257, 155491, 352518, 277236, 663025, 541912, 486645, 509772, 569722, 460848, 821426, 629396, 284516, 657379, 442195, 700862, 533161, 105293, 14474, 115212, 214703, 212879, 204130, 5868, -57778, -103716, 160579, 261721, 292112, -18162, 490584, 486109, 583642, 627761, 357895, 575329, 638999, 608835, 572251, 419194, 691209, 334049, 427647, 67377, 259736, 525778, 417872, 620531, 300934, 722724, 417579, 379927, 135099, 119395, 661226, 718291, 138004, 454430, 511847, 489712, 246097]
1535B46097L436J87534J96063o33142j89359M39663k91995K19146K3174k23425
1525b2808L91793j9861L73821n2094o0668m9983o3757Q6358Q232n60098R291L90634
1513D30860l24900j11740L80191J69965r2736o2900l23451R8314J39000l09597
1503f994o5670J83053q7875m3533Q1824P13312k70071j07139Q8456l65785K40690
1492C60268j42920k23156k43252K72780J72442j25705k60238K39044N14390m58042
1482A05611J49157l4727Q2295K64818o9191k01038J17369l49073J70221K15235
1472D50677J10128J12331m31563J313O3599K05615k51764k38102K94416J82017
1462D98667M646K25175j14651k39691J1186m8430j39705J49582j99251k4389K23262
$$ y = [246097, 249533, 437067, 633130, -12, -189371, 250292, -41703, 177443, 200617, -22808, 368985, 349124, 722945, 670851, 610183, 560200, 496443, 582801, 591033, 30935, 40226, 430860, 105960, -5780, 374411, 544376, 451640, 388740, 65289, 163603, 302603, -6994, -72664, 110389, 22514, -21019, 60805, 774117, 504046, 396907, 485363, 119578, 360268, 217348, -5808, -249060, 23720, 196162, 70457, -189781, 49263, 563653, 105611, 254768, 220041, 302336, 567154, 497963, 296925, 414294, 65221, 235442, 450677, 560805, 673136, 241573, 242886, 306485, 512100, 260336, 22234, 316650, 498667, 503313, 728488, 613837, 374146, 385332, 336902, 197197, 346779, 147528, 123139, 346401]
1451C46401j13645M10092l62047r2493j29053p3441j9624j09782M81061K43381
1441E80850k89154j60067J52894L2750L27669o5679k92550j82000n2002k86430
1431b33719L30950K12782k00827J55445k16133L08236L001K18769l35364m52836
1421b09696N95493m96739m45267M91711J88686j05909N3525L74442K64341k47670
1411D62917j83627M04530k05385k46779K93974j08085j87530j80297K73331n3348
1401B69701n74876L38725k07990M33644L62286q1689j49010J26802j98237p4584
1391B44772L18890j50364J99941m19491L00291r9593k41211o1332q3696r5281
1381h7074K4233M76065j01383l08325J65312J9545L64351j52213m1854q189j24081
$$ y = [346401, 232756, 642848, 280801, 188308, 59255, -14186, -33810, -143592, 337469, 580850, 291696, 131629, 284523, 317273, 644942, 579263, 286713, 104713, 52711, -233719, 97231, 310013, 109186, 264631, 48498, 356734, 359735, 578504, 243140, -209696, 385797, -110942, -556209, -64498, 124188, 18279, 71804, 446246, 710587, 462917, 279290, 683820, 478435, 231656, 525630, 417545, 230015, 49718, 323049, 269701, -305175, 33550, -174440, 259204, 621490, 539801, 390791, 517593, 319356, 244772, 563662, 413298, 613239, 193748, 494039, 394446, 153235, 91903, 8207, -87074, -62841, 413224, 311841, 3516, 168828, 188373, 552724, 400511, 358657, 350468, 226387]
1370B26387j22257K94200p5441r0034O7972p7153O5175j96888j42033l09676j0706
1359c70454M87718K19799K5622k66251m25863K54863J26667R0043N1145j1305
1349A81984p3432O0153J25369k40230R5289J32545J34893K98694k11255j68965
1339C35045l74227j53326p5416L39008R5308L9267k31550N1580q1386J53826M63118
1328E61247J23969q388l36343l17597j18565j40626K14486J25382l88050N28362
1318B43877j17198n0473k45150j34306P3381L05780K83163K02541j40830j13610
1308C07175K34194j54532K7016j89879J3006l4226j62946J16651L80548p5003
1298D62004j56777k06973k10878K57933j62176L82939J02446j71164j58636l91068
$$ y = [226387, 104130, 398330, 322889, 232855, 300827, 223674, 288849, 91961, -50072, -359748, -370454, 117264, 337063, 362685, 96434, -329429, -74566, 52101, 142144, 193289, 181984, 108552, 168705, 294074, 53844, 149133, 281678, 416571, 715265, 504010, 335045, -39182, -192508, -267924, 71084, 166392, 205659, -25891, 25689, -55697, 98129, 561247, 685216, 676828, 340485, 22888, -95677, -236303, -21817, 103565, -284485, 243877, 126679, 76206, -168944, -303250, -229869, 75911, 359074, 561615, 420785, 307175, 541369, 386837, 413853, 223974, 236980, 202754, 39808, 156459, 537007, 462004, 305227, 98254, -112624, 145309, -16867, 366072, 468518, 297354, 138718, -252350]
1288b52350M49036L6824R1032k157l05302k1380L59994j31113j30441K0372K27021
1277C41536j01654j56652J45295k22124J68413L67841o2532k25846L33888J1827
1267E99992Q980l21915J6441K13L30760j4440l62164Q5229p8014j67357j11388
1256a3663K50194r49J09781l99280j56241L34500q9503M40115j58454j10041j5409
1245A91050n6947J29113l46618k08165L78236M1974J65256j15684j93568L08484
1235B93131k9866j72958q2476N5027j8406j94527K96166M8281j40851N762N8447
1224A17730K3387o6249K38214q9882j8266m1617K73013j47176j72080m08873L01011
1213I212j42755O1842m0242p2562J29685l15450K51073M30624m6132O1220J30893
$$ y = [-252350, 196686, 233510, 324542, 322385, 17083, -4297, 355697, 224584, 94143, 114515, 341536, 239882, 83230, 228525, 6401, 174814, 542655, 480123, 254277, 588165, 599992, 608972, 287057, 303498, 303711, 634471, 620031, 257867, 343096, 265082, 97725, -13663, 236531, 235582, 345363, -53917, -210158, 124342, 34839, 474954, 316500, 206459, 191050, 134103, 263216, -83402, -291567, 86669, 128643, 293899, 178215, -15353, 293131, 263265, 90307, 7831, 62858, 44452, -150075, 146091, 194372, 53521, 59283, 117730, 141117, 74868, 313082, 223200, 204934, 163317, 436330, 289154, 117074, -291799, 9212, -133543, -71701, -111943, -184505, -54820, -370270, -119197, 311427, 265295, 326515, 457408]
1202D57408n39303L85967j48967l55985M15093j95455k8518k196J52517K31017
1192C71578l52204q3036L42751k16160l26276k2506L5419K31179o5838l5774N92898
1181D72031M6286k47130k94782j59693K7811m9693N9071L17564K63344L9883n5335
1170D19357k54299M3965l9023k07581l27561M36389J63620j38528K93832l3085
1160C57086k35710L06494l06133j76667P8006J40664K56014J08066o0294m97381
1150b9855J36216k61898J06846K74903O3637k66735O4550n7103j92728K06017
1140D3850L60082o7793k5622K12896N7684k93282J04508o5093m8148R0651j75624
1129A94109O2605j7894L44109j92868j99650L1900M4666M8783o7482p3492M08594
$$ y = [457408, -81895, 304072, 155105, -200880, 214213, 18758, -9760, -11956, 140561, 371578, 19374, -63662, 279089, 62929, -263347, -285853, -250434, -19255, -85093, -120867, 472031, 518317, 271187, -23595, -183288, -155477, -205170, -146099, 171465, 434809, 474692, 419357, 165058, 209023, 170000, -37581, -365142, 71247, 234867, 96339, 390171, 357086, 121376, 427870, 121737, -54930, 23076, 163740, 419754, 527820, 467526, -29855, 106361, -155537, -48691, 226212, 289849, 23114, 87664, 30561, -162167, 43850, 403932, 336139, 310517, 523413, 581097, 287815, 392323, 327230, 279082, 369733, 194109, 256714, 238820, 582929, 390061, 190411, 222311, 266977, 315760, 248278, 174786, 583380]
1118E83380m80502p2255j40081O9464K46053k43555j44690R1480J14030O2531
1108H5855J78190l6783M6676L38183P9212j72474m61976r3603M9697o3789m26671
1097d77483K3134N41212N6424J60288j9695p3329K14366M3174m4214m79494J57205
1086A01588o5520m5674o4981p0465m9537j14192L95435j03916M6564n02419N78846
1075A05729P5210q3584J44661l47226L55629p224n13743Q6191m9438N3424K70621
1064I0250J36370q7854j7467l50999j21424K6181J33686J50030J51734K33558
1054C44065M9728O9457l45019j32820Q8123J29301L8770k63541K11252k20015
1044c0699O0342P5650j94213J43006R5244j81461j3804R2393l39229o4555p4439
$$ y = [583380, 102878, 30623, -109458, -39994, 206059, -37496, -182186, -90706, 23324, 85855, 264045, 227262, 273938, 612121, 691333, 518859, 56883, -36720, 12977, -50812, -477483, -454349, 86863, 143287, 303575, 283880, 210551, 424917, 468091, 423877, -55617, 101588, 36068, -9606, -74587, -145052, -194589, -308781, 86654, -17262, 29302, -473117, 105729, 180939, 97355, 242016, -105210, 250419, 243195, -270548, -184357, -233795, -180371, 90250, 226620, 138766, 121299, -229700, -351124, -324943, -191257, -41227, 110507, 344065, 393793, 463250, 118231, -14589, 73534, 202835, 241605, -21936, 189316, -30699, 29643, 105293, -88920, 54086, 149330, -32131, -45935, 46458, -292771, -357326, -431765]
1033d31765M77513l9004l49058j55906K10558j2158J85560K74356K89832r4762
1023C55166m7717R6020N4766K851j15273K53834J00455n15179j96624m40357K46316
1012b05742P8537J73737J44537n84799M0413k01224K88416J23007k13932K90991
1002f6059n1226L25479q3490l15306l07668K46100L86314j54599J69490m32911
992b83876L15941K32712j45145k7436j01184j96170N27806l3042k47910N1097
982I2793R2403k338O1741j4592r8450J81341l0080r4362k42152o1238j68264K76102
970g096N3519M3244N37n05103n353k31362J20906L10210L72412K49437j85230
959B16121L4400n5134l37439m02104J80282N47492k11202J05248j63416j28119
$$ y = [-431765, 45748, 6744, -342314, -498220, -287662, -299820, -114260, 160096, 449928, 355166, 307449, 403469, 458235, 461086, 345813, 599647, 700102, 184923, -11701, -452058, -205742, -127205, 46532, 191069, -393730, -353317, -554541, -266125, -143118, -357050, -66059, -117285, 208194, 124704, -190602, -498270, -252170, 134144, -20455, 149035, -283876, 32065, 264777, 119632, 92196, -8988, -205158, 322648, 289606, 41696, 92793, 185196, 182858, 244599, 230007, 131557, 312898, 282818, 188456, -53696, -114934, -283198, -7096, 46423, 89667, 90204, -414899, -420252, -651614, -530708, -220498, 151914, 401351, 216121, 250521, 195387, -142052, -544156, -363874, 183618, -27584, 77664, -85752, -213871]
949b13871n3483j7151N41483j2087k57322L28367p3947N4838O5870o9028k85429
938H240j45876K233j48931J65616K03073r0397J36315J54771K0227o6908L22310
927E60673k63152j13587J07157J65157l3875n52573l7927k23722L08523L01281
917B17955p3863j00673K74999j09308n6231K8180l46404J97673M10730J46702
907E89760J30416m23138j19608p7094m45504l08866L31618M12219K97330k74973
897A12160j92248M38415J7220k48586k29242p4565j47457m52160M8362K32773
887d95328M67278J10016p5158o6390O8468L01827j84374l77891N9694J82740K297
876f821o1926O5464J37714M7830l01850l40839k15187o6652Q3858K44842J56739
$$ y = [-213871, -267354, -284505, 256978, 244891, -12431, 315936, 241989, 296827, 362697, 293669, 8240, -137636, -135403, -284334, -118718, 84355, -6042, 130273, 285044, 305271, 238363, 560673, 297521, 183934, 291091, 456248, 422373, -130200, -168127, -391849, -83326, 217955, 144092, 43419, 318418, 209110, 152879, 181059, -165345, 32328, 443058, 589760, 720176, 297038, 177430, 100336, -345168, -654034, -322416, 89803, 387133, 112160, -80088, 358327, 375547, 126961, -102281, -176846, -324303, -776463, -728101, -495328, -28050, 81966, 6808, -59582, 8886, 310713, 126339, -251552, -191858, -9118, -6821, -68747, -3283, 134431, 182261, -119589, -460428, -675615, -742267, -658409, -413567, -256828]
865b56828K73774J47211k03378m94145N032L84710o2258L23513j34878n05519
855e22766M3721K45113M08836K16389n54442j73244p2414P4281j35433M93803
845B3844M3002l58353K49600P5612r547P0640J00013j55588k15322j69274L25223
834b0150M60012J11113l49764N0243j30254k81913l35334J81786j00805M8455
824c66611R7066j73597J83033r3638L803J54587R8122P6288j34026j90777l19229
813f64979l3464M06927r74L44103k5711o28973N2344O60973K64109j42990k9394
802B01971r9369l183j79177O3928j70590m4034J83211P1731o7708J37420o042
791H8158J0459k11764J2303j83377l94020j02956K55670K07170N91421L97309
$$ y = [-256828, 16946, 164157, -39221, -533366, -528334, -143624, -205882, 117631, -17247, -522766, -479045, -233932, 174904, 391293, -163149, -336393, -408807, -334526, -469959, 23844, 66846, -291507, -41907, 33705, 24158, 94798, 194811, 39223, -176099, -345373, -20150, 439862, 550975, 201211, 251454, 121200, -160713, -496047, -314261, -415066, -366611, -269545, -443142, -260109, -353747, -349944, -195357, -97235, -20947, -154973, -345750, -664979, -698443, -291516, -292490, 51613, 25902, -603071, -550727, 110246, 374355, 231365, 201971, 102602, 99419, -79758, -15830, -186420, -230454, -47243, 24488, -43220, 94200, 88158, 98617, -113147, -100844, -284221, -678241, -781197, -525527, -318357, 273064, 670373]
781F70373j46535R00o24321k7269K1307j47597k50773N9716J15658J64493o3250
770b27298q9307l2032M2737k9785K56807O9193K35942j78542r7321j15096j77039
759c41741j46242Q7960J28459L90844k94901j66011k573j5941M67498j26233j1578
748c0459L16613j29048j90938j63975j45413p3848K26767J8141l84465J55999
738d00626N4596L87355k05526j07424P0415K36853k37891p4672J32293k32720
728c77347J77230j97072l21297P7818N3333K5789O89893j71147k30828J40774
718a32854N6571j28260J22917J55942r4167J22076k45264L00091j7201k84849
708a44998r8562j2452L40224R6209l18336K14563L64712l16846k23086l37167
$$ y = [670373, 523838, 524738, -99583, -126852, -105545, -253142, -503915, -444199, -328541, -164048, -227298, -316605, -348637, -305900, -335685, -78878, -9685, 226257, 47715, -49606, -164702, -341741, -487983, -400023, -271564, 119280, -175621, -341632, -344205, -360146, 107352, -18881, -30459, 286154, 157106, -33832, -197807, -343220, -417068, -190301, -172160, -556625, -400626, -346030, 41325, -164201, -271625, -201210, 35643, -202248, -276920, -144627, -377347, -200117, -397189, -718486, -640668, -587335, -561546, 128347, -42800, -273628, -132854, -76283, -204543, -81626, 74316, -19851, 102225, -143039, 157052, 139851, -144998, -243560, -256012, 84212, 180421, -137915, 76648, 441360, 124514, -98572, -435739]
698d35739j50161L23835j55817J0982M82873k25881k11653L42734J25035O1513
688A67721j1431q7937j10164j96258k2270k55475K40378J22198j6679K24007j42004
677h7914M01618O8396k10854L0888J03381L9191k2975m36833n5240l3391r8467
666c02200M54561m7312k15599O5496p0430m5213k06195j85267K39835J37198j33659
655c08785l48640K40264r5945j07288M49502j54648k9304L42695j1976K02464
645A78339K41353l79701J16546K43368j15082m92627j18453j10521N9401J38709
635b38668l48765J03136L69443m5728j1996K21736k9822K53475k25472l97849
625c50510M26873k55955j3004M2032p3444j0317K52702j74885r2525J65917J0082
$$ y = [-435739, -585900, -262065, -417882, -406900, 75973, -149908, -361561, -18827, 106208, 167721, 156290, 68353, -41811, -238069, -260339, -515814, -275436, -153238, -169917, 54090, -87914, 313704, 382100, 171246, 202134, 305515, 344706, 321731, -115102, -170342, -203733, -302200, 152361, 105049, -110550, -45054, -115484, -160697, -366892, -552159, -312324, -175126, -308785, -657425, -417161, -513106, -620394, -170892, -325540, -354844, -12149, -24125, 178339, 419692, 39991, 156537, 399905, 284823, -207804, -326257, -436778, -377377, -238668, -587433, -484297, -114854, -160582, -172578, 49158, 19336, 272811, 47339, -350510, 76363, -179592, -192596, -150564, -224008, -234325, 18377, -156508, -249033, -83116, -73034]
614g3034k20861J86194M4957k59692K0378k03292O9799k95375K0645L02902K5765
603c81614j83786K60919r5854M1288J81616k21103P1199k98j77479j30139k07476
592h42727L74689L27938k6075n9702K83770L2054k68856j28210k31790K75636
582b63273J73523j58232j51783K98631m38198L52917n2368l72510N94751J65077
572A48535q2117j69139K1826n6071j84483J92850j39575m32295L76004j34995
562d59460o5085J55254J30984L1030l41272R6856k8581p6601L21254L08752n0602
551B2529J01318j31293k88112J61830l72070j65247K73328P3441Q0600L5845l48745
540e56576j57731O53401K99414n51903K28726k22315L24760j45953M580j09528
$$ y = [-73034, -293895, -107701, -62744, -322436, -302058, -505350, -435551, -730926, -710281, -407379, -381614, -565400, -304481, -400335, -359047, -177431, -398534, -327335, -327633, -505112, -635251, -842727, -468038, -140100, -166175, -225877, 57893, 89947, -178909, -307119, -538909, -263273, -89750, -247982, -399765, -101134, -539332, -186415, -238783, -611293, -16542, 148535, 66418, -102721, -80895, -136966, -321449, -128599, -268174, -700469, -324465, -459460, -524545, -369291, -238307, -207277, -548549, -451693, -480274, -556875, -235621, 73131, 22529, 123847, -7446, -295558, -133728, -505798, -671045, -397717, -324276, -243676, -207831, -556576, -714307, -60906, 238508, -313395, -84669, -306984, 17776, -128177, -123597, -233125]
530b33125j99472O2281n8208N75267r3809m31992M8572K06550j00263K84072p7820
519a7947r0922K13119k06199l3280K94899l52399o9397m60507R5669K91712j61341
508d96593J19347J0174L29779l67300J78231J20529K38470k1314l73785L4940
498b27522k5614n304K72432l17143l8314K43629j65723j76923K0665L1606J28847
487b59364J74283j77132l4646m7828L06355L39426p1166l94873R6748k69446L10159
476b7484M2053J31467n0055l25900l11926K93199L20235j31141r220j41257j38888
465c48917O8412J1614k74154M04323J63021k60738l06608p878M66339p6595q0032
454b41213K94217M0563L49039j54330R9916m54225k60649J77988k31004p3672
$$ y = [-233125, -432597, -370316, -428524, 146743, 52934, -379058, -330486, -123936, -224199, 59873, -17947, -108869, 104250, -101949, -135229, 159670, -192729, -262126, -722633, -626964, -335252, -496593, -377246, -367072, -37293, -404593, -226362, -105833, 132637, 111323, -262462, -227522, -253136, -258440, 13992, -303151, -341465, -97836, -263559, -440482, -419817, -388211, -259364, -85081, -262213, -296859, -344687, -38332, 301094, 229928, -164945, -68197, -337643, -27484, 14569, 146036, 95981, -229919, -541845, -248646, 71589, -59552, -68772, -210029, -348917, -280505, -268891, -543045, -138722, 24299, -236439, -543047, -550925, -84586, -161181, -241213, 53004, 93567, 442606, 288276, 388192, -66033, -326682, -148694, -379698, -453370]
444d53370K68624J39724l75008k49395m3801m5452K11974J2784J58028K16917
434a58975M6276m4892O3371p2187k45853M71393o1356k99537l33595K41647K4735
423c68973K6848J44653k70557l02983K23870J69764N99975j06209j78355j09626
413a71593k83803N15262l72753l14910M44696N78838p74914l03214J53455K80787
403b48149K80237j28479j94304J71751J23263m819l21862L17277j40912j5346
393a61343K49027o81816M03648m9003k04831M4313M8851j59924K81052J8866r5621
382c06781k10489O9341J74057l057K18311j32309k76921q1567R8883K60946l62239
371e51825k2273L47297J60931l52819K6645J26174k20473J18529P0377q7972K4969
$$ y = [-453370, -184746, -45022, -420030, -669425, -713226, -758678, -546704, -533920, -375892, -158975, -112699, -157591, -94220, -166407, -412260, 59133, -2223, -301760, -635355, -393708, -368973, -342125, -197472, -468029, -771012, -547142, -377378, 222597, 116388, -61967, -171593, -455396, 59866, -312887, -627797, -183101, 395737, -379177, -682391, -528936, -248149, 32088, -96391, -290695, -118944, 4319, -500, -322362, -5085, -145997, -161343, 87684, -594132, -190484, -239487, -444318, -400005, -351154, -511078, -230026, -211160, -306781, -517270, -447929, -273872, -276929, -58618, -190927, -467848, -549415, -450532, -189586, -551825, -574098, -226801, -65870, -418689, -392044, -265870, -486343, -367814, -297437, -385409, -360440]
360c60440l39787m19960K60896M32514K88029k75321p7281l164J53451j5692l17321
349f74076K84145K01834L42701O7776P6898l48058K14836j21647l23360n7161
339c36112k56926J58955L38026Q8421k63950M11765l91488k81716K30404J06834
329a95787j80721J42865L59158q4735l28972j29794L04294l5392K93069K84361
319D28346n15465j65966R493N7571l37813p6864J35178K95134m87534K29729p9954
308e08145j78466K16764M59453l63103k97702M76377m1413L81360n32137j1597
298c98609j09642k34068j2995K30606j60376j25341L83314Q6722K48164n5142
288a47367j82191J30499j67458l59247P19805K050j52027l51493L69479j20559
$$ y = [-360440, -700227, -1120187, -859291, -426777, -138748, -414069, -491350, -494514, -341063, -356755, -674076, -389931, -188097, 154604, 222380, 299278, -48780, 166056, 44409, -278951, -336112, -593038, -434083, -96057, -7636, -271586, 140179, -251309, -533025, -302621, -195787, -376508, -233643, 125515, 40780, -288192, -417986, -113692, -149084, 143985, 428346, -87119, -253085, -243592, -186021, -523834, -600698, -465520, -170386, -657920, -428191, -508145, -686611, -469847, -10394, -373497, -671199, -194822, -236235, 145125, -387012, -398609, -508251, -742319, -755314, -524708, -685084, -810425, -427111, -340389, -92225, -147367, -329558, -199059, -366517, -725764, -5959, -3909, -155936, -507429, -137950, -258509]
278b58509m83992P8517J12803N18129k02645j09361M49077j69799l61817J06400
268c21197K50884K41262k56894k05324M20543k60164k79345J93723J00584K92591
258A76663m68569N4405L15265j18235J20591J61686l73601k48102O9803K13325
248i6769L12990j72163l16185m3018K48644k81493P4318k53580K39369O01356
$$ y = [-258509, -742501, -663984, -551181, -33052, -235697, -345058, 104019, -65780, -427597, -321197, -70313, 170949, -85945, -291269, 129274, -130890, -410235, -216512, -115928, 176663, -291906, -237501, 77764, -40471, 80120, 241806, -131795, -379897, -310094, -96769, 216221, 44058, -272127, -315145, -66501, -347994, -273676, -527256, -287887, 313469]
$$ [...]
##END NTUPLES=NMR SPECTRUM
##END=
