##TITLE=1H_EC-3268x
 DMSO-d6
 8 sc, 
 31.05.2022
##JCAMPDX= 6.0         $$ Bruker NMR JCAMP-DX V2.0
##DATA TYPE= NMR SPECTRUM
##DATA CLASS= NTUPLES
##ORIGIN= UXNMR, Bruker Analytische Messtechnik GmbH
##OWNER= root
$$ XWIN-NMR		Version 3.5
$$ Tue May 31 14:28:50 2022 Russian Standard Time (UT+4h)  she@DPX200
##.OBSERVE FREQUENCY= 200.1313499996
##.OBSERVE NUCLEUS= ^1H
##.ACQUISITION MODE= SIMULTANEOUS
##.ACQUISITION SCHEME= undefined
##.AVERAGES= 8
##.DIGITISER RES= 18
##SPECTROMETER/DATA SYSTEM= spect
##.PULSE SEQUENCE= zg30
##.SOLVENT NAME= CDCl3
##.SHIFT REFERENCE= (INTERNAL, CDCl3, 0, 15.7689)
##AUDIT TRAIL= $$ (NUMBER, WHEN, WHO, WHERE, WHAT)
$$ ##TITLE= Audit trail, XWIN-NMR		Version 3.5
$$ ##JCAMPDX= 5.01
$$ ##ORIGIN= Bruker BioSpin GmbH
$$ ##OWNER= she
$$ F:/spectra/data/she/nmr/H-F/1/pdata/1/auditp.txt
$$ ##AUDIT TRAIL=  $$ (NUMBER, WHEN, WHO, WHERE, WHAT)
(   1,<2022-05-31 14:27:34.78 +0400>,<she>,<DPX200>,
      <created by zg, POWCHK disabled, PULCHK disabled
       configuration hash MD5:
       00 E9 B6 7A A2 85 ED C7 34 08 36 98 17 FE 4E 26
       data hash MD5: 16K
       06 F0 48 6A F6 63 97 2E 6E B7 32 8B 8E 7A 78 3A>)
(   2,<2022-05-31 14:27:37.79 +0400>,<she>,<DPX200>,
      <Start of raw data processing
       efp BC_mod = 2 LB = 0.24 FT_mod = 6 PKNL = 1 PHC0 = -18032.06 PHC1 = 7.600739 SI = 16K 
       data hash MD5: 16K
       D0 9E FC F4 91 B2 F1 2F DB 50 E3 E5 6C 91 EA A8>)
(   3,<2022-05-31 14:27:56.84 +0400>,<she>,<DPX200>,
      <pk PHC0 = -6.566008 PHC1 = 3.4 
       data hash MD5: 16K
       FC 76 62 66 A6 0C 22 DF D3 8F E0 89 C4 35 D9 0F>)
(   4,<2022-05-31 14:28:00.40 +0400>,<she>,<DPX200>,
      <abs ABSG = 5 
       data hash MD5: 16K
       7A EA FD D6 65 82 56 0F 39 F8 AD D6 9F A8 02 03>)
$$ ##END=
$$ 
$$ hash MD5
$$ F8 2D 07 A0 F7 FE 84 AF D6 17 BE FA 5B E2 DE 34
##$RELAX= 
##$RELAX= 
##$RELAX= 
##$RELAX= 
##$RELAX= 
##$RELAX= 
$$ Bruker specific parameters
$$ --------------------------
##$DU= <F:/spectra>
##$EXPNO= 1
##$NAME= <H-F>
##$PROCNO= 1
##$TYPE= <nmr>
##$USER= <she>
##$AMP= (0..31)
100 100 100 100 100 100 100 100 100 100 100 100 100 100 100 100 100 100 
100 100 100 100 100 100 100 100 100 100 100 100 100 100 
##$AQSEQ= 0
##$AQ_mod= 1
##$AUNM= <au_zg>
##$AUTOPOS= <>
##$BF1= 200.13
##$BF2= 200.13
##$BF3= 200.13
##$BF4= 200.13
##$BF5= 200.13
##$BF6= 200.13
##$BF7= 200.13
##$BF8= 200.13
##$BYTORDA= 1
##$CFDGTYP= 0
##$CFRGTYP= 5
##$CHEMSTR= <none>
##$CNST= (0..31)
1 1 145 1 1 1 1 1 1 1 1 1 1 1 1 1 1 1 1 1 1 1 1 1 1 1 1 1 1 1 1 1 
##$CPDPRG= <>
##$CPDPRG1= <>
##$CPDPRG2= <>
##$CPDPRG3= <>
##$CPDPRG4= <mlev>
##$CPDPRG5= <mlev>
##$CPDPRG6= <mlev>
##$CPDPRG7= <mlev>
##$CPDPRG8= <mlev>
##$CPDPRGB= <>
##$CPDPRGT= <>
##$D= (0..31)
0 1.2 0 0 0 0 0 0 0 0.06 0 0.03 0 0 0 0 0.0002 0 0 0 0 0 0 0 0 0 0 0 0 
0 0 0 
##$DATE= 1653992854
##$DBL= (0..7)
120 120 120 120 120 120 120 120 
##$DBP= (0..7)
150 150 150 150 150 150 150 150 
##$DBP07= 0
##$DBPNAM0= <>
##$DBPNAM1= <>
##$DBPNAM2= <>
##$DBPNAM3= <>
##$DBPNAM4= <>
$$ [...]
##$SUBNAM2= <"">
##$SUBNAM3= <"">
##$SUBNAM4= <"">
##$SUBNAM5= <"">
##$SUBNAM6= <"">
##$SUBNAM7= <"">
##$SUBNAM8= <"">
##$SUBNAM9= <"">
##$SW= 18.0517283424761
##$SWIBOX= (0..15)
0 0 2 0 0 0 0 0 0 0 0 0 0 0 0 0 
##$SW_h= 3612.71676300578
##$TD= 16384
##$TD0= 1
##$TE= 0
##$TE2= 300
##$TE3= 300
##$TEG= 300
##$TL= (0..7)
0 120 120 120 120 120 120 120 
##$TP= (0..7)
150 150 150 150 150 150 150 150 
##$TP07= 0
##$TPNAME0= <>
##$TPNAME1= <>
##$TPNAME2= <>
##$TPNAME3= <>
##$TPNAME4= <>
##$TPNAME5= <>
##$TPNAME6= <>
##$TPNAME7= <>
##$TPOAL= (0..7)
0.5 0.5 0.5 0.5 0.5 0.5 0.5 0.5 
##$TPOFFS= (0..7)
0 0 0 0 0 0 0 0 
##$TUNHIN= 0
##$TUNHOUT= 0
##$TUNXOUT= 0
##$USERA1= <user>
##$USERA2= <user>
##$USERA3= <user>
##$USERA4= <user>
##$USERA5= <user>
##$V9= 5
##$VALIST= <valist>
##$VCLIST= <CCCCCCCCCCCCCCC>
##$VD= 0
##$VDLIST= <DDDDDDDDDDDDDDD>
##$VPLIST= <PPPPPPPPPPPPPPP>
##$VTLIST= <TTTTTTTTTTTTTTT>
##$WBST= 1024
##$WBSW= 4
##$XGAIN= (0..3)
0 0 0 0 
##$XL= 0
##$YL= 0
##$YMAX_a= 376413
##$YMIN_a= -489102
##$ZGOPTNS= <>
##$ZL1= 120
##$ZL2= 120
##$ZL3= 120
##$ZL4= 120
##$ABSF1= 15.74469
##$ABSF2= -2.307159
##$ABSG= 5
##$ABSL= 3
##$ALPHA= 0
##$AQORDER= 0
##$ASSFAC= 0
##$ASSFACI= 0
##$ASSFACX= 0
##$ASSWID= 0
##$AUNMP= <proc_1d>
##$AZFE= 0.1
##$AZFW= 0.1
##$BCFW= 0
##$BC_mod= 2
##$BYTORDP= 0
##$COROFFS= 0
##$CY= -3
##$DATMOD= 1
##$DC= 0
##$DFILT= <>
##$DTYPP= 0
##$F1P= 0
##$F2P= 0
##$FCOR= 1
##$FTSIZE= 16384
##$FT_mod= 6
##$GAMMA= 0
##$GB= 0
##$INTBC= 1
##$INTSCL= 0
##$ISEN= 128
##$LB= 0.24
##$LEV0= 0
##$LPBIN= 0
##$MAXI= 10000
##$MC2= 0
##$MEAN= 0
##$ME_mod= 0
##$MI= 1.114404
##$NCOEF= 0
##$NC_proc= -7
##$NLEV= 6
##$NOISF1= 3.799351
##$NOISF2= 2.8
##$NSP= 0
##$NTH_PI= 0
##$NZP= 0
##$OFFSET= 15.76893
##$PC= 1
##$PHC0= -18038.63
##$PHC1= 11.00074
##$PH_mod= 1
##$PKNL= yes
##$PPARMOD= 0
##$PSCAL= 0
##$PSIGN= 0
##$REVERSE= no
##$SF= 200.130000522835
##$SI= 16384
##$SIGF1= 3
##$SIGF2= 2
##$SINO= 5.538805
##$SIOLD= 16384
##$SREGLST= <1H.CDCl3>
##$SSB= 0
##$STSI= 16384
##$STSR= 0
##$SW_p= 3612.71676300578
##$SYMM= 0
##$S_DEV= 0
##$TDeff= 16384
##$TDoff= 0
##$TI= <>
##$TILT= no
##$TM1= 0
##$TM2= 0
##$TOPLEV= 0
##$USERP1= <user>
##$USERP2= <user>
##$USERP3= <user>
##$USERP4= <user>
##$USERP5= <user>
##$WDW= 1
##$XDIM= 16384
##$YMAX_p= 536427089
##$YMIN_p= -758916
$$ End of Bruker specific parameters
$$ ---------------------------------
##NTUPLES= NMR SPECTRUM
##VAR_NAME=  FREQUENCY,     SPECTRUM/REAL,   SPECTRUM/IMAG
##SYMBOL=    X,             R,               I
##VAR_TYPE=  INDEPENDENT,   DEPENDENT,       DEPENDENT
##VAR_FORM=  AFFN,          ASDF,            ASDF
##VAR_DIM=   16384,         16384,           16384
##UNITS=     HZ,            ARBITRARY UNITS, ARBITRARY UNITS
##FACTOR=    0.220516191357247, 1,           1
##FIRST=     3155.83605623725, 0,            0
##LAST=      -456.880706768525, 0,           0
##MIN=       -456.880706768525, -758916,     0
##MAX=       3155.83605623725, 536427089,    0
$$ Real data points
##PAGE= N=1
##DATA TABLE= (X++(R..R)), XYDATA
$$ [...]
$$ plain form
10004 230904 275882 300285 358145 253529 123148 150675 257677 183171 168133 77217 42091
9993 42091 164390 298555 365670 281460 319521 327912 381511 482663 327619 386019 334697
9982 334697 319169 391628 395638 447293 223296 173124 371117 342727 378545 358135 508734
9971 508734 506021 500292 385648 288643 476529 491423 266925 431976 168391 -125158 131689
9960 131689 73768 206469 61239 115135 209396 305203 272270 99795 -100197 66914 158576
9949 158576 175228 306971 239315 142059 221644 243543 120120 181397 382225 224048 -133676
9938 -133676 -69845 183463 213193 47399 35872 181859 55033 -100243 -17704 39978 -56304
9927 -56304 -57167 -291204 -150626 232286 212025 136166 102101 90274 160003 7362 79779
$$ packed form
10004B30904M4978K4403N7860j04616j30381K7527J07002p4506j5038r0916l5126
9993D2091J22299J34165O7115q4210L8061Q391N3599J01152j55044N8400n1322
9982C34697j5528P2459M010N1655k23997n0172J97993k8390L5818k0410J50599
9971E08734k713n729j14644r7005J87886J4894k24498J65051k63585k93549K56847
9960A31689n7921J32701j45230N3896R4261R5807l2933j72475j99992J67111R1662
9949A58576J6652J31743o7656r7256P9585K1899j23423O1277K00828j58177l57724
9938a33676O3831K53308K9730j65794j1527J45987j26826j55276Q2539N7682r6282
9927e6304q63k34037J40578L82912k0261p5859l4065j1827O9729j52641P2417
$$ plain form
9916 79779 247882 236464 189251 222665 189109 7610 -4785 36775 173148 211011 237874
9905 237874 257550 163152 182818 43311 182564 125462 21284 217070 223023 97063 182279
9894 182279 155025 158468 160729 173250 171970 80690 92451 -91574 -20634 129787 212414 267173
9882 267173 99359 -126048 -106407 -136108 -22972 150278 233896 60538 -25912 17583 31357
9871 31357 42010 132289 -8660 -111687 -61644 126141 162933 -89043 -36279 274845 194321
9860 194321 38982 90916 99967 202843 23964 95358 49526 153355 23703 -81445 111286
9849 111286 242176 130895 51 115615 -17080 -245111 -85393 6934 -66551 -36736
9839 -36736 -3411 142003 223679 234735 172120 82591 282706 219816 158819 279901 174087
$$ packed form
9916G9779J68103j1418m7213L3414l3556j81499j2395M1560J36373L7863K6863
9905B37874J9676r4398J9666j39507J39253n7102j04178J95786N953j25960Q5216
9894A82279k7254L443K261J2521j280r1280J1761j84025P0940J50421Q2627N4759
9882B67173j67814k25407J9641k9701J13136J73250Q3618j73358q6450M3495J3774
9871C1357J0653R0279j40949j03027N0043J87785L6792k51976N2764L11124q0524
9860A94321j55339N1934R051J02876j78879P1394m5832J03829j29652j05148J92731
9849A11286J30890j11281j30844J15564j32695k28031J59718R2327p3485K9815
9839c6736L3325J45414Q1676J1056o2615q9529K00115o2890o0997J21082j05814
$$ plain form
9828 174087 257804 229201 200591 134648 146181 256494 332839 358306 285157 36102 280453
9817 280453 299631 194957 242985 297523 437287 539912 486580 494427 431068 153369 282845
9806 282845 57807 145286 287967 61926 101481 196246 385809 386430 399324 452509 582981
9795 582981 673831 739224 602388 222765 295657 467654 348628 432355 570667 529341 549166
9784 549166 550512 609398 725990 575886 655373 764824 881979 825958 821797 842063 1184653
9773 1184653 1198381 1035267 936576 786889 855540 832308 929614 1151766 1031117 1027299 1260119
9762 1260119 1150972 1155803 1324131 1345708 1252517 1105858 1364045 1599267 1576942 1559447 1563384
9751 1563384 1490425 1440170 1750655 1661785 1610162 1678675 1735570 1774838 1896912 1837874 1751253
$$ packed form
9828A74087Q3717k8603k8610o5943J1533J10313P6345K5467p3149k49055K44351
9817B80453J9178j04674M8028N4538J39764J02625n3332P847o3359k77699J29476
9806B82845k25038Q7479J42681k26041L9555R4765J89563O21J2894N3185J30472
9795E82981R0850O5393j36836l79623P2892J71997j19026Q3727J38312m1326J9825
9784E49166J346N8886J16592j50104P9487J09451J17155n6021m161K0266L42590
9773A184653J3728j63114r8691j49687O8651k3232R7306K22152j20649l818K32820
9762A260119j09147M831J68328K1577r3191j46659K58187K35222k2325j7495L937
9751A563384p2959n0255L10485q8870n1623O8513N6895L9268J22074n9038q6621
$$ plain form
9740 1751253 1687513 1918602 1979996 2264354 2391983 2423746 2440861 2509164 2573411 2775068 3036226
9729 3036226 3107100 3335100 3495608 3777415 4005551 4077502 4372065 4599066 4895594 5141306
9719 5141306 5404911 5592787 5943272 6363844 6831836 7245170 7880265 8677500 9358454 10204802
9709 10204802 11218600 12438815 14059010 15492977 17317590 19748800 22624962 26110902
9701 26110902 30298787 35538491 43231959 53405110 61057452 59116418 47537405 36111280
9693 36111280 27952997 22476524 18875479 15945137 13635655 12389263 11053665 9757835
9685 9757835 8699573 7960296 7248029 6618842 6250339 6110607 5585857 5183393 4902667
9676 4902667 4371410 3996072 3704840 3627056 3313813 3290255 3420507 3254022 3132077 3012176
$$ packed form
9740A751253o3740K31089O1394K84358J27629L1763J7115O8303O4247K01657K61158
9729C036226P0874K28000J60508K81807K28136P1951K94563K27001K96528K45712
9719E141306K63605J87876L50485M20572M67992M13334O35095P97235O80954Q46348
9709A0204802J013798J220215J620195J433967J824613K431210K876162L485940
9701B6110902M187885N239704P693468J0173151P652342j941034j1579013j1426125
9693C6111280q158283n476473l601045k930342k309482j246392j335598j295830
9685I757835j058262p39277p12267o29187l68503j39732n24750m02464k80726
9676D902667n31257l75338k91232p7784l13243k3558J30252j66485j21945j19901
$$ plain form
9666 3012176 2929188 2874161 2503131 2373805 2318556 2123365 2116374 2063722 2278355 2260471 2161248
9655 2161248 2065823 1865305 1863329 1644090 1735135 1678500 1594778 1572899 1401660 1122481 1352835
9644 1352835 1363024 1388362 1293070 1222524 1232248 1114532 1082995 1190949 1072211 1045239 869844
9633 869844 709981 1015277 924878 873774 898374 888715 791978 943866 1007739 830015 718980
9622 718980 724415 718995 751772 900916 741328 761698 655753 672988 611555 582213 535428
9611 535428 567942 732981 891314 913549 660244 654910 699953 652970 626778 759061 701023
9600 701023 560158 538522 434167 540281 583388 320672 469968 436252 310177 488964
9590 488964 462298 578866 591295 332823 179814 279317 507239 303698 461165 589365
$$ packed form
9666C012176q2988n5027l71030j29326n5249j95191o991n2652K14633j7884r9223
9655B161248r5425k00518j976k19239R1045n6635q3722k1879j71239k79179K30354
9644A352835J0189K5338r5292p0546R724j17716l1537J07954j18738k6972j75395
9633H69844j59863L05296r0399n1104K4600r659r6737J51888O3873j77724j11035
9622G18980N435n420L2777J49144j59588K0370j05945J7235o1433k9342m6785
9611E35428L2514J65039J58333K2235k53305n334M5043m6983k6192J32283n8038
9600G01023j40865k1636j04355J06114M3107k62716J49296l3716j26075J78787
9590D88964k6666J16568J2429k58472j53009R9503K27922k03541J57467J28200
$$ plain form
9580 589365 639199 691466 691402 594170 587689 610902 640956 691212 570251 315566 561749 446782
9568 446782 363586 589096 557819 498961 300751 552114 418316 366585 550559 699325
9558 699325 590474 408328 557700 711577 535988 294673 383505 590982 619627 600007
9548 600007 768984 623561 621264 796976 675213 622122 590570 622290 474129 505198 740264
9537 740264 648983 795581 576920 548186 535685 404484 326991 319477 384626 588291 680421
9526 680421 677254 464807 538189 559832 420294 583026 460687 309388 245807 400127 298552
9515 298552 257032 297298 306955 329803 607250 596415 380508 440822 430406 437953 399635 149512
9503 149512 307394 350687 459788 616804 667622 695138 800466 807046 531856 401514 438708
$$ packed form
9580E89365M9834N2267o4r7232o481K3213L0054N0256j20961k54685K46183j14967
9568D46782q3196K25510l1277n8858j98210K51363j33798n1731J83974J48766
9558F99325j08851j82146J49372J53877j75589k41315Q8832K07477K8645j9620
9548F00007J68977j45423k297J75712j21763n3091l1552L1720j48161L1069K35066
9537G40264r1281J46598k18661k8734j2501j31201p7493p514O5149K03665R2130
9526F80421l167k12447P3382K1643j39538J62732j22339j51299o3581J54320j01575
9515B98552m1520M0266R657K2848K77447j0835k15907O0314j0416P547l8318k50123
9503A49512J57882M3293J09101J57016N0818K7516J05328O580k75190j30342L7194
$$ plain form
9492 438708 452994 423357 558097 486102 109994 318319 470657 332983 327526 347384 369514
9481 369514 394352 502913 524516 574903 417583 495000 517094 356558 491939 344834 285346
9470 285346 250313 359254 420810 411602 234777 300159 419878 239330 312856 575933 424897
9459 424897 336040 305330 364922 425850 445890 400126 377141 465522 595122 678946 372332
9448 372332 385320 392685 459690 448048 482828 570360 531633 557348 480629 531140 687784 755002
9436 755002 664339 616250 637292 620835 786437 707948 854443 744441 651622 775568 681269
9425 681269 493159 673213 690543 576743 447659 413718 530468 513285 422878 398511 647924
9414 647924 521331 696540 798771 646427 528207 461253 628949 524432 641082 640628
$$ packed form
9492D38708J4286k9637J34740p1995l76108K08325J52338j37674n457J9858K2130
9481C69514K4838J08561K1603N0387j57320P7417K2094j60536J35381j47105n9488
9470B85346l5033J08941O1556r208j76825O5382J19719j80548P3526K63077j51036
9459D24897q8857l0710N9592O0928K0040m5764k2985Q8381J29600Q3824l06614
9448C72332J2988P365O7005j1642L4780Q7532l8727K5715p6719N0511J56644O7218
9436G55002r0663m8089K1042j6457J65602p8489J46495j10002r2819J23946r4299
9425F81269j88110J80054J7330j13800j29084l3941J16750j7183r0407k4367K49413
9414F47924j26593J75209J02231j52344j18220o6954J67696j04517J16650m54
$$ plain form
9404 640628 813623 765383 608263 623242 641371 586315 916797 1010920 959744 898769 897918
9393 897918 967896 959308 779624 604371 628885 554706 567884 680792 649192 522706 384901
9382 384901 458136 480126 280157 345287 652849 523951 406602 573042 478039 672821
9372 672821 637403 586397 449517 474220 591977 498379 334826 435659 382988 291104 473172
9361 473172 472871 493221 486858 359223 460036 457228 375112 273629 515068 537265 511535 470483
9349 470483 569326 426780 436481 386404 251064 313714 397052 462278 478881 503289 531882
9338 531882 582452 633875 600865 503910 520740 668491 529028 293468 305136 284403 250848
9327 250848 390635 486526 584339 504864 411619 494462 571890 624377 385943 413858 472396
$$ packed form
9404F40628J72995m8240j57120J4979J8129n5056L30482R4123n1176o0975q51
9393H97918O9978q588j79684j75253K4514p4179J3178J12908l1600j26486j37805
9382C84901P3235K1990j99969O5130L07562j28898j17349J66440r5003J94782
9372F72821l5418n1006j36880K4703J17757r3598j63553J00833n2671r1884J82068
9361D73172l01K0350o363j27635J00813k808q2116j01483K41439K2197k5730m1052
9349D70483R8843j42546R701n0077j35340O2650Q3338O5226J6603K4408K8593
9338E31882N0570N1423l3010r6955J6830J47751j39463k35560J1668k0733l3555
9327B50848J39787R5891R7813p9475r3245Q2843P7428N2487k38434K7915N8538
$$ plain form
9316 472396 418036 475585 589059 455537 325090 425295 573238 519473 596823 516109 641966
9305 641966 462343 498275 639736 577434 727435 657767 661358 705483 571334 336037 344577
9294 344577 654774 743589 753791 910470 844013 697667 816455 791053 825209 770792 782557
9283 782557 911165 793604 941908 1017585 985732 697166 687576 614789 733756 818109 802256
9272 802256 728493 605009 721322 666542 761547 771002 923171 924644 731586 761291 1002732
9261 1002732 1051440 995478 1028529 1389748 1425011 1285954 1213033 1251867 1377618 1329607 1419291
9250 1419291 1630815 1705124 1636830 1571118 1662909 1728910 1795952 1626383 1502981 1286571 1352061
9239 1352061 1621782 1619739 1628809 1641719 1653103 1696164 1926881 2062597 2159979 1907325 1806637
$$ packed form
9316D72396n4360N7549J13474j33522j30447J00205J47943n3765P7350q0714J25857
9305F41966j79623L5932J41461o2302J50001o9668L591M4125j34149k35297Q540
9294C44577L10197Q8815J0202J56679o6457j46346J18788k5402L4156n4417J1765
9283G82557J28608j17561J48304P5677l1853k88566r590p2787J18967Q4353j5853
9272H02256p3763j23484J16313n4780R5005R455J52169J473j93058K9705K41441
9261A002732M8708n5962L3051L61219L5263j39057p2921L8834J25751m8011Q9684
9250A419291K11524P4309o8294o5712R1791O6001O7042j69569j23402k16410O5490
9239A352061K69721k043R070J2910J1384M3061K30717J35716R7382k52654j00688
$$ plain form
9228 1806637 2017771 2254319 2291970 2130425 2219588 2270109 2194176 2245859 2346691 2263841 2194505
9217 2194505 2313294 2270137 2314581 2444307 2639131 2782961 2786794 2768407 2771666 2856077 2907515
9206 2907515 2699757 2818783 2969488 3220626 3218697 3306755 3181862 3022812 2992403 3093382
9196 3093382 3164063 3170741 3255212 3489341 3310365 3177948 3364145 3244864 3382941 3404601
9186 3404601 3499072 3576440 3623091 3566659 3645245 3678527 3666263 3672035 3705059 3782861 3669665
9175 3669665 3501681 3747694 3580835 3506077 3724888 3948995 4092838 4236005 4386394 4419537
9165 4419537 4179868 4157056 4186178 4135680 4181277 4259516 4329146 4603826 4689138 4746827 4940809
9154 4940809 4585511 4579078 4657408 4763381 5028546 5005962 5007657 5077748 5183021 5395910 5486652
$$ packed form
9228A806637K11134K36548L7651j61545Q9163N0521p5933N1683J00832q2850o9336
9217B194505J18789m3157M4444J29726J94824J43830L833j8387L259Q4411N1438
9206B907515k07758J19026J50705K51138j929Q8058j24893j59050l0409J00979
9196C093382P0681O678Q4471K34129j78976j32417J86197j19281J38077K1660
9186C404601R4471P7368M6651n6432P8586L3282j2264N772L3024P7802j13196
9175C669665j67984K46013j66859p4758K18811K24107J43843J43167J50389L3143
9165D419537k39669k2812K9122n0498M5597P8239O9630K74680Q5312N7689J93982
9154D940809l55298o433P8330J05973K65165k2584J695P0091J05273K12889R0742
$$ plain form
9143 5486652 5329460 5485740 5717470 5787457 5975216 5987580 6080444 6152491 6296942 6551428
9133 6551428 6515896 6517473 6799888 6951322 7126283 7166708 7265725 7305230 7527235 8068188 8074025
9122 8074025 7901602 8327463 8531383 8599936 8724420 8764146 8938039 9105990 9275867 9503477
9112 9503477 9742871 10085651 10227725 10426719 10730324 11034859 11430195 11598461 12168616 12589803
9102 12589803 12955627 13544671 13762302 14176373 14754527 15157770 15548495 16272618 17119784
9093 17119784 17790316 18396879 19012999 19687735 20388841 21227990 22355734 23393583 24303416
9084 24303416 25316152 26658797 28054779 29281423 31138153 33290172 35558206 37984609
9076 37984609 40804600 43904769 47367759 51889519 56638381 61605520 66821315 72109866
$$ packed form
9143E486652j57192J56280K31730O9987J87759J2364R2864P2047J44451K54486
9133F551428l5532J577K82415J51434J74961M0425R9017L9505K22005N40953N837
9122H074025j72423M25861K03920O8553J24484L9726J73893J67951J69877K27610
9112I503477K39394L42780J42074J98994L03605L04535L95336J68266N70155M21187
9102A2589803L65824N89044K17631M14071N78154M03243L90725P24123Q47166
9093A7119784O70532O06563O16120O74736P01106Q39149J127744J037849R09833
9084B4303416J012736J342645J395982J226644J856730K152019K268034K426403
9076C7984609K819991L100169L462990M521760M748862M967139N215795N288551
$$ plain form
9068 72109866 78267973 85035260 91832924 97460908 100732839 102147895 104198140 107774245
9060 107774245 111550899 113960291 112770291 107418060 99848273 91563168 84118305 78412394
9052 78412394 74668458 72180207 70064286 67963386 65793369 63632795 62262319 61480105
9044 61480105 61279710 61711896 62888317 64681207 66884987 70294928 74033148 78822392
9036 78822392 84633457 90815594 97590576 104504138 111076589 117036612 122163007 127257444
9028 127257444 133135748 140030813 146787788 150800171 150828423 148363044 144552926 139046459
9020 139046459 130340113 118100090 104204578 90946357 79870631 71106518 64516729
9013 64516729 59146727 55066279 51488156 48336837 45723184 42680411 39728130 37040171
$$ packed form
9068G2109866O158107O767287O797664N627984L271931J415056K050245L576105
9060A07774245L776654K409392j190000n352231p569787q285105p444863n705911
9052G8412394l743936k488251k115921k100900k170017k160574j370476p82214
9044F1480105k00395M32186J176421J792890K203780L409941L738220M789244
9036G8822392N811065O182137O774982O913562O572451N960023N126395N094437
9028A27257444N878304O895065O756975M012383K8252k465379l810118n506467
9020A39046459q706346j2240023j3895512j3258221j1075726q764113o589789
9013F4516729n370002m080448l578123l151319k613653l042773k952281k687959
$$ plain form
9005 37040171 34518948 32292080 30477148 28807248 27501625 26054240 24750569 23612076
8997 23612076 22784076 21898238 21217418 20480940 19872900 19321479 18664044 18385398 17590095
8988 17590095 17021095 16685358 16407409 16095191 15707028 15521224 15191518 15081719 15114078 15028665
8978 15028665 14982783 14850416 14537683 14307709 14119889 13998834 13781136 13547314 13400030 12915761
8968 12915761 12778538 12553053 12453643 12409549 12105614 12059744 12144051 12081903 11892223 11746840
8958 11746840 11522233 11565710 11571484 11650151 11600144 11448855 11473679 11606102 11787536 11866467 12129429
8947 12129429 12275777 12522933 12752781 13058276 13282150 13403970 13419701 13462289 13421917 13203153
8937 13203153 12861460 12703169 12708435 12717505 12846657 12802392 12877603 12716183 12491111 12455625 12491381
$$ packed form
9005C7040171k521223k226868j814932j669900j305623j447385j303671j138493
8997B3612076q28000q85838o80820p36478o08040n51421o57435k78646p95303
8988A7590095n69000l35737k77949l12218l88163j85804l29706j09799L2359q5413
8978A5028665m5882j32367l12733k29974j87820j21055k17698k33822j47284m84269
8968A2915761j37223k25485r9410m4094l03935m5870Q4307o2148j89680j45383
8958A1746840k24607M3477N774P8667n0007j51289K4824J32423J81434P8931K62962
8947A2129429J46348K47156K29848L05495K23874J21820J5731M2588m0372k18764
8937A3203153l41693j58291N266R070J29152m4265P5211j61420k25072l5486L5756
$$ plain form
8926 12491381 12690969 12825813 13122336 13270425 13524534 13547401 13993066 14538457 14792704 15118692
8916 15118692 15412015 15705241 16250169 16589551 17088009 17530605 18116070 18694536 18999475
8907 18999475 19619550 20367755 21071638 21848329 22534768 22997511 23825783 24267330 24962768
8898 24962768 25975773 27175962 28491514 29890244 31742267 33792277 36095322 38846787
8890 38846787 41883399 45156051 48450274 51934996 55572334 59806644 64650346 69411981
8882 69411981 73688118 77177788 79511096 80196632 78279087 74047339 69102758 64734792
8874 64734792 61596742 59510024 58370330 57844613 57088621 56172402 54996437 53676806 52768282
8865 52768282 52531358 52855770 54079649 55696164 57586376 60126657 62952409 66337746
$$ packed form
8926A2491381J99588J34844K96523J48089K54109K2867M45665N45391K54247L25988
8916A5118692K93323K93226N44928L39382M98458M42596N85465N78466L04939
8907A8999475O20075P48205P03883P76691O86439M62743Q28272M41547O95438
8898B4962768J013005J200189J315552J398730J852023K050010K303045K751465
8890C8846787L036612L272652L294223L484722L637338M234310M843702M761635
8882F9411981M276137L489670K333308O85536j917545m231748m944581m367966
8874F4734792l138050k086718j139694n25717p55992r16219j175965j319631r08524
8865E2768282k36924L24412J223879J616515J890212K540281K825752L385337
$$ plain form
8857 66337746 70211805 74009253 78127480 83230761 89507003 96614813 104557946 113059673
8849 113059673 121681569 128838987 134164695 136521200 134814216 129781110 121679959 113123724
8841 113123724 105932107 100151441 95028866 89527777 83234567 76562766 70855889 66010028
8833 66010028 61637431 57947133 55048464 52992437 51060967 49678286 49063387 48791264
8825 48791264 48995166 49391741 50160224 51283863 53159749 55664382 58265738 61263415 64249814
8816 64249814 66804234 69151597 71793899 75139219 78517077 81540467 83518617 83126551
8808 83126551 79927163 74217025 66824168 59099488 52430475 47157741 43005194 39671379
8800 39671379 37193632 35043714 32900908 31072801 29093902 27028023 25509484 24384217
$$ packed form
8857F6337746L874059L797448M118227N103281O276242P107810P943133Q501727
8849A13059673Q621896P157418N325708K356505j706984n033106q101151q556235
8841A13123724p191617n780666n122575n501089o293210o671801n706877m845861
8833F6010028m372597l690298k898669k056027j931470j382681o14899k72123
8825D8791264K03902L96575P68483J123639J875886K504633K601356K997677K986399
8816F4249814K554420K347363K642302L345320L377858L023390J978150l92066
8808H3126551l199388n710138p392857p724680o669013n272734m152547l333815
8800C9671379k477747k149918k142806j828107j978899k065879j518539j125267
$$ plain form
8792 24384217 23268889 22130010 21394548 20554650 19734476 18995929 18571772 18221816 17425738
8783 17425738 16794151 16247218 15904713 15573818 15238471 15004543 14686807 14335766 13922187
8774 13922187 13617408 13478530 13558764 13315034 13348095 13062791 12682500 12627000 12612770 12660512
8764 12660512 12635425 12516673 12528991 12746772 13018417 13043990 13086577 13158299 13337958 13433678
8754 13433678 13595279 13984038 14180711 14405060 14800359 15023999 15361687 15658036 16055055
8745 16055055 16600922 17229336 17812963 18417278 19183142 20195933 21495478 22839356 24293656
8736 24293656 25897905 27836547 30181503 32882060 36196225 39710366 43169407 45922779
8728 45922779 47727005 49652633 51853612 54300538 55955319 55764029 53502551 51023516
$$ packed form
8792B4384217j115328j138879p35462q39898q20174p38547m24157l49956p96078
8783A7425738o31587n46933l42505l30895l35347k33928l17736l51041m13579
8774A3922187l04779j38878Q0234k43730L3061k85304l80291n5500j4230M7742
8764A2660512k5087j18752J2318K17781K71645K5573M2587P1722J79659R5720
8754A3433678J61601L88759J96673K24349L95299K23640L37688K96349L97019
8745A6055055N45867O28414N83627O04315P65864J012791J299545J343878J454300
8736B4293656J604249J938642K344956K700557L314165L514141L459041K753372
8728D5922779J804226J925628K200979K446926J654781j91290k261478k479035
$$ plain form
8720 51023516 48696223 46892523 44937322 42314701 39137088 36013749 33371153 31672570
8712 31672570 30645611 29899858 29431003 29403413 29480115 29879513 30825176 31913203 33473860
8703 33473860 35432499 37844159 40373446 42589703 44716377 46456243 48267708 50841580
8695 50841580 54099323 58293997 62529584 65757779 67493136 66822374 63312901 57538793
8687 57538793 51441312 46120270 42105055 39022310 36768797 35169049 33367789 31689046
8679 31689046 29334651 27188848 25303359 23947440 22918183 22005140 21538388 20861722 20681000
8670 20681000 20887013 21061010 21269747 21703901 22441975 23494854 24827738 25726659 26113635
8661 26113635 26486398 26748955 27308841 27757301 27232187 26015945 24343653 22838904 21515488
$$ packed form
8720E1023516k327293j803700j955201k622621l177613l123339k642596j698583
8712C1672570j026959p45753m68855k7590P6702L99398R45663J088027J560657
8703C3473860J958639K411660K529287K216257K126674J739866J811465K573872
8695E0841580L257743M194674M235587L228195J735357o70762l509473n774108
8687E7538793o097481n321042m015215l082745k253513j599748j801260j678743
8679C1689046k354395k145803j885489j355919j029257r13043m66752o76666j80722
8670B0681000K06013J73997K08737M34154P38074J052879J332884Q98921L86976
8661B6113635L72763K62557N59886M48460n25114j216242j672292j504749j323416
$$ plain form
8652 21515488 20161492 18610205 16823174 15224470 13982172 12929621 12040365 11054030
8644 11054030 10207608 9647378 9167421 8805811 8358233 7902932 7724341 7505272 7151691
8635 7151691 6818120 6596491 6272643 5843285 5594296 5396794 5336469 5247718 4971832 4793456
8625 4793456 4651527 4545370 4503376 4207185 4240317 4270028 4167905 3930962 3708078 3629897
8615 3629897 3531220 3483497 3393528 3327617 3397835 3478627 3354647 3144321 3194829 3249238 2965715
8604 2965715 2980760 3021144 2840632 2620527 2703793 2520114 2397280 2388775 2363191 2377551 2425494
8593 2425494 2302982 2219085 2119672 1998617 2080625 2000952 2033931 2077755 1981618 1882968 1869851
8582 1869851 1759613 1723427 1810856 1818788 1735297 1904952 1454477 1548037 1638431 1544110 1604487
$$ packed form
8652B1515488j353996j551287j787031j598704j242298j052551q89256r86335
8644A1054030q46422n60230m79957l61610m47578m55301j78591k19069l53581
8635G151691l33571k21629l23848m29358k48989j97502o0325q8751k75886j78376
8625D793456j41929j06157m1994k96191L3132K9711j02123k36943k22884p8181
8615C629897r8677m7723q9969o5911P0218Q0792j23980k10326N0508N4409k83523
8604B965715J5045M0384j80512k20105Q3266j83679j22834q505k5584J4360M7943
8593B425494j22512q3897r9413j21055Q2008p9673L2979M3824r6137r8650j3117
8582A869851j10238l6186Q7429P932q3491J69655m50475R3560R0394r4321O0377
$$ plain form
8571 1604487 1468733 1325003 1457607 1361710 1125362 1247211 1291080 1432792 1309179 1059496
8561 1059496 934958 925116 883859 961215 765223 781369 955346 928985 897762 907180 850822
8550 850822 744060 632580 737723 713980 740063 709776 946530 875322 770512 783477 748728
8539 748728 692690 666258 831670 866284 935743 708595 707345 722431 509568 514979 342655
8528 342655 493951 649513 632869 693504 574126 577266 598766 748129 711431 550713 533100
8517 533100 550673 692755 711582 623804 669227 884400 914593 902711 922947 685797 703858
8506 703858 676815 533303 368628 553773 497705 480315 507943 352867 399454 412009 440540
8495 440540 534897 415574 417979 356396 399571 415382 486419 673743 745318 780233 513309
$$ packed form
8571A604487j35754j43730J32604r5897k36348J21849M3869J41712j23613k49683
8561A059496j24538r842m1257P7356j95992J6146J73977k6361l1223R418n6358
8550H50822j06762j11480J05143k3743K6083l0287K36754p1208j04810J2965l4749
8539G48728n6038k6432J65412L4614O9459k27148j250J5086k12863N411j72324
8528C42655J51296J55562j6644O0635j19378L140K1500J49363l6698j60718j7613
8517E33100J7573J42082J8827q7778M5423K15173L0193j1882K0236k37150J8061
8506G03858k7043j43512j64675J85145n6068j7390K7628j55076M6587J2555K8531
8495D40540R4357j19323K405o1583M3175J5811P1037J87324P1575L4915k66924
$$ plain form
8484 513309 691331 646531 632785 598638 439138 712672 665559 692488 679463 591143 463736
8473 463736 254302 242048 358037 301253 223517 167642 251365 530204 512313 333211 226571
8462 226571 267430 139937 159708 70506 -13962 83260 133744 153719 94613 144447 -69583
8451 -69583 -47208 102646 140113 62056 30233 66070 52734 265371 352695 237443 226663
8440 226663 208767 150567 30529 79499 128607 132715 153181 111485 225340 325323 304906
8429 304906 167966 166775 61330 128310 195183 210034 133088 94456 83709 151248 -10204
8418 -10204 -110932 -70963 -18722 -35904 -110593 -76114 -92341 -87650 -56029 34021 81231 -104320
8406 -104320 -1559 20613 -153855 -337709 -214673 -223675 -260896 -169589 -221305 -14264 111871
$$ packed form
8484E13309J78022m4800j3746l4147j59500K73534m7113K6929j3025q8320j27407
8473D63736k09434j2254J15989n6784p7736n5875Q3723K78839j7891j79102j06640
8462B26571M0859j27493J9771q9202q4468R7222N0484J9975n9106M9834k14030
8451f9583K2375J49854L7467p8057l1823L5837j3336K12637Q7324j15252j0780
8440B26663j7896n8200j20038M8970M9108M108K0466m1696J13855R9983k0417
8429C04906j36940j191j05445O6980O6873J4851p6946l8632j0747O7539j61452
8418a0204j00728L9969N2241j7182p4689L4479j6227M691L1621R0050M7210j85551
8406a04320J02761K2172j74468j83854J23036r002l7221R1307n1716K07041J26135
$$ plain form
8395 111871 110831 58794 159210 -13984 16601 75568 -226980 -270745 -132122 32390 33327
8384 33327 -292249 -214785 -58663 -269361 -215714 -174711 -158796 -190613 -206484 -9144 -97619
8373 -97619 -87977 -67499 58635 69291 111824 111643 109419 -36779 -80463 -136853 -123107 -16387
8361 -16387 251065 237980 58115 127890 260693 -39572 -70327 -122986 -178641 -21648 -188410
8350 -188410 -329546 146 -151168 -113830 171319 -2203 116513 -83328 -92633 -130124
8340 -130124 31528 84575 80651 -30250 -44841 -45982 92039 -20337 27583 59587 206214
8329 206214 148857 82787 128933 150757 174171 292855 159877 -60598 36535 109791 15110
8318 15110 -5696 74197 100901 160241 108888 138743 34930 66620 57446 -154415 -131003 230468
$$ packed form
8395A11871j040n2037J00416j73194L0585N8967l02548m3765J38623J64512R37
8384C3327l25576P7464J56122k10698N3647M1003J5915l1817j5871J97340q8475
8373i7619R642K0478J26134J0656M2533j81k224j46198m3684n6390J3746J06720
8361a6387K67452j3085j79865O9775J32803l00265l0755n2659n5655J56993j66762
8350a88410j41136L29692j51314L7338K85149j73522J18716j99841r305l7491
8340a30124J61652N3047l924j10901j4591j141J38021j12376M7920L2004J46627
8329B06214n7357o6070M6146K1824K3414J18684j32978k20475R7133P3256r4681
8318A5110k0806P9893K6704N9340n1353K9855j03813L1690r174k11861K3412L61471
$$ plain form
8306 230468 29668 -74556 -103643 -62158 72840 93737 -23690 -136874 -133223 -179769 -166077
8295 -166077 -116270 -67853 -90561 -33959 -44196 -78801 -99080 -25629 -64526 -255335 -116740
8284 -116740 -164145 -236793 -130288 -154125 -134860 -161663 -329762 -229721 -169772 -38666 172035
8273 172035 48695 -82868 -302308 -472761 -215305 -95639 -411536 -374739 -169933 -143043
8263 -143043 -212155 -136249 -167495 -164009 -197067 105274 110254 -160058 -108016 -125532 -149721 43758
8251 43758 87747 -161318 -121050 -225717 -278736 -204803 49835 122642 216333 19442 -120412
8240 -120412 -31843 -102123 -247998 -372085 -239274 -196191 -139002 -231698 -183618 -333526 -258119
8229 -258119 -162744 -254573 -360453 -359396 -158135 -90589 -164772 -244793 -57850 -173928 -279113
$$ packed form
8306B30468k00800j04224k9087M1485J34998K0897j17427j13184L651m6546J3692
8295a66077M9807M8417k2708N6602j0237l4605k0279P3451l8897j90809J38595
8284a16740m7405p2648J06505k3837J9265k6803j68099J00041N9949J31106K10701
8273A72035j23340j31563k19440j70453K57456J19666l15897L6797K04806K6890
8263a43043o9112P5906l1246L486l3058L02341M980k70312N2042j7516k4189J93479
8251D3758M3989k49065M0268j04667n3019P3933K54638P2807R3691j96891j39854
8240a20412Q8569p0280j45875j24087J32811M3083N7189r2696M8080j49908P5407
8229b58119R5375r1829j05880J057K01261O7546p4183q0021J86943j16078j05185
$$ plain form
8218 -279113 -293009 -280684 -104776 -178360 -361757 -136416 -11061 33043 -172229 -206722 -303373
8207 -303373 -302833 -245712 -414789 -380298 -371498 -201132 -130022 -432388 -422647 -178111 -334456
8196 -334456 -541158 -383031 -399226 -758916 522144 827193 83106 28181 -124592 -39225
8186 -39225 -127071 -56344 -37151 80159 144737 655 -135053 -322515 -182660 -102822 -219081
8175 -219081 -204495 -138231 -209281 -68752 -197205 -321529 -131464 -191517 -142648 -106959 -65523
8164 -65523 -30751 12278 -78730 9041 -63680 -75754 -271122 -458060 -420433 -330176 -302426
8153 -302426 -341642 -289493 -100640 -28086 -167391 -172607 -183038 -188080 -278773 -497770 -529073
8142 -529073 -317206 -248735 -174116 -345651 -443472 -369046 -229101 -282233 -394135 -106671 -83118
$$ packed form
8218b79113j3896J2325J75908p3584j83397K25341J25355M4104k05272l4493r6651
8207c03373N40N7121j69077L4491Q800J70366P1110l02366R741K44536j56345
8196c34456k06702J58127j6195l59690J281060L05049p44087n4925j52773Q5367
8186c9225q7846P0727J9193J17310O4578j44082j35708j87462J39855P9838j16259
8175b19081J4586O6264p1050J40529j28453j24324J90065o0053M8869L5689M1436
8164f5523L4772M3029r1008Q7771p2721j2074j95368j86938L7627R0257K7750
8153c02426l9216N2149J88853P2554j39305n216j0431n042r0693k18997l1303
8142e29073K11867O8471P4619j71535r7821P4426J39945n3132j11902K87464K3553
$$ plain form
8131 -83118 -118860 -146965 -94602 -310752 -397590 -285197 -271167 -291208 -350674 -298448 -262247
8120 -262247 -101740 -219165 -263496 -365664 -393562 -371610 -471876 -161940 -73789 -97378 7749
8109 7749 -266338 -320100 -192633 -88121 -107231 -72400 -200314 -78405 -128359 -295327 -153923
8098 -153923 -105345 63845 -248640 -413224 -224906 -303201 -315992 -169217 -13953 -156581
8088 -156581 -90454 -259 -28053 -144435 -101749 -117398 -101896 67464 -59282 -245104 -242117
8077 -242117 -178149 -77335 -13468 -242439 -340330 -387966 -288978 -284221 -80403 -3982 -198081
8066 -198081 -104511 -182288 -135332 -292668 -341685 -223828 -183364 -246210 -303749 -187329 -235976
8055 -235976 -252565 -304283 -219467 79862 29565 -28526 -37819 -65808 -197537 -21072 -7595
$$ packed form
8131h3118l5742k8105N2363k16150q6838J12393J4030k0041n9466N2226L6201
8120b62247J60507j17425m4331j02168k7898K1952j00266L09936Q8151k3589J05127
8109G749k74087n3762J27467J04512j9110L4831j27914J21909m9954j66968J41404
8098a53923M8578J69190l12485j64584J88318p8295j2791J46775J55264j42628
8088a56581O6127R0195k7794j16382M2686j5649J5502J69360j26746j85822K987
8077b42117O3968J00814O3867k28971r7891m7636R8988M757K03818P6421j94099
8066a98081R3570p7777M6956j57336m9017J17857M0464o2846n7539J16420m8647
8055b35976j6589n1718Q4816K99329n0297n8091r293k7989j31729J76465J3477
$$ plain form
8044 -7595 20854 -20226 35674 51210 29180 63403 -196935 -338958 -213309 -192426 -82910
8033 -82910 -145636 -289339 -318227 -97392 -129231 -194723 -47116 -176628 -203516 -487400 -290714
8022 -290714 -106475 -70977 -245348 -221792 -6719 15638 -258360 -74316 -101859 -190602 -322217
8011 -322217 -318288 -115656 72257 52388 6945 -56628 -198441 -285877 -250358 -68287 -109264
8000 -109264 -244931 -59772 16292 -195812 -296035 -316035 -258968 -137117 -221869 -104864
7990 -104864 -91063 -73648 -361090 -194933 -338266 -501520 -210772 -155177 -104548 -185979 -240960
7979 -240960 -193385 -236867 -233884 -140566 -74421 -69859 -105090 -50676 -165371 -312825 -292949 -245695
7967 -245695 -155039 -114304 -188430 -232374 -118139 -115199 -149602 -92524 -42632 -89190 -366737
$$ packed form
8044g595K8449m1080N5900J5536k2030L4223k60338j42023J25649K0883J09516
8033h2910o2726j43703k8888K20835l1839o5492J47607j29512k6888k83884J96686
8022b90714J84239L5498j74371K3556K15073K2357k73998J84044k7543q8743j31615
8011c22217L929K02632J87913j9869m5443o3573j41813q7436L5519J82071m0977
8000a09264j35667J85159P6064k12104j00223k0000N7067J21851q4752J17005
7990a04864J3801J7415k87442J66157j43333j63254K90748N5595N0629q1431n4981
7979b40960M7575m3482K983R3318O6145M562l5231N4414j14695j47454J9876M7254
7967b45695R0656M0735p4126m3944J14235K940l4403N7078M9892m6558k77547
$$ plain form
7956 -366737 -279797 -250787 -436589 -383249 -166582 -237799 -194920 -92399 -157465 -318832 -229196
7945 -229196 -244931 -37594 30483 89496 10969 18596 25454 -10864 -153278 -230226 -128250
7934 -128250 -58167 -66821 -25104 -149934 -222399 -244229 18425 102079 100930 112234 7858
7923 7858 -16848 16844 71975 -66749 -217364 -125066 40099 39283 -111099 -236445 -272387
7912 -272387 -185910 25109 -15422 -156058 -139181 -25344 -314920 -306264 -210988 -144822 -205151
7901 -205151 -352451 2029 -74967 -20989 14631 -27015 -28663 -81140 -115525 131026 -15010
7890 -15010 -143156 -185144 -27151 210191 82826 8233 45177 -258308 -206205 -19929 -66582
7879 -66582 15165 -45451 -235382 -126372 -33148 -210390 -282562 -278367 -118593 -51633 -31837
$$ packed form
7956c66737Q6940K9010j85802N3340K16667p1217M2879J02521o5066j61367Q9636
7945b29196j5735K07337O8077N9013p8527P627O858l6318j42414p6948J01976
7934a28250P0083q654M1717j24830p2465k1830K62654Q3654j149J1304j04376
7923G858k4706L3692N5131j38724j50615R2298J65165q16j50382j25346l5942
7912b72387Q6477K11019m0531j40636J6877J13837k89576Q656R5276O6166o0329
7901b05151j47300L54480p6996N3978L5620m1646j648n2477l4385K46551j46036
7890a5010j28146m1988J57993K37342j27365p4593L6944l03485N2103J86276m6653
7879f6582Q1747o0616j89931J09010R3224j77242p2172M195J59774O6960J9796
$$ plain form
7868 -31837 -114912 -226987 -364868 -363462 -215305 -98822 -64174 -71163 -77979 21188 -5241 126420
7856 126420 219846 -51258 -160261 53060 -42847 3270 44708 -33432 -53172 87560 -17543
7845 -17543 122353 -192712 -139301 -57510 50335 169468 90259 197497 159179 75202 55731
7834 55731 -97195 -63479 -182176 -90723 -9044 15404 -88190 -25645 141156 172657 175902
7823 175902 172697 65332 87165 -27441 -131648 68399 20927 -68456 48551 216465 40504
7812 40504 132830 537208 449002 117615 197393 -29445 -25093 67156 29269 -57959 20263
7801 20263 125678 -10680 122669 188120 137049 56054 117667 249351 70958 68287 136421
7790 136421 167608 190790 116890 112432 91140 95583 139834 231612 160313 201831 179704 136202
$$ packed form
7868c1837q3075j12075j37881J406J48157J16483L4648o989o816R9167k6429J31661
7856A26420R3426k71104j09003K13321r5907M6117M1438p8140j9740J40732j05103
7845a7543J39896l15065N3411Q1791J07845J19133p9209J07238l8318q3977j9471
7834E5731j52926L3716j18697R1453Q1679K4448j03594O2545J66801L1501L245
7823A75902l205j07365K1833j14606j04207K00047m7472q9383J17007J67914j75961
7812D0504R2326M04378q8206l31387P9778k26838M352R2249l7887q7228P8222
7801B0263J05415j36358J33349O5451n1071q0995O1613J31684j78393k671O8134
7790A36421L1187K3182p3900m458k1292M443M4251R1778p1299M1518k2127m3502
$$ plain form
7778 136202 117816 297153 467601 564224 289822 152953 282432 335898 451993 527895
7768 527895 583008 669708 796880 716978 692500 592770 698764 778138 828985 516606 648202
7757 648202 523976 429389 427174 393742 231274 193173 347110 235971 13804 155956 302435
7746 302435 300816 276807 204544 287109 354657 195371 206858 129336 288962 278799 322171
7735 322171 248786 306988 309613 169349 262902 380378 375674 327586 384809 292115 126727
7724 126727 64002 117424 134739 -99279 -97413 156609 94332 -20274 61251 -86577 59977
7713 59977 -22366 46679 290021 135494 76598 203887 304935 216344 111546 76824 364753
7702 364753 325553 324663 293945 361139 312348 390386 367046 481598 344448 258997 176168 158104
$$ packed form
7778A36202j8386J79337J70448R6623k74402j36869J29479N3466J16095P5902
7768E27895N5113Q6700J27172p9902k4478r9730J05994P9374N0847l12379J31596
7757F48202j24226r4587k215l3432j62468l8101J53937j11139k22167J42152J46479
7746C02435j619k4009p2263Q2565O7548j59286J1487p7522J59626j0163M3372
7735C22171p3385N8202K625j40264R3553J17476m704m8088N7223r2694j65388
7724A26727o2725N3422J7315k34018J866K54022o2277j14606Q1525j47828J46554
7713E9977q2343O9045K43342j54527n8896J27289J01048q8591j04798l4722K87929
7702C64753l9200q90l0718O7194m8791P8038k3340J14552j37150q5451q2829j8064
$$ plain form
7690 158104 203694 248700 188747 402070 348511 169682 237385 149831 213774 244765 352720
7679 352720 510986 414354 477016 409198 491434 495302 422269 382005 303512 340174 580711
7668 580711 608083 518393 440349 398555 674891 599051 552160 687203 672192 555164 398331
7657 398331 364194 641395 824937 863849 963772 1199246 1144711 1160668 942802 742291 821160
7646 821160 803166 1014032 849699 798882 926972 911827 912187 1181259 1104743 923483 741757
7635 741757 730904 583126 494959 536217 597945 615131 609339 624197 494912 699874 830427
7624 830427 641044 519663 501922 449899 703673 701638 535375 547423 573606 675694 677530
7613 677530 518351 459565 499093 581449 471190 549029 359673 515078 419256 515244 575426
$$ packed form
7690A58104M5590M5006n9953K13323n3559j78829O7703q7554O3943L0991J07955
7679C52720J58266r6632O2662o7818Q2236L868p3033m0264p8493L6662K40537
7668E80711K7372q9690p8044m1794K76336p5840m6891J35043j5011j17028j56833
7657C98331l4137K77201J83542L8912R9923K35474n4535J5957k17866k00511P8869
7646H21160j7994K10866j64333n0817J28090j5145L60K69072p6516j81260j81726
7635G41757j0853j47778q8167M1258O1728J7186n792J4858j29285K04962J30553
7624H30427j89383j21381j7741n2023K53774k035j66263J2048K6183J02088J836
7613F77530j59179n8786L9528Q2356j10259P7839j89356J55405r5822R5988O0182
$$ plain form
7602 575426 577890 664303 709155 691367 698997 737679 738797 642360 574855 689362 657718 663492
7590 663492 806174 899449 755754 709784 786721 889604 957898 735090 734128 891666 816028
7579 816028 778148 762502 669775 612178 759660 751297 776613 739697 795365 768774 837770 819203
7567 819203 827140 721761 683493 576847 633638 735493 750756 650058 755833 584257 644805
7556 644805 714120 566812 719562 789804 765092 853193 923526 854312 899454 851420 803896
7545 803896 691315 761680 1050687 1278960 1159386 1105961 1065074 1088373 1275867 1228480 1187581
7534 1187581 1227465 1324142 1216482 1169277 1211578 1040813 1085514 1147370 1178027 1109088 1096058
7523 1096058 1145281 1133480 1193560 1373676 1259101 1249552 1304500 1319181 1093322 1350213 1564541
$$ packed form
7602E75426K464Q6413M4852j7788P630L8682J118r6437o7505J14507l1644N774
7590F63492J42682R3275j43695m5970P6937J02883O8294k22808r62J57538p5638
7579H16028l7880j5646r2727n7597J47482q363K5316l6916N5668k6591O8996j8567
7567H19203P937j05379l8268j06646N6791J01855J5263j00698J05775j71576O0548
7556F44805O9315j47308J52750P0242k4712Q8101P0333o9214M5142m8034m7524
7545H03896j12581P0365K89007K28273j19574n3425m0887K3299J87494m7387m0899
7534A187581L9884R6677j07660m7205M2301j70765M4701O1856L0657o8939j3030
7523A096058M9223j1801O0080J80116j14575r549N4948J4681k25859K56891K14328
$$ plain form
7512 1564541 1610535 1554802 1412162 1431036 1610730 1481750 1289568 1408975 1480570 1695791
7502 1695791 1641959 1618194 1692847 1697276 1751850 1783138 1854150 1989404 2110136 1975782 2024280
7491 2024280 1958997 1798042 2033711 2050974 2036094 1892002 1803945 1874782 1882828 2021507 2278905
7480 2278905 2116321 2146808 2022928 2183527 2248740 2276090 2482352 2363279 2327369 2331170 2506928
7469 2506928 2533678 2667618 2632653 2677086 2713828 2801815 2595226 2762048 2850484 2864523 3146453
7458 3146453 3013144 2812756 3105250 3119158 3076190 3429208 3448000 3422435 3527729 3740595
7448 3740595 3871662 3844551 3788848 4001295 4055586 4200533 4395061 4566295 4770323 4838003
7438 4838003 4961910 4954379 5001414 5120543 5564929 6048952 5980381 6203583 6327941 6363101
$$ packed form
7512A564541M5994n5733j42640J8874J79694j28980j92182J19407P1595K15221
7502A695791n3832k3765P4653M429N4574L1288P1012J35254J20732j34354M8498
7491B024280o5283j60955K35669J7263j4880j44092q8057P0837Q046J38679K57398
7480B278905j62584L0487j23880J60599O5213K7350K06262j19073l5910L801J75758
7469B506928K6750J33940l4965M4433L6742Q7987k06589J66822Q8436J4039K81930
7458C146453j33309k00388K92494J3908m2968L53018J8792k5565J05294K12866
7448C740595J31067k7111n5703K12447N4291J44947J94528J71234K04028O7680
7438D838003J23907p531M7035J19129M44386M84023o8571K23202J24358L5160
$$ plain form
7428 6363101 6688561 6889212 7009763 7312839 7748083 8145129 8687379 9095040 9400334 9736631
7418 9736631 10013437 10428655 10518028 10292997 10155407 9896093 9617432 9394866 9066265 9062146
7408 9062146 9165165 9220602 9285027 9395723 9605093 9788149 9955497 10339031 10641918 10895028
7398 10895028 11188845 11716535 12119457 12660705 13029197 13632956 14133657 14771777 15293583
7389 15293583 15986760 16753712 17360315 18124818 19266932 20328530 21334790 22371148 23775172
7380 23775172 25099142 26590984 28622622 30615040 33026063 35605657 38820339 42479601
7372 42479601 46543865 50970808 55878898 61470373 68225743 76212336 85782942 97209100
7364 97209100 110492586 125853094 141804074 154973479 161078277 156916257 143421815
$$ packed form
7428F363101L25460K00651J20551L03076M35244L97046N42250M07661L05294L36297
7418I736631K76806M15218Q9373k25031j37590k59314k78661k22566l28601m119
7408I062146J03019N5437O4425J10696K09370J83056J67348L83534L02887K53110
7398A0895028K93817N27690M02922N41248L68492O03759N00701O38120N21806
7389A5293583O93177P66952O06603P64503J142114J061598J006260J036358J404024
7380B3775172J323970J491842K031638J992418K411023K579594L214682L659262
7372D2479601M064264M426943M908090N591475O755370P986593R570606J1426158
7364I7209100J3283486J5360508J5950980J3169405O104798m162020j3494442
$$ plain form
7357 143421815 124651289 105718399 89372779 76066239 65752980 57818116 51430030
7350 51430030 46097321 41914257 38438434 35253420 32670041 30289622 28476941 26657816
7342 26657816 24988008 23581702 22314938 21268605 20240627 19013779 18160252 17323679
7334 17323679 16600246 16067044 15552223 15106840 14487410 13937299 13489520 12810871 12465711
7325 12465711 12065758 11807144 11436435 11182546 10953907 10534972 10429924 10089384 9713142
7316 9713142 9576416 9418449 9277807 8965634 8757849 8570053 8395051 8438956 8053855 7854618
7306 7854618 7771778 7741713 7717741 7596540 7541229 7434776 7357920 7301964 7199884 7221463 7225318
7295 7225318 7105983 6989276 6620295 6499975 6526941 6725761 6673427 6581676 6553497 6585605
$$ packed form
7357A43421815j8770526j8932890j6345620j3306540j0313259p934864o388086
7350E1430030n332709m183064l475823l185014k583379k380419j812681j819125
7342B6657816j669808j406306j266764j046333j027978j226848q53527q36573
7334A7323679p23433n33202n14821m45383o19430n50111m47779o78649l45160
7325A2465711l99953k58614l70709k53889k28639m18935j05048l40540l76242
7316I713142j36726j57967j40642l12173k07785j87796j75002M3905l85101j99237
7306G854618q2840l0065k3972j21201n5311j06453p6856n5956j02080K1579L855
7295G225318j19335j16707l68981j20320K6966J98820n2334r1751k8179L2108
$$ plain form
7285 6585605 6517108 6372829 6625707 6605385 6497706 6546245 6315063 6475694 6392036 6226837
7275 6226837 6268511 6040179 6210324 6254331 6250687 6125131 6098076 6369073 6223282 5983525
7265 5983525 6068112 6097364 6292592 6287812 6218033 6329130 6359893 6327008 6349512 6289252 6620401
7254 6620401 6599002 6547354 6483247 6774098 6922571 6732861 6773686 6799924 6804491 6981297 6842405
7243 6842405 6888017 6996079 7119254 7045399 7224388 7215837 7160771 7377410 7427323 7391421 7519338
7232 7519338 7749199 7876056 7906002 8073178 8147159 8138192 8236615 8391050 8629256 8659741 8535389
7221 8535389 8385892 8722720 8880730 8876283 9019132 9217331 9086266 9116793 9395808 9514831
7211 9514831 9839274 10136220 10098118 10274744 10313003 10442750 10621173 10758723 10656376 10913425
$$ packed form
7285F585605o8497j44279K52878k0322j07679M8539k31182J60631q3658j65199
7275F226837M1674k28332J70145M4007l644j25556k7055K70997j45791k39757
7265E983525Q4587K9252J95228m780o9779J11097L0763l2885K2504o0260L31149
7254F620401k1399n1648o4107K90851J48473j89710M0825K6238M567J76806j38892
7243F842405M5612J08062J23175p3855J78989q551n5066K16639M9913l5902J27917
7232G519338K29861J26857K9946J67176P3981q967R8423J54435K38206L0485j24352
7221H535389j49497L36828J58010m447J42849J98199j31065L0527K79015J19023
7211I514831L24443K96946l8102J76626L8259J29747J78423J37550j02347K57049
$$ plain form
7201 10913425 11143540 11183209 11442121 11410896 11766632 11932605 11860032 12010279 12250756 12381406
7191 12381406 12468638 12815878 12949299 13182315 13430805 13656191 13857670 13992301 14224107 14318854
7181 14318854 14438480 14887039 14994469 15043116 15208656 15369354 15705137 16269818 16533617 16872261
7171 16872261 17088781 17056222 17348953 17719744 17779221 18012690 18508974 18809074 19200005 19483618
7161 19483618 19765679 20070997 20513400 20890688 21264110 21681499 22126920 22756204 23153425
7152 23153425 23585604 24209037 24511472 25051837 25725643 26150520 26710588 27278756 27996157
7143 27996157 28675241 29244058 29841516 30561193 31416320 32251367 33104603 33857042 34657609
7134 34657609 35587852 36414464 37332942 38104613 38911465 39985235 40728007 41768108 42826070
$$ packed form
7201A0913425K30115L9669K58912l1225L55736J65973p2573J50247K40477J30650
7191A2381406Q7232L47240J33421K33016K48490K25386K01479J34631K31806R4747
7181A4318854J19626M48559J07430M8647J65540J60698L35783N64681K63799L38644
7171A6872261K16520l2559K92731L70791N9477K33469M96284L00100L90931K83613
7161A9483618K82061L05318M42403L77288L73422M17389M45421O29284L97221
7152B3153425M32179O23433L02435N40365O73806M24877N60068N68168P17401
7143B7996157O79084N68817N97458P19677Q55127Q35047Q53236P52439Q00567
7134C4657609R30243Q26612R18478P71671Q06852J073770P42772J040101J057962
$$ plain form
7125 42826070 43778372 44813665 46012691 47300194 48337793 49391803 50593771 52065833
7117 52065833 53245853 54315096 55563155 56935080 58454245 59829754 61414941 63063702
7109 63063702 64487095 66036993 68142302 70047906 71804635 73876897 76089132 78293050
7101 78293050 80711143 83219927 85723890 88750876 91549541 94401624 97784504 101461803
7093 101461803 105129865 109067886 113212859 117528666 122033625 126879969 132224252 137760403
7085 137760403 143499315 149519376 156082305 162955880 170313699 177964734 186129283 194903170
7077 194903170 204362740 214545467 225086610 236357938 248682446 261668994 275321691
7070 275321691 290059034 305648167 322396151 339710624 357970149 377088885 396695052
$$ packed form
7125D2826070R52302J035293J199026J287503J037599J054010J201968J472062
7117E2065833J180020J069243J248059J371925J519165J375509J585187J648761
7109F3063702J423393J549898K105309J905604J756729K072262K212235K203918
7101G8293050K418093K508784K503963L026986K798665K852083L382880L677299
7093A01461803L668062L938021M144973M315807M504959M846344N344283N536151
7085A37760403N738912O020061O562929O873575P357819P651035Q164549Q773887
7077A94903170R459570J0182727J0541143J1271328J2324508J2986548J3652697
7070B75321691J4737343J5589133J6747984J7314473J8259525J9118736J9606167
$$ plain form
7063 396695052 416503490 436119864 455820603 474697818 492298076 507910940 520851568
7056 520851568 530181241 535522369 536427089 532737731 524574031 512208886 496804423 478733283
7048 478733283 458343905 436775040 415150563 393649490 372168425 351504129 331847480
7041 331847480 313129916 295914809 279763277 264378361 250112434 237039253 224679497
7034 224679497 213270512 202645819 192672174 183448725 174818411 166851974 159458300 152710590
7026 152710590 146104750 139981931 134143087 128527504 123438415 118752946 114311196 109933967
7018 109933967 105901345 101983985 98348105 94894994 91776424 88505581 85344001 82669629
7010 82669629 79873285 77151066 74576934 72244763 70024664 68049603 66008964 64125272
$$ packed form
7063C96695052J9808438J9616374J9700739J8877215J7600258J5612864J2940628
7056E20851568R329673N341128R04720l689358q163700j2365145j5404463j8071140
7048D78733283k0389378k1568865k1624477k1501073k1481065k0664296j9656649
7041C31847480j8717564j7215107j6151532j5384916j4265927j3073181j2359756
7034B24679497j1408985j0624693r973645r223449q630314p966437p393674o747710
7026A52710590o605840o122819n838844n615583n089089m685469m441750m377229
7018A09933967m032622l917360l635880l453111l118570l270843l161580k674372
7010H2669629k796344k722219k574132k332171k220099j975061k040639j883692
$$ plain form
7002 64125272 62113551 60036225 58477500 56699564 55128932 53636048 52338710 51005187
6994 51005187 49574307 48136425 47019635 45743794 44375643 43462723 42330392 41259888
6986 41259888 40192069 39113988 38049388 37276965 36473096 35568349 34584553 33883578 32938617
6977 32938617 32357950 31711538 31060713 30497187 30026729 29141899 28214708 27618625 26943440
6968 26943440 26353844 26035226 25585067 25167817 24635435 23892587 23484300 22931733 22539089
6959 22539089 22305274 21947584 21361121 21118668 20730919 20375877 19977939 19526902 18928579
6950 18928579 18477258 18113431 17596610 17228887 17045510 16649922 16417613 16171354 15853938
6941 15853938 15458380 15367969 15072423 14785979 14551378 14219527 13798062 13407386 13278569 12997941
$$ packed form
7002F4125272k011721k077326j558725j777936j570632j492884j297338j333523
6994E1005187j430880j437882j116790j275841j368151r12920j132331j070504
6986D1259888j067819j078081j064600p72423q03869r04747r83796p00975r44961
6977C2938617n80667o46412o50825n63526m70458q84830r27191n96083o75185
6968B6943440n89596l18618m50159m17250n32382p42848m08287n52567l92644
6959B2539089k33815l57690n86463k42453l87749l55042l97938m51037n98323
6950A8928579m51321l63827n16821l67723j83377l95588k32309k46259l17416
6941A5853938l95558r0411k95546k86444k34601l31851m21465l90676j28817k80628
$$ plain form
6931 12997941 12841740 12648687 12235368 11980078 11864680 11681108 11512468 11311627 10899775
6922 10899775 10640783 10569985 10156211 10076291 10133200 9949730 9706485 9469814 9576382 9610035
6912 9610035 9550565 9448323 9152314 8973889 8980527 8862934 8523306 8471431 8314430 8202524
6902 8202524 8382488 8182705 7942438 7688683 7463462 7420920 7563142 7442223 7261189 7295832
6892 7295832 6988173 6939363 6989145 7062891 6732004 6528727 6623620 6479108 6293120 6343100
6882 6343100 6250383 6165100 6095584 5801335 5727705 5698110 5587104 5586378 5423316 5578375 5541357
6871 5541357 5263764 5456357 5455510 5416873 5311715 5251170 4996133 4719424 4718518 4710592 4783380
6860 4783380 4559717 4577271 4513230 4349674 4388726 4381114 4214035 4217193 4252333 4263313 4049883
$$ packed form
6931A2997941j56201j93053m13319k55290j15398j83572j68640k00841m11852
6922A0899775k58992p0798m13774p9920N6909j83470k43245k36671J06568L3653
6912I610035n9470j02242k96009j78425O638j17593l39628n1875j57001j11906
6902H202524J79964j99783k40267k53755k25221m2542J42222j20919j81034L4643
6892G295832l07659m8810M9782P3746l30887k03277R4893j44512j85988M9980
6882F343100r2717q5283o9516k94249p3630k9595j11006p26j63062J55059l7018
6871E541357k77593J92593q47l8637j05158o0545k55037k76709r06p926P2788
6860D783380k23663J7554o4041j63556L9052p612j67079L158L5140J0980k13430
$$ plain form
6849 4049883 3847117 4017038 4096553 3898868 3974924 3794003 3741838 3640125 3553998 3604573
6839 3604573 3477796 3568481 3479596 3317706 3395341 3362122 3093143 3301270 3307203 3083941 2888336
6828 2888336 3079009 3179488 2947829 2834396 2864389 2949264 2993178 2609908 2591508 2599658 2629739
6817 2629739 2555833 2606179 2579791 2500797 2195420 2227794 2293023 2456809 2372847 2196501 2290669
6806 2290669 2129799 2165103 2262204 2184525 2184572 2163201 2208970 2094615 2047631 2226068 2072507
6795 2072507 1986080 1784741 1849022 2000999 1942459 1927480 1737716 1722616 1747722 1847805 1706490
6784 1706490 1495414 1597752 1595582 1634586 1553504 1538254 1458511 1546932 1571193 1565329 1569327 1515576
6772 1515576 1508592 1696778 1549659 1441613 1213961 1277933 1215190 1317520 1188262 1128573
$$ packed form
6849D049883k02766J69921P9515j97685P6056j80921n2165j01713q6127N0575
6839C604573j26777R0685q8885j61890P7635l3219k68979K08127N933k23262j95605
6828B888336J90673J00479k31659j13433K9993Q4875M3914l83270j8400Q150L0081
6817B629739p3906N0346k6388p8994l05377L2374O5229J63786q3962j76346R4168
6806B290669j60870L5304R7101p7679M7k1371M5769j14355m6984J78437j53561
6795B072507q6427k01339O4281J51977n8540j4979j89764j5100K5106J00083j41315
6784A706490k11076J02338k170L9004q1082j5250p9743Q8421K4261n864L998n3751
6772A515576o984J88186j47119j08046k27652O3972o2743J02330j29258n9689
$$ plain form
6762 1128573 1161201 959930 1084065 914626 1004403 1340983 1378224 1287649 1088127 1005897
6752 1005897 1058092 969195 1038770 1018934 684934 847538 968105 931581 874846 939803 948013
6741 948013 890882 1039543 900020 891993 912005 907161 986882 929019 1116191 960101 929747
6730 929747 911758 967350 852313 833389 876577 1012586 1076787 899959 931757 798146 931155
6719 931155 956899 1061065 976322 865070 771373 765116 584544 614521 729416 817983 779913
6708 779913 862336 833167 800732 535424 657539 774080 617984 564963 743164 619971
6698 619971 463390 625878 529969 537848 614832 412247 301249 253656 350360 423528 410943
6687 410943 540209 595851 482327 565025 487084 314446 235338 404431 574576 589746 565739
$$ packed form
6762A128573L2628k01271J24135j69439Q9777L36580L7241r0575j99522q2230
6752A005897N2195q8897O9575j9836l34000J62604J20567l6524n6735O4957Q210
6741I48013n7131J48661j39523q027K0012m844P9721n7863J87172j56090l0354
6730I29747j7989N5592j15037j8924M3188J36009O4201j76828L1798j33611J33009
6719I31155K5744J04166q4743j11252r3697o257j80572K9977J14895Q8567l8070
6708G79913Q2423k9169l2435k65308J22115J16541j56096n3021J78201j23193
6698F19971j56581J62488r5909P879P6984k02585j10998m7593R6704P3168j2585
6687D10943J29266N5642j13524Q2698p7941j72638p9108J69093J70145J5170k4007
$$ plain form
6676 565739 515744 558579 417630 428941 220250 154771 86947 314981 357809 377142 360350
6665 360350 366271 143788 40465 149594 330215 268459 148884 193172 344862 316143 92031
6654 92031 85473 209439 197448 267503 266281 192116 199787 318575 402554 408259 464029 457103
6642 457103 376179 350672 310145 223652 472972 341390 409398 266241 261901 562951 422927
6631 422927 347705 269356 386573 469622 336263 339596 349088 227570 161689 179581 116284
6620 116284 276170 266753 131514 210026 304625 358804 345513 112328 70187 135945 250684
6609 250684 277446 193874 284654 433139 387143 372651 263106 240158 356344 191771 261405
6598 261405 187998 41867 37743 254563 460737 400860 457696 290009 381007 197327 161303
$$ packed form
6676E65739m9995M2835j40949J1311k08691o5479o7824K28034M2828J9333j6792
6665C60350N921k22483j03323J09129J80621o1756j19575M4288J51690k8719k24112
6654I2031o558J23966j1991P0055j222p4165P671J18788Q3979N705N5770o926
6642D57103q0924k5507m0527q6493K49320j31582O8008j43157m340L01050j40024
6631D22927p5222p8349J17217Q3049j33359L333R492j21518o5881J7892o3297
6620A16284J59886r417j35239P8512R4599N4179j3291k33185m2141O5758J14739
6609B50684K6762q3572R0780J48485m5996j4492j09545k2948J16186j64573O9634
6598B61405p3407j46131m124K16820K06174n9877N6836j67687R0998j83680l6024
$$ plain form
6587 161303 192932 253332 171487 120752 155336 223621 321104 298026 308686 390203 350974 98178
6575 98178 225021 131297 47377 37405 134290 207041 171328 291433 309778 178149 117574
6564 117574 80822 216761 196172 304031 371970 173786 -38632 202181 196989 -44338 196746
6553 196746 172648 156962 208827 83918 186491 235383 143394 178932 290888 281019 256084
6542 256084 263994 288879 217078 113174 182499 296488 60896 265407 186935 295357 292286
6531 292286 245435 298610 314470 237038 141184 227278 168132 160558 93076 -51074 36734 91926
6519 91926 -8118 119964 92226 124773 119382 149475 207245 86968 -24887 126295 192091
6508 192091 236386 117847 -17515 -165298 -139947 4349 94266 15150 -26731 -64091 -69263
$$ packed form
6587A61303L1629O0400q1845n0735L4584O8285R7483k3078J0660Q1517l9229k52796
6575I8178J26843r3724q3920r972R6885P2751l5713J20105J8345j31629o0575
6564A17574l6752J35939k0589J07859O7939j98184k12418K40813n192k41327K41084
6553A96746k4098j5686N1865j24909J02573M8892r1989L5538J11956r869k4935
6542B56084P910K4885p1801j03904O9325J13989k35592K04511p8472J08422l071
6531B92286m6851N3175J5860p7432r5854Q6094n9146p574o7482j44150Q7808N5192
6519I1926j00044J28082k7738L2547n391L0093N7770j20277j11855J51182O5796
6508A92091M4295j18539j35362j47783K5351J44296Q9917p9116m1881l7360n172
$$ plain form
6497 -69263 163900 169166 59116 126211 111117 63369 -85525 -47487 54641 119461 150548
6486 150548 114498 147720 207325 143386 224095 204842 146210 161439 272959 32490 -13063
6475 -13063 -22342 -130903 9514 3703 151202 84848 -128133 -105237 82267 82853 -33697
6464 -33697 -125223 65942 68309 86732 110507 39387 25478 -145193 -114794 -58058 -141034 8453
6452 8453 198231 97017 70450 96431 148229 -80703 -179161 -184379 -268139 -157148 6981
6441 6981 -77877 -12988 2569 -19900 79757 55777 -121903 -125287 -81523 -163521 27080 -61986
6429 -61986 -108082 -106443 4345 20587 -58698 -174388 -25440 158766 213829 147320 72494
6418 72494 157528 115066 201809 65937 86591 129834 47014 -161315 -148078 -90045 6511
$$ packed form
6497f9263K33163N266j10050O7095j5094m7748j48894L8038J02128O4820L1087
6486A50548l6050L3222N9605o3939Q0709j9253n8632J5229J11520k40469m5553
6475a3063r279j08561J40417n811J47499o6354k12981K2896J87504N86j16550
6464c3697r1526J91165K367J8423K3775p1120j3909j70671L0399N6736q2976J49487
6452H453J89778j01214k6567K5981N1798k28932r8458n218q3760J10991J64129
6441F981q4858O4889J5557k2469R9657k3980j77680l384M3764q1998J90601q9066
6429f1986m6096J639J10788J6242p9285j15690J48948J84206N5063o6509p4826
6418G2494Q5034m2462Q6743j35872K0654M3243q2820k08329J3237N8033R6556
$$ plain form
6407 6511 116868 -58738 4170 127676 202584 264807 204200 -46752 -81550 -115097 149509
6396 149509 147506 256919 169249 182919 172886 -16646 -153133 -73735 9981 94954 123563
6385 123563 100202 52798 13408 109356 159433 369793 338514 100719 3652 64074 -72904
6374 -72904 -153679 -192806 -213950 73893 236968 130768 330248 314988 220917 97104 142128
6363 142128 4301 -177127 18167 126076 91468 29931 240134 163822 72444 -25400 -92150
6352 -92150 29626 131785 164395 106146 197363 130609 172014 177424 395182 454543 275443
6341 275443 241409 238576 159390 246888 188881 157385 134451 152445 227491 106332 205635 179597
6329 179597 249171 284527 347324 238256 142658 347144 428839 549004 370856 347880 231379
$$ packed form
6407F511J10357j75606O2908J23506P4908O2223o0607k50952l4798l3547K64606
6396A49509k003J09413q7670J3670j0033j89532j36487P9398Q3716Q4973K8609
6385A23563k3361m7404l9390R5948N0077K10360l1279k37795r7067O0422j36978
6374g2904q0775l9127k1144K87843J63075j06200J99480j5260r4071j23813M5024
6363A42128j37827j81428J95294J07909l4608o1537K10203p6312r1378r7844o6750
6352i2150J21776J02159L2610n8249R1217o6754M1405N410K17758N9361j79100
6341B75443l4034k833p9186Q7498n8007l1496k2934J7994P5046j21159R9303k6038
6329A79597O9574L5356O2797j09068r5598K04486Q1695J20165j78148k2976j16501
$$ plain form
6318 231379 273566 289944 425860 533554 503057 487909 522287 226324 379358 504322 420618
6307 420618 539966 489397 546468 573696 638093 584320 662336 718212 651007 744252 645873
6296 645873 573757 663927 583465 604325 627585 578215 462992 591844 545444 739766 723250
6285 723250 768604 579520 272456 146510 211985 418071 512936 568088 453485 439113 377746
6274 377746 409091 454232 425059 470084 244918 157565 464613 512117 416563 380687 392903
6263 392903 532251 490781 440008 326077 384143 413666 527730 500530 534880 455426 430350
6252 430350 447078 217914 113556 29248 258130 304427 115068 80754 186068 259141 279851
6241 279851 106348 299216 319752 348622 490599 398795 390378 355851 499613 400083 330983
$$ packed form
6318B31379M2187J6378J35916J07694l0497j5148L4378k95963J53034J24964q3704
6307D20618J19348n0569N7071K7228O4397n3773P8016N5876o7205R3245r8379
6296F45873p2116R0170q0462K0860K3260m9370j15223J28852m6400J94322j6516
6285G23250M5354j89084l07064j25946O5475K06086R4865N5152j14603j4372o1367
6274C77746L1345M5141k9173M5025k25166q7353L07048M7504r5554l5876J2216
6263C92903J39348m1470n0773j13931N8066K9523J14064k7200L4350p9454k5076
6252D30350J6728k29164j04358q4308K28882M6297j89359l4314J05314P3073K0710
6241B79851j73503J92868K0536K8870J41977r1804q417l4527J43762r9530o9100
$$ plain form
6230 330983 360193 459717 403731 509172 585647 441828 528751 399194 286417 367019 509393
6219 509393 606773 534544 237398 269994 535604 595924 535389 383594 474349 644203 552226
6208 552226 404471 530429 594134 327295 260975 321343 574271 659741 604381 340046 388799
6197 388799 449483 512782 388686 407466 436934 545928 531351 435954 508907 474224 451972
6186 451972 438665 578242 446892 615155 601152 684822 651508 748165 813763 714235 706301
6175 706301 803859 687485 845356 735661 611610 740061 877520 850176 748844 1068686
6165 1068686 939724 710425 645394 703623 705585 600111 646846 674096 615677 885822 834387
6154 834387 661748 789853 908220 1154473 976556 884776 1115235 1185889 1108388 1106395 1077724
$$ packed form
6230C30983K9210R9524n5986J05441P6475j43819Q6923j29557j12777Q0602J42374
6219E09393R7380p2229k97146L2596K65610O0320o0535j51795R0755J69854r1977
6208E52226j47755J25958O3705k66839o6320O0368K52928Q5470n5360k64335M8753
6197C88799O0684O3299j24096J8780K9468J08994j4577r5397P2953l4683k2252
6186D51972j3307J39577j31350J68263j4003Q3670l3314R6657O5598r9528p934
6175G06301R7558j16374J57871j09695j24051J28451J37459k7344j01332L19842
6165A068686j28962k29299o5031N8229J962j05474M6735K7250n8419K70145n1435
6154H34387j72639J28105J18367K46253j77917r1780K30459P0654p7501j993k8671
$$ plain form
6143 1077724 920696 1114148 1213811 1016226 1027328 1021439 936037 1055747 1020207 1129319 1211354
6132 1211354 1118359 1188540 1263331 1400252 1389283 1361196 1402377 1239848 1288050 1392965 1539645
6121 1539645 1515347 1417500 1524596 1481418 1459010 1566268 1598376 1799949 1726834 1757498 1832272
6110 1832272 1948587 1983086 1950022 1795166 1911435 2055475 1975073 1953402 2064654 2017248
6100 2017248 1852211 1986200 2228293 2182982 2130867 2187143 2230850 2200693 2304480 2299855 2443551
6089 2443551 2667527 2633736 2540319 2529344 2817318 2893971 2771390 2763055 2903457 2792461 2686780
6078 2686780 2873903 3110986 3209440 3277339 3416109 3507328 3527195 3646668 3672720 3942539
6068 3942539 4096182 3965141 3940878 4131708 3991251 4156786 4226279 4164307 4315562 4530927
$$ packed form
6143A077724j57028J93452R9663j97585J1102n889q5402J19710l5540J09112Q2035
6132A211354r2995P0181P4791J36921j0969k8087M1181j62529M8202J04915J46680
6121A539645k4298r7847J07096m3178k2408J07258L2108K01573p3115L0664P4774
6110A832272J16315L4499l3064j54856J16269J44040q0402k1671J11252m7406
6100B017248j65037J33989K42093m5311n2115N6276M3707l0157J03787m625J43696
6089B443551K23976l3791r3417j0975K87974P6653j22581q335J40402j10996j05681
6078B686780J87123K37083R8454O7899J38770R1219J9867J19473K6052K69819
6068C942539J53643j31041k4263J90830j40457J65535O9493o1972J51255K15365
$$ plain form
6058 4530927 4743028 4803800 4988938 5072067 4942942 5246319 5435786 5504727 5540721 5631321
6048 5631321 5812205 6046375 6212097 6272124 6494527 6602714 6697162 6978442 7183805 7238743
6038 7238743 7493244 7900141 8087919 8218607 8318817 8411823 8891485 9121358 9288880 9727284
6028 9727284 9875241 10130959 10337545 10637292 11044393 11339977 11391276 11701795 11987077 12354130
6018 12354130 12820939 13079849 13731967 14170717 14671373 15244257 15892700 16511397 17138026
6009 17138026 17674909 18338828 19097328 19816160 20877136 21587060 22345500 23375400 24732400
6000 24732400 25936127 26951278 28549031 30264709 31733590 33778688 35778361 37688115
5992 37688115 39766598 42264210 44786148 47431670 50300241 53067247 55928533 58451940
$$ packed form
6058D530927K12101O0772J85138Q3129j29125L03377J89467O8941L5994R0600
6048E631321J80884K34170J65722O0027K22403J08187R4448K81280K05363N4938
6038G238743K54501M06897J87778J30688J00210R3006M79662K29873J67522M38404
6028I727284J47957K55718K06586K99747M07101K95584N1299L10519K85282L67053
6018A2354130M66809K58910O52118M38750N00656N72884O48443O18697O26629
6009A7138026N36883O63919P58500P18832J060976P09924P58440J029900J357000
6000B4732400J203727J015151J597753J715678J468881K045098J999673J909754
5992C7688115K078483K497612K521938K645522K868571K767006K861286K523407
$$ plain form
5984 58451940 60848394 62978244 64874681 66212512 67017178 67329786 67544026 67405705 67235439
5975 67235439 67228123 67318625 67881550 68906477 70208148 71926475 73450295 74960365 76157996
5966 76157996 77774109 79766387 82425659 85594326 89275404 93171656 97058719 101057411
5958 101057411 104956759 108679921 111377617 112828021 113073961 111927732 109328774 105333476
5950 105333476 100793603 96138431 91322935 86770163 82555610 79019328 76103879 73414950
5942 73414950 71136410 69296445 67932710 66880335 65923438 65509057 65378057 65259676 65163321
5933 65163321 65500596 65591726 65959813 66171470 65922342 65517994 64378281 63015981 61230373
5924 61230373 58764903 56065354 52954186 49719353 46543776 43905482 41226591 38429295
$$ packed form
5984E8451940K396454K129850J896437J337831Q04666L12608K14240j38321j70266
5975F7235439p316R0502N62925J024927J301671J718327J523820J510070J197631
5966G6157996J616113J992278K659272L168667L681078L896252L887063L998692
5958A01057411L899348L723162K697696J450404K45940j146229k598958l995298
5950A05333476m539873m655172m815496m552772m214553l536282k915449k688929
5942G3414950k278540j839965j363735j052375r56897m14381j31000j18381r6355
5933F5163321L37275R1130L68087K11657k49128m04348j139713j362300j785608
5924F1230373k465470k699549l111168l234833l175577k638294k678891k797296
$$ plain form
5916 38429295 36194557 33905868 32037141 30324222 28644562 27040938 25742147 24554589
5908 24554589 23196331 22118183 21120952 20216186 19350657 18447518 17560121 17076078 16605149
5899 16605149 15914663 15396012 14865286 14383936 13975663 13285551 12793964 12395826 11938221
5890 11938221 11565535 11163013 10805593 10524554 10258496 10189582 10029211 9627944 9210779 9016977
5880 9016977 8736567 8432551 8344922 8301230 8088478 7937999 7681483 7487221 7267651 6999860
5870 6999860 6982108 6690361 6467906 6336411 6390747 6337405 6055207 5922805 5812988 5533599
5860 5533599 5300620 5167178 5244467 5215739 5116914 4932605 4831703 4767444 4723993 4687131 4538213
5849 4538213 4281081 4253083 4109077 4157062 4130446 3911697 3795197 3622726 3720171 3594519
$$ packed form
5916C8429295k234738k288689j868727j712919j679660j603624j298791j187558
5908B4554589j358258j078148r97231r04766q65529r03139q87397m84043m70929
5899A6605149o90486n18651n30726m81350m08273o90112m91587l98138m57605
5890A1938221l72686m02522l57420k81039k66058o8914j60371m01267m17165j93802
5880I016977k80410l04016q7629m3692k12752j50479k56516j94262k19570k67791
5870F999860j7752k91747k22455j31495N4336n3342k82198j32402j09817k79389
5860E533599k32979j33442P7289k8728r8825j84309j00902o4259m3451l6862j48918
5849D538213k57132k7998j44006M7985k6616k18749j16500j72471R7445j25652
$$ plain form
5839 3594519 3623572 3601998 3420297 3309915 3328690 3328253 3232508 2980687 2979519 3162526 3045344
5828 3045344 2830650 2846365 2790935 2811930 2829270 2804540 2615725 2380691 2384666 2302611 2373928
5817 2373928 2442961 2450514 2237817 2204211 2518512 2417673 2250747 2223297 1914347 1761768
5807 1761768 1968618 2156079 2016309 1911514 1947571 1854957 2060492 2241475 2123759 1891581
5797 1891581 1894863 1928674 1881864 1897809 1728352 1688280 1885635 1822224 1716637 1529124 1415564
5786 1415564 1366296 1366973 1588409 1719199 1531145 1658168 1697851 1603433 1552239 1498380 1611623
5775 1611623 1678227 1659556 1697699 1577260 1514913 1561957 1404735 1566764 1415568 1446891 1494342
5764 1494342 1406458 1559183 1523022 1579168 1601043 1642010 1526471 1502678 1480583 1485022 1474386
$$ packed form
5839C594519K9053k1574j81701j10382J8775m37r5745k51821j168J83007j17182
5828C045344k14694J5715n5430K0995J7340k4730j88815k35034L975q2055P1317
5817B373928O9033P553k12697l3606L14301j00839j66926k7450l08950j52579
5807A761768K06850J87461j39770j04795L6057r2614K05535J80983j17716k32178
5797A891581L282L3811m6810J5945j69457m0072J97355o3411j05587j87513j13560
5786A415564m9268O77K21436J30790j88054J27023L9683r4418n1194n3859J13243
5775A611623O6604j8671L8143j20439o2347M7044j57222J62029j51196L1323M7451
5764A494342q7884J52725l6161N6146K1875M0967j15539k3793k2095M439j0636
$$ plain form
5753 1474386 1364449 1305447 1384086 1423646 1223412 1238554 1142041 1213209 1056383 1140904 1090155
5742 1090155 992012 871965 996630 1017461 1078219 1069936 1006657 1120633 1398274 1242484 1050204
5731 1050204 1078486 946324 988241 1097148 1139013 1069928 1209700 1125004 997917 865941
5721 865941 882916 762075 776804 814041 948817 959641 987467 824740 801441 661845 575718
5710 575718 641065 454740 493832 547121 506453 851263 871110 781840 879552 959185 998538
5699 998538 945954 677759 577942 647652 474688 545079 548926 703754 605124 562533 357580
5688 357580 285748 436184 388617 455946 499374 414073 325758 337259 507465 687427 601962
5677 601962 444318 509753 654239 755776 669492 640961 566086 531310 604129 841871 683965
$$ packed form
5753A474386j09937n9002P8639L9560k00234J5142r6513P1168j56826Q4521n0749
5742A090155r8143j20047J24665K0831O0758q283o3279J13976K77641j55790j92280
5731A050204K8282j32162M1917J08907M1865o9085J39772q4696j27087j31976
5721H65941J6975j20841J4729L7237J34776J0824K7826j62727k3299j39596q6127
5710E75718O5347j86325L9092N3289m0668L44810J9847q9270R7712P9633L9353
5699I98538n2584k68195r9817O9710j72964P0391L847J54828r8630m2591k04953
5688C57580p1832J50436m7567O7329M3428q5301q8315J1501J70206J79962q5465
5677F01962j57644O5435J44486J01537q6284k8531p4875l4776P2819K37742j57906
$$ plain form
5666 683965 559877 717287 746388 699113 590679 672945 952481 1001565 1007288 849445 814677
5655 814677 1133923 1086768 1135962 1322038 1320959 971502 756445 735408 813500 857400 793322
5644 793322 848200 818990 926467 1168253 947108 913619 996795 1197286 1029005 821682
5634 821682 890343 992630 1030350 851206 781056 731446 841427 802592 910825 993321 993145
5623 993145 902196 926767 934233 989425 819636 831639 1048766 952050 865683 1279107 1460628
5612 1460628 1170254 1124078 996591 1152765 1134095 996409 885119 888470 860908 973830
5602 973830 882446 796519 750302 1184713 1232780 1078076 1111954 1127977 1186814 1029753 1001882
5591 1001882 1030911 1028365 978427 798028 838611 907835 1067055 1000953 749371 943043 1000191
$$ packed form
5666F83965j24088J57410K9101m7275j08434Q2266K79536M9084N723j57843l4768
5655H14677L19246m7155M9194J86076j079l49457k15057k1037P8092M3900o4078
5644G93322N4878k9210J07477K41786k21145l3489Q3176K00491j68281k07323
5634H21682O8661J02287L7720j79144p0150m9610J09981l8835J08233Q2496j76
5623I93145r0949K4571P466N5192j69789J2003K17127r6716q6367M13424J81521
5612A460628k90374m6176j27487J56174j8670j37686j11290L351k7562J12922
5602I73830r1384q5927m6217M34411M8067j54704L3878J6023N8837j57061k7871
5591A001882K9029k546m9938j80399M0583O9224J59220o6102k51582J93672N7148
$$ plain form
5580 1000191 975038 998549 1080759 1044890 907841 792746 905013 797117 728226 820930 920699
5569 920699 1033397 1082839 1102159 1087809 1027517 1147226 1290302 1179690 872589 1013901
5559 1013901 1190015 1224788 1394859 1401320 1263150 1387046 1640488 1725416 1894956 1974880
5549 1974880 1966171 2277574 2346690 2526061 2746330 2860725 2949605 3139908 3175374 3026565
5539 3026565 2977720 2763355 2614493 2445217 2181238 1995161 2228527 2318316 2333152 2331914
5529 2331914 2374145 2368315 2334301 2359090 2517513 2705357 2885561 2997149 3372836 3650668
5519 3650668 3908098 4052639 4103748 4503049 5013358 5317833 5336270 5532041 5458378 4933823
5509 4933823 4414482 3851551 3489670 3278866 3059000 2957711 2836499 2758862 2712571 2713187
$$ packed form
5580A000191k5153K3511Q2210l5869j37049j15095J12267j07896o8891R2704R9769
5569I20699J12698M9442J9320j4350o0292J19709J43076j10612l07101J41312
5559A013901J76114L4773J70071O461j38170J23896K53442Q4928J69540P9924
5549A974880q709L11403O9116J79371K20269J14395Q8880J90303L5466j48809
5539C026565m8845k14365j48862j69276k63979j86077K33366Q9789J4836j238
5529B331914M2231n830l4014K4789J58423J87844J80204J11588L75687K77832
5519C650668K57430J44541N1109L99301N10309L04475J8437J95771p3663n24555
5509D933823n19341n62931l61881k10804k19866j01289j21212p7637m6291O16
$$ plain form
5499 2713187 2640782 2584544 2385029 2413266 2419737 2280512 2508204 2757183 2844247 2719086 2911067
5488 2911067 2961909 3000491 3081226 3126740 3356934 3379736 3234447 2933890 2831239 2564288
5478 2564288 2455458 2279937 2153522 1980324 1958587 1915585 2010360 1811778 1461238 1424457
5468 1424457 1601041 1696257 1414373 1364444 1346245 1351143 1536113 1661840 1751781 1619846 1482173
5457 1482173 1437205 1436580 1383150 1345773 1434163 1526207 1554634 1264448 1307593 1349577 1256182 1253591
5445 1253591 1435773 1381434 1132816 1308195 1279660 1290500 1145123 1025888 1051250 1045522 1266383
5434 1266383 1236097 1124267 1062478 932021 978189 1164659 1003670 937494 953045 973514 1225621
5423 1225621 1489567 1459390 1385593 1251866 1117983 1104654 870258 711148 628023 709369
$$ packed form
5499B713187p2405n6238j99515K8237O471j39225K27692K48979Q7064j25161J91981
5488B911067N0842L8582Q0735M5514K30194K2802j45289l00557j02651k66951
5478B564288j08830j75521j26415j73198k1737m3002R4775j98582l50540l6781
5468A424457J76584R5216k81884m9929j8199M898J84970J25727Q9941j31935j37673
5457A482173m4968o25n3430l7377Q8390R2044K8427k90186M3145M1984r3395k591
5445A253591J82182n4339k48618J75379k8535J0840j45377j19235K5362n728K20861
5434A266383l0286j11830o1789j30457M6168J86470j60989o6176J5551K0469K52107
5423A225621K63946l0177p3797j33727j33883j3329k34396j59110q3125Q1346
$$ plain form
5413 709369 727628 724245 789970 818174 802435 797613 888600 806839 750507 917054 918860 819293
5401 819293 884935 910334 874182 766532 769359 824781 788391 764826 771497 875717 892563 1044268
5389 1044268 908748 718808 741880 709946 682689 578782 581723 444333 653859 512972
5379 512972 547408 435467 436511 444569 501083 381593 351715 471807 579572 746733 716306
5368 716306 588281 473730 512193 420474 457250 392032 601882 495606 378795 568613
5358 568613 577149 488099 370121 518367 586011 661845 648884 615438 533099 497546 503015 444707
5346 444707 554729 564682 592379 748799 580503 372775 529975 651195 665568 459234
5336 459234 354503 491846 531837 412303 369330 548928 602208 554790 759308 634231
$$ packed form
5413G09369J8259l383O5725K8204j5739m822R0987q1761n6332J66547J806r9567
5401H19293O5642K5399l6152j07650K827N5422l6390k3565O671J04220J6846J51705
5389A044268j35520j89940K3072l1934k7257j03907K941j37390K09526j40887
5379E12972L4436j11941J044Q058N6514j19490k9878J20092J07765J67161l0427
5368G16306j28025j14551L8463r1719L6776o5218K09850j06276j16811J89818
5358E68613Q536q9050j17978J48246O7644P5834j2961l3446q2339l5553N469n8308
5346D44707J10022R953K7697J56420j68296k07728J57200J21220J4373k06334
5336D59234j04731J37343L9991j19534m2973J79598N3280m7418K04518j25077
$$ plain form
5326 634231 634952 600748 542733 679854 707067 706903 772627 684694 570089 669603 773249 651598
5314 651598 818162 866815 715425 728969 735990 677020 630019 743269 771742 579093 424802
5303 424802 621492 702557 673500 564354 784231 760768 688586 870643 955913 1038653 859534
5292 859534 872450 870395 1013935 1053977 1003828 1197190 1095655 1042583 996723 984560 1043487
5281 1043487 874114 727600 945898 1181636 967189 1016482 1074760 989642 942013 1008342
5271 1008342 1080240 1169121 986917 1079164 1108478 1100982 1352212 1322302 1223490 1402786 1300343
5260 1300343 1328075 1306741 1592441 1647348 1526487 1303701 1348939 1492295 1436211 1410331 1518283
5249 1518283 1848336 1601607 1442283 1438077 1550680 1536153 1463046 1431085 1421105 1295214 1427396
$$ packed form
5326F34231P21l4204n8015J37121K7213j64O5724q7933j14605R9514J03646j21651
5314F51598J66564M8653j51390J3544P021n8970m7001J13250K8473j92649j54291
5303D24802J96690Q1065k9057j09146K19877k3463p2182J82057Q5270Q2740j79119
5292H59534J2916k055J43540M0042n0149J93362j01535n3072m5860j2163N8927
5281A043487j69373j46514K18298K35738k14447M9293N8278q5118m7629O6329
5271A008342P1898Q8881j82204R2247K9314p496K51230k9910r8812J79296j02443
5260A300343K7732k1334K85700N4907j20861k22786M5238J43356n6084k5880J07952
5249A518283L30053k46729j59324m206J12603j4527p3107l1961r980j25891J32182
$$ plain form
5238 1427396 1561793 1679166 1573646 1436732 1354787 1668097 1692499 1763807 1639263 1599075
5228 1599075 1605142 1684776 1558675 1641813 1728060 1648393 1700836 1823842 1725607 1733149 1836286
5217 1836286 1888874 1937243 1725490 1582334 1642110 1811333 1572948 1671584 1735796 1526670
5207 1526670 1394677 1540883 1462545 1562934 1425383 1597790 1532265 1423668 1395084 1556378
5197 1556378 1536450 1211044 1161846 1286489 1497702 1401136 1372194 1368401 1493664 1525533 1353820
5186 1353820 1204536 1329229 1529997 1650303 1404885 1070634 1043373 1127593 1128823 1183439
5176 1183439 1201836 1185172 1243389 1090760 1146095 957865 1003045 1288717 1280495 1056177 983047
5165 983047 1073010 1141849 1176383 1152457 1267653 1232468 1469746 1371792 1242269 1228669 1418933
$$ packed form
5238A427396J34397J17373j05520j36914q1945L13310K4402P1308j24544m0188
5228A599075O067P9634j26101Q3138Q6247p9667N2443J23006r8235P542J03137
5217A836286N2588M8369k11753j43156N9776J69223k38385R8636O4212k09126
5207A526670j31993J46206p8338J00389j37551J72407o5525j08597k8584J61294
5197A556378j9928l25406m9198J24643K11213r6566k8942l793J25263L1869j71713
5186A353820j49284J24693K00768J20306k45418l34251k7261Q4220J230N4616
5176A183439J8397j6664N8217j52629N5335j88230M5180K85672q222k24318p3130
5165I83047Q9963O8839L4534k3926J15196l5185K37278r7954j29523j3600J90264
$$ plain form
5154 1418933 1284452 1168301 1166699 1248430 1299965 1188743 1105466 1086062 977851 1069091 1212799
5143 1212799 1247362 1162654 1126523 963825 1020157 1230681 1220639 1182035 1323975 1253506 936475
5132 936475 1175270 1424695 1191681 1200290 1207381 1178803 1271207 1315288 1580656 1465347 1402240
5121 1402240 1363229 1332862 1420785 1347279 1477120 1714970 1436947 1638088 1856439 2010921
5111 2010921 2068372 1998220 1761365 1768712 1720398 1513291 1555196 1537966 1435338 1467614 1743694
5100 1743694 1781960 1909174 1811903 1572895 1555518 1467763 1479720 1557622 1510062 1499440 1603796
5089 1603796 1563535 1647427 1855024 1708219 1696107 1510549 1669232 1815578 1709289 1670660
5079 1670660 1753763 1617327 1422170 1613034 1642756 1734177 1577931 1611539 1673071 1708398 1854723
$$ packed form
5154A418933j34481j16151j602Q1731N1535j11222q3277j9404j08211R1240J43708
5143A212799L4563q4708l6131j62698N6332K10524j0042l8604J41940p0469l17031
5132I36475K38795K49425k33014Q609P091k8578R2404M4081K65368j15309o3107
5121A402240l9011l0367Q7923p3506J29841K37850k78023K01141K18351J54482
5111B010921N7451p0152k36855P347m8314k07107M1905j7230j02628L2276K76080
5100A743694L8266J27214r7271k39008j7377q7755J1957P7902m7560j0622J04356
5089A603796m0261Q3892K07597j46805j2112j85558J58683J46346j06289l8629
5079A670660Q3103j36436j95157J90864K9722R1421j56246L3608O1532L5327J46325
$$ plain form
5068 1854723 1910335 1888285 2053319 2260835 2383723 2379998 2399122 2261352 2096725 1925759
5058 1925759 1748291 1634427 1655606 1626787 1634977 1637297 1560075 1425855 1334100 1380688 1497175
5047 1497175 1383810 1465124 1674511 1606837 1503441 1357261 1190821 1246696 1300584 1343134
5037 1343134 1321219 1329339 1313914 1159920 1105094 1122478 1236925 1365275 1462938 1327422 1402099
5026 1402099 1391174 1337483 1559793 1616546 1516162 1392590 1419194 1463243 1479313 1436980 1481790
5015 1481790 1357316 1364526 1537234 1432403 1287136 1357668 1551830 1481159 1488817 1450730 1366469
5004 1366469 1350346 1502651 1567211 1718040 1482523 1372277 1441808 1572550 1578210 1506669 1420925
4993 1420925 1586418 1613417 1547401 1625225 1561795 1609461 1573521 1707543 1722281 1739127 1690693
$$ packed form
5068A854723N5612k2050J65034K07516J22888l725J9124j37770j64627j70966
5058A925759j77468j13864K1179k8819Q190K320p7222j34220r1755M6588J16487
5047A497175j13365Q1314K09387o7674j03396j46180j66440N5875N3888M2550
5037A343134k1915Q120j5425j53994n4826J7384J14447J28350R7663j35516P4677
5026A402099j0925n3691K22310N6753j00384j23572K6604M4049J6070m2333M4810
5015A481790j24474P210J72708j04831j45267P0532J94162p0671P658l8087q4261
5004A366469j6123J52305O4560J50829k35517j10246O9531J30742N660p1541q5744
4993A420925J65493K6999o6016P7824o3430M7666l5940J34022J4738J6846m8434
$$ plain form
4982 1690693 1565048 1755402 1729197 1754970 1499712 1612119 1768548 1648897 1740364 1667020
4972 1667020 1727346 1932578 2022550 2077567 2181745 2048837 1968800 2030498 1960171 2011986 2026813
4961 2026813 1972137 1954206 2077345 2206149 2139542 2134312 2292790 2330872 2369255 2432067 2635653
4950 2635653 2578752 2346687 2338206 2347581 2447248 2746997 2631994 2560258 2707243 2458614 2468112
4939 2468112 2562718 2691975 2690286 2610173 2670215 2678747 2680009 2589361 2762296 2898740 2856103
4928 2856103 3131491 3263846 3066563 2913816 3138649 3125062 3025181 3203412 3507304 3392905
4918 3392905 3423091 3311814 3427448 3466596 3456993 3641360 3920016 3856914 3787707 4022854 4004393
4907 4004393 3972121 3981419 4197196 4421539 4287825 4244919 4290980 4460097 4585388 4465046
$$ packed form
4982A690693j25645J90354k6205K5773k55258J12407J56429j19651R1467p3344
4972A667020O0326K05232Q9972N5017J04178j32908q0037O1698p0327N1815J4827
4961B026813n4676j7931J23139J28804o6607n230J58478L8082L8383O2812K03586
4950B635653n6901k32065q481R375R9667K99749j15003p1736J46985k48629R498
4939B468112R4606J29257j689q0113O0042Q532J262r0648J72935J36444m2637
4928B856103K75388J32355j97283j52747K24833j3587r9881J78231L03892j14399
4918C392905L0186j11277J15634L9148r603J84367K78656o3102o9207K35147j8461
4907D004393l2272R298K15777K24343j33714m2906M6061J69117J25291j20342
$$ plain form
4897 4465046 4578280 4757353 4789115 4841620 5075523 5098992 5107207 5182070 5371023 5370856 5306605
4886 5306605 5581119 5771747 5867647 5956245 5843328 5966940 6214312 6506955 6559340 6616926
4876 6616926 6835456 7030758 7166019 7233086 7411625 7576545 7799299 7842172 8250088 8442171
4866 8442171 8678312 8901743 8986576 8965945 9347541 9577276 9891203 10204098 10394149 10818795
4856 10818795 11166552 11601022 11915410 12151244 12618233 13124617 13432430 14029449 14572195
4847 14572195 15139943 15708729 16136934 16605167 17265498 17871948 18664842 19200649 19724915
4838 19724915 20445006 21251544 21815617 22407741 23102117 23902125 24285070 24867067 25747001
4829 25747001 26420834 26933296 27523596 28192395 28932282 29544451 30271463 30950286 31638000
$$ packed form
4897D465046J13234J79073L1762N2505K33903K3469Q215P4863J88953j67o4251
4886E306605K74514J90628R5900Q8598j12917J23612K47372K92643N2385N7586
4876F616926K18530J95302J35261O7067J78539J64920K22754M2873M07916J92083
4866H442171K36141K23431Q4833k0631L81596K29735L13927L12895J90051M24646
4856A0818795L47757M34470L14388K35834M66989N06384L07813N97019N42746
4847A4572195N67748N68786M28205M68233O60331O06450P92894N35807N24266
4838A9724915P20091Q06538N64073N92124O94376Q00008L82945N81997Q79934
4829B5747001O73833N12462N90300O68799P39887O12169P27012O78823O87714
$$ plain form
4820 31638000 32405503 33163573 33987458 34675733 35356113 36271301 37058680 37850442 38709009
4811 38709009 39679572 40635198 41504407 42626286 43613969 44543292 45537160 46543872 47410420
4802 47410420 48444051 49247670 49979305 50970865 51909602 53046693 54140030 54893206 55663397
4793 55663397 56466413 57430888 58140441 58641837 59241632 59800123 60321468 60714825 61209797
4784 61209797 61322468 61691340 61811350 61876075 62341709 62605408 62952166 63051644 63236969 63596815
4774 63596815 63824259 63993977 64212126 64184750 64052056 63976979 64153560 64242293 64298952 63825840
4764 63825840 63899306 64050880 63838993 63836004 63654335 63472035 63404302 63347729 63361992 63234702
4754 63234702 62953843 62619615 62402725 62234921 61906811 61392962 60760554 60144846 59440716
$$ packed form
4820C1638000P67503P58070Q23885O88275O80380R15188P87379P91762Q58567
4811C8709009R70563R55626Q69209J121879R87683R29323R93868J006712Q66548
4802D7410420J033631Q03619P31635R91560R38737J137091J093337P53176P70191
4793E5663397Q03016R64475P09553N01396N99795N58491N21345L93357M94972
4784F1209797J12671L68872J20010O4725M65634K63699L46758R9478J85325L59846
4774F3596815K27444J69718K18149k7376j32694p5077J76581Q8733N6659m73112
4764F3825840P3466J51574k11887k989j81669j82300o7733n6573J4263j27290
4754F3234702k80859l34228k16890j67804l28110n13849o32408o15708p04130
$$ plain form
4745 59440716 58707490 57927498 57295513 56568088 55411738 54311284 53256288 52393472 51519490
4736 51519490 50485398 49431777 48415502 47634988 46455579 45630835 44914907 43902834 43035544
4727 43035544 42060085 41328415 40444398 39679675 38945846 38156943 37248669 36373822 35663567
4718 35663567 34849088 34104883 33559194 32878047 31964266 31191272 30472643 29754362 29130868
4709 29130868 28805032 27958635 27224327 26397763 25736741 25233572 24443681 23913597 23250792
4700 23250792 22376513 21744644 21081350 20206329 19532773 18792853 18038410 17460851 17082183
4691 17082183 16588206 15832728 15331899 14950304 14544609 13914566 13610963 13070446 12756065
4682 12756065 12566111 12172202 11930443 11732492 11322736 10948983 10859764 10651612 10388276 10170645
$$ packed form
4745E9440716p33226p79992o31985p27425j156350j100454j054996q62816q73982
4736E1519490j034092j053621j016275p80514j179409q24744p15928j012073q67290
4727D3035544r75459p31670q84017p64723p33829p88903r08274q74847p10255
4718C5663567q14479p44205n45689o81147r13781p72994p18629p18281o23494
4709B9130868l25836q46397p34308q26564o61022n03169p89891n30084o62805
4700B3250792q74279o31869o63294q75021o73556p39920p54443n77559l78668
4691A7082183m93977p55478n00829l81595m05695o30043l03603n40517l14381
4682A2756065j89954l93909k41759j97951m09756l73753q9219k08152k63336k17631
$$ plain form
4672 10170645 9873802 9684443 9580446 9166524 8872656 8670797 8453566 8273002 8029196
4663 8029196 7740808 7857038 7773318 7630986 7383630 7087099 7008742 6967100 6740323 6755630
4653 6755630 6546027 6411617 6145362 6125440 6220727 6259956 6105969 5864517 5972254 5833507
4643 5833507 5683823 5524390 5442204 5246146 5295650 5240684 5146180 5177974 5110425 5040232 4962900
4632 4962900 4910223 4906208 4875619 4732411 4439636 4474158 4394733 4358750 4312794 4172029 4120055
4621 4120055 4193991 4326859 4335816 4225711 4236705 4222063 4087375 3774754 3812532 3883657 3889013
4610 3889013 3730134 3625238 3614280 3445909 3461403 3615290 3555505 3388716 3532308 3352978
4600 3352978 3276377 3260941 3400958 3252678 3246052 3188869 3286227 3395203 3227665 3228535 3378403
$$ packed form
4672A0170645k96843j89359j03997m13922k93868k01859k17231j80564k43806
4663H029196k88388J16230q3720j42332k47356k96531p8357m1642k26777J5307
4653F755630k09603j34410k66255j9922R5287L9229j53987k41452J07737j38747
4643E833507j49684j59433q2186j96058M9504n4966r4504L1794o7549p0193p7332
4632D962900n2677m015l0589j43208k92775L4522p9425l5983m5956j40765n1974
4621D120055P3936J32868Q957j10105J0994j4642j34688l12621L7778P1125N356
4610C889013j58879j04896j0958j68371J5494J53887n9785j66789J43592j79330
4600C352978p6601j5436J40017j48280o626n7183R7358J08976j67538Q70J49868
$$ plain form
4589 3378403 3303461 3129475 3246642 3259454 2950638 2808045 2755736 2615657 2706060 2687149
4579 2687149 2609493 2845106 2845768 2817679 2849393 2753838 2719782 2733527 2948814 2762147 2500683
4568 2500683 2727919 2881113 2774878 2822287 2815517 2672987 2658740 2715199 2600238 2674375 2603312
4557 2603312 2671179 2643423 2578352 2348677 2428130 2391982 2312786 2238229 2183327 2228725 2198695
4546 2198695 2264029 2295130 2452604 2530909 2448209 2060544 1922309 1894421 1921558 2008811 1975489
4535 1975489 2182166 2242371 2124325 2210470 2385840 2271758 2234376 2542707 2601271 2407590
4525 2407590 2260845 2233114 2168296 2059757 2019715 2054308 2093125 2170707 2021651 2101274 2268673
4514 2268673 2289640 2134854 2136232 2332863 2529571 2183575 2094085 2330629 2436003 2379894
$$ packed form
4589C378403p4942j73986J17167J2812l08816j42593n2309j40079R0403j8911
4579B687149p7656K35613O62k8089L1714r5555l4056J3745K15287j86667k61464
4568B500683K27236J53194j06235M7409o770j42530j4247N6459j14961P4137p1063
4557B603312O7867k7756o5071k29675P9453l6148p9196p4557n4902M5398l0030
4546B198695O5334L1101J57474P8305q2700l87665j38235k7888K7137Q7253l3322
4535A975489K06677O0205j18046Q6145J75370j14082l7382L08331N8564j93681
4525B407590j46745k7731o4818j08539m0042L4593L8817P7582j49056P9623J67399
4514B268673K0967j54786J378J96631J96708l45996q9490K36544J05374n6109
$$ plain form
4504 2379894 2509970 2640267 2601666 2714370 2499768 2138985 2282512 2542291 2572848 2449628
4494 2449628 2294127 2399533 2711093 2729923 2692286 2752758 2870111 2732897 2732844 2704515 2772600
4483 2772600 2908381 2785771 2750133 2828045 2886368 2808857 2798032 2765641 2863828 2817127 2870664
4472 2870664 2925299 2997417 2897221 2994888 2983822 2860980 3046875 3157996 3131095 3226524 3250650
4461 3250650 3227881 3281899 3319506 3482580 3438023 3536119 3842944 3807123 3714872 3906097 3934528
4450 3934528 4120868 4385063 4131987 4062656 4045804 4136125 4205826 4391098 4411193 4444226 4575319
4439 4575319 4732670 4724571 4736967 5031146 5009395 4939848 5034013 5194614 5095540 5100062 5321161
4428 5321161 5371813 5791332 5792884 5455957 5530969 5684882 5713568 5793851 5883678 6068479 6442443
$$ packed form
4504B379894J30076J30297l8601J12704k14602l60783J43527K59779L0557j23220
4494B449628j55501J05406L11560J8830l7637O0472J17353j37214n3k8329O8085
4483B772600J35781j22610l5638P7912N8323p7511j0825l2391R8187m6701N3537
4472B870664N4635P2118j00196R7667j1066j22842J85895J11121k6901R5429K4126
4461C250650k2769N4018L7607J63074m4557R8096L06825l5821r2251J91225K8431
4450C934528J86340K64195k53076o9331j6852R0321O9701J85272K0095L3033J31093
4439D575319J57351q099J2396K94179k1751o9547R4165J60601r9074M522K21099
4428E321161N0652M19519J552l36927P5012J53913K8686Q0283Q9827J84801L73964
$$ plain form
4417 6442443 6444860 6575632 6643118 6745533 7022755 7087706 7312790 7509200 7586619 7941120
4407 7941120 8294020 8404101 8681959 8972547 9410383 9567423 9811920 10128228 10603950 11166591
4397 11166591 11598297 12077463 12394590 13108147 13807089 14721968 15648188 16597163 17501597
4388 17501597 18793792 20376665 21975363 23886442 26104766 28311437 30758628 32942063
4380 32942063 34606097 36191730 37924970 39773549 42100002 44930678 48039121 50814344
4372 50814344 52802713 53567546 53496619 53810868 54912934 56586932 58856114 60830353 61510236
4363 61510236 60483658 58067724 55711689 53605395 52280503 51668684 51349122 50576531 48958881
4354 48958881 46336962 43217695 39999761 37437928 35420169 33689368 32113214 30356022
$$ packed form
4417F442443K417J30772O7486J02415K77222O4951K25084J96410P7419L54501
4407G941120L52900J10081K77858K90588M37836J57040K44497L16308M75722N62641
4397A1166591M31706M79166L17127P13557O98942R14879R26220R48975R04434
4388A7501597J292195J582873J598698J911079K218324K206671K447191K183435
4380C2942063J664034J585633J733240J848579K326453K830676L108443K775223
4372E0814344J988369P64833p0927L14249J102066J673998K269182J974239O79883
4363F1510236j026578k415934k356035k106294j324892o11819l19562p72591j617650
4354D8958881k621919l119267l217934k561833k017759j730801j576154j757192
$$ plain form
4346 30356022 28130948 25823065 23452063 21518944 19878947 18308710 16883825 16169232
4338 16169232 15597105 14759761 14069482 13611434 13140205 12612685 12179999 11823273 11546259
4329 11546259 11063987 10865039 10455507 10309042 10126972 9776340 9622263 9371150 9384460 9221646
4319 9221646 9132512 9020270 8858686 8828722 8669871 8709468 8608203 8685083 8680680 8595432 8975460
4308 8975460 9076906 8735479 8408597 8185265 8032989 7946716 7801735 7662261 7537989 7509447
4298 7509447 7385521 7357406 7390273 7329456 7421803 7179031 7430555 7443403 7585724 7550700 7515417
4287 7515417 7405958 7148065 7312412 7485755 7435682 7403401 7293313 7305667 7248938 7318064
4277 7318064 7307929 7562568 7677474 7582963 7559715 7514192 7465780 7409699 7380377 7348895 7294873
$$ packed form
4346C0356022k225074k307883k371002j933119j639997j570237j424885p14593
4338A6169232n72127q37344o90279m58048m71229n27520m32686l56726k77014
4329A1546259m82272j98948m09532j46465j82070l50632j54077k51113J3310j62814
4319I221646q9134j12242j61584k9964j58851L9597j01265P6880m403q5248L80028
4308H975460J01446l41427l26882k23332j52276q6273j44981j39474j24272k8542
4298G509447j23926k8115L2867o0817R2347k42772K51524J2848J42321l5024l5283
4287G515417j09459k57893J64347J73343n0073l2281j10088J2354n6729O9126
4277G318064j0135K54639J14906r4511k3248m5523m8412n6081k9322l1482n4022
$$ plain form
4266 7294873 7143224 7151779 7302584 7270301 7376325 7358485 7171643 7069082 7091556 7255635
4256 7255635 7211892 7228224 7266844 7326367 7487800 7644699 7379475 7205771 7404501 7463368
4246 7463368 7379014 7626368 7657604 7720300 7841410 7715460 7721117 7982883 7964502 7881409 7911175
4235 7911175 8138687 8250192 8377589 8394536 8482450 8565273 8750225 8931484 8845970 8825217
4225 8825217 8908696 9132065 9508568 9434871 9361882 9653534 9951132 9981634 10359786 10700545
4215 10700545 10743246 10749104 11099649 11452373 11547531 11943463 12348339 12462150 12844222 13348060
4205 13348060 13750014 14129133 14646324 15282823 16002012 16577841 17478620 18838749 20007606
4196 20007606 20915562 21897083 22536427 22765414 22585657 21843677 20886804 20185810 19358319
$$ packed form
4266G294873j51649Q555J50805l2283J06024j7840j86842j02561K2474J64079
4256G255635m3743J6332L8620N9523J61433J56899k65224j73704J98730N8867
4246G463368q4354K47354L1236O2696J21110j25950N657K61766j8381q3093K9766
4235G911175K27512J11505J27397J6947Q7914Q2823J84952J81259q5514k0753
4225H825217Q3479K23369L76503p3697p2989K91652K97598L0502L78152L40759
4215A0700545M2701N858L50545L52724R5158L95932M04876J13811L82072N03838
4205A3348060M01954L79119N17191O36499P19189N75829R00779J360129J168857
4196B0007606R07956R81521O39344K28987j79757p41980r56873p00994q27491
$$ plain form
4187 19358319 18598118 18112678 17913943 17949579 17738749 17597441 17394522 17738343 17898957 17915257
4177 17915257 17763061 17702583 18008475 18002334 18089155 18338848 18647637 18944103 19026232 19153469
4167 19153469 19682694 20241576 20615442 20951669 21267965 21533656 22028967 22653852 23288812
4158 23288812 23811960 24477205 25040445 25794711 26681619 27187850 27735171 28540056 29365203
4149 29365203 30364079 31357411 32171912 33412498 34526602 35728075 36852511 37882190 39163321
4140 39163321 40220887 41389712 42686722 43535557 44566317 45446895 46426798 47476978 48637513
4131 48637513 49475526 50500858 51608296 52744303 53928911 55045307 56238376 57791312
4123 57791312 59272408 60890230 62617363 64294310 66088233 68053042 70219543 72265560
$$ packed form
4187A9358319p60201m85440j98735L5636k10830j41308k02919L43821J60614J6300
4177A7915257j52196o0478L05892o141Q6821K49693L08789K96466Q2129J27237
4167A9153469N29225N58882L73866L36227L16296K65691M95311O24885O34960
4158B3288812N23148O65245N63240P54266Q86908N06231N47321Q04885Q25147
4149B9365203R98876R93332Q14501J240586J114104J201473J124436J029679J281131
4140C9163321J057566J168825J297010Q48835J030760Q80578R79903J050180J160535
4131D8637513Q38013J025332J107438J136007J184608J116396J193069J552936
4123E7791312J481096J617822J727133J676947J793923J964809K166501K046017
$$ plain form
4115 72265560 74140555 76185885 78370392 80481599 82596621 84510518 86344938 88331628
4107 88331628 90416295 92209028 93859405 95551653 96983467 98756355 100773211 102823948
4099 102823948 104894556 106917758 109000209 111320646 114091284 116695290 119718735 123094752
$$ packed form
4115G2265560J874995K045330K184507K111207K115022J913897J834420J986690
4107H8331628K084667J792733J650377J692248J431814J772888K016856K050737
4099A02823948K070608K023202K082451K320437K770638K604006L023445L376017
$$ [...]
##END NTUPLES=NMR SPECTRUM
##END=
