##TITLE=1H_EC-3268-xy
 DMSO
 8 sc, 
 18.11.2021
##JCAMPDX= 6.0         $$ Bruker NMR JCAMP-DX V2.0
##DATA TYPE= NMR SPECTRUM
##DATA CLASS= NTUPLES
##ORIGIN= UXNMR, Bruker Analytische Messtechnik GmbH
##OWNER= root
$$ XWIN-NMR		Version 3.5
$$ Thu Nov 18 11:30:25 2021 Russian Standard Time (UT+4h)  she@DPX200
##.OBSERVE FREQUENCY= 200.131346
##.OBSERVE NUCLEUS= ^1H
##.ACQUISITION MODE= SIMULTANEOUS
##.ACQUISITION SCHEME= undefined
##.AVERAGES= 8
##.DIGITISER RES= 18
##SPECTROMETER/DATA SYSTEM= spect
##.PULSE SEQUENCE= zg30
##.SOLVENT NAME= DMSO
##.SHIFT REFERENCE= (INTERNAL, DMSO, 0, 15.7271)
##AUDIT TRAIL= $$ (NUMBER, WHEN, WHO, WHERE, WHAT)
$$ ##TITLE= Audit trail, XWIN-NMR		Version 3.5
$$ ##JCAMPDX= 5.01
$$ ##ORIGIN= Bruker BioSpin GmbH
$$ ##OWNER= she
$$ F:/spectra/data/she/nmr/H-F/1/pdata/1/auditp.txt
$$ ##AUDIT TRAIL=  $$ (NUMBER, WHEN, WHO, WHERE, WHAT)
(   1,<2021-11-18 11:28:57.12 +0400>,<she>,<DPX200>,
      <created by zg, POWCHK disabled, PULCHK disabled
       configuration hash MD5:
       00 E9 B6 7A A2 85 ED C7 34 08 36 98 17 FE 4E 26
       data hash MD5: 16K
       2B 36 F6 59 52 33 A6 91 2D D5 37 47 56 02 38 19>)
(   2,<2021-11-18 11:29:02.54 +0400>,<she>,<DPX200>,
      <Start of raw data processing
       efp BC_mod = 2 LB = 0.24 FT_mod = 6 PKNL = 1 PHC0 = -15517 PHC1 = 15.80081 SI = 16K 
       data hash MD5: 16K
       EB 48 CE DD 37 44 3C D4 F9 69 01 70 74 82 41 09>)
(   3,<2021-11-18 11:29:26.07 +0400>,<she>,<DPX200>,
      <pk PHC0 = 1.645139 PHC1 = -5.6 
       data hash MD5: 16K
       CC 28 EB 7C 2A 07 DA 75 26 C4 F5 E4 25 A4 6E 7D>)
(   4,<2021-11-18 11:29:29.51 +0400>,<she>,<DPX200>,
      <abs ABSG = 5 
       data hash MD5: 16K
       3E E2 36 BE B7 FD 0C A6 93 76 9F 5F D1 53 84 89>)
$$ ##END=
$$ 
$$ hash MD5
$$ 30 01 79 F1 99 E9 87 6B 43 29 82 08 25 0C EB 5B
##$RELAX= 
##$RELAX= 
##$RELAX= 
##$RELAX= 
##$RELAX= 
##$RELAX= 
$$ Bruker specific parameters
$$ --------------------------
##$DU= <F:/spectra>
##$EXPNO= 1
##$NAME= <H-F>
##$PROCNO= 1
##$TYPE= <nmr>
##$USER= <she>
##$AMP= (0..31)
100 100 100 100 100 100 100 100 100 100 100 100 100 100 100 100 100 100 
100 100 100 100 100 100 100 100 100 100 100 100 100 100 
##$AQSEQ= 0
##$AQ_mod= 1
##$AUNM= <au_zg>
##$AUTOPOS= <>
##$BF1= 200.13
##$BF2= 200.13
##$BF3= 200.13
##$BF4= 200.13
##$BF5= 200.13
##$BF6= 200.13
##$BF7= 200.13
##$BF8= 200.13
##$BYTORDA= 1
##$CFDGTYP= 0
##$CFRGTYP= 5
##$CHEMSTR= <none>
##$CNST= (0..31)
1 1 145 1 1 1 1 1 1 1 1 1 1 1 1 1 1 1 1 1 1 1 1 1 1 1 1 1 1 1 1 1 
##$CPDPRG= <>
##$CPDPRG1= <>
##$CPDPRG2= <>
##$CPDPRG3= <>
##$CPDPRG4= <mlev>
##$CPDPRG5= <mlev>
##$CPDPRG6= <mlev>
##$CPDPRG7= <mlev>
##$CPDPRG8= <mlev>
##$CPDPRGB= <>
##$CPDPRGT= <>
##$D= (0..31)
0 1.2 0 0 0 0 0 0 0 0.06 0 0.03 0 0 0 0 0.0002 0 0 0 0 0 0 0 0 0 0 0 0 
0 0 0 
##$DATE= 1637220536
##$DBL= (0..7)
120 120 120 120 120 120 120 120 
##$DBP= (0..7)
150 150 150 150 150 150 150 150 
##$DBP07= 0
##$DBPNAM0= <>
##$DBPNAM1= <>
##$DBPNAM2= <>
##$DBPNAM3= <>
##$DBPNAM4= <>
##$DBPNAM5= <>
$$ [...]
##$SUBNAM2= <"">
##$SUBNAM3= <"">
##$SUBNAM4= <"">
##$SUBNAM5= <"">
##$SUBNAM6= <"">
##$SUBNAM7= <"">
##$SUBNAM8= <"">
##$SUBNAM9= <"">
##$SW= 18.0517287032376
##$SWIBOX= (0..15)
0 0 2 0 0 0 0 0 0 0 0 0 0 0 0 0 
##$SW_h= 3612.71676300578
##$TD= 16384
##$TD0= 1
##$TE= 0
##$TE2= 300
##$TE3= 300
##$TEG= 300
##$TL= (0..7)
0 120 120 120 120 120 120 120 
##$TP= (0..7)
150 150 150 150 150 150 150 150 
##$TP07= 0
##$TPNAME0= <>
##$TPNAME1= <>
##$TPNAME2= <>
##$TPNAME3= <>
##$TPNAME4= <>
##$TPNAME5= <>
##$TPNAME6= <>
##$TPNAME7= <>
##$TPOAL= (0..7)
0.5 0.5 0.5 0.5 0.5 0.5 0.5 0.5 
##$TPOFFS= (0..7)
0 0 0 0 0 0 0 0 
##$TUNHIN= 0
##$TUNHOUT= 0
##$TUNXOUT= 0
##$USERA1= <user>
##$USERA2= <user>
##$USERA3= <user>
##$USERA4= <user>
##$USERA5= <user>
##$V9= 5
##$VALIST= <valist>
##$VCLIST= <CCCCCCCCCCCCCCC>
##$VD= 0
##$VDLIST= <DDDDDDDDDDDDDDD>
##$VPLIST= <PPPPPPPPPPPPPPP>
##$VTLIST= <TTTTTTTTTTTTTTT>
##$WBST= 1024
##$WBSW= 4
##$XGAIN= (0..3)
0 0 0 0 
##$XL= 0
##$YL= 0
##$YMAX_a= 124243
##$YMIN_a= -167512
##$ZGOPTNS= <>
##$ZL1= 120
##$ZL2= 120
##$ZL3= 120
##$ZL4= 120
##$ABSF1= 15.72706
##$ABSF2= -2.324789
##$ABSG= 5
##$ABSL= 3
##$ALPHA= 0
##$AQORDER= 0
##$ASSFAC= 0
##$ASSFACI= 0
##$ASSFACX= 0
##$ASSWID= 0
##$AUNMP= <proc_1d>
##$AZFE= 0.1
##$AZFW= 0.1
##$BCFW= 0
##$BC_mod= 2
##$BYTORDP= 0
##$COROFFS= 0
##$CY= -3
##$DATMOD= 1
##$DC= 0
##$DFILT= <>
##$DTYPP= 0
##$F1P= 0
##$F2P= 0
##$FCOR= 1
##$FTSIZE= 16384
##$FT_mod= 6
##$GAMMA= 0
##$GB= 0
##$INTBC= 1
##$INTSCL= 0
##$ISEN= 128
##$LB= 0.24
##$LEV0= 0
##$LPBIN= 0
##$MAXI= 10000
##$MC2= 0
##$MEAN= 0
##$ME_mod= 0
##$MI= 1.114404
##$NCOEF= 0
##$NC_proc= -8
##$NLEV= 6
##$NOISF1= 3.799351
##$NOISF2= 2.8
##$NSP= 0
##$NTH_PI= 0
##$NZP= 0
##$OFFSET= 15.72706
##$PC= 1
##$PHC0= -15515.35
##$PHC1= 10.20081
##$PH_mod= 1
##$PKNL= yes
##$PPARMOD= 0
##$PSCAL= 0
##$PSIGN= 0
##$REVERSE= no
##$SF= 200.13000490172
##$SI= 16384
##$SIGF1= 3
##$SIGF2= 2
##$SINO= 5.538805
##$SIOLD= 16384
##$SREGLST= <1H.CDCl3>
##$SSB= 0
##$STSI= 16384
##$STSR= 0
##$SW_p= 3612.71676300578
##$SYMM= 0
##$S_DEV= 0
##$TDeff= 16384
##$TDoff= 0
##$TI= <>
##$TILT= no
##$TM1= 0
##$TM2= 0
##$TOPLEV= 0
##$USERP1= <user>
##$USERP2= <user>
##$USERP3= <user>
##$USERP4= <user>
##$USERP5= <user>
##$WDW= 1
##$XDIM= 16384
##$YMAX_p= 338863205
##$YMIN_p= -1117668
$$ End of Bruker specific parameters
$$ ---------------------------------
##NTUPLES= NMR SPECTRUM
##VAR_NAME=  FREQUENCY,     SPECTRUM/REAL,   SPECTRUM/IMAG
##SYMBOL=    X,             R,               I
##VAR_TYPE=  INDEPENDENT,   DEPENDENT,       DEPENDENT
##VAR_FORM=  AFFN,          ASDF,            ASDF
##VAR_DIM=   16384,         16384,           16384
##UNITS=     HZ,            ARBITRARY UNITS, ARBITRARY UNITS
##FACTOR=    0.220516191357247, 1,           1
##FIRST=     3147.45665852962, 0,            0
##LAST=      -465.260104476162, 0,           0
##MIN=       -465.260104476162, -1117668,    0
##MAX=       3147.45665852962, 338863205,    0
$$ Real data points
##PAGE= N=1
##DATA TABLE= (X++(R..R)), XYDATA
$$ [...]
7002I1231j76884K06925l4368l85531j16376J49960L14621J8618q3235k73996
$$ 91231 -85653 121272 86904 -298627 -415003 -265043 49578 68196 -15039 -289035
6992b89035r3960J41909j89840j16932J51403j51198L24906n3991L0629J0818
$$ -289035 -382995 -241086 -430926 -547858 -396455 -547653 -222747 -276738 -246109 -235291
6982b35291R544K02994j17412J93972k52148j36224M42633Q7964k17274j63637
$$ -235291 -225747 -22753 -140165 53807 -198341 -334565 108068 196032 -21242 -184879
6972a84879L8037J26043l23846J57251j9218l72014M75425J53059p4631L772m11493
$$ -184879 -146842 -20799 -344645 -187394 -206612 -578626 -103201 49858 -24773 -21001 -432494
6961d32494k46357L73399J54397m34042q1224M24363P7698J65475L16066j12285
$$ -432494 -678851 -305452 -151055 -585097 -666321 -241958 -164260 1215 317281 204996
6951B04996k67518k27703Q5057j30341N0970M48488k76683j38010K42812J0718
$$ 204996 -62522 -290225 -205168 -335509 -284539 163949 -112734 -250744 -7932 2786
6941B786j8144L76279m90078m67996L72994N238p3875n7939J84181P9318J59331
$$ 2786 -15358 360921 -129157 -597153 -224159 -218921 -292796 -350735 -166554 -87236 72095
6930G2095j78824l2284j67864K20534k583k39081L74907J47171l69661J37338
$$ 72095 -106729 -139013 -306877 -86343 -88926 -328007 46900 194071 -175590 -38252
6920c8252j2633m4936L411l77905j34315M01818j62514l52467J92876j6392k47912
$$ -38252 -50885 -95821 -92410 -470315 -604630 -202812 -365326 -717793 -524917 -541309 -789221
6909g89221M08764K88986j10588j33864K04773j46717K50014j08574L99079l87382
$$ -789221 -380457 -91471 -202059 -335923 -131150 -277867 -27853 -136427 262652 -124730
6899a24730n57844J1400J41075L13465k05527M4933O1832K2148j42297J76243
$$ -124730 -682574 -671174 -530099 -216634 -422161 -377228 -315396 -293248 -435545 -259302
6889b59302J51695p4315k24103k76848L36797J24625J98182J89239m77894P8847
$$ -259302 -107607 -181922 -406025 -682873 -346076 -221451 -23269 165970 -311924 -233077
6879b33077L77623K53854k58024l20665M5898J458r7998j13182K1713J81846m54806
$$ -233077 144546 398400 140376 -180289 -134391 -132933 -230931 -344113 -322400 -140554 -595360
6868e95360j05984K7556N76107k39773j19001Q9412M66237J64474j77476J59922
$$ -595360 -701344 -673788 -97681 -337454 -456455 -367043 99194 263668 86192 246114
6858B46114k1359m33698M8856M20579l56081k72681q6495L21446j12211j5335
$$ 246114 224755 -208943 -160087 260492 -95589 -368270 -454765 -133319 -245530 -260865
6848b60865j95994N2727p6119k51644K41169L39502L31070j71818j8112K42262
$$ -260865 -456859 -404132 -480251 -731895 -490726 -151224 179846 8028 -10084 232178
6838B32178l079P6793j94574k20412L1761n8286j28378P7884L07462N1189j26397
$$ 232178 229099 305892 111318 -109094 -77333 -135619 -263997 -186113 121349 172538 46141
6827D6141j01632L43726l19213k36933J804j89636J37856J21242l61233k33028
$$ 46141 -55491 288235 -30978 -267911 -266107 -455743 -317887 -196645 -557878 -790906
6817g90906K7251J69363n1721K35100L4658J22692p6768k10770J65570k72905
$$ -790906 -763655 -594292 -646013 -410913 -376255 -253563 -330331 -541101 -375531 -648436
6807f48436M34613J23438k40732j28411l43011M04810N92504l31104p7807K99937
$$ -648436 -213823 -90385 -331117 -459528 -802539 -397729 194775 -136329 -214136 85801
6797H5801j77364k53964q2367L18236K07816m23686L77463j7836k70573l5853
$$ 85801 -91563 -345527 -427894 -109658 98158 -325528 51935 34099 -236474 -272327
6787b72327l17518l9253L75435k13880R6341n2396J79781l5842J18126k71412
$$ -272327 -589845 -629098 -253663 -467543 -371202 -423598 -243817 -279659 -161533 -432945
6777d32945k12626Q2079j29803L80435l22692J69216R2550R9391J94494o0264
$$ -432945 -645571 -563492 -693295 -312860 -635552 -466336 -373786 -274395 -79901 -140165
6767a40165j38984O0694j6461L04994l10390k60698L26595L2465j51391J19345
$$ -140165 -279149 -218455 -234916 70078 -240312 -501010 -174415 -141950 -293341 -173996
6757a73996k09152J87194J28617k3618j22390q9107k48682r3073N2004K26238
$$ -173996 -383148 -195954 -67337 -90955 -213345 -302452 -551134 -644207 -592203 -365965
6747c65965j56526J41607L19166Q3988J26093m53353m24675J36965L36013Q0800
$$ -365965 -522491 -380884 -61718 22270 148363 -304990 -729665 -592700 -256687 -175887
6737a75887o5270K27985K30192k39626R1132m6176j73220M1746l15168j20938
$$ -175887 -241157 -13172 217020 -22606 68526 22350 -150870 -109124 -424292 -545230
6727e45230J51533J55193O4708k23112j60316k60173K58732j32498M7639K88733
$$ -545230 -393697 -238504 -173796 -396908 -557224 -817397 -558665 -691163 -643524 -354791
6717c54791j1181m08618l43078O62930J80111j73481L62951j80346k02885k5001
$$ -354791 -365972 -774590 -1117668 -454738 -274627 -448108 -85157 -265503 -468388 -493389
6707d93389L57233k18378K5275J29013j53993L83905o2716j96157J11851L07374
$$ -493389 -136156 -354534 -329259 -200246 -354239 29666 -33050 -229207 -117356 190018
6697A90018k0413l33015l49413J00814K84591q6847r4074J88910q4568m59556
$$ 190018 169605 -163410 -512823 -412009 -127418 -214265 -308339 -119429 -203997 -663553
6687f63553k03100M73916l18579k91667R58880j65925J81623L8236N949j58082
$$ -663553 -866653 -392737 -711316 -1002983 -44103 -210028 -28405 9831 15780 -142302
6677a42302J20541J34498j61301j64036L17539k26825R7108j24041l0662J97587
$$ -142302 -21761 112737 -48564 -212600 104939 -121886 -24778 -148819 -179481 18106
6667A8106O459q2409l26879J71948N9555l03400L2247L27210J54741K1097j32393
$$ 18106 24565 -57844 -384723 -212775 -153220 -456620 -424373 -97163 57578 78675 -53718
6656e3718j6324k87852M50604j83043j84684K53783j26788m6349K18971n70713
$$ -53718 -70042 -357894 92710 -90333 -275017 -21234 -148022 -194371 24600 -546113
6646e46113R0068K02470L39218j95545J457j04J23622j72755j65860J64348l69976
$$ -546113 -456045 -253575 85643 -109902 -108445 -108549 15073 -157682 -323542 -159194 -529170
6635e29170j79671J13447K63120J64156J01343P4023l82349p0785M82584K397
$$ -529170 -708841 -595394 -332274 -168118 -66775 7248 -375101 -445886 36698 39095
6625C9095k63658j39863L65274k94580K32711r9696j23911L4492k44675L5850
$$ 39095 -224563 -364426 848 -293732 -61021 -160717 -284628 -250136 -494811 -458961
6615d58961J74474J70228n73167M822M6370K84101J78309j19018R4740j54419
$$ -458961 -284487 -114259 -687426 -682604 -636234 -352133 -173824 -292842 -198102 -352521
6605c52521K16978j35741n0580L00810o03268j5432J35058L00949N45458m92526
$$ -352521 -135543 -271284 -321864 -21054 -624322 -639754 -504696 -203747 341711 -150815
6595a50815l97032K05849K61939K1432l12549j86207j58318K50186L63611r1271
$$ -150815 -547847 -341998 -80059 -58627 -371176 -557383 -715701 -465515 -101904 -193175
6585a93175K20502J80717m82616j41018N68450k51868j09145N25503j37386l62644
$$ -193175 27327 208044 -274572 -415590 152860 -99008 -208153 317350 179964 -182680
6575a82680J05613n3748K1313j64886R5830j17310j38055L62365m65313J17684
$$ -182680 -77067 -130815 -109502 -274388 -178558 -295868 -433923 -71558 -536871 -419187
6565d19187J37268K31429N9675m36432j94195J87177L98630j00925J95291J78398
$$ -419187 -281919 -50490 9185 -427247 -621442 -434265 -35635 -136560 58731 237129
6555B37129j85257k46984K86348k64775j51899L94669j72094m58267J72273m43334
$$ 237129 51872 -195112 91236 -173539 -325438 69231 -102863 -561130 -388857 -832191
6545h32191K22151M68290M28566n4997n24935k47620K16539L89734j87638M5043
$$ -832191 -610040 -141750 286816 231819 -293116 -540736 -324197 65537 -122101 -77058
6535g7058k37113Q4001K76692J24448k26560j04321k5211m9473l27565K29630
$$ -77058 -314171 -230170 46522 170970 -55590 -159911 -185122 -234595 -562160 -332530
6525c32530j8069o0544l25790K01851K02128q8115J36685n5399l05552J85157
$$ -332530 -350599 -411143 -736933 -535082 -332954 -421069 -284384 -339783 -645335 -460178
6515d60178N16586l62317K8283K08406j55910k76930J77240j62626R6714R2578
$$ -460178 56408 -305909 -277626 -69220 -225130 -502060 -324820 -487446 -390732 -298154
6505b98154k80783J54058K14167k47320L73802L86512k09437K8313k75325m0412
$$ -298154 -578937 -424879 -210712 -458032 -84230 302282 92845 121158 -154167 -194579
6495a94579K65998j46090l16014m09729k62529O68036L49213m6534p3085J09725
$$ -194579 71419 -74671 -390685 -800414 -1062943 -394907 -45694 -92228 -165313 -55588
6485e5588j77587k88975J79921J10003K25375K84765r831j66921m84189O8967
$$ -55588 -233175 -522150 -342229 -232226 -6851 277914 268083 101162 -383027 -314060
6475c14060o4659r5399M80861K45650j69946J17576L29928k23121m42959n5399
$$ -314060 -378719 -474118 6743 252393 82447 200023 529951 306830 -136129 -191528
6465a91528K18586J39787J3267m63827k49928J01988O07089Q6438j38236J40412
$$ -191528 27058 166845 180112 -283715 -533643 -431655 175434 261872 123636 264048
6455B64048l61078k23774j30686N9348M00062L45909o06302j20149K45448j92163
$$ 264048 -97030 -320804 -451490 -392142 7920 353829 -252473 -372622 -127174 -319337
6445c19337K89653l21239j65407L30409K3402k46684K82236J55261k15770j94151
$$ -319337 -29684 -350923 -516330 -185921 -162519 -409203 -126967 28294 -187476 -381627
6435c81627K04987q3360k11541j03006l8679J54743L52249M4507m85360K17079
$$ -381627 -176640 -260000 -471541 -574547 -613226 -458483 -106234 -61727 -547087 -330008
6425c30008j53547k13N46122j99293j48192j59066k4964L20866J92052m4762M46821
$$ -330008 -483555 -483768 62354 -136939 -285131 -444197 -469161 -148295 43757 -1005 445816
6414D45816q9230l83264l36712J51332K14686l61553J23440r3728K03664J96831
$$ 445816 356586 -26678 -363390 -212058 2628 -358925 -235485 -329213 -125549 71282
6404G1282n22841k58667K54820K39223J3766m61793J19250o2149Q5101J69715
$$ 71282 -451559 -710226 -455406 -216183 -202417 -664210 -544960 -607109 -522008 -352293
6394c52293r9499L04189L70106m2251r0599k66695m6079J49925l0327R8737L03493
$$ -352293 -451792 -147603 222503 180252 89653 -177042 -223121 -73196 -103523 -4786 298707
6383B98707j03280m39475J25740L87390O4735q3733J50578l37906n7515r2611
$$ 298707 195427 -244048 -118308 269082 333817 250084 400662 62756 5241 -87370
6373h7370J91405j25050j79959p9779K06928r3590l67710M24081J11220m29361
$$ -87370 104035 -21015 -200974 -280753 -73825 -167415 -535125 -111044 176 -429185
6363d29185K03149j22657j22338K51033K04474J78292K8087j18685k97743l8722
$$ -429185 -226036 -348693 -471031 -219998 -15524 162768 190855 72170 -225573 -264295
6353b64295Q9044J2353K41051J89254j27368m76114j56473L73508j18965n8564
$$ -264295 -175251 -162898 78153 267407 140039 -336075 -492548 -119040 -238005 -296569
6343b96569J37205J02549o458l4528J34390o8350j56314p4674J85200L11931L006
$$ -296569 -159364 -56815 -63273 -97801 36589 -31761 -188075 -262749 -77549 234382 237388
6332B37388R0076j79488J14679k51178J8467K6236k05333J86898K55090j89103
$$ 237388 327464 147976 262655 11477 29944 56180 -149153 37745 292835 103732
6322A03732k56742K87023j96222k87806J57883L45943K23471l21024r4858j93021
$$ 103732 -153010 134013 -62209 -350015 -192132 153811 377282 56258 -38600 -231621
6312b31621J07650K92328m3443J78017k52614J52502j81529J12920K44175n14329
$$ -231621 -123971 168357 124914 302931 50317 202819 21290 134210 378385 -135944
6302a35944J62551K56149J24928K80042l3314q9296N5374J80238n3410o41627
$$ -135944 26607 282756 407684 687726 654412 565116 620490 800728 747318 105691
6292A05691L82028j38651J96953j34731j71692L06587J17226m72357o1121L15601
$$ 105691 487719 349068 546021 411290 239598 546185 663411 191054 129933 445534
6282D45534o2365j00997j9111K53262n3265k56370J69747p9774j33961M6331L93113
$$ 445534 383169 282172 263061 516323 463058 206688 376435 296661 162700 209031 602144
6271F02144J71572l15389R308n41883l25655K68524K35089J05964M5445j60285
$$ 602144 773716 458327 467635 -74248 -399903 -131379 103710 209674 255119 94834
6261I4834J2392L94840m5049j4866j4440p8695l3125n7923J28752J6382l45801
$$ 94834 107226 502066 457017 442151 427711 349016 315891 257968 386720 403102 57301
6250E7301J35393L82610k03010m6045P0903K87537N8282o23376m37575j0936J32150
$$ 57301 192694 575304 372294 326249 397152 684689 742971 119595 -317980 -328916 -196766
6239a96766O23178K89878n8602k59427K6564m00648L1623K00584J1539k03098
$$ -196766 426412 716290 657688 398261 424825 24177 55800 256384 267923 64825
6229F4825q3728r0285L0739r1499j08181M12623j26625M8327N7542l22379L62525
$$ 64825 -18903 -109188 -78449 -169948 -278129 134494 7869 56196 113738 -208641 153884
6218A53884J1986o01647L85501L43616q6961L1498L2006m3935o762K55812J975
$$ 153884 165870 -435777 -50276 293340 206379 237877 269883 225948 219186 474998 476973
6207D76973N61640m50187j01755K81736K59645m37591j55485P3943J91160j49457
$$ 476973 1038613 588426 486671 768407 1028052 590461 434976 508919 700079 550622
6197E50622j33211K96898k62543j26255J5075K0699J59268J25957l52712J92394
$$ 550622 417411 714309 451766 325511 340586 361285 520553 646510 293798 486192
6187D86192J22184j59832K16834l40523r0645J90287j78604P4776j70560Q4104
$$ 486192 608376 448544 665378 324855 234210 424497 245893 320669 150109 234213
6177B34213J17516J91221R2479j27785p1750k31126q2067M83480K402j90647N61863
$$ 234213 351729 542950 635429 507644 435894 204768 122701 606181 608583 417936 979799
6166I79799K08715k49463Q3193k08336k62303j78930O16K91238n527R7309l264
$$ 979799 1188514 939051 1022244 813908 551605 372675 373291 664529 659002 756311 753047
6155G53047l11855K9799p7582q1419M43421L91086J15218l05095j70614L65637
$$ 753047 441192 470991 393409 311990 755411 1146497 1261715 956620 786006 1151643
6145A151643k86616p3687K24787j1683l60627M2207l7110J18968K5359M06406
$$ 1151643 865027 791340 1016127 1004444 643817 686024 648914 767882 793241 1199647
6135A199647k06221j57624O6747J78750l1823k69765r947J20124J73319j31974
$$ 1199647 993426 835802 902549 1081299 1049476 779711 769764 889888 1063207 931233
6125I31233J16725k0264K42840p6908P1266m54097m00050K87758J76719P9681
$$ 931233 1047958 1027694 1270534 1193626 1264892 810795 410745 698503 875222 954903
6115I54903L57950O4943l29872J9724K92885m6303k00146k21516N9995R0800K1414
$$ 954903 1312853 1377796 1047924 1067648 1360533 1314230 1114084 892568 952563 1043363 1064777
6104A064777K08358l7389j8910K17559J95260k43969k0515Q4382P247l15720L17025
$$ 1064777 1273135 1235746 1216836 1434395 1629655 1385686 1365171 1449553 1456800 1141080 1458105
6093A458105J99790k52827K69533M41869p2870J04269j12084J40235l4142Q1411
$$ 1458105 1657895 1405068 1674601 2116470 2043600 2147869 2035785 2176020 2141878 2223289
6083B223289K32423k50200k19518K25864K269k84356O7040J76544j03173q6208
$$ 2223289 2455712 2205512 1985994 2211858 2214127 1929771 1996811 2173355 2070182 1983974
6073A983974K14314K68885J03228J51793K85561j03796m9081Q837P0761o9416
$$ 1983974 2198288 2467173 2570401 2722194 3007755 2903959 2854878 2863715 2934476 2865060
6063B865060l17832J17295N77459M9466n0232j76295q8409P46577L47650J05843
$$ 2865060 2547228 2664523 3241982 3291448 3241216 3064921 2976512 3723089 4070739 4176582
6053D176582k15690j79089j1911P5830L77853K29083K61106o3232N03515j79837
$$ 4176582 3960892 3781803 3769892 3845722 4223575 4452658 4713764 4650532 5154047 4974210
6043D974210j64164j65677J20819J29941J27846M54802j43054M27214J76135L21792
$$ 4974210 4810046 4644369 4765188 4895129 5022975 5477777 5334723 5761937 5938072 6259864
6033F259864j25258N7946L93701j34165K76797K87186L76381J83721O57557L2785
$$ 6259864 6134606 6192552 6586253 6452088 6728885 7016071 7392452 7576173 8233730 8266515
6023H266515L9837J75546M13483N55531J73619L53800L28924J0625M28314M51382
$$ 8266515 8306352 8481898 8895381 9450912 9624531 9978331 10307255 10317880 10746194 11197576
6013A1197576M89574P17432L79967M03157N28694P75107Q48621R20786R58808
$$ 11197576 11687150 12404582 12784549 13187706 13716400 14491507 15340128 16260914 17219722
6004A7219722O34711P74426R10578J518992J490216J663295J583150J514874K000200
$$ 17219722 17854433 18628859 19539437 21058429 22548645 24211940 25795090 27309964 29310164
5995B9310164K106409J782986K208881J880133K396199K030495J443745J125940
$$ 29310164 31416573 33199559 35408440 37288573 39684772 41715267 43159012 44284952
5987D4284952Q34413J289135J22170n17199p78075q46350o16299p87796l60765
$$ 44284952 45119365 46408500 46530670 46013471 45235396 44389046 43772747 42984951 42624186
5978D2624186O58343K97254L92252P92781J486783J307063J512593J643284K707464
$$ 42624186 43282529 43579783 43972035 44764816 46251599 47558662 49071255 50714539 53422003
5969E3422003K745118K718064L020145K673281K891602L029778K745814J813971
$$ 53422003 56167121 58885185 61905330 64578611 67470213 70499991 73245805 75059776
5961G5059776J098824L26381n69704k147137k550851l321145m288494m215487
$$ 75059776 76158600 76484981 75915277 73768140 71217289 67896144 63607650 59392163
5953E9392163l307092l096484k254260k168281j534406j153582r89706r18992
$$ 59392163 56085071 52988587 50734327 48566046 47031640 45878058 44888352 43969360
5945D3969360j366132k28277K73042j32913p6373K40348J37512P72176M81071
$$ 43969360 42603228 42374951 42647993 42515080 42438707 42679055 42816567 43588743 44069814
5936D4069814L96763J94886j83257q44654r31676j324934j917228j967666j740221
$$ 44069814 44466577 44661463 44478206 43633552 42701876 41376942 39459714 37492048 35751827
5927C5751827k692436k291835j963924k284601k164445j466476p36761j303358
$$ 35751827 33059391 30767556 28803632 26519031 24354586 22888110 22151349 20847991
5919B0847991j660373q91848j023644r52485q82302n23473q17291p85154l99294
$$ 20847991 19187618 18295770 17272126 16319641 15437339 14913866 14096575 13311421 12912127
5910A2912127k36397n18460j236265o73258M392j87289l12332l89101m05347m21739
$$ 12912127 12675730 12157270 10921005 10247747 10252139 10064850 9752518 9363417 8958070 8536331
5900H536331k14122j99028j03202n56353m46893k37244J28093j46052j94598j37294
$$ 8536331 8322209 8123181 8019979 7463626 7016733 6779489 6907582 6761530 6566932 6429638
5890F429638k17609j10751m36436m9117J17703J25599m66443k44811k95166k72705
$$ 6429638 6212029 6101278 5664842 5615725 5733428 5859027 5392584 5147773 4852607 4579902
5880D579902K29088K43989k55577j40695n90937l01567M07604j32223k88091J69011
$$ 4579902 4808990 5052979 4797402 4656707 4065770 3764203 4171807 4039584 3751493 3920504
5870C920504j57751K97549l76249K87115k70647l07090k57947J8319j09199M76341
$$ 3920504 3762753 4060302 3684053 3971168 3700521 3393431 3135484 3153803 3044604 3520945
5860C520945J15692k96223k05734k61451l43477k58833Q0453N9684j70680k03948
$$ 3520945 3636637 3340414 3134680 2873229 2529752 2270919 2351372 2411056 2240376 2036428
5850B036428L65503j18040j41331o5388K75763N9705m14532l95876L20581M66739
$$ 2036428 2401931 2283891 2142560 2077172 2352935 2412640 1998108 1602232 1922813 2389552
5840B389552n44421K23187l5320k58297k46617k67572R1848K53433m6826k38400
$$ 2389552 1845131 2068318 2032998 1774701 1528084 1260512 1352360 1605793 1558967 1320567
5830A320567K3111l45882M07632L37410K87888l37213J07968l1879k51053k34211
$$ 1320567 1343678 997796 1405428 1742838 2030726 1693513 1801481 1769602 1518549 1284338
5820A284338k04826j47261k08218Q9710L67547K65831j29809j96151M9657j38224
$$ 1284338 1079512 932251 724033 813743 1181290 1447121 1317312 1121161 1170818 1032594
5810A032594L35145j20285P7608j22748l7963L7775p222K44293l86414P7412k37236
$$ 1032594 1367739 1247454 1325062 1202314 1164351 1202126 1194904 1439197 1052783 1130195 892959
5799H92959r7518K21375N3204J85559k10503l57295m4424J16137N0977L1005l3626
$$ 892959 795441 1016816 1070020 1255579 1045076 687781 643357 759494 810471 841476 807850
5788H07850L76145j77267m01699p3175K45894K24000J33079l67600p5604q3437
$$ 807850 1183995 1006728 605029 531854 777748 1001748 1134827 767227 691623 608186
5778F08186K60790M7147N05012O8692k75192J32030m66090j80953K23577P8884
$$ 608186 868976 916123 1421135 1489827 1214635 1346665 880575 699622 923199 1002083
5768A002083L93432j18603l00985m4787J8349J49341L77886k17799j75611J90121
$$ 1002083 1395515 1276912 975927 931140 949489 1098830 1476716 1258917 1083306 1273427
5758A273427Q9709m61549j90319K55120l15489K67340n26220K25617K24061J30999
$$ 1273427 1363136 901587 711268 966388 650899 918239 392019 617636 841697 972696
5748I72696K4753k68738k43966o2111L98367K81355k50464j51823j87477J13530
$$ 972696 997449 728711 484745 422634 821001 1102356 851892 700069 512592 626122
5738F26122l09968P8501J96699P570O8894M61335j34108L92624r151j86410l01464
$$ 626122 316154 394655 591354 598924 667818 1129153 995045 1387669 1378518 1192108 890644
5727H90644n34267K39967m0228J79479J63651j99688k92960K6719J01640m31390
$$ 890644 356377 596344 556116 735595 899246 699558 406598 433317 534957 103567
5717A03567K60790N10736j54534j98397k93254L50411M57449l61424m42747R1185
$$ 103567 364357 875093 720559 522162 228908 579319 1036768 675344 232597 323782
5707C23782R0315Q4054J3371j48619J78077j38439l42626J55182M42507J04042
$$ 323782 414097 498151 511522 362903 540980 402541 59915 215097 657604 761646
5697G61646K37662m08772K7623J11916J524l16954p0245K3276K20751l0964l5649
$$ 761646 999308 590536 618159 730075 731599 414645 344400 367676 588427 557463 521814
5686E21814j50172l46900K65517R5153L25394j12228j94008r0320M03722J06111
$$ 521814 371642 24742 290259 385412 710806 598578 404570 314250 717972 824083
5676H24083k83824J13157J14251o00588r3099M21025K79308l9369l00844j10044
$$ 824083 540259 653416 767667 167079 73980 495005 774313 734944 434100 324056
5666C24056k19192M7011M73343j15162K77522j39443k86196r3623J77537J43523
$$ 324056 104864 151875 625218 510056 787578 648135 361939 268316 445853 589376
5656E89376m3513m5007k94121j37324K08906K73471Q0867l61846J89619k58860
$$ 589376 545863 500856 206735 69411 278317 551788 632655 270809 460428 201568
5646B01568l14106L0231O1351O21958o0549j49098L023l03042J59252J70993j36437
$$ 201568 -112538 -82307 -20956 601002 540453 391355 394378 91336 250588 421581 285144
5635B85144m4861O02485k28460k79623k29045J3138K58795l0975k24365j75295
$$ 285144 240283 842768 614308 334685 105640 118778 377573 346598 122233 -53062
5625e3062K87855J39750j13390Q3066j3111l34846o6266L84740J23377L55917
$$ -53062 234793 374543 261153 344219 331108 -3738 -70004 314736 438113 794030
5615G94030J86780j97043m04885q730P6870j46708J15835m39157j65733M52610
$$ 794030 980810 783767 378882 370152 447022 300314 416149 -23008 -188741 263869
5605B63869l08428L4701J16645j86932j66962J40607N11105k33224l90909J29735
$$ 263869 -44559 -9858 106787 -80145 -247107 -106500 404605 171381 -219528 -89793
5595h9793j05915j172L21301K28941L9443L5771Q6041n81530L694k93214m3K5643
$$ -89793 -195708 -196880 124421 353362 392805 428576 514617 -66913 -63219 -356433 -356476 -330833
5583c30833M60179K79623j55761p8547k83011K11600n7335J98610J62986j4938
$$ -330833 129346 408969 253208 174661 -108350 103250 45915 244525 407511 392573
5573C92573L8070j55922r1966o2621N8022J2236k9308J64641j12877j16215K97493
$$ 392573 430643 274721 182755 120134 178156 190392 161084 325725 212848 96633 394126
5562C94126j44781J12022j3023K43479k22535L3164L43725l30311o13321R7366
$$ 394126 249345 361367 348344 591823 369288 402452 746177 415866 -197455 -100089
5552a00089K12863J5117J35361j70963L4704j13867O15851k82939m92324N33203
$$ -100089 112774 127891 263252 92289 126993 13126 628977 346038 -146286 386917
5542C86917N2778k14285j76058K16951M64489j26334l30104L904m9114k97021
$$ 386917 439695 225410 49352 266303 730792 604458 274354 278258 229144 -67877
5532f7877Q8582j29957j37167M18416L80178L8017m22784j08119r7390R1949m7070
$$ -67877 20705 -109252 -246419 171997 552175 590192 167408 59289 -38101 53848 6778
5521F778K98358J58143J81911q4388j09m8746N0326k77357k62973j21834L50165
$$ 6778 305136 463279 645190 560802 560693 511947 562273 284916 21943 -99891 250274
5510B50274L87637l65433j96117L14810J55389l76831j52559P5498J12669k50388
$$ 250274 637911 272478 76361 391171 546560 169729 17170 92668 205337 -45051
5500d5051K0786J75482K30028j60291k12261J01732J07434K42257K7620j56585
$$ -45051 -24265 151217 381245 220954 8693 110425 217859 460116 487736 331151
5490C31151k30781Q398j43212N3732Q6996L49295n4503k04463K68769m07439j6511
$$ 331151 100370 108768 -34444 19288 106284 455579 401076 196613 465382 57943 41432
5479D1432K09030j65608j03658K18024m1697j69173K25678J92983k75009K941
$$ 41432 250462 84854 -18804 199220 157523 -11650 214028 407011 132002 134943
5469A34943J34534k90492Q3293J16325k91081J3499l8803p6448j6649J82750L97312
$$ 134943 269477 -21015 62278 178603 -112478 -98979 -137782 -214230 -230879 -48129 349183
5458C49183K67862k61690j42374k39676K90920K40549o6878K5380k51722l11146
$$ 349183 617045 355355 212981 -26695 264225 504774 437896 463276 211554 -99592
5448i9592N69365j32410k46850Q7795j43382q3760O9995L02097k28791J33168
$$ -99592 469773 337363 90513 178308 34926 -48834 21161 323258 94467 227635
5438B27635M7006j65668L11978r3217k65187L22843N33348l02161l23404M58373
$$ 227635 274641 108973 420951 327734 62547 385390 918738 616577 293173 751546
5428G51546k67148k45648P364l1830L5211j18687K05253K82317L8434p1510l51681
$$ 751546 484398 238750 246114 214284 249495 130808 336061 618378 656812 585302 233621
5417B33621j013j0477m57477K80348L06938J06598k24303K60289k69365j18646
$$ 233621 232608 222131 -235346 45002 351940 458538 234235 494524 225159 106513
5407A06513K37831l6051j61368j85445o0268l9226M27653r108K5630q6880l36035
$$ 106513 344344 308293 146925 -38520 -98788 -138014 289639 280531 306161 219281 -116754
5396a16754J22330P2106J82773J57058J33483k36816m79641L66205k73949k90579
$$ -116754 5576 77682 260455 417513 550996 314180 -165461 200744 -73205 -363784
5386c63784M10105J39073O1891J69926L08064m11101j71799K46579l4600L26521
$$ -363784 46321 185394 247285 417211 725275 314174 142375 388954 354354 680875
5376F80875l0128k35164k8596J21311M91218j35534L5501R5136m39103p0297L7341
$$ 680875 650747 415583 386987 508298 999516 863982 899483 994619 555516 485219 522560
5365E22560J17606K72584q2682J13938j6037o35537P215J67496Q0710m16079l5008
$$ 522560 640166 912750 830068 944006 927969 292432 299647 467143 547853 131774 96766
5354I6766K56298Q3666Q7012J2120m3533L3222k80012K40127M46515l77071k48864
$$ 96766 353064 436730 523742 535862 492329 525551 245539 485666 932181 555110 306246
5343C06246M43062m30385j55082M6482O8441j19991L02781L85306j27607N7670
$$ 306246 749308 318923 163841 210323 278764 158773 461554 846860 719253 776923
5333G76923l49108l28718L90740J66926q6552r7268J78088N7713l36582j28397
$$ 776923 427815 99097 489837 656763 570211 472943 651031 708744 372162 243765
5323B43765j96690J95787q1251J92267M46919j38009k41607O7687l70072o0504
$$ 243765 47075 242862 161611 353878 800797 662788 421181 488868 118796 58292
5313E8292K48049K21562N1103K9093r0116J7732n309M3595N68602k06792l1657
$$ 58292 306341 527903 579006 608099 517983 535715 530406 574001 1142603 935811 904154
5302I04154L01532l579k19762k19891j75315m38516K53507J51244J55257K55792
$$ 904154 1205686 1202107 982345 762454 587139 148623 402130 553374 708631 964423
5292I64423k22604r8868k45173k08768J90260K65108K18577l92775k4565K36691
$$ 964423 741819 642951 397778 189010 379270 644378 862955 470180 445615 682306
5282F82306p408L51843n8406q8672l9064J03071M8257L03891K49320l33694L0280
$$ 682306 674898 1026741 968335 879663 840599 943670 991927 1295818 1545138 1211444 1241724
5271A241724l66368j96238L57864J55940k35565J24929j56596K02373k38264r7498
$$ 1241724 875356 679118 1036982 1192922 957357 1082286 925690 1128063 889799 792301
5261G92301j94925P9680j9293P56J86709l8729J91382k8755M7485Q0923L2469
$$ 792301 597376 677056 657763 658519 845228 806499 997881 969126 1016611 1097534 1130003
5250A130003l97571N24445O7211k33644P9323L55146o99405Q3323L21225M7410
$$ 1130003 732432 1256877 1324088 1090444 1169767 1524913 825508 908831 1230056 1277466
5240A277466j66234j70303R0581K79636J18884j93264k27979K74837J9736r1275
$$ 1277466 1111232 940929 1031510 1311146 1430030 1236766 1008787 1283624 1303360 1212085
5230A212085P6691j25717L6887k3120l53406J28599J32106m8836j2656k20789
$$ 1212085 1288776 1163059 1199946 1176826 823420 952019 1084125 1035289 1022633 801844
5220H01844J47218Q4748p8955l93375K99995K88380j33014j34528J38173J71298
$$ 801844 949062 1033810 954855 561480 861475 1149855 1016841 882313 1020486 1191784
5210A191784l74680r2010M32151j78119j14984l14288K50470K48084M6885p5128
$$ 1191784 817104 725094 1157245 979126 864142 549854 800324 1048408 1095293 1020165
5200A020165k22773k82489J4408K29032J72416Q0208k51826k92058J41484M0279
$$ 1020165 797392 514903 529311 758343 930759 1010967 759141 467083 608567 648846
5190F48846K02880j71696J31284N43581k079j90570k47433j17284o6815L8804
$$ 648846 851726 680030 811314 1354895 1352816 1162246 914813 797529 730714 769518
5180G69518M9699k01068K47948n2145k98657o5965L8102R6585K14951j62758j41405
$$ 769518 819217 618149 866097 813952 515295 449330 487432 584017 798968 636210 494805
5169D94805l8631K35477M83037m19934j52293L38471q4287k97201p0112J28118
$$ 494805 456174 691651 1174688 754754 602461 940932 856645 559444 489332 617450
5159F17450K77817m00806l6171N65999N28M1417m4939J05392j1227j54887J48649
$$ 617450 895267 494461 458290 1024289 1024817 1066234 1021295 1126687 1115460 960573 1109222
5148A109222l06033k4341m49860J32555J27281j70414j18527M78409J09527M0668
$$ 1109222 803189 778848 328988 461543 588824 418410 299883 778292 887819 928487
5138I28487K4118k5860L3854j86274L70893m4165p5684J233J08377k26277K30426
$$ 928487 952605 926745 960599 774325 1145218 1101053 1025369 1026602 1134979 908702 1139128
5127A139128J47834k80485K67466K04196K3889l82839j78940L31867m01802J08368
$$ 1139128 1286962 1006477 1273943 1478139 1502028 1119189 940249 1272116 870314 978682
5117I78682J98797n1119J08876j09491p3937J90688r6514j12323J25967K40726
$$ 978682 1177479 1126360 1235236 1125745 1051808 1242496 1145982 1033659 1159626 1400352
5107A400352L9906l16334m28755L07984j12031R9783J67300l05558J62479J21134
$$ 1400352 1440258 1123924 695169 1003153 891122 990905 1158205 852647 1015126 1136260
5097A136260J07771J37637M6252j24474J61594J74053q5517k8151j33853J96912
$$ 1136260 1244031 1381668 1427920 1303446 1465040 1639093 1553576 1525425 1391572 1588484
5087A588484L18427n11147O1790J49639L9626j95211j21836M5802m9373l29599
$$ 1588484 1906911 1395764 1457554 1607193 1646819 1451608 1329772 1375574 1326201 996602
5077I96602k31665M27582K5276J41290J33124J3693j96359j84752J10673j06427
$$ 996602 764937 1192519 1217795 1359085 1492209 1505902 1309543 1124791 1235464 1129037
5067A129037j87276k99370r8353j085L47421l71625k17226L89360K1401j67608
$$ 1129037 941761 642391 544038 542953 890374 518749 301523 690883 712284 544676
5057E44676N8926j90167M19688Q7861K40650j58630r03Q5533k25089L02933k14689
$$ 544676 603602 413435 833123 920984 1161634 1003004 1002101 1087634 862545 1165478 950789
5046I50789k18944R9661L292K94539K86829N0187k06306k42673o6200J22776M5196
$$ 950789 731845 831506 834798 1129337 1416166 1466353 1260047 1017374 951174 1073950 1119146
5035A119146j9638J08395l43196j14411N49464J06791k39858n0913j18983j21733
$$ 1119146 1099508 1207903 864707 750296 1299760 1406551 1166693 1115780 996797 875064
5025H75064J0938L98489J4480j49637P4810P1246J4552q9154J17986M3733m17437
$$ 875064 886002 1284491 1298971 1149334 1224144 1295390 1309942 1220788 1338774 1382507 965070
5014I65070k32327K20809J82598R2896J32515j24034J41459K49536j28293l09931
$$ 965070 732743 953552 1136150 1229046 1361561 1237527 1378986 1628522 1500229 1190298
5004A190298L19155n05263J14378l7440N4025K51427j18501p2455r8884j15803
$$ 1190298 1509453 1004190 1118568 1081128 1135153 1386580 1268079 1195624 1096740 980937
4994I80937K48592L63726m11715J01511J77040K30099J36108O2769k58600n18900
$$ 980937 1229529 1593255 1181540 1283051 1460091 1690190 1826298 1889067 1630467 1111567
4984A111567J73873K96534K81201k84775k77510N5864J89446L05569j51071p5467
$$ 1111567 1285440 1581974 1863175 1578400 1300890 1356754 1546200 1851769 1700698 1625231
4974A625231K41029K15911k79686n9700N212p3148N0386J03334J71474l7670K73760
$$ 1625231 1866260 2082171 1802485 1742785 1747997 1674849 1725235 1828569 2000043 1962373 2236133
4963B236133L9535j48334j07456j31107j97062L28722k3070k51411R9960n9914
$$ 2236133 2275668 2127334 2019878 1888771 1691709 2020431 1997361 1745950 1845910 1785996
4953A785996o7395k5069K25186k84479L42378L16987n2906o4889J88110J41385
$$ 1785996 1718601 1693532 1918718 1634239 1976617 2293604 2240698 2175809 2363919 2505304
4943B505304j27794k01641J41388M35850l9295k62335L61682k00271Q8116J09321
$$ 2505304 2377510 2175869 2317257 2753107 2713812 2451477 2813159 2612888 2701004 2810325
4933B810325k12768j42628K08768J93262j17865o976J32207K25544m03416N3459
$$ 2810325 2597557 2454929 2663697 2856959 2739094 2732118 2864325 3089869 2686453 2739912
4923B739912L11266r690O5680L68187j66280p1059l24249K75597K07476k71419
$$ 2739912 3051178 3041488 3107168 3475355 3309075 3238016 2913767 3189364 3396840 3125421
4913C125421l4903M39927M530k0804K32773K09200j43482J94992M6613q9556M1569
$$ 3125421 3090518 3530445 3534975 3514171 3746944 3956144 3812662 4007654 4054267 3964711 4006280
4902D006280P98600l13921k09008O45823J6115J11684K84810J58070l16851k71756
$$ 4006280 4804880 4490959 4281951 4927774 4943889 5055573 5340383 5498453 5181602 4909846
4892D909846O4784M3699N07261r2715L38587K38883n9297L93628L42839J25234
$$ 4909846 4974630 5018329 5525590 5432875 5771462 6010345 5951048 6344676 6687515 6812749
4882F812749R1564M62447K54590L88498M6417p4667M74986J09945l370O40414
$$ 6812749 6904313 7366760 7621350 8009848 8056265 7981598 8456584 8566529 8563159 9203573
4872I203573K81383L54468K38491N20428M17348Q20664L18549P16525L65891O28340
$$ 9203573 9484956 9839424 10077915 10598343 11015691 11836355 12154904 12871429 13237320 13865660
4862A3865660K58146K75277L42780M56560L48679M94436P74883M81801O85687
$$ 13865660 14123806 14399083 14741863 15198423 15547102 16041538 16816421 17298222 17983909
4853A7983909N96219L35182N59961J97764K63473N25557P29205N23077M89202
$$ 17983909 18580128 18915310 19475271 19673035 19936508 20462065 21191270 21714347 22203549
4844B2203549L89027P04755J88066N92068M59372K34673L32909N43420P25754
$$ 22203549 22592576 23297331 23485397 24077465 24536837 24771510 25104419 25647839 26373593
4835B6373593N59747Q38752L54826O10845R15324K69517R81804Q37909K66884
$$ 26373593 26933340 27772092 28126918 28737763 29653087 29922604 30904408 31742317 32009201
4826C2009201Q13073P33963R31770P33022Q61666R15556L02701M47033M91299
$$ 32009201 32822274 33556237 34488007 35221029 36082695 36998251 37300952 37747985 38239284
4817C8239284M82600J025963M37294M18682J10217M8216J4512K24381N7889n6536
$$ 38239284 38721884 39747847 40185141 40603823 40714040 40762256 40776768 41001149 41059038 41002502
4807D1002502J24715M11764J97437j85775J75078K72888j06092J48212k66423
$$ 41002502 41127217 41538981 41736418 41550643 41725721 41998609 41892517 42040729 41774306
4798D1774306j61952J28703N04050P5007m30997j5084M6751j45602K94317K08893
$$ 41774306 41612354 41741057 42245107 42320114 41889117 41874033 41920784 41775182 42069499 42278392
4788D2278392J77578k89211m88422K97265p2735J03199M61366J65740k14491k62069
$$ 42278392 42455970 42166759 41678337 41975602 41902867 42006066 42467432 42633172 42418681 42156612
4778D2156612n74538p5786k23221j016076l02642j95559q13557p09575r60573
$$ 42156612 41582074 41506288 41283067 40266991 39964349 39768790 38955233 38245658 37285085
4769C7285085j231185m19987n21560n90812p77757p34757p40723o27710n10456
$$ 37285085 36053900 35633913 35112353 34521541 33743784 33009027 32268304 31640594 31130138
4760C1130138n25100o94385o53804n65708p47274o17333m87760o36922n54563
$$ 31130138 30605038 29910653 29256849 28691141 27943867 27326534 26838774 26201852 25647289
4751B5647289k65516l77492m90943j64115n75790n84776k13849l48895o70597
$$ 25647289 25381773 25004281 24513338 24349223 23773433 23188657 22974808 22625913 21955316
4742B1955316r14066k79115m68667o03136m92346p17928q27249k33968k74866
$$ 21955316 21041250 20762135 20293468 19690332 19197986 18480058 17652809 17418841 17143975
4733A7143975n14743o87084l79002n67589o19261n33709o03778l29903n08380
$$ 17143975 16629232 15942148 15563146 14995557 14376296 13842587 13238809 12908906 12400526
4724A2400526k17802j12180o52549p46666K2684l70378j80162m98820l01732o8333
$$ 12400526 12182724 12070544 11417995 10671329 10694013 10323635 10143473 9644653 9342921 9274588
4714I274588k24167n28845l63074P6427J92234m93159n49112k7013l4113j95737
$$ 9274588 9050421 8521576 8158502 8234929 8427163 7934004 7384892 7357879 7323766 7128029
4704G128029N3723j75956k60025j41556L2555N0322j21067k69113L22492K93999
$$ 7128029 7181752 7005796 6745771 6604215 6636770 6687092 6566025 6296912 6619404 6913403
4694F913403k29506k06423l64867l45106n52538K06328K61724l34077k16762K9682
$$ 6913403 6683897 6477474 6112607 5767501 5214963 5421291 5683015 5348938 5132176 5161858
4684E161858P8155M43121k63198j30821J02253k15054k80076L4666K9592l62838
$$ 5161858 5240013 5683134 5419936 5289115 5391368 5176314 4896238 4930904 4960496 4597658
4674D597658m19510K04817J29720j1055m06387k31327M70047M65378k32656l66698
$$ 4597658 4178148 4382965 4512685 4501630 4095243 3863916 4333963 4799341 4566685 4199987
4664D199987j56036k92810k40019j90200k93J64928k00349L46005j2229k38437
$$ 4199987 4043951 3751141 3511122 3320922 3320629 3485557 3285208 3631213 3618984 3380547
4654C380547j94102j26933q7985k9600R8602m81558P6451N01274R6856L5259m44226
$$ 3380547 3186445 3059512 2971527 2941927 3040529 2558971 2635422 3136696 3233552 3268811 2824585
4643B824585K5571N29666j4639k26465J04499l12898J20088K72994m87026k34626
$$ 2824585 2850156 3379822 3365183 3138718 3243217 2930319 3050407 3323401 2836375 2601749
4633B601749K69043M0726j70654L4881K56884m04831m16564M98318M88635J88828
$$ 2601749 2870792 2911518 2740864 2775745 3032629 2627798 2211234 2709552 3198187 3387015
4623C387015l62226j27044j05882k04038L72063l9228l43744n3607m84360N2688
$$ 3387015 3024789 2897745 2791863 2587825 2959888 2920660 2576916 2523309 2038949 2091637
4613B091637K46461K93267J04412k58688j02731k20135M41840j00711k65799K47002
$$ 2091637 2338098 2631365 2735777 2477089 2374358 2154223 2596063 2495352 2229553 2476555
4603B476555l40671j58010J11874j77384k10729L09129L98387k44447J07067r0297
$$ 2476555 2135884 1977874 2089748 1912364 1701635 2010764 2409151 2164704 2271771 2181474
4593B181474r9295L56445j55923M34849K88396m83085K727K41398l26477j60235
$$ 2181474 2082179 2438624 2282701 2717550 3005946 2522861 2525588 2766986 2440509 2280274
4583B280274N16785J84154m82740j6655M55252j95095l06850J49354l4300l2753
$$ 2280274 2797059 2981213 2498473 2481818 2937070 2741975 2435125 2584479 2550179 2517426
4573B517426l2933J19321j70207J17493J90268Q418k37058J78535k36587j98916
$$ 2517426 2484493 2603814 2433607 2551100 2741368 2749786 2512728 2691263 2454676 2255760
4563B255760q5936K63460N652l5628j70111k34050Q8420K68065K37178l16725
$$ 2255760 2169824 2433284 2438936 2403308 2233197 1999147 2087567 2355632 2592810 2276085
4553B276085N41360r1594m61426R5534J45754M58907p7235o892P0653j36232K96092
$$ 2276085 2817445 2725851 2264425 2359959 2505713 2964620 2887385 2880493 2951146 2814914 3111006
4542C111006j37832L4007J43777o5585N1377l3837J55051R8543K0435k23643j93500
$$ 3111006 2973174 3007181 3150958 3085373 3136750 3102913 3257964 3356507 3376942 3153299 2959799
4531B959799q2488N8169L7657L28J01243k59577L52736M1230P4784j10895n4639
$$ 2959799 2877311 2935480 2973137 2973465 3074708 2815131 3167867 3209097 3283881 3172986 3118347
4520C118347k71672N1605N18852M0914k22057p0650L8610O0770J15783j80194
$$ 3118347 2846675 2898280 3417132 3458046 3235989 3165339 3203949 3264719 3380502 3200308
4510C200308l0981L77429L04818k83373k50800L10936k12187J1940K72618k19234
$$ 3200308 3169327 3546756 3851574 3568201 3317401 3628337 3416150 3428090 3700708 3481474
4500C481474J0126L25660J6604J98468J18479k19547p933N3510N04224J86559
$$ 3481474 3491600 3817260 3833864 4032332 4150811 3931264 3923331 3976841 4481065 4667624
4490D667624k15623k34408j1146j43432L69350M19727J23197k64582r9865J47661
$$ 4667624 4452001 4217593 4206447 4063015 4432365 4852092 4975289 4710707 4610842 4758503
4480D758503O6217q3321K05304J98052j353m24493P23412J40739K4263J91169
$$ 4758503 4824720 4741399 4946703 5144755 5143402 4718909 5442321 5583060 5607323 5798492
4470E798492l17605o5333L30656M27001L447N54210j16524N4854j39954K55178
$$ 5798492 5480887 5415554 5746210 6173211 6176658 6730868 6614344 6669198 6529244 6784422
4460F784422N26807k8529o0909J92347J47916L84955R1855L7020L51324M98607
$$ 6784422 7311229 7282700 7221791 7414138 7562054 7947009 8038864 8075884 8427208 8925815
4450H925815l14634L18158M87486m0660M31130j8328R9873N54317M5093M4972
$$ 8925815 8611181 8929339 9416825 9376165 9807295 9788967 9888840 10443157 10488250 10533222
4440A0533222L08768N22752M85266p0191O3150Q83007M95508r8850M0354J91943
$$ 10533222 10841990 11364742 11850008 11779817 11842967 12725974 13221482 13122632 13162986 13354929
4430A3354929M37522P12076N06872j3201K60484L72855O41349P17691J64976K33422
$$ 13354929 13792451 14504527 15011399 14998198 15258682 15631537 16272886 16990577 17155553 17388975
4420A7388975J080804N82881N10490P78391J365589J046933J018960R97415J274816
$$ 17388975 18469779 19052660 19563150 20341541 21707130 22754063 23773023 24770438 26045254
4411B6045254J489092J220212J553470J552465J838113L140719L060661K625314
$$ 26045254 27534346 28754558 30308028 31860493 33698606 36839325 39899986 42525300
4403D2525300L157182L623785M604234M744874N367320N946111O951562P393032
$$ 42525300 45682482 49306267 53910501 58655375 64022695 69968806 76920368 84313400
4395H4313400P499408P032079O135650N386371M736296N973712P361784Q049716
$$ 84313400 91812808 98844887 104980537 110366908 115103204 121076916 128438700 136488416
4387A36488416Q716450Q701993O650350L256219P22769L18963J936055L779495
$$ 136488416 145204866 153906859 160557209 163813428 164536197 164855160 166791215 170570710
4379A70570710N236048N299749L099621j763959o283381r263535q285519n445797
$$ 170570710 175806758 181106507 184206128 182442169 176158788 166895253 158609734 153163937
4371A53163937l779233k262126k451891m363741p452995j0057020r953513q577270
$$ 153163937 149384704 147122578 144670687 140306946 132853951 122796931 112843418 104266148
4363A04266148o510400m988105m611431n194170n590325o668325p094660o259987
$$ 104266148 97755748 92767643 88156212 82962042 77371717 70703392 63608732 57348745
4355E7348745n941361m365403l810085k981931k320019k431558j861794j790341
$$ 57348745 51407384 47041981 43231896 40249965 37929946 35498388 33636594 31846253
4347C1846253j370019j631677j230753j323185j062578n05974r42870j101469
$$ 31846253 30476234 28844557 27613804 26290619 25228041 24722067 23779197 22677728
4339B2677728o92961k51485r21036p32958k48162l64604r66778q65628o85667
$$ 22677728 21984767 21733282 20812246 20079288 19831126 19466522 18499744 17634116 16948449
4330A6948449p38865K29182m71887o30705m41485n33305l2806n22216j30518l50167
$$ 16948449 16209584 16438766 15966879 15336174 14894689 14361384 14328578 13806362 13675844 13325677
4320A3325677j97803k85426j37676m72950q6606j05574m05184K8144J05398k05782
$$ 13325677 13127874 12842448 12704772 12231822 12145216 12039642 11634458 11662602 11768000 11562218
4310A1562218m30918j04246j17994r6087O9723j0720j33572j63822L36430L74212
$$ 11562218 11131300 11027054 10909060 10812973 10882696 10871976 10738404 10574582 10911012 11285224
4300A1285224q3489j11467k00238L0252l57037l13994j97515j93980p9624n39127
$$ 11285224 11201735 11090268 10890030 10920282 10563245 10249251 10051736 9857756 9778132 9239005
4290I239005n14637k08085L51246m36494k21871K56892k51028k51870n25658R7992
$$ 9239005 8724368 8516283 8867529 8431035 8209164 8466056 8215028 7963158 7437500 7535492
4280G535492k09068K70000K15888m96607j09945l09518l41535M47478j43853n1337
$$ 7535492 7326424 7596424 7812312 7315705 7205760 6896242 6554707 7002185 6858332 6806995
4270F806995j08685k04150L62976J35425Q0091K2796o2416q9176k04716m12993
$$ 6806995 6698310 6494160 6857136 6992561 7072652 7095448 7033032 6943856 6739140 6326147
4260F326147j5418J35839P8317j8334j1113j46660j55277q0032p5379R5907K58523
$$ 6326147 6310729 6446568 6524885 6506551 6495438 6348778 6193501 6113469 6038090 6133997 6392520
4249F392520j03207J02158j04975k9128k3258N4469n33002j28718L11040M80619
$$ 6392520 6289313 6391471 6286496 6257368 6234110 6288579 5755577 5626859 5937899 6418518
4239F418518J30783k11180l38332L15223j8014j1029j35806P4316L32417n82310
$$ 6418518 6549301 6338121 5999789 6315012 6296998 6285969 6150163 6224479 6556896 5974586
4229E974586J58863L44857J09907J41019L07138m44124m44173J42758j10602Q4614
$$ 5974586 6133449 6478306 6588213 6729232 7036370 6592246 6148073 6290831 6180229 6264843
4219F264843K44901L11160L98854j69915l9221k72703J04593M8427k2930j40894
$$ 6264843 6509744 6820904 7219758 7049843 7010622 6737919 6842512 6890939 6868009 6727115
4209F727115Q1626Q8717n1673O02544r9716L8522N6608o0688J52460m9467J39250
$$ 6727115 6808741 6897458 6845785 7448329 7348613 7387135 7443743 7383055 7535515 7486048 7625298
4198G625298l17580j956L13237j62300J35339L24455L76597K64352j16276O60583
$$ 7625298 7307718 7305762 7618999 7456699 7592038 7916493 8293090 8557442 8441166 9101749
4188I101749R806k1975M79356p8912K5827J60265k12407p4513K32114L03365L32096
$$ 9101749 9111555 9089580 9568936 9490024 9515851 9676116 9463709 9389196 9621310 9924675 10256771
4177A0256771Q10024l8352K70723q6712j44673K04311L92231K13747K65445K74587
$$ 10256771 11066795 11028443 11299166 11212454 11067781 11272092 11664323 11878070 12143515 12418102
4167A2418102J72549M80137L29039K51023L9566L50840N79048L73683p1119M40967
$$ 12418102 12590651 13070788 13399827 13650850 13690416 14041256 14620304 14993987 14922868 15363835
4157A5363835P02590L99474K68916K3422O46073M24738O42546N99811O02479N20585
$$ 15363835 16066425 16465899 16734815 16758237 17404310 17829048 18471594 19071405 19673884 20194469
4147B0194469M86391Q14845O67272N29980M00201J024258J348185O91987Q63517
$$ 20194469 20680860 21495705 22162977 22692957 23093158 24117416 25465601 26157588 27021105
4138B7021105P76913O90775O58627J313255J003172K24692Q30297L63438R22357
$$ 27021105 27798018 28488793 29147420 30460675 31463847 31688539 32518836 32882274 33804631
4129C3804631Q04492O19222N38164Q70171O07177O73844O28640N77432R57826
$$ 33804631 34609123 35228345 35766509 36636680 37243857 37917701 38546341 39123773 40081599
4120D0081599J208693J051301J486009J558151J359842J384169J396585J278813
$$ 40081599 41290292 42341593 43827602 45385753 46745595 48129764 49526349 50805162
4112E0805162K318099K146746J766719K151043K443076K035067K068864K596669
$$ 50805162 53123261 55270007 57036726 59187769 61630845 63665912 65734776 68331445
4104F8331445K454876J960935K256582K028549K479764J931153K185207K341669
$$ 68331445 70786321 72747256 75003838 77032387 79512151 81443304 83628511 85970180
4096H5970180K923571L671904L619069M009263M748928N526761N912230O520475
$$ 85970180 88893751 92565655 96184724 100193987 104942915 110469676 116381906 122902381
4088A22902381P234963R337080J0518910J1841428J3487181J5233599J6055860
$$ 122902381 130137344 139474424 149993334 161834762 175321943 190555542 206611402
4081B06611402J7754036J9563382K0955287K1670384K1701518J9418746J1188450
$$ 206611402 224365438 243928820 264884107 286554491 308256009 327674755 338863205
4074C38863205k979509j7835059k8938879l2092008k8671034k3115754j8837804
$$ 338863205 335883696 318048637 289109758 257017750 228346716 205230962 186393158
4067A86393158j4814885j2380704r883559q158512p153914o269399n438841m718541
$$ 186393158 171578273 159197569 149314010 141155498 134001584 127732185 122293344 117574803
4059A17574803m527260l962446k996800k866914k581620k007408j909355j436300
$$ 117574803 113047543 109085097 106088297 103221383 100639763 98632355 96723000 95286700
4051I5286700j818405m97913l63824j41546m7341k59669L10353L97562O34933
$$ 95286700 93468295 92970382 92606558 92465012 92417671 92158002 92468355 92865917 93500850
4042I3500850R15959Q01659J164296L52452R01878J351296J296214J227052P28675
$$ 93500850 94416809 95218468 96382764 96735216 97637094 98988390 100284604 101511656 102240331
4033A02240331O36179J580171J310979P04804J189255J249221J082603J503453
$$ 102240331 102876510 104456681 105767660 106472464 107661719 108910940 109993543 111496996
4025A11496996J425394J700472J695120J874152J901834J506112J748165J887001
$$ 111496996 112922390 114622862 116317982 118192134 120093968 121600080 123348245 125235246
4017A25235246J868259J703838J440177J284410J702245J670615R85557J102587
$$ 125235246 127103505 128807343 130247520 131531930 133234175 134904790 135890347 136992934
4009A36992934R82823O75101Q01262M25533J39212j90859J35244r1275n56022
$$ 136992934 137975757 138650858 139452120 139877653 140016865 139826006 139961250 139869975 139313953
4000A39313953k095758k326723l127464k776702k141021k638803k464851k288531
$$ 139313953 137218195 134891472 131764008 128987306 126846285 124207482 121742631 119454100
3992A19454100k558385k498523l220534l890660m268627l782825l898396l492749
$$ 119454100 116895715 114397192 111176658 107285998 103017371 99234546 95336150 91843401
3984I1843401l403053l688172l143383k854496k776387k752145l125463k544907
$$ 91843401 88440348 84752176 81608793 78754297 75977910 73225765 70100302 67555395
3976F7555395k246420k596492k184144k175157k355806k027773j587171j758182
$$ 67555395 65308975 62712483 60528339 58353182 55997376 53969603 52382432 50624250
3968E0624250j917211j869776j726446q11600j064406j797278j184034r05401
$$ 50624250 48707039 46837263 45110817 44299217 43234811 41437533 40253499 39348098
3960C9348098q58551n02639n61700p24459o78377j012286o28167j194471p06796
$$ 39348098 38489547 37986908 37425208 36700749 36022372 35010086 34381919 33187448 32480652
3951C2480652j001694j010574j346286j430447j141455q01732q26651j083318
$$ 32480652 31478958 30468384 29122098 27691651 26550196 25748464 24921813 23838495
3943B3838495k08403n36408q82152o21364k75877J20966q58774l28133m44786
$$ 23838495 23630092 23093684 22211532 21590168 21314291 21435257 20576483 20248350 19803564
3934A9803564q61892R7328l62340l91920l66688j86185R3999o418k50887l03056
$$ 19803564 18941672 19039000 18676660 18284740 17918052 17731867 17825866 17819448 17568561 17265505
3924A7265505m25896m762R4403k92858n8618n6158j69802m6618m02338l12237
$$ 17265505 16839609 16834847 16929250 16636392 16577774 16521616 16351814 16305196 15902858 15590621
3914A5590621K92611k3707j14101R0118J46280k5724l57547j23798L7385k92952
$$ 15590621 15883232 15859525 15745424 15835542 15981822 15956098 15598551 15474753 15512138 15219186
3904A5219186N43895J0089l71009Q8874j50622L97429k34732K71897k2497Q8859
$$ 15219186 15763081 15773170 15402161 15491035 15340413 15737842 15503110 15775007 15752510 15841369
3894A5841369O819L41774l240P4097J51422m318N15522L271N28579L60106L08638
$$ 15841369 15848188 16189962 16186722 16260819 16412241 16407923 16923445 16926716 17455295 17815401 18124039
3883A8124039o8563J0364M11101p277J75749K17631L89782J77855L39542O20051
$$ 18124039 18055476 18065840 18476941 18469664 18645413 18863044 19252826 19430681 19770223 20390274
3873B0390274M39132M35629M41495N60231J02974M08280M79229J54822j67993
$$ 20390274 20829406 21265035 21706530 22266761 22369735 22778015 23257244 23412066 23244073
3864B3244073Q86095J008795M14053j63731K33970O40188J114855K19209O57776
$$ 23244073 24130168 25138963 25553016 25389285 25623255 26263443 27378298 27597507 28255283
3855B8255283J287021M90889M64929L61027N84551P38050Q73763R64912L84996
$$ 28255283 29542304 30033193 30498122 30859149 31443700 32181750 33055513 34020425 34405421
3846C4405421Q31510J305743R34700N40996Q85997J365498J463196J420948J190736
$$ 34405421 35236931 36542674 37477374 38018370 38904367 40269865 41733061 43154009 44344745
3837D4344745J527542J687574J857388J402616J899560K035986J935136J974265
$$ 44344745 45872287 47559861 49417249 50819865 52719425 54755411 56690547 58664812
3829E8664812K188525K629690K488354K607514L034429L407035L729706M237195
$$ 58664812 60853337 63483027 65971381 68578895 71613324 75020359 78750065 82987260
3821H2987260M307281M223913N195080N715444N995088O396216P490532P570085
$$ 82987260 87294541 91518454 96713534 102428978 108424066 114820282 122310814 129880899
3813A29880899Q329857R076376R629195J0317091J0478467J1106183J1261422
$$ 129880899 138210756 147287132 156916327 167233418 177711885 188818068 200079490
3806B00079490J1296910J1037853J0856831J0108182R273474Q131867O208051
$$ 200079490 211376400 222414253 233271084 243379266 252652740 260784607 266992658
3799B66992658M950684L475410J869275J226710N8602r99004j657731k204503
$$ 266992658 271943342 275418752 277288027 278514737 278573339 277574335 275916604 273712101
3791B73712101k853017l735798m229969m891404o399193p739960q017557r371056
$$ 273712101 270859084 267123286 262893317 258001913 251602720 243862760 235845203 226474147
3783B26474147j0150624j0836030j1252529j1132976r973911r639995r724636
$$ 226474147 216323523 205487493 194234964 183101988 173128077 163488082 153763446
3776A53763446r229053q250441q190243p362111o868898o538935n634968n321179
$$ 153763446 144534393 136283952 128093709 120731598 113862700 107323765 101688797 96367618
3768I6367618n550405n154969m010300l861746l698351l635157l407483k814195
$$ 96367618 90817213 85662244 81651944 77790198 74091847 70456690 67049207 64235012
3760F4235012k109944k278600k019936k659829j583742j636491j460199j618894
$$ 64235012 62125068 59846468 57826532 55166703 53582961 51946470 50486271 48867377
3752D8867377j755382j543428r53715j112868j200419r38927j097003r86884j217306
$$ 48867377 47111995 45568567 44614852 43501984 42301565 41362638 40265635 39278751 38061445
3743C8061445q86058q20273r35166m96805l91449p88409n92168l10490o35212
$$ 38061445 37175387 36355114 35419948 34923143 34531694 33743285 33151117 32840627 32205415
3734C2205415r05992l87621n92372l71649q49835q72495n1074k40643l93252p69875
$$ 32205415 31299423 30911802 30319430 29947781 29097946 28225451 28174377 27933734 27540482 26770607
3724B6770607n79013j90782l82143l91248n15525p11277J32860p3316n3878m35164
$$ 26770607 26191594 26000812 25618669 25227421 24711896 24000619 24133479 24060163 24006285 23571121
3714B3571121o54256k91131l46071j17659k85807L74691l20924p0840K23706l68673
$$ 23571121 22916865 22625734 22279663 22162004 21876197 22250888 21929964 21859124 22082830 21714157
3704B1714157m0853m84107j00076K9703n2057j51581n24200o6912K0219j32828
$$ 21714157 21673304 21189197 21089121 21118824 21066767 20915186 20390986 20324074 20344293 20211465
3694B0211465l39079k24596k1748k56738N9625n8320k83120n5897J00617k244
$$ 20211465 19872386 19647790 19626042 19369304 19428929 19370609 19087489 19031592 19132209 19129965
3684A9129965l6027R1443P5737J62800m11665o0184r8326J39242K77026k75536
$$ 19129965 19093938 19185381 19261118 19423918 19012253 18952069 18853743 18992985 19270011 18994475
3674A8994475j8515M77537J56140J72602L13551J24939k84060P08252Q48269M55206
$$ 18994475 18975960 19453497 19609637 19782239 20095790 20220729 19936669 20644921 21493190 21948396
3664B1948396K58484O84217P04082O09624K65184R82162Q72222Q38496O86429
$$ 21948396 22206880 22891097 23595179 24204803 24469987 25452149 26324371 27162867 27849296
3655B7849296P32762J066250R55303J038333O99474R24545Q88749M15928P73675
$$ 27849296 28582058 29648308 30603611 31641944 32341418 33265963 34154712 34570640 35344315
3646C5344315J400203O33917J021637O10250J118668P81151M24560J021615q904
$$ 35344315 36744518 37378435 38400072 39010322 40128990 40910141 41334701 42356316 42347412
3637D2347412N36102R63843M32807K72743J3511K84051k47963l42188J28747l22077
$$ 42347412 42883514 43847357 44280164 44552907 44566418 44850469 44602506 44260318 44389065 44066988
3627D4066988O9926J06575l09753J97201J4107r5821Q2564p2841J60268K83556
$$ 44066988 44136914 44243489 43933736 44130937 44145044 44049223 44131787 44058946 44219214 44502770
3617D4502770L24055O16588P63745J20674N63421R72748R80238J453380J251541
$$ 44502770 44826825 45443413 46207158 46327832 46891253 47864001 48844239 50297619 51549160
3608E1549160J721242K004924J778324J628690K642746K714611K957599L271008
$$ 51549160 53270402 55275326 57053650 58682340 61325086 64039697 66997296 70268304
3600G0268304L033195L241099L759787L526338L949756L512194M003192L956194
$$ 70268304 73301499 76542598 80302385 83828723 87778479 91290673 95293865 99250059
3592I9250059L683697L725445L701252L812753L851640L203003K856824L174779
$$ 99250059 102933756 106659201 110360453 114173206 118024846 121227849 124084673 127259452
3584A27259452K984233K414883K509400K068432J591124K016522J819600J232118
$$ 127259452 130243685 132658568 135167968 137236400 138827524 140844046 142663646 143895764
3576A43895764J184222R21099O84778M5330L28239M23567M25626J31811j99944
$$ 143895764 145079986 146001085 146685863 146731193 147059432 147482999 147908625 148040436 147840492
3567A47840492L33634N8923J33598J10895k20283k55548j65638p10680o30876
$$ 147840492 148174126 148233049 148366647 148477542 148257259 148001711 147836073 147125393 146494517
3558A46494517m98271k15661o04053n01341k27636q07041j165225r14689j046235
$$ 146494517 145996246 145780585 145176532 144675191 144447555 143640514 142475289 141560600 140514365
3549A40514365j178062j433655j670119k082218k223321k640584k505187k937269
$$ 140514365 139336303 137902648 136232529 134150311 131926990 129286406 126781219 123843950
3541A23843950l255058l208905l039712l400008l678867l748159l316137l560621
$$ 123843950 120588892 117379987 114340275 110940267 107261400 103513241 100197104 96636483
3533I6636483l801815l710787l130289l408054l299938l423990l548520k827487
$$ 96636483 92834668 89123881 85993592 82585538 79285600 75861610 72313090 69485603
3525F9485603k808386k673901k796508k399039k172062k240861k141149j522468
$$ 69485603 66677217 64003316 61206808 58807769 56635707 54394846 52253697 50731229
3517E0731229r02666q11692j123602o73547o61591n72767o42262M172n82067p27762
$$ 50731229 49828563 49016871 47893269 47219722 46558131 45985364 45343102 45347274 44765207 44037445
3507D4037445j89329K2352q5690j39415j45978n51325N011M5690M05675m13624
$$ 44037445 43848116 43870468 43784778 43645363 43499385 42948060 42953071 42998761 43404436 42990812
3497D2990812m44939L9883p0816n34962k42950k91489m21389j118335j107815
$$ 42990812 42545873 42585756 42514940 41979978 41737028 41445539 41024150 39905815 38798000
3488C8798000p66871m68391m69795j104032j213107r46375o70288q53961j019107
$$ 38798000 38031129 37562738 37092943 35988911 34775804 33829429 33159141 32305180 31286073
3479C1286073r62461q77039j165532r05111j028634r66083r52648r73085j423709
$$ 31286073 30323612 29446573 28281041 27375930 26347296 25381213 24428565 23455480 22031771
3470B2031771r33116n12248o53311r27561r38816j049744o35970j27407l61656
$$ 22031771 21098655 20586407 19933096 19005535 18066719 17016975 16381005 16253598 15891942
3461A5891942o03182q04529q13481j92667m75522j54152n10768m63614k88352
$$ 15891942 15288760 14484231 13670750 13478083 13002561 12848409 12337641 11874027 11585675
3452A1585675m90189J64543r73230n99796k17510J23260k2768j83406m01551l55183
$$ 11585675 11095486 11260029 10286799 9687003 9469493 9592753 9569985 9386579 8985028 8629845
3442H629845p5123J3909m03922k19125k19295k17895l57518J86286K8369k96801
$$ 8629845 8554722 8568631 8164709 7945584 7726289 7508394 7150876 7337162 7365531 7068730
3432G068730M937m39920j50454l00394j02894q1846k43127K28648j00712l93293
$$ 7068730 7073667 6633747 6483293 6182899 6080005 5998159 5755032 5983680 5882968 5489675
3422E489675J09782p6808j27846o7097k63270k97407o1617J79077k0594m1865
$$ 5489675 5599457 5522649 5394803 5327706 5064436 4767029 4705412 4884489 4863895 4822030
3412D822030j98826o9028K76528j95776l56662j64333K90685j68728j66673K69273
$$ 4822030 4623204 4554176 4830704 4634928 4278266 4113933 4404618 4235890 4069217 4338490
3402D338490k34105l77121l96698k15767K63990j43359M6256q998R8975j93334
$$ 4338490 4104385 3727264 3330566 3114799 3378789 3235430 3281686 3272688 3371663 3178329
3392C178329L3689j82316K65928N04371k79047k26475m0557m37242m7468k25592
$$ 3178329 3212018 3029702 3295630 3800001 3520954 3294479 3253922 2816680 2769212 2543620
3382B543620q6436J76768J67182K14284l91263p25579j47134P04061K95243j13384
$$ 2543620 2457184 2633952 2801134 3015418 2624155 1898576 1751442 2455503 2750746 2637362
3372B637362r1403l27717J45014j12342k0936N7047j0508j46504r6924K87703
$$ 2637362 2545959 2218242 2363256 2250914 2229978 2287025 2276517 2130013 2033089 2320792
3362B320792O4948L26997N1508q25682J91592L42699l95721J03007l52247K74100
$$ 2320792 2385740 2712737 2764245 1938563 2130155 2472854 2077133 2180140 1827893 2101993
3352B101993J36618Q3043k73283o7757Q9866j81934m3074K91590q914j24093J89257
$$ 2101993 2238611 2321654 2048371 1980614 2070480 1888546 1845472 2137062 2128148 2004055 2193312
3341B193312j32013k15157q630r6547l29106j07589J89945L65415l2060O9419
$$ 2193312 2061299 1846142 1837512 1740965 1411859 1304270 1494215 1859630 1827570 1896989
3331A896989k96495J68864p7281q5527J51227J88540k32279j71954r8879K76949
$$ 1896989 1600494 1769358 1692077 1606550 1757777 1946317 1714038 1542084 1443205 1720154
3321A720154K35079k87571j08879K64762K05397N7307o1483j74297M28219J26697
$$ 1720154 1955233 1667662 1558783 1823545 2028942 2086249 2024766 1850469 2278688 2405385
3311B405385J52195j96192k05418k42769o3305o1476J45333R1756k60556Q6252
$$ 2405385 2557580 2361388 2155970 1913201 1849896 1788420 1933753 2025509 1764953 1851205
3301A851205L43036j75744j5441J73030J33448k81881k8954J43086J63122l67393
$$ 1851205 2194241 2018497 2003056 2176086 2309534 2027653 1998699 2141785 2304907 1937514
3291A937514R6368K59971j86228l36543k6377K12566N18842j60092j3842j64724
$$ 1937514 2033882 2293853 2107625 1771082 1744705 1957271 2476113 2316021 2302179 2137455
3281B137455J36017m0347j90848r692J13250j8926N7676p4273j85908L13117O1640
$$ 2137455 2273472 2233125 2042277 2032585 2145835 2126909 2184585 2110312 1924404 2237521 2299161
3270B299161m80712l10846M06705p0050K42818r7131n5956l9460j93821k20050
$$ 2299161 1818449 1507603 1914308 1844258 2087076 1989945 1933989 1894529 1700708 1480658
3260A480658J14042M36060j99079Q4259L12233Q143j64087R04k69761m69036P34791
$$ 1480658 1594700 2030760 1831681 1915940 2228173 2236316 2072229 2073133 1803372 1334336 2069127
3249B069127K37889n97776M96028p4531k60549O2110k07233K27740k02445L35372
$$ 2069127 2307016 1709240 2205268 2130737 1870188 1932298 1725065 1952805 1750360 2085732
3239B085732j4099M4620m0718m63969J71502j43102k8624K91375R9132Q8509k12771
$$ 2085732 2071633 2116253 2075535 1611566 1783068 1639966 1611342 1902717 2001849 2090358 1877587
3228A877587J90981Q1670K51428K65546Q1847l49804j83480N0428j03761J03707
$$ 1877587 2068568 2150238 2401666 2667212 2749059 2399255 2215775 2266203 2162442 2266149
3218B266149L46796L33556L18214k43452M1382l49875o8764J52687m40627J55384
$$ 2266149 2612945 2946501 3264715 3021263 3062645 2712770 2644006 2796693 2356066 2511450
3208B511450o8590m70685m11535L51804N9444r236j43376k09019m64050J04309
$$ 2511450 2442860 1972175 1560640 1912444 1971888 1962652 1819276 1610257 1146207 1250516
3198A250516K30771j11736L7150O9232L2769m55761L39258p4832O7367M6847l94544
$$ 1250516 1481287 1369551 1406701 1475933 1508702 1052941 1392199 1317367 1384734 1431581 1037037
3187A037037k7658m4763L3073K50899K81452j72560k68779j51179J5367J74101
$$ 1037037 1009379 964616 997689 1248588 1530040 1357480 1088701 937522 952889 1126990
3177A126990j12693K4310j94888J55930Q4031k34358J08855l0497n23180M15460
$$ 1126990 1014297 1038607 843719 999649 1083680 849322 958177 927680 404500 819960
3167H19960L68803l35099l85544j20507M13191j09812j11653j13427R5007K59001
$$ 819960 1188763 853664 468120 347613 760804 650992 539339 425912 520919 779920
3157G79920j84270L28270J15067J24629r8666J86854k03861q4473j62452K2089
$$ 779920 595650 923920 1038987 1163616 1064950 1251804 1047943 963470 801018 823107
3147H23107J7018m16865K55281L86666k3960m03191J06901L50497k54199K64994
$$ 823107 840125 423260 678541 1065207 1041247 638056 744957 1095454 841255 1106249
3137A106249M36518j84910j96603j47433L6797P986J50320m50325L14192K81462
$$ 1106249 1542767 1357857 1161254 1013821 1050618 1058604 1208924 758599 1072791 1354253
3127A354253l70006n25835L75937J42140l9643L7892l47909J8963K94925J93081
$$ 1354253 984247 458412 834349 976489 936846 974738 626829 645792 940717 1133798
3117A133798l90044n61486K78415K44700j6719k17482O1966J64075N64546k25709
$$ 1133798 743754 182268 460683 705383 688664 471182 533148 697223 1261769 1036060
3107A036060k51214L56218o2536J5082l5703k82269o7677j16887L38024j02646
$$ 1036060 784846 1141064 1078528 1093610 1057907 775638 707961 591074 929098 826452
3097H26452j88230J52381O8207J49812l03125J65151p9727l06187J96009P4067
$$ 826452 638222 790603 858810 1008622 705497 870648 790921 484734 680743 754810
3087G54810K12846j90511K64126J94276L16800p6952l90826l85136l46194J90050
$$ 754810 967656 777145 1041271 1235547 1552347 1475395 1084569 699433 353239 543289
3077E43289J43451J82290l22677m8693P9178L13681l57475q6339K69120M1416
$$ 543289 686740 869030 546353 497660 576838 890519 533044 446705 715825 757241
3067G57241k04077n0121N4565J17632L63362m23660j34579j60049K94859K10687
$$ 757241 553164 503043 557608 675240 1038602 614942 480363 320314 615173 825860
3057H25860j61345N28117K70869k5481n1976n58554J1579J18844n4327l05320
$$ 825860 664515 1192632 1463501 1438020 1386044 827490 839069 957913 903586 598266
3047E98266m63192K69872K01713J325M80797l4321k92145j86283K57982k99450
$$ 598266 135074 404946 606659 607984 1088781 1054460 762315 576032 834014 534564
3037E34564Q4374L99733k57900k60012j57397k29340j44600J5721K05538M69403
$$ 534564 618938 1018671 760771 500759 343362 114022 -30578 -14857 190681 660084
3027F60084J93840j29534m56718N33366L95001L50776l20683l53995l80446L32056
$$ 660084 853924 724390 267672 801038 1196039 1546815 1226132 872137 491691 823747
3017H23747j11188p7809m26993q5784j5723N9996J43228k58531K00577j03768
$$ 823747 712559 634750 207757 121973 106250 166246 309474 50943 251520 147752
3007A47752k5639J20745j19694r6192J69549l8151o8553L5351M54676K01915k94142
$$ 147752 122113 242858 123164 26972 196521 158370 89817 125168 579844 781759 487617
2996D87617k23246K2928J5149l04114J11526J74508Q0940N9562K32442J54136
$$ 487617 264371 287299 302448 -1666 109860 284368 365308 424870 657312 811448
2986H11448j29107M4345O7785q42725J78109O73966J8178l65726J16760l08539
$$ 811448 682341 726686 794471 -48254 129855 803821 821999 456273 573033 264494
2976B64494j30055K26232j26754l93361o52L36537J80944m7024l9166m410l22438
$$ 264494 134439 360671 233917 -159444 -160096 176441 357385 310361 271195 266785 -55653
2965e5653L68582j28621K12235J50574j91011l52241K13299K57242k48613q76
$$ -55653 312929 184308 396543 547117 356106 3865 217164 474406 225793 224917
2955B24917k24226k72525k53731R7897O26896L16645j49173R3720l93104O1238
$$ 224917 691 -271834 -525565 -427668 199228 515873 366700 460420 67316 128554
2945A28554P9757l67105J02613J16306M7879j27625J47626M6017j18732J77484
$$ 128554 208311 -158794 -56181 60125 108004 -19621 128005 174022 55290 232774
2935B32774J2419q0090J6599k22458p4808J93201Q9775j42911K53214k45255M08056
$$ 232774 245193 165103 181702 -40756 -115564 77637 167412 24501 277715 32460 440516
2924D40516r2436j34199k27372J81308L6125o3459j18166p1297n2432K78949L45319
$$ 440516 348080 213881 -13491 167817 203942 140483 22317 -48980 -101412 177537 522856
2913E22856k42879K52738K2162k38923j0873m45267J63161Q710K59976r292J66064
$$ 522856 279977 532715 554877 315954 305081 -140186 22975 31685 291661 282369 448433
2902D48433N5356R5164J37628l68418j07338J72835l3865O3381J16931k51603
$$ 448433 503789 598953 736581 368163 260825 433660 399795 463176 580107 328504
2892C28504j95648R9490K30448l01837K67987j70615Q2392O2101K95598K68904
$$ 328504 132856 232346 462794 160957 428944 258329 340721 402822 698420 967324
2882I67324m05579j52095J07868l7598L22628j76625M4210q1830L56456o0988
$$ 967324 561745 409650 517518 479920 802548 625923 670133 588303 944759 883771
2872H83771J03208l5632k51220o7754O7143R0719m42361P7408l28656M15337K7646
$$ 883771 986979 951347 700127 632373 699516 790235 347874 425282 96626 511963 539609
2861E39609K56567J71255q3775m3588k25767m7639j47279j73836k5605k7446R110
$$ 539609 796176 967431 883656 840068 614301 566662 419383 245547 219942 192496 201606
2850B01606j86249N72399K42434m92421K9224J24986q1141j43488r7562J50369
$$ 201606 15357 587756 830190 337769 366993 491979 410838 267350 169788 320157
2840C20157J57415N1224J7414j53050j1865l58683J87771L03602k4007k6461j04195
$$ 320157 477572 528796 546210 393160 381295 22612 210383 513985 489978 463517 359322
2829C59322q911L70233l85369J06149n4951j89148RJ90981k73098m59918p516
$$ 359322 350411 720644 335275 441424 386473 197325 197334 388315 115217 -344701 -352217
2818c52217N36859N71250k06327k39267k54260q8410J60512n9101K33233o2937
$$ -352217 184642 755892 549565 310298 56038 -32372 128140 69039 302272 239335
2808B39335p1503n14441K46972n6123M4308L53425J2101p8481J18645l94584k28241
$$ 239335 167832 -346609 -99637 -155760 -111452 241973 254074 175593 294238 -100346 -328587
2797c28587J5732J67890N9156K09867J88126J4002K23041O6242j22375p6542k20355
$$ -328587 -312855 -144965 -85809 124058 312184 326186 549227 615469 493094 416552 196197
2786A96197j28448Q616k89988L66186j0059m3246l65600k03425L00538k8355J46259
$$ 196197 67749 76365 -213623 152563 142504 99258 -266342 -469767 -169229 -197584 -51325
2775e1325J42872J12182L45459j97630j97341m03581J44524m21037L09785M35764
$$ -51325 91547 203729 549188 351558 154217 -249364 -104840 -525877 -216092 219672
2765B19672N5051k59840K08302N7281Q9934k79576k47915o3754L34698j57723
$$ 219672 274723 14883 223185 280466 370400 90824 -157091 -220845 113853 -43870
2755d3870j95749j36928L01321r4358K13620m5512k37269K34490k23977k2028
$$ -43870 -239619 -376547 -75226 -169584 44036 -1476 -238745 -4255 -228232 -250260
2745b50260J0607Q5583p4701N24753J63025K76878k83978o8235k47240m36926
$$ -250260 -239653 -154070 -228771 295982 459007 735885 451907 383672 136432 -300494
2735c00494L43978M8537L09919k58393k39199q7058M8864J58798P410M6453j8339
$$ -300494 43484 92021 401940 143547 -95652 -182710 -133846 24952 32362 78815 60476
2724F0476K8487k38730L56454N2181j40698k15499O860J25646M9632m0189K15940
$$ 60476 88963 -149767 206687 258868 118170 -97329 -90469 35177 84809 44620 260560
2713B60560j03786l48590J9511k1717J2771Q583M1045L21222l51J36767J14064
$$ 260560 156774 -191816 -172305 -194022 -181251 -172668 -131623 189599 189248 326015 440079
2702D40079o21010j85766O25439P9357l29924j30004q0443j64077j1049p242M14267
$$ 440079 -180931 -366697 258742 338099 8175 -121829 -202272 -366349 -377398 -384640 29627
2691B9627k72427J33811P2890k43521m7419N6362j59138j15528J0928K59292L01577
$$ 29627 -242800 -108989 -36099 -279620 -327039 -270677 -429815 -545343 -534415 -275123 26454
2680B6454K54917j17630j91251j9942k18277K76110p1247J31530l87244j30475
$$ 26454 281371 163741 -27510 -47452 -265729 10381 -60866 70664 -316580 -447055
2670d47055J91260L9999M395q565J22372K50607n7679o1508l09056k23218J3049
$$ -447055 -255795 -215796 -211401 -219966 -97594 153013 95334 33826 -275230 -498448 -485399
2659d85399K74906k52964n9790K61746k60023L65798J30638k20974k27091K53744
$$ -485399 -210493 -463457 -523247 -261501 -521524 -155726 -25088 -246062 -473153 -219409
2649b19409L8967j15515J6630L56765k47195k71828M56360K58639q4842k52582
$$ -219409 -180442 -295957 -279327 77438 -169757 -441585 14775 273414 188572 -64010
2639f4010o1670k53435M8155P19986O0684l99527k00744j37926J08792L4284J34327
$$ -64010 -125680 -379115 -330960 389026 449710 50183 -150561 -288487 -179695 -145411 -11084
2628a1084j82760q8288J62944k6815k16715j3482J58274p437N8381J21410j08933
$$ -11084 -193844 -282132 -119188 -146003 -362718 -376200 -217926 -225363 -166982 -45572 -154505
2617a54505k50624J333N2968l46193L26586p0338l3727L54549J20202l5295K09736
$$ -154505 -405129 -403796 -350828 -697021 -370435 -440773 -474500 -119951 251 -35044 174692
2606A74692N2352j73520k29618m958n6335K24473K65493j99582k93638l06420
$$ 174692 227044 53524 -176094 -181052 -237387 -12914 252579 52997 -240641 -547061
2596e47061l6491J95976k03460J53271M60484r4176L4818j8937O7032k46322K5942
$$ -547061 -583552 -387576 -591036 -437765 22719 -71457 -36639 -55576 11456 -234866 -208924
2585b08924j04186K1731o7222j1754M2758n7862L56544j6603Q8937j62039j72932
$$ -208924 -313110 -291379 -358601 -370355 -327597 -385459 -28915 -45518 43419 -118620 -291552
2574b91552m09648J09749M61571K10174j04741J5989j40255j06521M74598l77184
$$ -291552 -701200 -591451 -129880 80294 -24447 -8458 -148713 -255234 219364 -157820
2564a57820m04722K53403l26015k05173L59934L82575J56358J47757k30689m27367
$$ -157820 -562542 -309139 -635154 -840327 -480393 -97818 58540 206297 -24392 -451759
2554d51759L77418J85627J64352m53022k10636M07208j95961l72275N37841k4410
$$ -451759 -74341 111286 275638 -177384 -388020 19188 -176773 -549048 -11207 -35617
2544c5617k6055l46832K85232k74835Q4771L34925j37783J96296k7999p7145J47204
$$ -35617 -61672 -408504 -123272 -398107 -313336 21589 -116194 80102 52103 -25042 122162
2533A22162l08386k39095R4867M87908j91618k71729K21877l99372k554N02909
$$ 122162 -186224 -425319 -330452 157456 -34162 -305891 -84014 -483386 -485940 16969
2523A6969K48241n83576n7192K92419J8020k94518l5122K48804K31988k79713
$$ 16969 265210 -318366 -375558 -83139 -65119 -359637 -394759 -145955 86033 -193680
2513a93680k84420N8130L12229L3674q1442J53643j19476J84919k10247Q5332
$$ -193680 -478100 -419970 -107741 -74067 -155509 -1866 -121342 63577 -146670 -61338
2503f1338r6689j45763j29382K04965M57706K61014k90637o2530J70226m43938
$$ -61338 -158027 -303790 -433172 -228207 229499 490513 199876 137346 307572 -136366
2493a36366n9066j68992K62021K1973M71354k29895k16255J53836q5676K96248
$$ -136366 -195432 -364424 -102403 -80430 390924 161029 -55226 98610 12934 309182
2483C09182k19850l02584J36759n96311K25419J13165Q1647J83666K0983J0618
$$ 309182 89332 -213252 -76493 -672804 -447385 -334220 -252573 -68907 -47924 -37306
2473c7306k4261J90979l93155L22831Q2180l41360J51768k40323K32961k0035
$$ -37306 -61567 129412 -263743 59088 141268 -200092 -48324 -288647 -55686 -75721
2463g5721l96131j72004L2581k50449P16133K71991k1484j8107j35866K80629
$$ -75721 -471852 -643856 -611275 -861724 -145591 126400 104916 86809 -49057 231572
2453B31572k23474P0667j2301k28821j36439L4826M18275j82928K25050m9561
$$ 231572 8098 78765 66464 -162357 -298796 -263970 154305 -28623 196427 146866
2443A46866l24609P345l9819j388M5227O7025M33806j89496k15512j34428p4900
$$ 146866 -177743 -170398 -210217 -211605 -166378 -99353 334453 144957 -70555 -204983 -279883
2432b79883K11540j35096K12965j45917m9753k49747j02834L75348J33215N3422
$$ -279883 -68343 -203439 9526 -136391 -186144 -435891 -538725 -163377 -30162 23260
2422B3260j82175J5886O75087p0949l84270J88933J6635l08976m5977j73824K12699
$$ 23260 -158915 -143029 532058 461109 76839 265772 282407 -26569 -72546 -246370 -33671
2411c3671l95685R5774K37920o6437L35520n945k44952J42307M48038Q3329j88951
$$ -33671 -429356 -333582 -95662 -162099 173421 167476 -77476 64831 512869 596198 407247
2400D07247l56801j3231j24811L7456J17378l73565j31219j52687J00486J42322
$$ 407247 50446 37215 -87596 -50140 67238 -306327 -437546 -590233 -489747 -347425
2390c47425K66541o4130j5646o2390L41019j75940r0975P5620l33267K84502L73700
$$ -347425 -80884 -145014 -160660 -223050 117969 -57971 -148946 -73326 -406593 -122091 251609
2379B51609j88237q8805J61553j19007k01203M13550m01308j21306J22475J1280
$$ 251609 63372 -25433 136120 17113 -184090 229460 -171848 -293154 -170679 -159399
2369a59399m1694J32785j24199k6924J21539j9066j31636J31015K07141n75164
$$ -159399 -201093 -68308 -192507 -219431 -97892 -116958 -248594 -117579 89562 -485602
2359d85602j09160J65250J57688K02273K84372k92729j10698J49137q1069l44615
$$ -485602 -594762 -429512 -271824 -69551 214821 -77908 -188606 -39469 -120538 -465153
2349d65153J28731L03683j29544P4255j2005k4705K79821k3822J54937j96488
$$ -465153 -336422 -32739 -162283 -88028 -100033 -124738 155083 131261 286198 89710
2339H9710k72759J07696K1832J05401Q2853j56973R9886k31778j21651J24935
$$ 89710 -183049 -75353 -53521 51880 134733 -22240 77646 -154132 -275783 -150848
2329a50848n9623J99274O7982j63066m26536O19802p09j49198J70653J68586n1489
$$ -150848 -210471 -11197 56785 -106281 -532817 86985 86276 -62922 107731 276317 224828
2318B24828j53058m05643k5123L49829k77143O9049J36964j47635M8838K12913
$$ 224828 71770 -333873 -358996 -9167 -286310 -217261 -80297 -227932 -179094 33819
2308C3819n447M8339l54809K25211k40961j55876N6698K15030q9053R051L84135
$$ 33819 28372 76711 -278098 -52887 -293848 -449724 -393026 -177996 -267049 -257998 126137
2297A26137M58979k95301n47834J7909K59256j41125L5052Q8729k70632K0241
$$ 126137 585116 289815 -258019 -240110 19146 -121979 -86927 1802 -268830 -248589
2287b48589J89879l9598p5511k69863L04323j13266m547J93388K07055l22864
$$ -248589 -58710 -98308 -173819 -443682 -139359 -252625 -257172 -63784 143271 -179593
2277a79593R9109j1688K46715O7308l41630r1837l08957J77031J43047n9270l2120
$$ -179593 -80484 -92172 154543 221851 -119779 -211616 -520573 -343542 -200495 -259765 -291885
2266b91885j07126j14031l7745J73498K44773M1929N9877k25040K2087J08952
$$ -291885 -399011 -513042 -550787 -377289 -132516 -90587 -30710 -255750 -233663 -124711
2256a24711J43243j9303K4520l17423L30020n5872O2014Q4166m6346O024l2972
$$ -124711 18532 -771 23749 -293674 36346 -19526 42488 126654 80308 86332 53360
2245E3360O1236j99881r4007Q8573r8242J21064k6149K75974J10660n88249j79553
$$ 53360 114596 -85285 -179292 -90719 -188961 -67897 -94046 181928 292588 -295661 -475214
2234d75214M49242J67421l37608l9084Q4399o2133Q6065M9193k05685L16535L971
$$ -475214 -25972 141449 -196159 -235243 -150844 -212977 -126912 -77719 -283404 33131 37102
2223C7102k36594k92814L76625j38566k30959K01323N21538j11621j01203n0175
$$ 37102 -199492 -492306 -115681 -254247 -485206 -283883 237655 126034 24831 -25344
2213b5344k42398L43616K48048L54403q90733q0995K60230k9386L61790l5012
$$ -25344 -267742 75874 323922 678325 -212408 -293403 -33173 -62559 299231 264219
2203B64219j04687L04194l60305l60873K1832K34427k10907J1823J46150K28449
$$ 264219 159532 463726 103421 -257452 -235620 -1193 -212100 -200277 -54127 174322
2193A74322j36138K65345R7580m32004J28426k2426o8801j73601j23407N2260
$$ 174322 38184 303529 401109 -30895 97531 75105 6304 -167297 -290704 -238444
2183b38444J84404J66374K76618j74633j3623J33828l9778q7100N3120j6764r4823
$$ -238444 -54040 112334 388952 214319 200696 334524 294746 207646 260766 244002 149179
2172A49179J78916m07122Q1553K25764o1926L4750K14971m4393J94876l33311
$$ 149179 328095 -79027 2526 228290 166364 201114 416085 371692 566568 233257
2162B33257m40568O9207K16688r8181m09164J65693J87579P9868l38502M62545
$$ 233257 -207311 -138104 78584 -19597 -428761 -263068 -75489 4379 -334123 128422
2152A28422K86334n85409m2057k78385L5783J34330q1700P5330J46915o7446J10224
$$ 128422 414756 -170653 -212710 -491095 -455312 -320982 -402682 -327352 -180437 -247883 -137659
2141a37659M40914J69364j65770m63880K56966L6898n29557N37195J96686j45522
$$ -137659 303255 472619 306849 -157031 99935 136833 -392724 144471 341157 195635
2131A95635r9313k33505j39271K21204K4851m07868J96209O0598P7752l25219
$$ 195635 96322 -137183 -276454 -55250 -30399 -438267 -242058 -181460 -103708 -428927
2121d28927K70233K1611o4053k48144Q8566J93132J63917L067J96529L7381j85093
$$ -428927 -158694 -137083 -201136 -449280 -360714 -167582 -3665 -598 195931 233312 48219
2110D8219q6437L01468j10312n39017M71032L63800k17690K8610J15997m7490
$$ 48219 -38218 263250 152938 -386079 84953 448753 231063 259673 375670 328180
2100C28180J89804J26669l8056q773k2835L36132l9307k01138j2971J90428m85350
$$ 328180 517984 644653 606597 597824 574989 911121 871814 670676 657705 848133 362783
2089C62783l46886L6351K01284K62582p00667n5482L7121J78612J01204p1760
$$ 362783 15897 52248 253532 516114 -184553 -240035 -202914 -24302 76902 5142
2079E142k43824n3587k95928K90767J85593l36262l5766J81003k13100J42739
$$ 5142 -238682 -292269 -588197 -297430 -111837 -448099 -483865 -302862 -515962 -373223
2069c73223J05878K89617J27216k42434l36613n8625O80912N8457l98200J00294
$$ -373223 -267345 22272 149488 -92946 -429559 -488184 192728 251185 -147015 -46721
2059d6721M53076q946J83445r36167j05793K41632M3140L60725K37811m48507
$$ -46721 406355 397409 580854 -355313 -461106 -219474 -176334 184391 422202 -26305
2049b6305o36759K3513N55669J0218M0932J77761l56079k12029N22422m14169
$$ -26305 -663064 -639551 -83882 -73664 -32732 145029 -211050 -423079 99343 -314826
2039c14826m149J38817J03731j93728k69147M18063j36978J07972o5856p9101
$$ -314826 -318975 -180158 -76427 -270155 -539302 -121239 -258217 -150245 -216101 -295202
2029b95202j07479J83262k03676j79757m9312J49509J55801J92785k79838R2239
$$ -295202 -402681 -219419 -423095 -602852 -652164 -502655 -346854 -154069 -433907 -341668
2019c41668J51576Q7689J45491j20550k86923J33017K12894k89974L6870N12214
$$ -341668 -190092 -102403 43088 -77462 -364385 -231368 -18474 -308448 -271578 240636
2009B40636J6183k45071j71659q0023J99935L59786k60504l24655R4078j2468
$$ 240636 256819 11748 -159911 -239934 -39999 319787 59283 -265372 -171294 -183762
1999a83762K44404J0000k73402J4789K46998J72987k25542k72249m18566N38733
$$ -183762 60642 70642 -202760 -187971 59027 232014 6472 -265777 -684343 -145610
1989a45610N23287r1512j53882k83655J87479K14941k25106r9005k82357k54076
$$ -145610 377677 286165 132283 -151372 36107 251048 25942 -73063 -355420 -609496
1979f09496J77895R2582Q9033l6942K32411r5977N1020J18688l1553J64421R9684
$$ -609496 -431601 -339019 -249986 -286928 -54517 -150494 -99474 19214 -12339 152082 251766
1968B51766l00187J26580k89997k39768K27077O16808J02356o81224r1141j75513
$$ 251766 -48421 78159 -211838 -451606 -224529 392279 494635 -186589 -277730 -453243
1958d53243K60986K83219q1442m11331L84505j59961L6949j7255O8028M9763j39602
$$ -453243 -192257 90962 9520 -401811 -17306 -177267 -140318 -157573 -89545 -39782 -179384
1947a79384j65799K52687M1206j67117k036R8101M31776n58448j59955o3251L79436
$$ -179384 -345183 -92496 -51290 -218407 -220443 -122342 309434 -249014 -408969 -472220 -92784
1936i2784K85454l97143p6069j44555K06770L61437m23486Q1099K2231M34327
$$ -92784 192670 -204473 -280542 -425097 -218327 143110 -280376 -199277 -177046 257281
1926B57281j59911m9298K2036l08787j06459l07998J02929L64823k46412J60352
$$ 257281 97370 48072 70108 -238679 -345138 -653136 -550207 -185384 -431796 -271444
1916b71444o2499L324K98034k81618M27880r9088k72253o411K40417J59891j94484
$$ -271444 -333943 -330619 -32585 -314203 113677 14589 -257664 -264075 -23658 136233 -58251
1905e8251J81824k13052K77183k4266P4545k22834j96754J85846k1894L47832
$$ -58251 123573 -89479 187704 163438 237983 15149 -181605 4241 -17653 330179
1895C30179M9896k0194l28665k7492J48102J24416k31300K65645k92077p9900
$$ 330179 380075 359881 31216 3724 151826 276242 44942 310587 18510 -61390
1885f1390L58976l31775J51308J18328k99089L56425K16330l2552k55801L72713
$$ -61390 297586 -34189 117119 235447 -63642 292783 509113 476561 220760 593473
1875E93473j85957J58095p8818p48934K17300j28087J55057O0968j2873J31376
$$ 593473 407516 565611 486793 -262141 -44841 -172928 -17871 43097 30224 161600
1865A61600l25083K22257J58355o9487j06989K40925M60733l10894p1760j04815
$$ 161600 -163483 58774 217129 147642 40653 281578 742311 431417 359657 254842
1855B54842k02960l03104K11879J22704o3442J2791r4167k4796k9924l19402J99271
$$ 254842 51882 -251222 -39343 83361 19919 32710 -61457 -86253 -116177 -435579 -236308
1844b36308K81843L5412j45279k59480J62558J17777j59370m3204l9478L10603
$$ -236308 45535 80947 -64332 -323812 -161254 -43477 -202847 -246051 -285529 25074
1834B5074K17247p0276m56432j83002J63585J2791J31856K84283r3911M2594o01116
$$ 25074 242321 172045 -284387 -467389 -303804 -291013 -159157 125126 31215 73809 -527307
1823e27307O1968J69843M43729K10792l83685l06380K16926M30310J14555n68476
$$ -527307 -465339 -295496 148233 359025 -24660 -331040 -114114 316196 430751 -137725
1813a37725j24863Q7461L42262m9971l18617J8782l94075R4763L66702M53690
$$ -137725 -262588 -175127 167135 117164 -201453 -182671 -576746 -481983 -115281 338409
1803C38409l7539L8703l46123R9822l15693Q5831L57166r1351j93950j56353K44192
$$ 338409 300870 339573 -6550 93272 -222421 -136590 220576 129225 -64725 -221078 23114
1792B3114M47725k69169k25854k58838j70995L03064J63062J43662K01019K0356
$$ 23114 470839 201670 -24184 -283022 -454017 -150953 12109 155771 356790 377146
1782C77146j96731l36687j55935J33332M58295j68477l49311L87671M01522n43841
$$ 377146 180415 -156272 -312207 -178875 279420 110943 -238368 149303 550825 6984
1772F984K88096n01082j37137j18524L35205M38037k28780M0539Q6843k64655
$$ 6984 295080 -206002 -343139 -461663 -126458 311579 82799 123338 210181 -54474
1762e4474l27084M56625O3717l72551k03578O8532k56434k6445K19242N17476
$$ -54474 -381558 75067 138784 -233767 -437345 -368813 -625247 -651692 -432450 85026
1752H5026k7531K09578Q6451j31512n29723k74268J43408N2194J5909L59338J64060
$$ 85026 57495 267073 353524 222012 -307711 -581979 -438571 -386377 -370468 -11130 152930
1741A52930j05497L39931n41440J29253M89386j04417m52967k99913L353l60169
$$ 152930 47433 387364 -154076 -24823 464563 360146 -92821 -392734 -389381 -749550
1731g49550J10333L07780k75098K99661J60197L6876O7816l00358L2859K38643
$$ -749550 -639217 -331437 -606535 -306874 -146677 -109801 -41985 -342343 -309484 -70841
1721g0841m245O6411l74678k04325K51169j75480J3349Q9181r2910j9011J42689
$$ -70841 -75086 -8675 -383353 -587678 -336509 -511989 -498640 -409459 -502369 -521380 -378691
1710c78691N63329J29321j13429j37895k59205K36546K7145j85889N6192K69344
$$ -378691 184638 313959 200530 62635 -196570 39976 67121 -118768 -62576 206768
1700B06768o230l23406j90708L37102q5571k93081j0482N31331J46821j47268
$$ 206768 200538 -122868 -313576 23526 -62045 -355126 -365608 165723 312544 165276
1690A65276J45642l55463j511K76236l3434K76578o1327m04303m40897M15400
$$ 165276 310918 -44545 -46056 230180 196746 473324 411997 7694 -433203 -17803
1680a7803J11019j93610J45272J29658j59871J33665L6170j62376Q8656j30700
$$ -17803 93216 -100394 44878 174536 14665 148330 184500 22124 110780 -19920
1670a9920j56290l0459J36843L021J35466j94667j59874N05535l06007N6293K21837
$$ -19920 -176210 -206669 -69826 -66805 68661 -126006 -285880 219655 -86352 -30059 191778
1659A91778k59550l54015J76002k8711p1880O7279R5377K11379L55480k79582
$$ 191778 -67772 -421787 -245785 -274496 -346376 -279097 -183720 27659 383139 103557
1649A03557L7403K61964m06380j43466k87229O02139N3599j4011k32693l68851
$$ 103557 140960 402924 -3456 -146922 -434151 167988 221587 207576 -25117 -393968
1639c93968L74532j22766j01386l15844N89693O7084P4669k87750p2902K34295
$$ -393968 -19436 -142202 -243588 -559432 30261 97345 172014 -115736 -188638 45657
1629D5657k70468j00539N5788J10278N2445K16214j70553L46663j41103K0198
$$ 45657 -224811 -325350 -269562 -159284 -106839 109375 -61178 285485 144382 164580
1619A64580k4169j71788O3786j17399k46683j56490J90152L08816j46879K2250
$$ 164580 140411 -31377 32409 -84990 -331673 -488163 -298011 10805 -136074 -113824
1609a13824J73040R0772N54707l16627p64677L56342K16981J55091j31025m6254
$$ -113824 59216 149988 704695 388068 -376609 -20267 196714 351805 220780 174526
1599A74526k61245m1899R369J13132o9035K15641j78651J55235k27611j20510
$$ 174526 -86719 -128618 -119249 -6117 -75152 140489 -38162 117073 -110538 -231048
1589b31048J88995j14197L13794J95348k46324r6797k5077j36546m5281J25883
$$ -231048 -42053 -156250 157544 352892 106568 9771 -15306 -151852 -197133 -71250
1579g1250j44354J21860O09135m16403m85059K05482L45373M5984m21656j63701
$$ -71250 -215604 -93744 515391 98988 -386071 -180589 164784 210768 -210888 -374589
1569c74589j0438L26554J48469k16248q0417k34955N4192M82035K89265q0928
$$ -374589 -385027 -58473 89996 -126252 -206669 -441624 -387432 94603 383868 302940
1559C02940J88862k00550l24439j81314K3425J21410J22380l28908M9221K17042
$$ 302940 491802 291252 -33187 -214501 -191076 -69666 52714 -276194 -226973 -9931
1549i931j78975M472k90638K18954p6961K26013M08269k89131l9852L634k1506
$$ -9931 -188906 -184434 -475072 -256118 -333079 -107066 301203 12072 -27780 -24146 -45652
1538d5652o3532K32161L5859P7018K00290O0095n109o9068k07197M4022J79702
$$ -45652 -109184 122977 158836 235854 436144 496239 491130 422062 214865 258887 438589
1527D38589K55110m31666m0108j22576r4373l51387k03673P1223J17730J42499
$$ 438589 693699 262033 221925 99349 4976 -346411 -550084 -478861 -361131 -218632
1517b18632j20879K27956j68517j59319P8168j62287J66594J02331J55050M41521
$$ -218632 -339511 -111555 -280072 -439391 -361223 -523510 -356916 -254585 -99535 341986
1507C41986M8051j51422K04756j42662J6647m305l53510m37613L34052l3015l30219
$$ 341986 390037 238615 443371 300709 317356 313051 -40459 -478072 -144020 -177035 -507254
1496e07254k11073R0752N33307l62130P295j7586N15573L2644m03215M46739N5310
$$ -507254 -718327 -627575 -94268 -456398 -449103 -466689 48884 81528 -321687 125052 180362
1485A80362j72937j38059L6043L18177l1903k93457p3395Q5784J78715r2942l74293
$$ 180362 7425 -130634 -94591 223586 191683 -101774 -175169 -89385 89330 -3612 -377905
1474c77905J07125J17328M2150K71494k44515K14349j33022J12812p9028j15230
$$ -377905 -270780 -153452 -111302 160192 -84323 130026 -2996 109816 30788 -84442
1464h4442N23812q6244j79238l89637j69557O9824j1235l3562P0097q0038L58793
$$ -84442 439370 353126 173888 -215749 -385306 -315482 -326717 -360279 -290182 -370220 -11427
1453a1427q0809j24470k29164J10901K72146K30169K0517q7810j47385j50964
$$ -11427 -92236 -216706 -445870 -334969 -62823 167346 187863 100053 -47332 -198296
1443a98296k00732L93509q8196L33750k74312j18801K48212j06476J82974j05694
$$ -198296 -399028 -5519 -93715 240035 -34277 -153078 95134 -11342 171632 65938
1433F5938n0020k48406J5259m56891N5111M26086r6826K90186M79643k39313l27090
$$ 65938 15918 -232488 -217229 -674120 -619009 -192923 -289749 437 480080 240767 -86323
1422h6323J93782k02576j5338l32597k56391L27655k72457L9300J8201O25018
$$ -86323 107459 -95117 -110455 -443052 -699443 -371788 -644245 -604945 -586744 38274
1412C8274L8204j21230j27005l9060K28902J52507j30706n7300R3782l07609K51830
$$ 38274 76478 -44752 -171757 -210817 18085 170592 39886 -17414 76368 -231241 20589
1401B0589J54151o4497j87988l22633R4015j58469L05669J72345l15014J55562
$$ 20589 174740 110243 -77745 -400378 -306363 -464832 -159163 13182 -301832 -146270
1391a46270m2212j96788p6549L01703K17366j77377O1135J65743K92133k93935
$$ -146270 -188482 -385270 -461819 -160116 57250 -120127 -58992 106751 398884 104949
1381A04949n83609J96111R9190K46785J59715K1164O7842N46846n07715n82727
$$ 104949 -478660 -282549 -183359 63426 223141 244305 312147 858993 351278 -231449
1371b31449k66992J09983M29343j55092p1198J07930J72106k34647J86873l9429
$$ -231449 -498441 -388458 40885 -114207 -185405 -77475 94631 -140016 46857 7428
1361G428J41690j26225k13666l29153M46512N9250m1034O7702K4425j20524K31108
$$ 7428 149118 22893 -190773 -519926 -73414 -14164 -55198 12504 36929 -83595 147513
1350A47513N7054k71261r1523R6724k19940J78726J40722j97265K01804K82405
$$ 147513 204567 -66694 -158217 -61493 -281433 -102707 38015 -159250 42554 324959
1340C24959j23907j24871K99338N4607K9281m45084k6425Q2107M202J27552j8835
$$ 324959 201052 76181 375519 430126 459407 14323 -12102 70005 74207 201759 182924
1329A82924n82597J94861M3829j70082L51225N3016k95495J8919L06787j63918
$$ 182924 -399673 -204812 -160983 -331065 20160 73176 -222319 -203400 103387 -60531
1319f0531J74457k32007k74145p7330K41507L95162J49360M45066m04991m00246
$$ -60531 113926 -118081 -392226 -469556 -228049 167113 316473 761539 356548 -43698
1309d3698j52232M3921k22495j01056L57286k65064O0644k37919R7146L97511
$$ -43698 -195930 -152009 -374504 -475560 -118274 -383338 -322694 -560613 -463467 -65956
1299f5956l3362K40346l46356J69141r4603J43349j24025L45406j7806J98899
$$ -65956 -99318 141028 -205328 -36187 -130790 12559 -111466 233940 216134 415033
1289D15033r9226j04808j9016l26241k00681J00801O9889n3527j0683L1865p7007
$$ 415033 315807 210999 191983 -134258 -334939 -234138 -164249 -217776 -228459 -196594 -273601
1278b73601L37791L8174J52657j01457J39087J43978l86896L00561J04649k09037
$$ -273601 64190 102364 255021 153564 292651 436629 49733 350294 454943 245906
1268B45906M8169P5338p6075M09935n00903O6737O5060j00288K8804q8725l11273
$$ 245906 294075 369413 293338 703273 202370 269107 334167 233879 262683 173958 -137315
1257a37315Q40N5746K45546n68872k20890K42073L46753N3011K20720k98437j68783
$$ -137315 -136475 -80729 164817 -404055 -624945 -382872 -36119 16892 237612 -60825 -229608
1246b29608J42354j26472l43706K08820M21714j02949L01495o3020l04615p161
$$ -229608 -87254 -213726 -557432 -348612 73102 -29847 271648 208628 -95987 -103148
1236a03148J92424l7766M12075L56641m91388l23801K90364l13164J08646J14458
$$ -103148 89276 51510 463585 820226 328838 5037 295401 -17763 90883 205341
1226B05341j48460J94593n3632J69574J23987k48284k1591j5446Q4805j55008
$$ 205341 56881 251474 197842 367416 491403 243119 221528 206082 290887 135879
1216A35879q26847J71372L56210K43017n66332r2836l0016L78992K31671M4292
$$ 135879 -690968 -519596 -163386 79631 -486701 -579537 -609553 -230561 1110 45402
1206D5402J84125N9311k00967o40194M04981L9725J29167K49598J84473l78973
$$ 45402 229527 288838 87871 -552323 -147342 -107617 21550 271148 455621 76648
1196G6648r4324n8319J28816L18306m63955N707O31312m52356j69518Q2771Q0833
$$ 76648 -17676 -75995 52821 371127 -92828 -87121 544191 91835 -77683 5088 85921
1185H5921l10942R3061r8654k88814m166M42286M2279k04392K88029M71543Q8398
$$ 85921 -225021 -131960 -230614 -519428 -523594 -81308 -39029 -243421 44608 516151 604549
1174F04549l30804O2790j49233j79934N3J03962n7020L43209n40605J5552L12542
$$ 604549 273745 336535 187302 7368 7421 111383 54363 397572 -143033 -127481 185061
1163A85061M27497m41696m58415K17448J57564J234j73700L83087N5316k75733
$$ 185061 612558 170862 -287553 -70105 87459 88693 -85007 298080 353396 77663
1153G7663j7061l67900J58878O23459k1121m05717m79783j70515M25472k6971
$$ 77663 60602 -307298 -148420 475039 453918 48201 -431582 -602097 -176625 -203596
1143b03596M508k419l8598M54154L01476j40467O857p9658m82237j60647K07521
$$ -203596 -199088 -201507 -240105 214049 515525 375058 381915 302257 -179980 -340627 -133106
$$ [...]
##END NTUPLES=NMR SPECTRUM
##END=
