##TITLE=1H_EC-3268-x
 DMSO
 8 sc, 
 17.11.2021
##JCAMPDX= 6.0         $$ Bruker NMR JCAMP-DX V2.0
##DATA TYPE= NMR SPECTRUM
##DATA CLASS= NTUPLES
##ORIGIN= UXNMR, Bruker Analytische Messtechnik GmbH
##OWNER= root
$$ XWIN-NMR		Version 3.5
$$ Wed Nov 17 12:19:29 2021 Russian Standard Time (UT+4h)  she@DPX200
##.OBSERVE FREQUENCY= 200.131346
##.OBSERVE NUCLEUS= ^1H
##.ACQUISITION MODE= SIMULTANEOUS
##.ACQUISITION SCHEME= undefined
##.AVERAGES= 8
##.DIGITISER RES= 18
##SPECTROMETER/DATA SYSTEM= spect
##.PULSE SEQUENCE= zg30
##.SOLVENT NAME= DMSO
##.SHIFT REFERENCE= (INTERNAL, DMSO, 0, 15.716)
##AUDIT TRAIL= $$ (NUMBER, WHEN, WHO, WHERE, WHAT)
$$ ##TITLE= Audit trail, XWIN-NMR		Version 3.5
$$ ##JCAMPDX= 5.01
$$ ##ORIGIN= Bruker BioSpin GmbH
$$ ##OWNER= she
$$ F:/spectra/data/she/nmr/H-F/1/pdata/1/auditp.txt
$$ ##AUDIT TRAIL=  $$ (NUMBER, WHEN, WHO, WHERE, WHAT)
(   1,<2021-11-17 12:18:16.54 +0400>,<she>,<DPX200>,
      <created by zg, POWCHK disabled, PULCHK disabled
       configuration hash MD5:
       00 E9 B6 7A A2 85 ED C7 34 08 36 98 17 FE 4E 26
       data hash MD5: 16K
       F0 D3 B7 A0 7E B1 81 E4 F4 B5 E5 09 7B 2A B7 94>)
(   2,<2021-11-17 12:18:19.40 +0400>,<she>,<DPX200>,
      <Start of raw data processing
       efp BC_mod = 2 LB = 0.24 FT_mod = 6 PKNL = 1 PHC0 = -15509.3 PHC1 = 7.60081 SI = 16K 
       data hash MD5: 16K
       56 70 32 6C F0 F7 3F BA 8E 98 14 0B 30 13 5E 7A>)
(   3,<2021-11-17 12:18:38.56 +0400>,<she>,<DPX200>,
      <pk PHC0 = -4.760719 PHC1 = 1.6 
       data hash MD5: 16K
       5D C8 98 2D D7 21 22 F8 73 DA 22 DB E6 2E D1 6A>)
(   4,<2021-11-17 12:18:42.28 +0400>,<she>,<DPX200>,
      <abs ABSG = 5 
       data hash MD5: 16K
       5A 34 C7 6C 95 A6 22 ED CA A3 46 BE D3 87 F3 58>)
$$ ##END=
$$ 
$$ hash MD5
$$ AA 82 06 80 20 55 25 1A AF CF 12 0E 5A 22 FF D5
##$RELAX= 
##$RELAX= 
##$RELAX= 
##$RELAX= 
##$RELAX= 
##$RELAX= 
$$ Bruker specific parameters
$$ --------------------------
##$DU= <F:/spectra>
##$EXPNO= 1
##$NAME= <H-F>
##$PROCNO= 1
##$TYPE= <nmr>
##$USER= <she>
##$AMP= (0..31)
100 100 100 100 100 100 100 100 100 100 100 100 100 100 100 100 100 100 
100 100 100 100 100 100 100 100 100 100 100 100 100 100 
##$AQSEQ= 0
##$AQ_mod= 1
##$AUNM= <au_zg>
##$AUTOPOS= <>
##$BF1= 200.13
##$BF2= 200.13
##$BF3= 200.13
##$BF4= 200.13
##$BF5= 200.13
##$BF6= 200.13
##$BF7= 200.13
##$BF8= 200.13
##$BYTORDA= 1
##$CFDGTYP= 0
##$CFRGTYP= 5
##$CHEMSTR= <none>
##$CNST= (0..31)
1 1 145 1 1 1 1 1 1 1 1 1 1 1 1 1 1 1 1 1 1 1 1 1 1 1 1 1 1 1 1 1 
##$CPDPRG= <>
##$CPDPRG1= <>
##$CPDPRG2= <>
##$CPDPRG3= <>
##$CPDPRG4= <mlev>
##$CPDPRG5= <mlev>
##$CPDPRG6= <mlev>
##$CPDPRG7= <mlev>
##$CPDPRG8= <mlev>
##$CPDPRGB= <>
##$CPDPRGT= <>
##$D= (0..31)
0 1.2 0 0 0 0 0 0 0 0.06 0 0.03 0 0 0 0 0.0002 0 0 0 0 0 0 0 0 0 0 0 0 
0 0 0 
##$DATE= 1637137095
##$DBL= (0..7)
120 120 120 120 120 120 120 120 
##$DBP= (0..7)
150 150 150 150 150 150 150 150 
##$DBP07= 0
##$DBPNAM0= <>
##$DBPNAM1= <>
##$DBPNAM2= <>
##$DBPNAM3= <>
##$DBPNAM4= <>
##$DBPNAM5= <>
$$ [...]
##$SUBNAM2= <"">
##$SUBNAM3= <"">
##$SUBNAM4= <"">
##$SUBNAM5= <"">
##$SUBNAM6= <"">
##$SUBNAM7= <"">
##$SUBNAM8= <"">
##$SUBNAM9= <"">
##$SW= 18.0517287032376
##$SWIBOX= (0..15)
0 0 2 0 0 0 0 0 0 0 0 0 0 0 0 0 
##$SW_h= 3612.71676300578
##$TD= 16384
##$TD0= 1
##$TE= 0
##$TE2= 300
##$TE3= 300
##$TEG= 300
##$TL= (0..7)
0 120 120 120 120 120 120 120 
##$TP= (0..7)
150 150 150 150 150 150 150 150 
##$TP07= 0
##$TPNAME0= <>
##$TPNAME1= <>
##$TPNAME2= <>
##$TPNAME3= <>
##$TPNAME4= <>
##$TPNAME5= <>
##$TPNAME6= <>
##$TPNAME7= <>
##$TPOAL= (0..7)
0.5 0.5 0.5 0.5 0.5 0.5 0.5 0.5 
##$TPOFFS= (0..7)
0 0 0 0 0 0 0 0 
##$TUNHIN= 0
##$TUNHOUT= 0
##$TUNXOUT= 0
##$USERA1= <user>
##$USERA2= <user>
##$USERA3= <user>
##$USERA4= <user>
##$USERA5= <user>
##$V9= 5
##$VALIST= <valist>
##$VCLIST= <CCCCCCCCCCCCCCC>
##$VD= 0
##$VDLIST= <DDDDDDDDDDDDDDD>
##$VPLIST= <PPPPPPPPPPPPPPP>
##$VTLIST= <TTTTTTTTTTTTTTT>
##$WBST= 1024
##$WBSW= 4
##$XGAIN= (0..3)
0 0 0 0 
##$XL= 0
##$YL= 0
##$YMAX_a= 131640
##$YMIN_a= -187276
##$ZGOPTNS= <>
##$ZL1= 120
##$ZL2= 120
##$ZL3= 120
##$ZL4= 120
##$ABSF1= 15.71604
##$ABSF2= -2.33581
##$ABSG= 5
##$ABSL= 3
##$ALPHA= 0
##$AQORDER= 0
##$ASSFAC= 0
##$ASSFACI= 0
##$ASSFACX= 0
##$ASSWID= 0
##$AUNMP= <proc_1d>
##$AZFE= 0.1
##$AZFW= 0.1
##$BCFW= 0
##$BC_mod= 2
##$BYTORDP= 0
##$COROFFS= 0
##$CY= -3
##$DATMOD= 1
##$DC= 0
##$DFILT= <>
##$DTYPP= 0
##$F1P= 0
##$F2P= 0
##$FCOR= 1
##$FTSIZE= 16384
##$FT_mod= 6
##$GAMMA= 0
##$GB= 0
##$INTBC= 1
##$INTSCL= 0
##$ISEN= 128
##$LB= 0.24
##$LEV0= 0
##$LPBIN= 0
##$MAXI= 10000
##$MC2= 0
##$MEAN= 0
##$ME_mod= 0
##$MI= 1.114404
##$NCOEF= 0
##$NC_proc= -8
##$NLEV= 6
##$NOISF1= 3.799351
##$NOISF2= 2.8
##$NSP= 0
##$NTH_PI= 0
##$NZP= 0
##$OFFSET= 15.71604
##$PC= 1
##$PHC0= -15514.06
##$PHC1= 9.20081
##$PH_mod= 1
##$PKNL= yes
##$PPARMOD= 0
##$PSCAL= 0
##$PSIGN= 0
##$REVERSE= no
##$SF= 200.13000710694
##$SI= 16384
##$SIGF1= 3
##$SIGF2= 2
##$SINO= 5.538805
##$SIOLD= 16384
##$SREGLST= <1H.CDCl3>
##$SSB= 0
##$STSI= 16384
##$STSR= 0
##$SW_p= 3612.71676300578
##$SYMM= 0
##$S_DEV= 0
##$TDeff= 16384
##$TDoff= 0
##$TI= <>
##$TILT= no
##$TM1= 0
##$TM2= 0
##$TOPLEV= 0
##$USERP1= <user>
##$USERP2= <user>
##$USERP3= <user>
##$USERP4= <user>
##$USERP5= <user>
##$WDW= 1
##$XDIM= 16384
##$YMAX_p= 468953851
##$YMIN_p= -1264973
$$ End of Bruker specific parameters
$$ ---------------------------------
##NTUPLES= NMR SPECTRUM
##VAR_NAME=  FREQUENCY,     SPECTRUM/REAL,   SPECTRUM/IMAG
##SYMBOL=    X,             R,               I
##VAR_TYPE=  INDEPENDENT,   DEPENDENT,       DEPENDENT
##VAR_FORM=  AFFN,          ASDF,            ASDF
##VAR_DIM=   16384,         16384,           16384
##UNITS=     HZ,            ARBITRARY UNITS, ARBITRARY UNITS
##FACTOR=    0.220516191357247, 1,           1
##FIRST=     3145.25112836699, 0,            0
##LAST=      -467.465634638787, 0,           0
##MIN=       -467.465634638787, -1264973,    0
##MAX=       3145.25112836699, 468953851,    0
$$ Real data points
##PAGE= N=1
##DATA TABLE= (X++(R..R)), XYDATA
$$ [...]
11586 -229123 -121657 -158780 42943 -46504 -234601 36122 99346 143655 -37502 -1173
11576 -1173 -352313 -631858 -563216 -193518 -254413 -82556 -27681 -129333 177063 -210786
11566 -210786 -199753 -282086 -193818 -37729 -375579 -143247 -156593 -274239 -70125 -472969
11556 -472969 -415439 16909 309142 135544 -161648 -191877 14261 116704 110005 59538
11546 59538 69602 197642 32343 -532396 -59778 116613 165889 -226411 -497629 -315767
11536 -315767 97588 -75043 -43197 -231104 -611530 -323866 -51943 -172366 -13792 125349
11526 125349 252761 569381 418725 214690 -472712 -506430 -317537 113638 -37043 -113212
11516 -113212 332015 384531 97709 -321073 -214350 -156721 -359557 -304199 -202813 251608
11506 251608 415227 439131 123363 -57653 306761 127520 -267561 -489420 -659104 -678221
11496 -678221 -578172 -399782 -421965 -104699 -242621 -533317 -625290 -761745 -579827 -427562
11486 -427562 -355870 -563542 -731842 -406104 -142299 -104253 -187093 -100256 -385659 -291469
11476 -291469 -343022 -259044 290401 116889 521830 341337 -148250 -368473 -241677 -270778
11466 -270778 95667 53246 -110065 -180694 183334 213513 -205544 -111382 -226250 -87230
11456 -87230 -585543 -232925 -356419 -270196 83343 -225625 141969 48849 -184594 -80284
11446 -80284 -20332 53026 -198771 -76848 351739 166792 18771 231736 60557 134781
11436 134781 -22703 -303948 25390 41040 17012 130356 214837 128751 -290294 -152611
11426 -152611 -47701 44917 -24781 -550058 -389373 -139071 -350142 -231551 4353 -132534
11416 -132534 -284843 -118129 -196263 -31752 -369080 -287931 28809 -201546 -414648 187707
11406 187707 353893 -346597 -299792 -445289 -414057 -81525 9496 595629 396068 282782
11396 282782 76752 -249979 85325 210776 134433 57868 50101 -98144 30748 -6005
11386 -6005 -16735 143566 -138863 -121471 -202479 -420888 -368498 -259153 4348 -5259 -132413
11375 -132413 -57871 -54163 112106 128824 -87158 -26566 -299028 -266686 -489531 -312801 52765
11364 52765 -325666 -893515 -610114 -495260 -631458 -464995 41120 13228 -154530 -125402
11354 -125402 265938 294189 90372 -45899 14840 -199747 -241272 -125741 -40958 -80573
11344 -80573 -114393 52872 65936 -76614 -353665 -21774 454919 242757 84439 193817
11334 193817 -39197 -291399 -118163 -216557 -494816 -440767 -309273 -351182 -173729 -132693
11324 -132693 -338334 -103775 -164966 -255327 -378412 27339 250162 167952 -351018 -749758
11314 -749758 -441992 -123590 -117908 89053 190136 448090 352702 162454 -46994 -41732
11304 -41732 -30468 4622 -180126 -485368 -312267 -156869 10302 -81917 -178257 -494242
11294 -494242 37231 22601 -125196 -144077 -88143 255944 95749 -682614 -465840 -287651
11284 -287651 -427390 -660591 -292157 262903 448560 134944 -322623 -285196 -41783 -58295
11274 -58295 -272915 293330 165928 -175080 -386526 -330113 185285 264203 -658782 -332392
11264 -332392 48725 3873 27043 45769 139662 8514 32075 45423 -279525 -417665 -116454
11253 -116454 53810 311456 509370 194041 12794 97750 378849 333047 443838 -36122
11243 -36122 -523301 -479481 -88473 100329 -367428 -443118 -345073 -46343 156334 6683
11233 6683 -367044 -160254 -37895 58089 -26132 75263 133524 -63334 328290 140928
11223 140928 -462952 -555972 -128952 53666 219433 367161 237946 114070 -141767 -218145
11213 -218145 -4422 -163243 -399894 -339651 -185903 -108013 -445535 -235559 232661 -361262
11203 -361262 -461018 -129535 55047 120550 57766 25080 247023 122552 181112 323424
11193 323424 -255357 -300159 -4903 -339714 -657343 -281587 -271085 95657 299899 -53339
11183 -53339 -368536 -458045 -442190 -131675 181068 -272923 -114298 -17332 -45255 -432856
11173 -432856 -677409 -607511 -83468 -42601 -153599 -373888 -438087 -189710 -47708 161566
11163 161566 96443 61348 -121513 14655 -243757 -437797 -220529 166002 161143 49205
11153 49205 90185 316485 30165 -165400 -134928 22411 67294 -293467 -100757 -246769
11143 -246769 -228211 -34947 -40662 -292741 -199325 -123927 -332900 -417218 -488712 -248519 -282177
11132 -282177 -343987 -442023 -440401 -362635 -172433 -405862 73411 276826 244565 -38945 -355991
11121 -355991 171617 364311 221 236636 73499 291418 231041 -141754 -36110 -115747
11111 -115747 -168326 -119714 -499930 -275697 -164795 -167172 -330248 -417653 -350921 -290937 -303041
11100 -303041 -361901 -553257 -451407 -507197 -730965 -396937 -647983 -525313 -422500 -381154
11090 -381154 -611599 -383684 -601284 -168868 36514 -97901 -27209 71328 307319 -173656
11080 -173656 75744 341373 -30198 -95625 208342 127900 -239555 -315824 -293577 -553885
11070 -553885 -388210 -422095 -245934 273949 -141164 -175244 19425 61307 -120958 10934
11060 10934 -196939 -81945 -164186 -133379 -184130 -213768 -60852 125528 40485 -357200 -283094
11049 -283094 -4565 -38990 -254119 -118550 -424715 -453308 98840 36624 -268379 -210656
11039 -210656 -202338 -532688 -428482 -5018 -23473 -141969 -92804 -349567 -49424 27920
11029 27920 113476 387339 262395 175479 150498 343784 421658 283756 120185 87287 -245576
11018 -245576 -189335 -51748 73438 -108148 446606 92554 -342229 41831 270428 -142602
11008 -142602 -243770 147723 346284 -14636 -204974 -112056 -270249 -237704 -381355 101021
10998 101021 26584 43658 -154677 -24328 450794 160895 117198 -115124 -133436 -23359
10988 -23359 -83660 454 -1879 -63572 -363216 163391 370419 121016 67411 -73691 -28903
10977 -28903 112321 -93995 -16413 29229 -433296 -295018 324034 384073 418361 423689 114582
10966 114582 57430 35578 10038 92067 172111 108094 51642 -136958 4493 183417 144078
10955 144078 96760 -9385 265576 265826 -261499 -221979 274369 260733 167967 311152 189140
10944 189140 -302168 -273515 -560487 -367275 -5401 390632 110177 -80817 -128120 -284802
10934 -284802 -58436 -169578 -139677 -219092 -269130 -44155 23144 52197 69699 217058 11396
10923 11396 -94104 -29583 -158698 -415622 -231139 13027 -72131 342463 -29873 -68432
10913 -68432 -248368 -89870 135193 -111138 -340753 -196942 -237907 272993 175105 172366
10903 172366 68728 -347544 -567406 113400 399755 -201221 -273531 150987 150757 237437
10893 237437 36629 143366 8178 184086 182337 268280 -71151 -391407 -435979 13009
10883 13009 -48803 -231659 148685 108232 304047 331221 492307 371439 248446 154867
10873 154867 143915 -39306 354338 138696 146094 46682 194015 487670 469007 183817
10863 183817 230706 -61913 -69789 147893 81562 -74568 -135617 -189315 -214428 -122964 21979
10852 21979 -232213 154460 253940 452438 571239 386721 429981 311725 228742 428359
10842 428359 455173 83446 -227201 -404101 -394312 -368954 -233206 -127258 92742 -9523
10832 -9523 -406856 -440091 124647 164667 421785 8506 28353 419699 383994 -2625 -185283
10821 -185283 200563 16203 -166320 -196697 -4470 106794 223610 163922 546042 630823
10811 630823 352455 83590 38000 -66153 -128027 -108686 -88380 -612119 -130286 189938
10801 189938 139639 36361 -92383 54805 17253 -159741 208369 448504 317206 116749
10791 116749 86559 281993 219933 -165603 -155542 -277724 -323348 -144936 -102932 -78829 -9268
10780 -9268 -62724 -236563 238770 212780 287497 420391 23197 40527 -87696 -246258 179383
10769 179383 35310 229455 93507 160951 -188167 146346 293519 252683 135585 213315
10759 213315 -143506 -751 202571 452460 346371 109516 131622 -23867 -92223 113599
10749 113599 -79405 -352350 21397 312774 184502 274906 461606 425399 387987 -86049
10739 -86049 -32408 137325 133687 -40310 232078 232021 223454 96990 121756 70094 308 -100209
10727 -100209 99195 148559 424367 302148 55609 -2783 2040 -175034 -67639 -148847
10717 -148847 -619481 -105692 -534596 -333446 -9785 -259349 -45153 22968 310197 299065
10707 299065 246983 63033 387431 501502 306169 451154 749537 460563 198521 153466
10697 153466 -60827 -102178 -153919 70621 94606 381198 568457 530729 486163 384216
10687 384216 342889 412847 401867 145287 155416 440639 702509 542702 379719 590342
10677 590342 654512 1027473 1202770 486742 340550 428005 564750 763128 744000 956345
10667 956345 825108 530558 581723 800487 1014191 1131155 629933 410193 505568 711106
10657 711106 477412 241594 568870 619714 812955 948977 907194 908710 480617 660564
10647 660564 914371 756866 523540 510728 652526 584261 547933 388556 576443 939565
10637 939565 368378 471746 710387 792369 703031 897915 875512 340769 115162 220468
10627 220468 728391 767258 786842 776295 877638 860560 631863 385247 593535 907215
10617 907215 1097877 820376 706845 689740 911662 1413961 1322273 1317929 800571 633087
10607 633087 1009808 1110362 1158215 1145576 1226642 1308335 1394126 1159801 1094780 803131 824010
10596 824010 922453 1307947 1149024 1329669 1685986 1528886 1335251 1336925 1520954 1463400
10586 1463400 1404397 1587310 2010123 1693985 1398753 1750731 1579222 1416342 1530375 1499478
10576 1499478 1669480 1936091 1515502 1864961 2016607 2206317 2188952 1895181 1944907 1930708
10566 1930708 1916632 2148629 2497196 2239059 2158868 2188998 2065321 2132673 1936728 1722336
10556 1722336 2194016 1859730 1786581 1943055 2116858 2317990 2347298 1791864 1871666 2216747
10546 2216747 2178931 2069368 2245057 2399111 2882188 2750844 2613344 2744223 2961632 2961754
10536 2961754 2566408 2480774 2982192 3286304 3183845 3204603 3370758 3098725 3253477 3551540
10526 3551540 3113844 3443027 3541280 3947423 4344345 4338105 4711350 4800046 4504123 4347340
10516 4347340 4676805 4425066 4644620 4740472 4568035 4553791 4542844 4597391 4710521 4464846
10506 4464846 4896411 5544414 5435634 5266641 5437725 5423763 5614485 5873831 5776957 6158368
10496 6158368 5560425 5998991 6259458 6407268 6127031 6068921 6430998 6562234 6801168 6966881
10486 6966881 7284430 7643450 7330458 7732281 8311417 7712705 7829177 8056818 8338342
10477 8338342 8605851 8943714 9062482 8865996 8935657 9562525 9990894 10036424 10584433 10667244
10467 10667244 11117158 11400350 11324899 11364271 11618563 12040606 12991048 13218762 13335741 13563628
10457 13563628 14189655 14178420 14281602 15079756 16007395 16565771 16943739 17445431 17823170
10448 17823170 18155379 19213018 19765121 20344283 21512738 21890019 22321247 23127801 24053921
10439 24053921 24660056 25223079 26340547 27471224 28143032 28741888 29363803 30490798 31045047
10430 31045047 31901071 32367493 32767163 33362157 33848125 33942267 34526411 35230745 36160412
10421 36160412 36165889 36271292 36720686 36674597 36920410 37220523 37306003 37283186 37941375 38391625
10411 38391625 38501283 38614805 38878074 38942916 38918923 38842296 38766072 39453199 39029520 39269113
10401 39269113 39831102 39795934 39774261 39705639 38956748 38993961 39194774 39352093 39186002 38870534
10391 38870534 38813298 38927659 38651295 38519403 38338979 38193636 38179182 37929552 37732189 37286693
10381 37286693 37184757 36805980 36242095 36136625 35909724 35492836 34883586 34449007 34010553
10372 34010553 33568174 32989500 32712469 31873699 31076356 30690581 29462211 28585454 28021400
10363 28021400 27222106 26601457 25867251 24711539 24058328 23421375 23017204 22284920 21627232
10354 21627232 20424432 19493618 18635241 18062905 17290988 17043397 16536222 15799851 15415562
10345 15415562 15011667 14226869 13882862 13747472 13289622 13120893 12598516 12019329 11810861
10336 11810861 11335138 10812249 10123068 10484101 10214286 9787024 9626467 9514771 8994823
10327 8994823 8776582 8551803 8223309 8037054 8072977 7825449 7252821 7259324 7485319 7551770
10317 7551770 7104813 7004186 6673470 6565542 6516513 6506865 6269366 6103104 5621557 5621350
10307 5621350 5951485 5875280 5584017 5547117 5109913 4688703 4709783 5048117 5478782 5067304
10297 5067304 4939182 4336053 4576630 5084365 4753589 4257667 4511500 4862418 4450322
10288 4450322 4180512 4061552 3879200 3497057 3504406 3829851 3853063 3382866 3507630 3653197
10278 3653197 4162034 4058945 3859496 3655355 3054161 3210800 3442771 3080020 3119376 3006603
10268 3006603 2647136 2781610 2497530 2595953 2444099 1909141 2053326 2363300 2214723 2538867
10258 2538867 2788041 2543455 2290228 2130374 2143046 2132731 2174128 2166922 2004446 1571574
10248 1571574 1727637 1855965 1818173 2323974 2338023 1937922 2175489 2009981 1770969 1429103
10238 1429103 1777956 1526105 1717368 1610225 1636774 2038796 1948074 1288560 1173473 1389477
10228 1389477 1524329 1719240 1581287 1625396 1585224 1209602 1741816 1450325 1316389 1760337
10218 1760337 1323893 1155804 688856 1094500 1228334 1215173 1094995 1293232 1278450 1514487
10208 1514487 1119097 1035018 1164860 1302888 1407171 1409228 1099018 948824 754153 803409
10198 803409 698050 1065340 1334877 1297285 1341494 802505 1031773 1009291 729019 541373
10188 541373 662366 824419 947582 745451 477008 586846 957819 618973 955237 1267969
10178 1267969 692553 519073 711666 646498 857315 1057899 834897 1017730 715079 522192
10168 522192 376029 558462 683566 350252 276268 283009 424387 398150 835097 966758
10158 966758 891276 160811 107005 278935 210160 27141 28317 575831 387341 -81183
10148 -81183 -76678 118402 271213 172511 81306 336708 313878 573621 253197 76075 230765
10137 230765 434320 479843 154176 133095 53645 255333 403939 315896 -139471 195506
10127 195506 274537 687305 839533 518190 290342 22668 21345 40943 4605 -249407
10117 -249407 282879 728682 701926 59126 84533 -113640 288363 303516 322275 83194
10107 83194 292845 171512 182270 191416 161705 144736 411196 451798 385897 630238 367701
10096 367701 188105 286880 222091 -510495 -220050 -34000 -113215 -388319 -243385 82654
10086 82654 123862 -44543 -50500 -156327 -57316 319636 87128 127935 376729 145916 -93980
10075 -93980 -242812 -203356 177597 193919 -203940 277734 331536 147856 190543 -188296
10065 -188296 -719506 -399826 -218880 -50787 -215664 -389183 -260275 75182 198135 321148
10055 321148 304034 455649 114212 192880 565952 367856 307627 270188 215183 169803 282069
10044 282069 406943 204715 184424 257499 -112519 -235783 17014 363152 200787 499382
10034 499382 22242 -110237 -6794 317672 265780 520913 482293 754855 470606 -120263
10024 -120263 4801 102179 86665 -13932 -87078 250477 384106 334572 261041 195531 269211
10013 269211 46846 -125079 -186083 -408824 -207584 19402 32265 -359672 -323789 313107
10003 313107 -89348 -104222 19210 -302388 -295679 80848 232057 337907 -154181 -400003
9993 -400003 -476113 -185023 93910 8098 119108 -271158 -551132 -172213 -238639 7735
9983 7735 28791 32293 282398 369238 264306 -138661 -327557 -104064 -91371 -115297 -120246
9972 -120246 -203045 -296497 -418480 -379086 90260 164473 264895 128554 207357 54441 -147211
9961 -147211 58634 50860 204731 265259 -134836 -68625 43389 344168 356116 260024 560144
9950 560144 337115 52708 432013 463096 263765 88247 -188621 5670 369291 692244
9940 692244 251241 53552 -172228 172106 512500 4353 -137968 55729 60454 168861
9930 168861 259775 -532293 -605858 -235929 -380970 -89539 330897 749292 431940 278895
9920 278895 234496 -58349 -34176 -64225 552431 585839 -165763 -126257 307605 86241 -288931
9909 -288931 -242693 138765 -69679 -300409 22087 225422 370881 314670 190279 7289
9899 7289 116983 218816 261978 151084 7212 112568 305867 103494 193636 175240 -56766
9888 -56766 -112637 19224 51562 205724 -338932 -353973 128164 341605 254041 -54945 78846
9877 78846 -276621 -110862 119983 359996 -82192 -521881 -306459 -230107 75597 -51952
9867 -51952 -23230 15481 -139389 6348 36246 135779 -463673 -348831 66073 409385 582348
9856 582348 132575 244250 -7249 51155 -336451 -85346 142046 85965 104540 474285
9846 474285 110934 -113870 -89921 -345531 -342944 -133700 -19440 -276089 -296616 -158690
9836 -158690 -54602 -1571 233558 298735 552651 378554 -89973 837 -16761 85133
9826 85133 400854 67832 -174294 -161195 230552 359754 -164439 -465273 -324725 -14775
9816 -14775 -195970 18886 170796 295311 542617 421176 339615 388897 212540 486755
9806 486755 115129 42441 -117701 -394146 204032 240647 69035 161126 465183 124163
9796 124163 249296 2109 -130663 -211844 -236121 -1946 278926 249913 430714 336295
9786 336295 227920 292140 40837 25012 251821 572995 419460 652982 629762 808294
9776 808294 685189 146974 233114 145672 328045 726995 439294 524870 704993 625433
9766 625433 688042 249708 341682 273649 60345 197676 653063 563815 594882 642434 606705
9755 606705 622431 1199036 987640 965049 788494 787576 869708 776624 949021 773675 1104241
9744 1104241 1139134 1195853 1037589 1182836 1279144 1399245 1438985 1125292 1359766 1287866
9734 1287866 1101539 1178816 1237928 1496316 1473176 1129847 1051626 1201351 1191748 1367067 1640591
9723 1640591 1672766 1576573 1805693 2087293 1814334 1953251 2241867 2527112 2796198 3029108
9713 3029108 2870769 2887967 3259386 3387295 3604584 3861326 3811800 4011013 4096466 4485716
9703 4485716 4787925 5386277 5749157 6134022 7093432 8261207 9321631 10505742 11528415
9694 11528415 12894496 15193051 17613671 20296337 23504824 27768908 32701571 39324926
9686 39324926 43212438 41966354 35605537 27139306 21048984 16586065 13777765 11368491
9678 11368491 9961765 9234836 8263924 7588311 6541810 6267950 5908550 5377881 4959239
9669 4959239 4578096 4029093 3760403 3503427 3149517 3090950 2959068 2712308 2739960 2584560
9659 2584560 2536970 2091920 1929977 2029291 2088231 2137712 2145092 2034488 1778065 1364108 1512781
9648 1512781 1398443 1643433 1480887 1268707 1390345 1265158 1196584 1282939 1031452 1043831
9638 1043831 808874 1201486 1200251 990012 571258 390646 661610 542669 893793 932966
9628 932966 783736 638768 723002 707841 664253 612997 361137 250309 599250 352194
9618 352194 342349 406909 316569 85586 113409 532278 659795 316459 676244 673535 304353
9607 304353 283714 402202 185431 -19709 420865 19663 -87620 339855 252411 109559
9597 109559 225457 473795 241235 198440 198418 119731 224358 490415 663473 561488 555084
9586 555084 457387 708782 745518 528912 436805 361472 435298 359288 188064 316080 110758
9575 110758 -218824 -117179 -19559 255529 261151 518194 320632 234538 109111 158675 208901
9564 208901 50866 219554 471918 151170 179996 260269 -6986 -120965 32793 515449
9554 515449 725459 271114 110728 437467 580512 356166 -116889 76287 375360 119761
9544 119761 -17237 131129 -221030 -382674 116481 131288 139839 -148703 -50264 233045
9534 233045 187502 -51743 257057 772436 720322 351488 299620 301792 435393 309610 157280
9523 157280 90250 19323 -78271 -514261 -113127 105764 381078 590047 458035 353485
9513 353485 310357 498381 138616 225226 -9265 -1073 -15816 43691 -46251 -69257 -209434
9502 -209434 -52684 242801 -73042 -268941 -303027 -92217 -200149 51682 151748 396182
9492 396182 -188355 -402975 68764 160796 59904 15714 -348010 204 447377 586694
9482 586694 163061 76960 -163440 112154 209832 -95586 -40804 -7028 309214 41698
9472 41698 359071 473323 218767 257785 141623 -145042 -321139 157322 236610 -28128
9462 -28128 330488 597846 496702 55892 197029 135008 -86515 -90057 69249 167732 742917
9451 742917 737898 647000 645334 211482 356480 361420 428845 436775 665388 609605 242894 31802
9439 31802 301947 553477 152017 -277507 211532 216721 422422 596951 628023 211217
9429 211217 390632 484021 378683 341772 348507 -2583 -145066 311888 606387 471258
9419 471258 -27744 285562 140671 114800 255517 -21283 406614 763534 758322 68502
9409 68502 -110331 50737 65567 -27925 340088 793561 303017 -32925 -19445 280450
9399 280450 333043 701727 672104 581566 170501 99697 45369 144312 541362 671295 598016
9388 598016 87624 -32046 218492 -97198 -55001 18910 -107249 28174 212848 438581
9378 438581 170486 18887 256659 -1830 -92383 -6002 -142129 101072 61386 142619
9368 142619 30186 -22513 -76688 -166878 76484 -24994 -161166 -353814 -164290 -173524 154780
9357 154780 390655 514823 488038 166267 -121056 73348 78218 149548 369638 323016 397556
9346 397556 45407 -12770 -226253 -85669 383798 391096 -11787 144265 248169 -4788
9336 -4788 13807 235506 302100 -101547 -69156 -321524 -103030 141555 -69401 28899 -66505
9325 -66505 -115881 25923 52073 -100908 190306 348285 212223 227320 54690 -317781
9315 -317781 186065 316004 137498 372488 -233177 -605127 -238726 107185 390075 111095
9305 111095 405535 263236 417131 254066 268356 650591 685244 694453 474106 188926
9295 188926 354866 414611 195378 195233 -96325 194365 81025 173967 534629 711755 362335
9284 362335 327715 328119 247979 -102754 509320 766761 664266 524858 258370 -228962 232173
9273 232173 250070 365256 247847 109323 423181 716984 716759 280537 625989 751424
9263 751424 531057 860150 751469 519663 644481 947385 937879 748459 701954 678450
9253 678450 480212 735363 723699 682001 804100 586865 828645 548665 988656 764498
9243 764498 685178 980126 563634 707386 1266526 1085500 820529 700826 1404799 1156020
9233 1156020 813888 1194705 1339070 1194936 747631 1314617 1407012 1239880 1220875 1316344
9223 1316344 1378577 1341321 1735607 1744972 1504936 1658455 1929766 1680923 2078024 1838385
9213 1838385 1704577 2005210 1998133 2179160 1775432 1570563 1699404 1287050 1519710 1240074
9203 1240074 1350929 1638778 1374217 1856348 2122080 1944864 2221382 2264937 2004373 1839540
9193 1839540 1601678 1649777 2018249 2267686 2051238 1708934 1692842 2379754 2231305 1820278
9183 1820278 2398181 2567047 2279227 2301692 2579141 2187307 1983922 1947012 2269431 2196351
9173 2196351 2249455 2140160 2352181 2241693 2676228 2545997 2838343 2312421 2024494 2505738
9163 2505738 2520798 2346445 2153287 2337931 2255800 2580483 2604598 2814453 2716141 3094111
9153 3094111 3257667 3426117 3295902 3131405 3060348 2996645 3458308 3677596 3730482 3808368
9143 3808368 3837871 3840712 4144398 4371766 4189801 4085047 4030873 4218531 4301379 4437472
9133 4437472 4715102 4880089 4995075 4991501 5158409 5164031 5129026 5478333 5333871 5800876
9123 5800876 5695165 5818816 6177633 6220220 6610254 6951026 6583170 6764918 7154797 7084332
9113 7084332 7164989 7637159 7808696 8206656 8484172 8604211 8828229 9372878 9545613 9905772
9103 9905772 10823849 11632525 11990588 12430515 12939785 13463685 13895548 14607827 15619399
9094 15619399 17209901 18450229 19177581 20490910 22585377 24788671 26646142 28878546
9086 28878546 31850595 35426123 38949895 42242525 45915829 49792529 53924632 58414619
9078 58414619 61832783 64001618 65151065 66299828 68197380 70819354 72382388 71770644
9070 71770644 68547931 63255722 57430479 52571877 48979259 46415372 44188083 43036112
9062 43036112 42243773 40410193 38596381 37679906 37346967 36741571 36983141 37886375 39028767
9053 39028767 40610214 42655661 45467306 48977460 52647613 56929308 61080057 65818686
9045 65818686 70783499 75144227 78833109 82305746 85983270 90132382 94778135 97680946
9037 97680946 98405743 97086135 94485321 91263617 85901422 77814083 68363497 59376973
9029 59376973 51800138 45939898 41492759 37952579 34933304 32870462 31144525 29339715
9021 29339715 27469266 25744504 23873818 21975741 20939261 19398000 17995986 17101778
9013 17101778 16589141 15587740 14680618 14359773 13939361 13500079 13127591 12735550 12493213
9004 12493213 11862963 11752736 11480376 11074823 10839662 10696265 10683645 10315143 9844223 9747395
8994 9747395 9613450 9125712 8875018 9195339 8801605 8657222 8547053 8193515 8545743 8653273
8984 8653273 8408624 8027435 7579624 7039046 7066347 6938664 6659067 6924030 6761377 6416899
8974 6416899 6861400 6641722 6438920 7026946 6963562 6372963 6361355 6492955 6720208 6977882
8964 6977882 7001062 6370109 6385114 6401013 6450040 6487273 6255423 6664608 6468377 6584050
8954 6584050 6514088 6542728 6933144 6722996 6550565 6660236 6546697 6788267 6890675 6951636
8944 6951636 6644158 6912358 7077720 7334859 7186824 7518842 7958682 8008153 7698146 8104857
8934 8104857 8195067 7942448 8012436 8115028 8171611 8794109 9073597 8888374 9483871 9979215
8924 9979215 10066071 10447039 10942346 11269839 11625557 11775834 12245034 12601729 12917801 13296371
8914 13296371 14551292 14848073 15464195 16254581 16899672 18103939 19817045 21258003 22625995
8905 22625995 24807246 26979525 29505483 31819005 34180881 36548446 39584407 42958199
8897 42958199 45821960 48371436 50508539 51391363 51389462 49782583 46746241 43293982 40069752
8888 40069752 37769159 36675140 35853362 35424342 35086244 34326771 33587424 32867872 32620597
8879 32620597 32470149 32647294 33207507 34426110 36067487 37801012 39860480 42655188 45297024
8870 45297024 48015040 51157373 55056824 59295725 64704954 69979096 75808493 81344390
8862 81344390 85833666 88751823 89699271 87933133 84101316 77750389 71774283 67177517
8854 67177517 63517174 60297085 56236133 52181374 47726808 43619089 40638284 38178084
8846 38178084 36304701 34233206 32836319 31842574 30695487 30051180 30191297 30533784 30972184
8837 30972184 31358576 32753653 34297666 36158938 37976234 40089932 42256648 44580807
8829 44580807 46235764 47633001 49547543 51564769 53513050 54750115 53969647 51657377
8821 51657377 47847230 42608799 37498944 32983968 30039731 27327268 25166183 23496429
8813 23496429 22283986 21212107 20013772 18779026 17705254 16600040 15723172 15106704
8805 15106704 13955873 13106783 13001788 12742014 12405565 12104982 11635782 10826265 10829664 10506001
8795 10506001 9509380 9547035 9735657 9974615 9750787 9435196 9030703 8400795 8626176 8227258
8785 8227258 8262855 8453323 8045536 7810349 7906478 7998601 8500429 8481822 8437257 8235395
8775 8235395 7930559 8086141 8187880 8058107 7901437 7873372 8310304 8295864 8387993 8410711
8765 8410711 8759795 8453829 8664491 8637005 9084853 9359527 9809191 9980374 10241387 10810044
8755 10810044 11555622 11517234 12030522 12458126 13206298 14230581 15367798 16347578 17645140
8746 17645140 19248917 21039555 23071690 25424299 28070597 29987571 31505959 32490752
8738 32490752 33555833 35008083 36504735 36606784 35393982 33414266 31688850 30391662
8730 30391662 28943780 27677862 25858117 23537800 21717966 20484314 19395180 18896301
8722 18896301 18776826 18764726 18948153 18863827 19295122 20369491 21503746 22608038 23786640
8713 23786640 26019052 27907922 29243323 30488598 31154923 32781463 35150597 37840736
8705 37840736 40193288 43035106 44662749 44740245 43208551 40046116 35694859 31532551
8697 31532551 28599856 26026829 23845896 22671354 21590969 20971493 19741441 17989357
8689 17989357 16773409 15867798 14849547 14249878 13844664 13275411 13173875 13344797 13134626
8680 13134626 13922471 14327393 14954859 15364531 16348123 16993506 17751807 17910855 18253081
8671 18253081 18114183 18257509 18310086 17301265 16486406 15108044 13952180 13501311 12762127
8662 12762127 11856954 10583315 9250993 8399398 8027791 7737581 6739235 6066980 5792992
8653 5792992 5951420 5498254 5338342 5376337 5085572 5169604 5056207 4591474 4434794 3984376
8643 3984376 3693168 3835811 3760534 3461048 3616711 3675530 3422571 3148913 3341488 3169260
8633 3169260 2817775 2646586 2610411 2825476 2440376 2384480 2100789 2182556 2258600 2553616
8623 2553616 2405785 2328610 2028796 1768313 2021870 1933823 2175533 1882392 1785367 1800458
8613 1800458 1812443 1917448 1504704 1386714 1639585 1326768 1259381 1238526 774679 976543
8603 976543 1138797 1115518 1211336 1247775 921283 995897 1134517 1137841 1032606 825087 673593
8592 673593 1003952 1150675 1289689 1338808 1474349 1028115 925177 994274 1010194 808418
8582 808418 756551 547049 -1264973 -704022 57581 581998 821868 340869 -229029 250485
8572 250485 791249 674387 456567 415256 576878 436902 -127864 189751 587186 1083675
8562 1083675 429614 294818 279655 335018 127654 -170761 270381 189932 479462 374914
8552 374914 452128 535248 379564 636180 607220 653845 499973 719568 477084 229136
8542 229136 297415 359119 536427 834228 395178 581217 231795 266245 26213 137645
8532 137645 227317 109610 478573 554697 354523 265779 302109 347722 125472 24146 268323
8521 268323 38979 478063 699873 279447 85929 337870 140866 136104 213817 265803
8511 265803 -267315 -148325 303658 170537 193937 214501 282739 475984 436424 639461
8501 639461 223075 249409 46297 -168237 614687 855909 420650 259016 -6159 -195554
8491 -195554 -274877 -57357 245931 96864 -269480 -188890 3765 -30994 -56133 104422
8481 104422 20303 -163612 112107 223283 152063 96073 -199885 -98523 -20050 87794
8471 87794 -273587 -286608 -290661 -365807 -401530 -526825 -489248 -635516 -477121 -117494 -131331
8460 -131331 -223059 -168050 15911 76220 162920 522807 732459 515343 279527 -57241
8450 -57241 592004 -36004 -105939 -51848 -174770 -459260 -702108 -650872 -902608 -652702
8440 -652702 -342326 -234168 -169786 150838 -85734 -25126 -182491 -267477 -152199 -139773
8430 -139773 -402963 -331922 -196338 -289627 -307692 -247794 -204151 -203288 33285 -66454 -582150
8419 -582150 -567184 -530603 -297409 -604317 -732708 -585257 -533654 -117550 158019 79593
8409 79593 -372636 -576897 -564069 -280516 -13212 -267981 -411853 -333409 -771358 -520331
8399 -520331 -212030 -321845 -321861 -383635 -229515 -143991 -129393 -140260 -342663 -612272 -423819
8388 -423819 15447 -183870 -259728 -249677 -160860 -203458 -461056 -273223 -279009 -111751 -8200
8377 -8200 -350450 -115435 -245462 -211287 -112214 -150506 -136015 -201446 237444 -23375 -84159
8366 -84159 -184985 110951 244282 28528 287712 292651 34779 30436 374468 415147 127466
8355 127466 -219393 -150917 -382772 -403870 -368377 -452372 101945 -59725 -262809 -536084
8345 -536084 -242963 214073 337373 -102298 -391783 -232443 18880 303899 225609 -183026
8335 -183026 -391116 -179212 146512 25434 -78943 -65155 -164774 -217313 -100093 -299567
8325 -299567 -88804 -221516 -492590 -238034 -465007 -764201 -524977 -283370 -250078 -194332
8315 -194332 -77060 108565 -142258 -1804 -5009 -187502 5561 -405617 -545263 -139005
8305 -139005 -130172 -192336 -41707 -347649 -49602 -169803 -579088 -627718 -479086 -648388
8295 -648388 -672636 -480187 -341006 -168214 -266581 -210125 -403892 -396435 -429500 -663764 -603946
8284 -603946 -219884 -345679 57544 -109544 -592698 -570350 -620200 -482718 -556058 -567395
8274 -567395 -379930 -362070 -121816 172378 -186409 -500913 -510346 -146706 -20325 19445
8264 19445 -441546 -658988 -287590 -412795 -474938 -429108 -236491 -120985 334143 446589
8254 446589 -143587 -187643 101100 89965 -253066 -775785 -207134 -49393 -101707 -276929
8244 -276929 -209818 -92481 -82090 -377286 -202917 -364335 -552931 -465996 -487606 -210273
8234 -210273 -145062 -35602 -637325 -554109 -577785 -631912 -356635 -276851 121601 227485 413851
8223 413851 310288 -318774 -848184 -627443 -723985 -440411 -315477 -575006 -574148 -637837 -881540
8212 -881540 -861717 -586182 -646685 -618255 -747773 -708851 -416829 -74840 -218770 -681017
8202 -681017 -560478 -265278 -461928 -497109 -706485 -319436 -417636 30586 -541501 687198
8192 687198 877320 -630598 -499676 -305231 510796 -139586 -366545 -384288 -342098 -382681
8182 -382681 -365756 -346688 -252520 -308441 -698334 -386867 -325753 -533310 -609509 -819037 -776497
8171 -776497 -602246 -639656 -696785 -1028021 -581818 -757951 -898603 -306375 -93298 28248
8161 28248 -364020 -47438 -287365 -301075 -145871 -142626 -692781 -583239 -630706 -410592 -391530
8150 -391530 981 251972 -534730 -547980 -409407 -390480 -486223 -716704 -407464 -143246
8140 -143246 -320639 -560001 -601124 -136543 -397145 -244080 -538510 -165013 -219932 -739311
8130 -739311 -504982 -596217 -688347 -702872 -643320 -715737 -253319 -484759 -291476 -269391 -605607
8119 -605607 -479655 -629783 -359541 -398902 -551606 -493449 -539630 -717263 -574951 -757500
8109 -757500 -689689 -338144 -188947 -97909 -274726 -350669 -350694 -334599 -486109 -216369 -500593
8098 -500593 -323609 -464317 -193458 -92540 -686815 -672738 -663515 -338466 -385100 -262994
8088 -262994 -98157 64571 -261303 -173763 -184398 -230555 -25235 -306700 -202358 -201462 -546406
8077 -546406 -571952 -538303 -527723 -744004 -263409 -358337 54499 -78736 -233220 -257770 -150307
8066 -150307 -263425 -58288 -225207 -148033 63396 -144494 -305371 -260610 -424247 -513958
8056 -513958 -538271 -939936 -801219 -925763 -553590 -28762 -197687 -537412 -100004 -91743
8046 -91743 -396373 -142556 105410 45322 -191318 22813 -562174 -745059 -564256 154590
8036 154590 57198 -756064 -237193 -195325 -347942 -428341 -369708 -569078 -359897 -212817
8026 -212817 -680858 -735415 -567898 -566628 -374237 -283057 -740306 -434542 -118097 -510827
8016 -510827 -111751 -344534 -918094 -664701 -380332 -376407 -589754 -333662 -216271 -305355
8006 -305355 -552089 -553780 -382805 -116757 -295006 -615125 -344060 -232183 138153 323222
7996 323222 313463 -183318 -600983 -739279 -721226 -577817 -254141 -714674 -1150625 -700360
7986 -700360 -582567 -880215 -660236 -673014 -701189 -785200 -552971 -650932 -462555 -373759 -246547
7975 -246547 -135500 -553066 -363369 -313214 -418225 -354867 -571287 -389326 -511637 -688554
7965 -688554 -97553 84671 -282918 -403244 -550911 -354392 -536483 -35507 153413 -141137
7955 -141137 -494264 92718 44756 35955 150419 -20958 -459068 -522734 -594899 -450166 -238950
7944 -238950 -334592 -680114 -844237 -520934 -305635 -257362 129247 -97201 -384777 -254451
7934 -254451 -392142 -112642 -376959 -236324 -203374 74523 -347743 -522720 -423364 -438569
7924 -438569 -564307 -815200 -747659 -600172 -358065 -119290 -212611 -500405 -648162 -550328
7914 -550328 -242249 -485409 -468183 -466184 -664224 -483194 -448941 -130479 -511956 -396446
7904 -396446 -627584 -726182 -509173 -396287 -276135 -282677 -289813 -54746 -197718 -339719 -327728
7893 -327728 -466203 -365760 78556 -30635 -528005 -305326 157155 -40526 -303040 -1884
7883 -1884 128650 -378430 -99924 11748 -191747 -183769 -128146 -418131 -586841 -594451 -312588
7872 -312588 -361423 -436850 -610382 -773789 -839693 -688351 -746194 -1231681 -758670 -570559
7862 -570559 -294182 -238318 -270703 34346 115341 -20986 -189211 -85264 -119710 -183760 -308874
7851 -308874 -518538 -692694 -687800 -662829 -68776 -303332 -337558 -430280 -581085 -610802 -202810
7840 -202810 94135 169774 -106627 -44955 -411155 -507105 -529576 -667472 -447207 -534312 -680330
7829 -680330 -507121 -380680 -109091 204709 -80742 202267 26356 -284682 -713720 -464573
7819 -464573 -508908 -606148 -443433 -528851 -661562 -896669 -485012 -505686 -313348 -705003
7809 -705003 -989113 -330470 -552910 -543555 -919656 -597699 -309379 77444 9241 175016
7799 175016 153803 275889 116179 -174832 57099 214144 222203 333116 -236803 -360821
7789 -360821 -341351 -341390 -44359 -45406 2346 71931 -25998 -121630 -270854 -116 370191 -79503
7777 -79503 15757 274481 -170980 -289172 -75294 -157010 -266973 -22871 80572 252294
7767 252294 240919 124821 -178822 -271392 -308030 -345547 -184753 -142533 -49424 77019 146430
7756 146430 224826 644067 500806 498494 501469 577656 304907 36406 26544 260583 181316
7745 181316 -198235 -65723 -151206 -18948 106667 561977 282703 77618 129857 169640
7735 169640 101784 240470 283776 124731 -78529 -57284 -85653 -155147 83917 213321 -462644
7724 -462644 -786494 -904185 -624373 -443956 -179821 -185855 -569210 -309133 8796 101758
7714 101758 18443 -105576 67713 -135978 -541514 -86961 492999 314021 -49495 -19645
7704 -19645 -147166 199545 -283391 -195740 72750 404464 375339 188209 182494 252665 268890
7693 268890 490670 227783 125934 33084 30182 170445 503793 350384 329244 434594
7683 434594 527021 537590 634982 666239 646586 1015072 1095997 1008908 1255350 1101554 834394
7672 834394 667562 757262 931577 649160 642686 809581 966387 856147 1134743 977851
7662 977851 477828 429022 310025 263493 207154 170918 75745 -154755 237946 181669 166394
7651 166394 66519 -90020 98861 101429 143311 -146034 133897 176331 -241028 92356 158303
7640 158303 235417 308493 180092 362978 110069 -148188 -39680 141737 -289152 -115893
7630 -115893 166722 128186 151363 -90509 -71336 20405 -13578 -230124 -506437 -403442 -669919
7619 -669919 -222101 -39279 -100829 -283040 -76500 180001 -121363 -90814 12001 -72149
7609 -72149 44895 249133 202422 203975 -224820 193984 37972 -177605 -145905 -490257 -269422
7598 -269422 2665 -264425 -411938 -44525 45260 -146868 -272135 129758 -44113 -763376
7588 -763376 -504569 -75248 220556 -334944 -413811 -23274 131468 36821 -38112 -230946
7578 -230946 -404370 -258604 -40399 -35408 2535 67527 342477 223948 -268546 80426
7568 80426 257011 -37388 -211921 219984 202830 -11831 -199959 -228627 71884 -140938
7558 -140938 -120128 -280099 -415633 -329713 79677 -17618 66302 -206059 73003 -25762 -145188
7547 -145188 -61173 -505616 -29094 -67786 -118903 82388 50356 977 -154592 -65730 -23055
7536 -23055 298608 -71573 -364379 -35911 -80247 -208936 241637 180449 -307327 -97581
7526 -97581 105225 267284 216882 -46172 -29727 186163 351570 49621 -553624 -76313
7516 -76313 429296 375500 246935 127753 58558 101145 271478 126043 107388 314031 383592
7505 383592 370922 125095 288168 439118 334284 454360 496618 105676 110738 322941
7495 322941 398368 469258 640979 503823 536265 531022 290468 230562 114633 282543 350534
7484 350534 470780 523425 326760 490473 464541 696218 96198 527686 540798 286618
7474 286618 222642 383094 389455 468567 736718 364154 234200 237657 522023 875295 874891
7463 874891 795699 1080202 1103635 936836 404855 750020 815038 1050351 837297 799085
7453 799085 754497 735331 799215 748601 798180 752511 242151 474246 666604 1005489 1020331
7442 1020331 563633 730703 838914 953040 960117 1441764 1372239 1397924 1585352 1605684
7432 1605684 1698518 1461313 1264373 1404556 1428493 1617267 1700725 1885599 1906851 1846637
7422 1846637 1995580 2315352 2345744 2178104 1999629 1982622 2258145 2547068 2760815 2715377
7412 2715377 2506392 2900639 2829719 2668082 2451244 2519194 2941235 3132336 3083750 2800277
7402 2800277 3016234 3180973 3558289 3542728 3468431 3721259 3374587 3668956 4033574 3905708
7392 3905708 3926732 3732988 3929925 4256340 4297062 4759989 4703274 4546138 5135406 5719182
7382 5719182 6035833 6234288 6628557 6519718 6983539 7576546 8186694 8983853 9916953 10251210
7372 10251210 10646299 11146442 11250203 11872080 12827096 13913770 15263314 16268793 17263234
7363 17263234 18955305 20579126 22694790 25051915 28153606 32047975 36073866 40420177
7355 40420177 45661154 51289629 57799470 65681495 74150147 83491445 93780952 101389066
7347 101389066 103817684 99973837 90363715 77778665 65174157 54216974 45568939 39067710
7339 39067710 34006982 30275477 26680137 24389127 22695429 21241985 19287995 17489858
7331 17489858 16186582 15142270 14149791 13021954 12246617 11179289 10766319 10422152 9878534
7322 9878534 9422052 9321008 8857242 8391603 8319879 7985657 7532884 7568711 6842001 6638425
7312 6638425 6188927 5891164 5796422 5524821 5517843 5592103 5385834 5103895 4659636 4113011
7302 4113011 3936971 4013382 3647447 3538566 3388382 3291937 3657590 3035336 3322017 3652418
7292 3652418 2892743 2918142 2788373 2531901 2559630 2624644 3002292 2831763 2528325 2051065
7282 2051065 1887649 2306270 2869766 2558658 2454198 1879154 1808813 1925944 1557218 1177702
7272 1177702 1825601 1769052 1296158 1288730 1580106 1503158 1239163 1394529 1328268 1049959
7262 1049959 1228975 1382831 1071520 1160945 1283606 1400443 1534332 1461484 1218605 901938
7252 901938 1003285 832689 1036234 844655 725136 856522 710879 687159 790845 475156
7242 475156 772904 734656 708765 737008 474253 402856 457361 684452 279212 507228 705006
7231 705006 949849 1224448 1324244 1198388 553623 466196 796105 637201 280181 287855
7221 287855 512247 584925 744533 774899 1157470 825927 95614 -77426 21681 239151
7211 239151 255767 292428 280449 635647 577581 529903 418900 -318255 163605 603493 452596
7200 452596 -127636 216731 334375 330302 429013 611029 38737 122556 430989 287385
7190 287385 405058 573109 193389 -393214 66158 -67678 67816 526294 706843 343825
7180 343825 133303 18200 -179532 -146912 -330264 -54646 142187 224465 497948 717239
7170 717239 168342 -206031 537852 744145 235026 100128 -159771 10789 -210731 -346177
7160 -346177 -448310 -134708 523550 261236 285069 45792 166226 20543 -308302 31351
7150 31351 -14333 -226086 -286755 211663 238240 342401 180590 179216 476634 681202 484919
7139 484919 345137 176694 17021 -216978 -77731 -168293 -116467 81957 230185 41002
7129 41002 -15923 -221769 -364673 -329113 105539 287139 153947 676058 355446 165656
7119 165656 180877 9814 -4618 343660 241903 405700 139242 202143 10913 390353
7109 390353 166475 -4567 41881 -196015 -189962 -102754 162247 408839 433746 -182028 -370105
7098 -370105 -106080 177118 342676 367898 474238 177317 -179336 -272440 101753 630146
7088 630146 173895 83711 -60284 -306548 -142346 -50990 285872 40851 -92478 -209965
7078 -209965 140330 334036 66606 -124053 -158791 64461 275122 123236 315027 151591
7068 151591 -201431 268296 306103 341422 -225668 -388011 -198781 -40239 215207 146009
7058 146009 319214 -21767 429051 198859 -140599 -222933 113771 618954 97985 -121228
7048 -121228 -253264 -435206 8117 255781 308172 341130 -66503 -143374 48309 -230741
7038 -230741 -301315 -355702 -224705 -324817 -163496 58870 -153037 -214487 -59624 -55108 -14669
7027 -14669 -275817 -125191 65285 209486 206634 248988 316697 365069 199689 811542 491879
7016 491879 162837 437662 -105909 -38710 211810 502902 153970 -33023 -5355 -147421
7006 -147421 -35833 209958 344126 202004 -151884 -44914 188172 124574 29888 223829
6996 223829 132907 438499 637701 919768 736877 455736 -78714 -428997 -260108 263451
6986 263451 296598 335020 314530 204331 -17920 294183 659354 640005 94442 316387
6976 316387 373833 484410 104386 107865 169710 56669 181057 32322 245334 208340 238320
6965 238320 274246 336964 114625 -52606 112023 313720 430935 445102 70260 -125167
6955 -125167 15307 185562 415399 -94878 -79520 416768 608175 738969 830630 959345
6945 959345 532155 126905 161828 326279 552901 469128 416048 443106 -34456 -15538 204800
6934 204800 52927 92056 502024 668382 452267 116997 190810 202214 146433 209262 150368
6923 150368 276117 213853 413945 227000 198626 79577 -137396 403474 515813 598936
6913 598936 754340 415717 582226 615508 268908 37391 311128 384596 320493 507573
6903 507573 628879 219778 -7081 856906 306475 161101 157001 101273 19631 43674 617194
6892 617194 578556 536757 626192 440159 266431 600276 531775 141138 300189 145616
6882 145616 106514 115165 156974 643758 777069 815277 818868 470566 935013 661784 269802
6871 269802 472550 328578 169441 195973 279805 438915 606969 811186 403362 493585
6861 493585 330545 -25990 211934 503911 837678 679148 503732 443612 544588 589203
6851 589203 359590 224176 1072756 987046 993826 970453 529703 874686 370272 313692 521992
6840 521992 492672 139115 368553 715219 723053 743945 730496 603510 487146 508021 166757
6829 166757 67961 558270 589944 447037 652004 559658 704632 1027011 986916 833051
6819 833051 521402 608533 480981 565551 244724 228225 533030 334775 316981 100021
6809 100021 353252 704431 557426 173850 252354 575253 1023660 736322 696963 567344
6799 567344 365749 720139 624021 623044 819985 598685 429729 645139 864338 933850 474798
6788 474798 266256 442659 313315 298565 625961 751420 547177 700916 609817 547575
6778 547575 665616 695452 820529 945048 842240 856249 561289 265535 362508 543444
6768 543444 700423 690195 691952 654838 573809 446165 999578 789403 352297 676926 997264
6757 997264 1094733 1275370 1031374 1006069 868677 742367 1301739 1528513 1397767 1219950
6747 1219950 1049465 843059 799946 728252 1247398 850073 1093353 876870 1011453 979505
6737 979505 1303897 1491780 1021127 924427 1012964 1379043 1097740 1310094 1681544 1626926
6727 1626926 1148828 1068549 987709 987113 1131346 1174508 1226342 1141862 1083341 830947 981666
6716 981666 1076481 939490 805092 1394308 1246439 1041296 808920 1033077 1689187 1529889
6706 1529889 1501628 1430290 1265827 1086585 1378866 1483981 1171429 1211455 1076822 1043465
6696 1043465 1532441 1283618 1283566 1565657 1465488 1655876 1772275 1601713 1749364 1872876
6686 1872876 1949775 1788295 1504154 1785708 1761552 1708293 1569445 1526367 1499360 1490041 2069433
6675 2069433 2080767 2004554 2132845 1932742 2140800 2134783 2190077 1867608 2135613 2537751
6665 2537751 2467781 1890997 1812945 2541367 2460932 2268787 2054958 2263802 2317641 2535727
6655 2535727 2651895 2399103 2075252 2441591 2424765 2445135 2250942 2291447 2402066 2806315
6645 2806315 3089331 2671166 2069122 2503163 2579816 2424767 2517711 2404987 2896740 3097025
6635 3097025 2907449 2775805 3106256 3382659 2775270 3105207 3124293 2725295 2835324 3310408
6625 3310408 3262903 3179067 3128999 3055465 3488957 3206829 3284116 3495737 3407290 3475797 3339934
6614 3339934 3499588 3397505 3574900 3531304 3405716 3735128 3656642 3848805 3737221 3135641
6604 3135641 3326261 4041431 4214161 3991342 4495890 4570959 3762373 3891603 4241880 4209015
6594 4209015 3874856 3754792 3979454 4437109 4500884 4363297 4659887 4401801 4352911 4147263
6584 4147263 4096027 3730362 4174624 4667280 4864289 5398488 5186228 5042202 5383432 5383972
6574 5383972 5381369 5681990 5958805 5780334 5386643 5160221 5191671 5578154 5524760 5865314
6564 5865314 6088674 5850144 5830162 5846637 5909390 6267530 6075826 6045479 6025059 6235160
6554 6235160 6418091 6383875 6485954 7111746 7084266 7287839 7512970 7536185 7314769 7562642
6544 7562642 7446793 7877683 7638435 7468711 7424110 7894305 7992574 8247503 8521829 8327819
6534 8327819 8411480 8738999 8731398 8872586 8862964 9060544 9232910 9174717 9194644 9299246 9581804
6523 9581804 9745720 9641673 9417814 9686002 10058773 10271580 10422000 10875773 11001136 11080807
6513 11080807 11142212 11235486 11080317 11490360 11924412 12138241 11854382 11895964 12317285 12283902
6503 12283902 12547699 13110342 13252968 13243433 13166385 13654296 13940817 14177806 14205086 14811247
6493 14811247 14627157 15100075 15379296 15948525 16273519 16270715 16554054 16507196 17050547 17491667
6483 17491667 17711042 18309385 18585922 18785303 19073169 19420267 19464114 19868622 20509811 20983749
6473 20983749 21525146 22287823 22472727 22817839 23344604 23857501 24660234 25198741 25872164
6464 25872164 26072717 26581900 27214655 28312212 29235364 29886242 30305067 31087992 31783837
6455 31783837 32700833 33516776 34720368 35435916 36260585 36997760 38326002 39317019 40406059
6446 40406059 41641841 42479298 43664966 44888668 46463559 47594140 48735607 50011796
6438 50011796 51156322 52545770 54478136 56031247 57434849 58846074 60881455 62450652
6430 62450652 64517021 66701974 68346517 70524595 72350113 74547525 76794361 79357613
6422 79357613 82236272 84841779 88122368 91217329 94207316 97470787 101312652 105074486
6414 105074486 109354036 113551609 117612755 122984662 128036545 133504889 139456564 145607686
6406 145607686 152277914 159409046 167382378 175958305 184616139 193906499 204380276 215759737
6398 215759737 227654578 240677590 254700448 268864185 283984661 300308674 317179048
6391 317179048 334329049 351800788 369221224 386460990 402548516 417574909 431091449
6384 431091449 442793406 452554052 460415424 465891898 468692319 468953851 466272370 460736586
6376 460736586 452966794 442641398 429579122 414522495 398176755 380211502 362000269
6369 362000269 343413121 325043034 307267402 290180965 274503674 259736159 245691447
6362 245691447 232230463 219952752 208117154 197195388 187241955 177626319 169699608
6355 169699608 161922800 153967647 146693262 140505642 135084654 128968622 123473996 118947594
6347 118947594 114261817 109391200 104944569 101367916 97822823 94009068 90524742 87172488
6339 87172488 84196631 81391098 78995796 76175376 73672694 71439333 69332541 66958994
6331 66958994 64747622 62735720 60447996 58831794 56747552 55085414 53610760 52133482
6323 52133482 50867758 49030883 47718958 46680220 45201135 44184515 42959292 41654861
6315 41654861 40973397 40031062 38804280 37575638 37061228 36523379 35543148 34391701 33448693
6306 33448693 32675955 31941440 31457691 30552058 29752906 29021703 28101485 27724082 26673999
6297 26673999 25735146 25590511 25306549 24706559 24274709 23381661 22618818 22491869 22478906 21730605
6287 21730605 21106887 20571794 20074982 19157311 19393119 19501952 18761166 18414107 17824630
6278 17824630 17368337 17085400 16621408 15941184 15786271 15628238 15646493 15558042 15337662 14727334
6268 14727334 14399494 13940220 13664501 13726455 13529915 13106330 12987871 12991840 12760170 12361479
6258 12361479 11997499 11846559 11705707 11594408 10991961 10901573 10888057 10821608 10978179 10557429
6248 10557429 10018483 9943146 9744222 9710966 9375468 9133349 9178398 9456712 9131626 9283782
6238 9283782 9419311 8631269 8084177 8019474 8253331 8288606 8231091 8133651 8262615 7872112
6228 7872112 7423952 7067860 6939512 6870768 6690315 6831613 6894914 6884177 6654614 6571911
6218 6571911 6601618 6462052 6550551 6339776 6098896 5879414 5639127 5499740 5236539 5036317
6208 5036317 5101877 4909953 5137443 5312056 5658097 5527870 5203013 4901960 4896490 5124561
6198 5124561 5180218 5230856 5259684 5230812 5247793 5044142 4822319 4911387 5063858 4981536 4824978
6187 4824978 4368104 3867339 3636036 4059562 4480562 4113912 3842264 4410066 4556545 4758223
6177 4758223 4752273 4200413 4153304 4363287 3858318 3894211 3806025 3896900 3911995 4019269 4223250
6166 4223250 4169231 4164897 3765537 3712733 3585901 3253479 3520848 3482142 3171635 3559773
6156 3559773 3453068 3213389 3087253 3152316 3169462 3383173 3152264 2958289 2998938 3540107
6146 3540107 3692844 3453629 3516942 3429835 3255686 3082673 3254536 3071092 3058100 3256875
6136 3256875 3419964 3420145 3599884 3558546 3292883 3091095 2761073 3010640 2717908 2954459
6126 2954459 2865888 2848329 2973974 2681381 2622118 2722644 2702031 2834652 2713847 2906061
6116 2906061 3015506 3017685 3173075 2999917 3288567 2966330 2587521 2637421 3240989 3439535
6106 3439535 3095331 2944086 2951985 2948504 3023830 2695155 2852265 3089633 3018122 3069354 2944078
6095 2944078 3396404 3270898 3349829 3350909 3603258 3596462 3481307 3551382 3552991 3645144 3310236
6084 3310236 3345655 3730543 3185041 3172464 3578554 3924588 4057038 4033314 3854390 3855926
6074 3855926 3728601 3724028 3777625 3690426 4070635 4200100 4050223 4089297 4103423 4134395 4295826
6063 4295826 4494522 4739874 4555966 4149702 4155854 4255310 4309815 4425519 4585654 4295374
6053 4295374 4688653 5151265 5348595 5646829 5354066 5825695 5925758 5516780 5578051 5817639
6043 5817639 5960287 5944310 5949167 6130845 6281519 6333098 6678263 6960216 7128858 7115340
6033 7115340 6999730 7265130 7442852 7400397 7488628 7978252 8385364 8496500 8441283 8565453
6023 8565453 8306046 8957486 9442218 10052274 10358036 10474458 10958444 11109395 11730644 12206565
6013 12206565 12879717 13382555 13628325 13884524 14638534 15457771 16146340 16771281 17837402
6004 17837402 19017139 20024328 21587194 23042076 24545187 25860148 27667685 29286544
5996 29286544 31544052 33426245 35444191 37409766 39852463 41865550 43593259 45526303
5988 45526303 46707475 47585062 47001838 46197380 45248241 44690844 43878680 43589577 43419918
5979 43419918 43042398 43322015 43212378 44235889 45409373 46260281 48057681 50414668 52728540
5970 52728540 55148056 58077240 61449022 64443201 67224673 70050728 73458797 75853686
5962 75853686 77719071 78503012 78203044 76212840 73269658 69796252 65870469 61932492
5954 61932492 58799192 55663220 52572428 50629302 48994892 47314751 45802947 44809322
5946 44809322 43364856 42948535 42846904 43025791 42900837 43422884 43693891 44090168 44851976
5937 44851976 45717205 45753647 45457099 45157046 43903676 42760627 41152769 39294122 37008075
5928 37008075 34634675 32399632 30023139 28207887 26282827 24588204 22913031 21437078
5920 21437078 20242134 19197461 18140968 17080954 16385575 15891096 14746924 13768240 13208341
5911 13208341 12685699 12073174 12111493 11722270 10990535 10367996 10085296 9821966 9968151 9655044
5901 9655044 8929205 8465554 8247767 8062877 8186063 7796822 7130944 7005933 6800652 6497073
5891 6497073 6799796 6596446 6138822 5691185 5865819 5864409 5898853 5870467 5537765 5549693
5881 5549693 5324558 5020360 4586541 4667498 4312093 4530139 4698624 4744399 4983276 4675761
5871 4675761 4728730 4683011 4417616 4194582 3714288 3745753 3713217 3807869 3677742 3805434
5861 3805434 3790035 3310485 2963699 2939559 3090841 3100069 3073760 2871147 2144596 2466608
5851 2466608 2389034 2536821 2326630 2700070 2529872 1965240 2112248 1979413 2150995 2027686
5841 2027686 2136454 1938673 1847409 1781345 2301820 2387043 2088182 2129103 1784617 1580004
5831 1580004 1920026 1866284 1764728 1726851 1737094 1773216 1626076 2016789 2018295 1701584 1318715
5820 1318715 1885641 1988914 2003928 2032669 2220167 2094560 1717625 1648048 1550140 1690376
5810 1690376 1777384 1688484 2019659 1730336 1378184 1151953 881818 1030051 1486795 1501956
5800 1501956 1694280 1892377 1592848 1351891 946191 938865 993938 1208314 1379125 1055429
5790 1055429 868106 1114001 916087 1079815 1394366 1381705 1028909 953395 1175020 1057606
5780 1057606 976432 1255390 1378933 1225655 973820 598441 678540 483007 243095 1043344
5770 1043344 1207959 1559459 1019328 937469 1102721 854124 489810 991757 1234088 1169554
5760 1169554 1474833 1469251 1312678 1084235 1041684 1049332 1033712 1028968 670033 931518 1346152
5749 1346152 943234 833447 955121 990923 657505 703148 440351 159787 475664 804345
5739 804345 815157 845712 370705 784490 1291809 1030555 1263068 1009580 886711 648916
5729 648916 668305 701737 351294 893964 699982 352428 388429 563696 541985 794379
5719 794379 947347 640138 390829 469480 612368 242652 242374 420934 288687 524786
5709 524786 440961 254804 329604 477732 411551 541861 490568 489466 245318 285943 360283
5698 360283 393723 775948 580184 413265 209082 631930 697756 489892 369949 453847
5688 453847 362114 -13218 -194496 175337 -85248 199855 588166 59271 172881 176646
5678 176646 -156211 139879 470792 513647 486494 712232 829672 542723 397491 307456
5668 307456 -113555 225352 200903 -34835 -177357 110303 246631 319811 114059 5657
5658 5657 95891 -44262 81206 -114913 -337654 -253422 -107962 104175 19292 110135 259284
5647 259284 112245 208355 281420 270398 823193 780906 581773 599376 715600 742734 506364
5636 506364 645929 220965 85813 383565 585378 570025 473790 450651 368568 298256 507193
5625 507193 529327 526141 166046 106936 -3170 -114782 168137 562333 392596 576846
5615 576846 81689 23763 195799 219342 -45577 174867 250449 608893 550541 160422
5605 160422 131064 -195933 -94245 553461 406752 180748 276524 16749 -263371 -112094
5595 -112094 -89559 -204349 157099 756511 540524 80572 113928 230694 345782 -120975
5585 -120975 -335748 66024 147687 -32977 -80631 48888 144082 125420 37580 280275 116170
5574 116170 -191750 -617524 -614582 -297191 290710 499529 297006 152779 -185551 63123
5564 63123 453030 772796 711114 591826 582917 436868 199428 80769 -231084 -208180 -124650
5553 -124650 5469 -110979 468008 411997 183558 96182 -92035 -324878 20475 -11142
5543 -11142 113926 110823 -119089 -54217 -235 -61287 239206 456932 143301 549803 677661
5532 677661 695880 819994 475336 380347 82427 -52807 110194 223796 368422 612426
5522 612426 503829 531278 303272 73006 -116542 -68760 -256119 -161427 -196657 299359
5512 299359 513763 240477 253388 336817 154970 180486 72140 -36031 26218 102004 -84861
5501 -84861 -27248 18964 -33219 102534 208741 291591 -37316 6036 217206 346807 -54082
5490 -54082 -285210 -165277 -11356 126938 122323 85885 423835 -118355 -660060 -88538
5480 -88538 55414 495655 214117 -333132 -399877 -65940 265461 -300924 30148 325402
5470 325402 -22800 163466 -113369 -62130 -90711 -37057 397585 507537 354225 -80452
5460 -80452 3815 -298911 15490 529849 773320 292883 308767 339492 284863 -64337 -167996
5449 -167996 46669 114416 -126729 175379 409812 492962 240365 58524 58547 -113640 -117608
5438 -117608 -88504 256597 137482 -120468 191582 -394772 -49544 227396 207325 46376
5428 46376 58909 -305420 -271686 -92241 108506 17862 172077 48010 226705 426454
5418 426454 405851 504650 428915 199658 156411 -309216 -374048 -89412 -36250 -80921 -327037
5407 -327037 -120498 150118 301961 -34994 -16810 -116614 314265 352783 -65439 -276482
5397 -276482 285551 267968 210568 570309 439375 -44260 -306163 -110894 101245 -199338
5387 -199338 345127 360475 4366 55584 -20221 -399444 -374772 -198894 -223165 -320476 -209483
5376 -209483 -298881 39367 147735 -124021 11424 233069 387652 523161 110404 270136
5366 270136 327692 437525 106763 81337 41246 632909 770419 82892 478221 254711
5356 254711 31595 104322 345672 602340 325137 280461 97025 -155972 133572 184526
5346 184526 4694 301897 342173 300638 387908 396096 265191 266904 508493 260276 139272
5335 139272 -99568 -239663 -28940 -80339 140942 -68252 -163139 -161240 -189806 -341950 107527
5324 107527 507913 66827 254851 450741 743703 766352 449177 294821 236939 182652
5314 182652 489460 658793 372435 79757 288454 363183 660165 535461 209886 235330
5304 235330 392033 276421 -124580 181658 514703 339288 356833 692367 405057 145868
5294 145868 436220 275326 239127 192200 417813 548160 466685 610897 563526 307962
5284 307962 345444 592281 307561 434005 493790 660119 942653 620647 604581 952925
5274 952925 549045 304501 699090 924668 813965 1003129 1191337 979613 589714 313153
5264 313153 384251 698030 673477 820604 875628 641564 649869 720059 453352 468396 785801
5253 785801 883469 1071686 939918 1205935 1173487 1118221 711864 867832 802713 992020
5243 992020 881402 1092915 1344207 1768174 1497184 1431055 1688470 1093678 1010290 1015885
5233 1015885 1138501 605526 372443 751369 475755 640689 977469 931017 602255 599051
5223 599051 772645 975248 741134 598560 546850 769955 616111 266679 63949 414667
5213 414667 600519 331657 614042 364285 624830 702726 750908 656736 743961 481214
5203 481214 302590 278237 241886 470066 874120 789630 505046 630175 531337 350886
5193 350886 328240 219235 465053 590657 525052 593619 361881 634495 738929 606077
5183 606077 609058 647045 803361 418386 108389 303418 536271 450838 706332 348107
5173 348107 384218 732396 488167 391842 346344 419140 568713 754908 810459 940580 1095022
5162 1095022 969432 654857 287931 388606 285020 562447 773330 487600 568130 889985
5152 889985 711740 1050663 1176933 903439 693484 991289 887220 841137 988415 519064
5142 519064 471210 606488 478957 581215 655777 946103 770107 1058909 1140296 963755
5132 963755 1018698 1213572 977540 574635 876818 953434 664155 439582 508594 892020
5122 892020 1171674 1197430 1058954 936207 1192221 1169550 950178 919109 946984 632424
5112 632424 1056208 1654455 1407782 1191414 1414450 1166930 1373607 1151790 1031594 1093182
5102 1093182 1105566 900965 1332877 1470388 1252415 974122 1224632 1574343 1672151 1129765
5092 1129765 1470149 1163828 1090444 1436661 1034899 1208461 1453178 1311786 1267746 1446931
5082 1446931 1414532 1379434 994504 1179228 1111581 1297997 1128439 1205407 1209547 1204559 683441
5071 683441 383971 578478 454472 765213 709331 566704 372456 609814 902034 567886
5061 567886 698490 467981 513010 980892 707225 788107 1011519 905714 573139 783103
5051 783103 818628 706003 770931 1131241 759581 707568 1047235 760402 738179 718365 1220421
5040 1220421 1158660 675822 734812 798118 957048 809453 783086 790875 608496 675711 1080416
5029 1080416 1082688 720957 624240 868362 872667 641368 897698 1010284 659235 894146
5019 894146 923067 889453 863455 696810 972492 844502 718385 954725 1054673 857877
5009 857877 1196838 1136413 1009656 690460 489767 688241 1230514 1237320 973698 1147654
4999 1147654 1251173 1139336 1226720 1695307 1572670 1258917 989200 916947 1220035 1070226
4989 1070226 1312462 1000963 799336 1516125 1774660 1410533 1099818 1132397 1347996 1034712
4979 1034712 692964 1102925 1391946 1294974 1854107 1595067 1704434 1554966 1258765 1516560
4969 1516560 1381540 1350784 1590066 1341814 1365523 1848049 1649388 1449803 1512835 1562024
4959 1562024 1419374 1951677 2078964 2278401 1692127 1709384 2127517 1826004 1910708 1844108
4949 1844108 1877477 2116767 1963790 1741008 1625185 2063667 2116486 2008092 2140062 2024227
4939 2024227 2342296 2293532 2533366 2523083 2463022 2428657 2387350 2270335 2156285 2143993 2186094
4928 2186094 2541617 2763997 2601705 2560099 2831968 2897633 3192544 2984011 2860680 2757584
4918 2757584 3106336 3346030 3426441 3461451 3366095 3255277 3457440 3760852 3880272 4141478
4908 4141478 4082132 3802269 3905922 4200309 4314351 3887053 3671767 3956531 4244291 4218713
4898 4218713 4432481 4530748 4744724 4491333 4276652 4482012 4809496 5330733 5633658 5983871
4888 5983871 5897865 5906709 6017199 6020971 6327381 6925913 6961402 6937416 6939550 7306278 7618332
4877 7618332 7882012 8089350 8536822 9062341 9496086 10081193 10198639 10504890 10693345 11093036
4867 11093036 11765360 12308783 12432525 12971547 13289445 14193711 14969086 15190588 15519685
4858 15519685 15630255 16086568 16278608 16955680 17556516 17831581 17976013 18227528 18602623
4849 18602623 19028530 19489837 19854410 20233105 20907421 21831608 22326366 22845015 22833685 23258083
4839 23258083 23823860 24124615 24735896 25389569 25962595 26790490 27345001 27562839 28337513
4830 28337513 29165044 29954878 30857093 31453528 31890982 32216811 33066538 34023202 34541617
4821 34541617 35308690 35547045 36277974 37025323 37621276 38010057 38364378 38766939 39131462
4812 39131462 39107481 39452651 39625438 39795959 39854370 39761607 39840145 40343294 40711493 40844550
4802 40844550 40838875 40838605 40801421 41170265 41278935 41038068 41286853 41869763 41749176 41796156 41880263
4791 41880263 41898425 41831459 41715483 42076047 41836377 41717287 41403300 41266346 41508911 41581359
4781 41581359 41622646 41249305 41306516 40955715 40770299 40783168 40445743 40169972 39470865 39083487
4771 39083487 38878873 38088601 37099571 36635048 36089810 35393960 34775937 34331794 33790255
4762 33790255 33143726 32419988 31525859 30930104 30618552 30018692 29162893 28699044 28214895
4753 28214895 27568642 27021863 26440737 26257264 25665610 24941857 24000099 23611064 23124077
4744 23124077 22580113 22364191 21507908 21074197 20877127 20465120 20082445 19025199 18694617
4735 18694617 18434683 17826315 17587557 17333228 17223467 16858393 16200890 15377559 14860843
4726 14860843 14741571 14665526 14094245 13207979 13104451 12994691 12005344 11750269 11420007 10481769
4716 10481769 10252224 10338887 9924662 9278350 9268558 9107314 9021900 8685186 8724053 8540323
4706 8540323 8059846 7954335 7860860 7544629 7435885 6989895 6913677 6717479 6375111 6417702
4696 6417702 6533128 6314166 6781274 6354617 6155283 6277360 6311002 6320453 6195847 5978026
4686 5978026 5824691 5593109 5677461 5757646 5699011 5440769 5450232 5151096 4811361 4716343 4659048
4675 4659048 4710301 4392353 4464762 4577403 4801017 4349656 3919273 3451228 3320294 3604580
4665 3604580 3563213 3440535 3660356 3785948 3443513 3267162 3532714 3575150 3681816 3690562
4655 3690562 3565117 3263689 2901505 3160179 3307126 2680499 2754996 2699775 3017989 2625288
4645 2625288 2746973 2574354 2581621 2846321 3069603 2683854 2777539 2904122 2793876 2844167
4635 2844167 2712273 2451004 2387226 2548351 2642421 2612587 3010826 2795447 2714636 2408021
4625 2408021 2550303 2488332 2464714 2222878 2228622 2531799 2332959 2207470 2078662 2647599
4615 2647599 2554072 2475097 2443417 2239976 2062872 2377516 2112747 2182226 2135215 2516231
4605 2516231 2529899 2495975 2760370 2897943 2698140 2427144 2309759 2234843 2525264 2638719
4595 2638719 2850279 2568827 2391261 2535643 2354642 2014954 2438332 2518807 2356376 2297276
4585 2297276 2552176 1915229 1672067 2052256 2208216 2446734 2471112 2461070 2283881 2418215
4575 2418215 2154934 2240900 2334370 2180876 2154280 2412112 2307628 2309346 2511919 2512124 2253232
4564 2253232 2287255 2438929 2546522 2523548 2440438 2267855 2164642 2211881 2600269 2656635
4554 2656635 2572328 2586597 2568479 2681441 2933924 2611889 2567317 2622028 2766688 2636349
4544 2636349 2309722 2284172 2805052 2845765 2230701 2072704 2330037 2341842 2454940 2652840
4534 2652840 2462805 2860036 3000156 2770800 2751878 2699311 2689974 2765417 2900583 2919814 2866616
4523 2866616 2825492 2685124 3026007 3542739 3480228 3362926 3479601 3850831 3663651 3689783
4513 3689783 3591758 3320663 3344923 3497687 3190065 3306669 3563367 3822191 4158484 3696851
4503 3696851 3805880 3883967 3909997 4343296 4085416 4193002 4246938 3790148 3607500 3899828
4493 3899828 4259242 4059703 3620104 3470055 3593102 3655912 3818498 4074511 4274980 4794762
4483 4794762 5104792 5076617 5132942 4818073 5087571 5070703 5075119 5313496 5590369 5528443 5404899
4472 5404899 5538509 6037894 6180345 5982008 6092751 6281063 6113868 6329947 6735711 6638337
4462 6638337 6878237 7496790 7440547 7308472 7527517 7831804 7557443 7920847 8319944 8436459
4452 8436459 8671307 8580163 8640732 9054924 9153840 9389491 10079570 10217198 10376530 10455495
4442 10455495 10839494 11526917 12108723 12003199 12084303 12192785 12142980 12366829 12841509 13220098
4432 13220098 13068943 13410095 13832625 14184382 14845703 15495399 15632853 16264568 16838081
4423 16838081 17387050 17760961 17966254 18186020 18757886 19552583 20357918 21525387 22161597
4414 22161597 22980497 24408163 25431731 26419517 28120143 29554011 31535647 33556555
4406 33556555 35562307 38120210 41039296 44905388 48615737 53278167 58285376 63175867
4398 63175867 69473224 77170849 84981072 92692432 99492060 105012750 110276084 115056259
4390 115056259 121090332 129005336 138593027 148677321 156987111 161997854 163631387 164104762
4382 164104762 164756132 167675520 173180922 180184876 186492066 188015093 183594141 175412378
4374 175412378 166528373 159083163 154355005 152257193 151193969 148372094 142120590 132973398
4366 132973398 122638127 112858795 105135129 98977595 94055480 89562118 84396740 78010992
4358 78010992 70617692 63651939 57189991 51964634 47525358 43840401 40789434 38198374
4350 38198374 35781325 33727271 31849997 30207505 28508302 27457386 26659847 25182211
4342 25182211 24628994 23197799 22050059 21433124 21416798 20945027 20360381 19706195 19029955
4333 19029955 18193798 17619623 17637561 17158070 16687511 16186940 15662745 15308466 14567315 14344303
4323 14344303 14394712 13512115 13203458 13084286 12921734 12542728 12002385 11849165 11780134 11758820
4313 11758820 11588970 11187498 10518737 11057816 10978145 10878855 10696616 10226742 10501481 10556563
4303 10556563 9927848 9909718 9416199 9138405 9190679 9240008 9130977 9519193 9551363 8976255
4293 8976255 9077565 8667927 8832059 8778501 8512978 8819477 8856735 8849116 8557325 8448236
4283 8448236 8471132 8136934 8272723 7815405 7321181 7119830 7390249 7153968 6628852 6572678
4273 6572678 6869943 6560575 6686886 6754972 6494339 6620056 6761119 6081228 6673860 6858995
4263 6858995 6693733 6503397 6041883 6304552 6314813 5957996 5995407 5922928 6459964 6128253
4253 6128253 5979864 6232134 5995224 5926616 5931545 5953742 5913864 6136333 6027449 6095796 6369552
4242 6369552 6544161 6477783 6240026 5857041 6392498 6889203 6683363 6580046 6316910 6254487
4232 6254487 6485698 6649166 6352013 6221025 6426279 6307871 6290133 6022413 6134666 6256120
4222 6256120 6464709 6355952 6513429 6496680 6923318 7185368 7051169 7062476 6929709 6988407
4212 6988407 7088383 6983145 7010018 6692539 6864751 7093244 7009609 7229351 7536992 7672788
4202 7672788 7994300 8250003 8099048 8245569 8097788 8229558 8444744 8598547 8728534 8867008
4192 8867008 8883341 9287485 9339524 9035669 9304662 9493865 9341549 9720218 10070092 10046846
4182 10046846 10087078 10408829 10612292 10660609 10715538 10755149 11033352 11596951 11708466 11559281
4172 11559281 12312306 12885138 13025920 13054586 12730369 13146742 13935149 14411480 14845984 15015163
4162 15015163 15168658 15536842 16158207 16535669 17140407 17359599 18119777 18881566 19322756
4153 19322756 19767808 20384624 21353449 21956230 22291277 22663840 23617614 24330492 24924597
4144 24924597 26009682 27217812 27859406 28871709 29562151 30242783 31131763 31212381 31955109
4135 31955109 33044631 33777107 34029006 34709215 35917458 36719882 37007028 37733855 38661874
4126 38661874 39252003 40169206 40909377 41877558 43138696 44704729 46115162 47126219 49000818
4117 49000818 50781068 52438555 54234702 56069611 57984705 59645759 61433799 63043796
4109 63043796 64844701 66158346 67377632 69002541 70537640 72187298 73918776 75839030
4101 75839030 77922803 79878712 81992323 84412459 86850413 89560534 92867219 96638369
4093 96638369 100951681 105175412 110328817 116438725 123113818 131256047 139942139 150139530
4085 150139530 161849027 174892949 189400898 205534673 224110832 244456006 266592928
4078 266592928 290608189 315503328 337896437 349846273 345567181 324665286 293188477
4071 293188477 260007561 230777886 206783632 187402030 171612959 158613507 147888586
4064 147888586 139293319 132118976 125577772 120064324 115389125 111334905 107588183 104790481
4056 104790481 101884968 99402665 97869739 97011878 95395373 94786016 94310250 93339623 93127068
4047 93127068 92926341 92966491 93233843 93798570 94037107 94123996 94359868 94743258 95082213 95618210
4037 95618210 96207396 96583008 97268981 98204886 99737784 100716154 101688125 103519342 104863368
4028 104863368 106483794 107771458 109070310 111097292 113442868 115639030 117777847 119753175
4020 119753175 121773062 123857878 125618089 127583384 129186506 131111655 133057161 134099985
4012 134099985 135333202 136383653 137602693 138532195 139153550 140272168 140953815 141216778 140917093
4003 140917093 140076824 138426267 136161151 133837215 131305023 129174473 127042041 124931323
3995 124931323 123358629 121045344 118684804 115528801 111383933 107479998 103956191 100706470
3987 100706470 96394160 93254332 90262086 87143018 83983702 81153388 78077025 74935370
3979 74935370 72100015 69476331 67098819 64492489 61736248 59314727 57712465 55741426
3971 55741426 53196371 51177101 49464211 48033332 46899605 45374976 44119851 42668462
3963 42668462 41230465 40627980 39824436 38969648 38611322 37782380 36442214 35086873 34255278
3954 34255278 33829223 33053433 31967438 30744022 29456351 28097048 26731617 25895494 25110778
3945 25110778 24728440 24064695 23614230 23176162 22574360 22375388 22292226 22053373 21248724 20520860
3935 20520860 19987873 19652089 19176054 19135337 19060916 18679120 18784741 18272043 17803417 18057857
3925 18057857 17864361 18239427 18137182 17453562 17135528 17354980 17334501 17345547 17537087 17234310
3915 17234310 17255606 17018256 17017218 16624400 16668899 17026422 16835798 16699186 16425023 16158964
3905 16158964 16300845 16239829 16462054 16646507 16996181 17156031 17299485 17424982 17304871 17229544
3895 17229544 17448623 18044296 18155798 18020012 17716627 17794080 18510381 18565751 19058244 19041378
3885 19041378 19116472 19231618 19460542 19740825 20052087 20374484 20659150 21050469 21364440 21660788
3875 21660788 22371710 22880099 22949001 23506168 24009958 24574179 24994634 25441102 25600948 26312424
3865 26312424 26814174 27573059 28151008 28096691 28370344 29656695 30252138 30692063 31208939
3856 31208939 31467993 32237282 33039956 33870024 34499252 35343494 36566929 37524730 38552188
3847 38552188 39707200 40470794 41555811 43182068 44289726 45593896 47027077 48633210
3839 48633210 50272491 52287526 54527220 56609027 58614448 60586838 62751689 65045428
3831 65045428 67878838 70831242 74200721 77416009 81159860 85219124 89736263 94749702
3823 94749702 100156989 105942736 112241110 119288471 127023635 135345163 144095771 153976188
3815 153976188 163832561 174211934 185497762 196862912 208612797 220727898 231538477
3808 231538477 242102002 252373890 260720158 267623109 273001285 276588789 278970352 280314337
3800 280314337 280311836 279280154 278361488 276455856 273598109 270437182 266227709 261524003 255860190
3791 255860190 248831913 240322471 230647348 220683412 210086336 199198839 188214175 177585562
3783 177585562 167466632 156961540 147985323 139248346 131278902 123905083 116583679 109981507
3775 109981507 104503892 99170477 94184478 89738217 84773035 80089056 75798885 72452881
3767 72452881 69510472 66691162 63820687 61637697 59062855 57001054 55320833 52913314
3759 52913314 51184417 49663120 48006493 46855150 45550354 44350504 42788425 41545014
3751 41545014 41144629 40107655 39068338 38441978 37318180 36560678 36151495 35690147 34375820
3742 34375820 33535115 33487274 32800960 31896248 30993135 30542349 30144301 29366214 29086529 28805997
3732 28805997 28556155 27683135 27298701 27189304 26824505 26405205 25914885 25196485 25001385
3723 25001385 24964513 24478788 23891834 23203825 23196245 23291957 23105207 22818501 22492260 22075247
3713 22075247 22087242 21952272 21915503 21865440 21805663 20873047 20789542 21047974 20947826 20329942
3703 20329942 20234925 20083822 19875596 20083724 19594268 19870217 19714109 19100350 19119613 18560393
3693 18560393 18750116 18413075 18631964 18403294 18427376 18798715 18656934 18336729 18099721 18415096
3683 18415096 18158610 18434944 18524111 18481165 18611517 18528712 18620230 18877909 18895042 19476040
3673 19476040 19794832 19344755 19369366 19962991 20481508 20940512 21544425 21843422 22535157 22958309
3663 22958309 23637632 23667976 23757557 25097903 26314308 26673720 27215708 28201286 29438546
3654 29438546 30422099 31251361 32277180 33172835 34172052 35050992 35988348 36586400 37584820
3645 37584820 38810429 39371442 39953196 40972649 41745047 42284859 43095366 43615038 43680461
3636 43680461 44621573 44896817 44878122 44626802 44934997 44715689 44639253 44831657 44656680 44605306
3626 44605306 44742393 44594587 44209978 44333443 44692702 44904066 44560860 44549365 44736837 45282748
3616 45282748 45984275 46393427 47425378 48181511 49130341 50454825 51688564 52792201 54369985
3607 54369985 56311290 58458960 60642342 62751910 65013805 68884753 72336919 75465399
3599 75465399 78678723 82315830 86152931 89829089 93851325 97785868 102206228 106428366
3591 106428366 110095664 114068406 118031861 121204140 124113307 126578140 129419759 131967299
3583 131967299 134198566 136499487 138433188 140260839 142173695 143461448 144404996 145229077
3575 145229077 145704668 146371206 146765842 147073033 147359778 147438004 147751241 147849044 147765631 148131394
3565 148131394 148131381 147739328 148098096 147920323 147561114 147200373 146852550 146471288 145778058 145288557
3555 145288557 145143776 144432029 143575942 143037730 142308662 140899940 139881622 137962242 136122964
3546 136122964 134424787 132310138 129823158 127087803 123987877 120745401 117602150 114448834
3538 114448834 110680379 107184759 103975289 100342873 96605789 93128030 89880739 86281177
3530 86281177 82679809 79334491 75806825 72311163 69066370 65848822 63242757 61090902
3522 61090902 58821757 56874844 55266455 53167069 51536425 50473578 49220805 48084493
3514 48084493 47625905 46926619 46040385 45699313 45664974 45435281 45304768 44629308 44223286 44324711
3504 44324711 44517142 44399541 43897362 43964985 43628074 43560030 43434582 43284129 43337477 42887193
3494 42887193 42954897 42574466 41913421 41380655 40633049 39702859 38952715 38274946 37515784 36183162
3484 36183162 35367930 34135388 33120154 32469672 31736500 30829183 29695388 28834571 27807172
3475 27807172 26523230 25411208 24213424 23113251 22606975 21736429 20837896 19877879 18690561
3466 18690561 18290858 17593811 17075041 16414281 15501003 14887774 14527041 14375591 13728990
3457 13728990 13210077 13031524 12925793 12081336 11859906 11724117 11219953 10798861 10279510
3448 10279510 10489240 10265360 9955814 9675344 9408491 9666907 9121887 8631352 8527934
3439 8527934 8559094 8338898 7910345 8190997 7920731 8083953 7776103 7254844 6974496 7065888
3429 7065888 6667185 6509511 6177191 5988569 6417918 5776523 5721214 6129114 6129966 5670267
3419 5670267 5677513 5269714 5261410 5374878 5013919 5088604 5266268 5109639 5012259 4963160 4928359
3408 4928359 4281224 4078297 4205928 4365999 4274145 4269376 4198673 4343614 4388703 4458655 4238054
3397 4238054 4112095 3808432 3882501 3943105 4236085 4321106 4083044 3725123 3559708 3579785
3387 3579785 3336970 3492961 3624288 3001756 2680362 2583598 2924618 2997293 3259930 3163240
3377 3163240 3565661 3532102 3184181 3221338 2795604 2743260 2634427 2634186 2612014 2709119 2792857
3366 2792857 2367403 2649572 3071197 3302801 2854079 2396959 2416934 2444774 2955970 2861762
3356 2861762 2610704 2842543 2871142 2721143 2845424 2392919 2405974 2158158 2196695 2121671
3346 2121671 2221607 1996878 2083487 1961894 2334466 2102414 2033449 1893239 1848959 1840067 1669810
3335 1669810 1944238 2035274 1641611 1865782 2233253 2459772 2373125 2267492 1903077 2011246
3325 2011246 2040874 1861963 1708289 1842446 1905662 1799239 1957045 2101882 2181102 2484502
3315 2484502 2469034 2436072 2337672 2106910 2220495 2249386 1974632 2117056 2154928 2082669 1859926
3304 1859926 2123236 2052277 1774282 1920260 1822881 1539815 1978768 2226720 1907714 1973887
3294 1973887 2219928 2087754 2014763 1909235 1923107 2278292 2396757 2524068 2399133 2040651
3284 2040651 1739312 2321188 2229334 1750829 1263387 1784128 1993406 2128397 1834815 1682079
3274 1682079 2054991 2136538 2067121 2121402 1870553 2053905 1870463 2008892 1942019 1857443
3264 1857443 1654208 1542420 1404828 1514887 1546019 1946662 2401140 2064493 1873615 1839015
3254 1839015 1665210 1720098 2124877 2321651 2088854 1722792 1771103 2112789 1983496 1912651
3244 1912651 1700490 1732606 1882157 2199363 2251298 2146070 1910609 1938001 2044706 1939045
3234 1939045 1708802 1637690 1805874 1632322 1868314 2085621 2023547 1914377 2293968 1852697
3224 1852697 1785067 2273480 2438534 2846323 2787486 2849937 3008521 2749534 2588277 2391344
3214 2391344 2371626 2654284 2532085 2531168 2040869 2298356 2123644 1609962 1559677 1239268
3204 1239268 1344900 1278202 1417491 1332611 1601247 1578873 1876518 1483950 1084726 1259569
3194 1259569 1215571 1381890 1656509 1664735 1862833 1404012 1130789 1261659 1383811 1746289
3184 1746289 1375990 1031311 655783 436230 396876 542521 483100 808237 939363 1054150
3174 1054150 995311 945807 912720 855273 993529 1130214 1079370 1063387 1375260 1146355 1027324
3163 1027324 981917 1116346 979112 810658 1083303 940261 963335 1085535 832653 1226152
3153 1226152 1124809 1340867 1058339 835111 1166725 1159302 1107261 1147633 1075001 1365537
3143 1365537 1147801 1185512 1376341 1547219 1366405 1485021 1400990 1526263 1582453 1183898
3133 1183898 1387539 1441322 1417357 1291559 1234793 1313463 918480 428847 594637 520093
3123 520093 725882 571566 780463 604334 593407 888931 472456 450965 721015 773726
3113 773726 875264 504263 583022 759999 547699 609247 591664 370285 560437 510354
3103 510354 -26601 556155 589267 614688 890331 1142088 1110798 765453 773443 740126 641916
3092 641916 881508 1248382 669165 784950 1098747 877999 526988 483420 818453 926743
3082 926743 952467 645113 696688 636263 410408 54985 286389 756952 914922 736094
3072 736094 628282 808415 544179 521627 645774 734590 613105 381081 702896 980070
3062 980070 1224317 1104913 588692 762177 1274160 1438904 1366961 1172544 859284 892451
3052 892451 1127695 912720 283722 626705 464332 260783 133875 234491 396418 553482
3042 553482 523328 64546 506911 1163600 961087 540435 450258 590100 509968 676722
3032 676722 996663 1087830 952191 911808 1018381 803240 928080 995746 1038590 1037575 947447
3021 947447 814078 453268 130691 353223 408525 295877 602827 550025 480554 372070
3011 372070 565143 261686 -277095 -77189 191858 146093 331947 398504 16951 -164970
3001 -164970 34419 396289 567653 568681 588770 573294 358271 339110 296314 204259 127522
2990 127522 519116 422215 477818 618738 241637 430316 368496 -73210 62892 140960
2980 140960 17689 278069 219190 -66049 -176764 79035 434189 207576 112708 142506
2970 142506 -73673 242823 219769 88267 344188 321124 61070 40036 -128329 149549
2960 149549 -94805 -134597 191806 41244 -122884 200436 52129 96164 138489 -271291
2950 -271291 -32446 20732 326218 459118 161770 11900 321902 514614 283863 315121
2940 315121 412327 46282 298064 325130 169451 370953 153328 -2259 -161702 -445467
2930 -445467 202203 458753 98028 -24075 163296 489734 164684 218157 463518 650935
2920 650935 203356 5854 120682 484361 585034 432101 265866 -66480 268723 516982
2910 516982 418548 192741 302885 605741 349319 189287 338658 237962 564013 336467
2900 336467 257536 493008 630744 392904 161055 127710 509734 690891 1043780 323922
2890 323922 488607 232624 367070 273314 336132 480848 -1258 119492 90624 359181
2880 359181 258404 81017 43724 396627 889687 708626 413360 420589 281624 235305
2870 235305 296459 81326 -16797 105094 131322 260899 206653 296150 601615 586915 508179
2859 508179 279443 101295 336807 652609 521556 538198 503354 192393 22413 389695
2849 389695 412557 3332 -99838 400098 866468 858186 776859 425489 529784 410316
2839 410316 115048 -240730 40320 286613 413817 497560 703854 559745 560018 339987
2829 339987 401271 -13060 59964 548386 381346 190474 208206 -188722 -265328 -265408 -117411
2818 -117411 -237526 155642 114783 258924 233229 -146895 -384698 -296321 -31210 -53373
2808 -53373 83939 88633 491964 169977 -171454 4386 21034 91905 -339508 -174345 -63457
2797 -63457 -426712 318735 268434 -31874 -238058 -478061 -127047 -82406 -51713 -91584 -207873
2786 -207873 -178424 143641 79145 229542 -316544 -198801 -175719 -445414 -214252 -460969
2776 -460969 133981 293699 55370 -441168 -377761 -481804 -359883 76354 163993 19352
2766 19352 -23815 53319 -61520 -62913 -284899 -95026 134063 164698 -18584 -300915 -49221
2755 -49221 198673 115597 265315 94395 -48454 403602 -59458 -662377 -511045 120892
2745 120892 -56101 -37134 380238 231038 -91797 115957 -177193 -80389 -119863 -306254
2735 -306254 -157894 -186995 -244646 -95110 -179538 -165538 -273884 -343983 -117465 -239851 -318619
2724 -318619 -200520 -131757 -17479 -64437 -253968 -439314 -331267 -216499 -219155 -534526
2714 -534526 -255467 -191710 -219046 191112 184486 -211356 -411227 -153655 14823 -246603
2704 -246603 -336164 20756 -18073 -98959 55620 70999 -189901 -605501 -479927 -218199
2694 -218199 -483428 -412902 -319448 -126144 -242431 -555950 -379525 -319108 -605234 -304332
2684 -304332 191064 385659 26155 -222729 -411637 -325555 32889 -116640 27286 -111512
2674 -111512 -225600 -72544 -277301 -281294 -109913 100420 -78465 -471404 -752352 -474209
2664 -474209 -7327 280938 -59809 -394263 -358566 62990 133318 -159438 -149075 -68134
2654 -68134 -146475 -329594 -207245 -287799 -387539 -312265 -65601 -127981 52767 692668 523278
2643 523278 76325 -145894 -296560 -214603 -325630 -264204 108991 75095 45021 -9309 -403134
2632 -403134 -349458 129267 177415 241316 322292 124444 143189 78243 -235937 -112908 -174316
2621 -174316 -442564 -512903 -360842 -155644 -351001 -353877 -102868 -165058 9570 -150345
2611 -150345 -94219 111901 129379 100093 -162 -43183 -408748 -81952 -209771 -226561 -360089
2600 -360089 -391714 -518069 -561886 -418600 -670132 -341727 -254531 -280448 -291876 64953 -165130
2589 -165130 -110264 -201511 133929 188890 17014 -41226 -174784 29509 175573 -59536
2579 -59536 -384815 -185399 -161634 -146068 308489 29374 -210780 23225 213690 151665
2569 151665 -199920 -257497 -410888 -588086 -456280 -264671 -71681 44694 -193445 322269
2559 322269 375272 406771 -113178 4746 176661 268526 212551 129906 207215 -82292 -90468
2548 -90468 -2365 78491 -220980 -299765 59136 3665 31283 6411 -269931 -122677 212205
2537 212205 426639 475465 56541 110806 -53018 -250523 101069 417749 93276 2206
2527 2206 317322 -35293 -411444 -423914 -211449 -163354 -253707 -401999 -471692 -341420 -576954
2516 -576954 -670301 -436301 -544491 -482050 -298525 -130850 8140 192148 -30203 -345623
2506 -345623 108237 98379 -139572 -29801 -24949 -296834 -245236 -169337 123033 669841 100590
2495 100590 45222 274233 308141 187499 180560 294275 44502 -299542 -331273 -419104 -197201
2484 -197201 -118754 3296 97662 226224 73225 67007 -29190 142317 150599 259021 -104737
2473 -104737 2090 146925 37306 -93232 -1745 -198833 -278810 -323232 -177943 115687
2463 115687 -138713 -317223 -229958 -260628 -319734 -88181 -189850 -125058 -262467 -150899
2453 -150899 -433702 28957 125683 111308 32115 330538 116990 -166205 22170 -27899
2443 -27899 -40429 -15995 213030 431072 -19796 -151569 -25240 -144306 -223375 -53555
2433 -53555 157944 -250282 -326647 -395809 -228761 -303969 -358336 -352753 18944 90586 -301186
2422 -301186 -173940 -149633 -97738 126268 -258419 -201149 160564 -89983 107759 -431334
2412 -431334 -521357 140953 79596 -377525 -749835 -731102 -517625 -318261 -451703 -323431
2402 -323431 19283 -129996 -168175 -36472 59193 -123719 34271 -13077 -22899 109123 13133
2391 13133 -625354 -834518 -394898 -560990 -111359 72771 124155 476341 488824 327552
2381 327552 -551854 -308572 151640 276561 208440 -145414 -472690 -262377 -95356 329421
2371 329421 436314 -66971 -98011 -25294 114641 155155 76713 -215072 -466430 -654091
2361 -654091 -499674 91375 82830 -31348 71885 147368 -191300 -341959 -520342 -412563
2351 -412563 -288390 -9053 -216400 -816475 -590885 -193903 -215591 -239164 41425 20858
2341 20858 33785 -13442 -106740 -70271 -193543 -529030 -549958 -426121 -279168 -175524 125045
2330 125045 -138273 2723 -8087 -319085 -397958 -332890 -768480 -606950 -388446 -709761
2320 -709761 -589127 -367654 34194 96085 -121283 98877 66679 -184974 -279329 -388768
2310 -388768 -213208 99072 -478884 -449457 -8147 7340 161673 79358 -301639 -306517 -18538
2299 -18538 206324 -182349 -385784 -270348 -110424 -127526 -103830 93599 -53162 -95085
2289 -95085 -101387 -385817 336664 247596 150995 -64272 45036 -118361 -280016 -286427 -545320
2278 -545320 -23354 249860 91912 176496 -1238 -120952 -489983 -259124 -9796 148524
2268 148524 -481706 -851770 -715913 -1073056 -1009748 -556474 -437657 -724018 -603757 -315232
2258 -315232 -117842 -511977 -460887 -20424 129040 13693 -12313 -235002 185060 -162161
2248 -162161 -273687 -326259 -233270 228699 594604 360235 418469 -218575 -470215 -335794
2238 -335794 -251988 -244940 -455193 -522083 -378098 -102462 116651 -146725 91573 364769
2228 364769 253659 591525 -87984 -781733 -194261 -269798 -258844 112133 146471 -137665
2218 -137665 -59770 138891 207632 36827 -354780 -166003 -112277 -11968 80650 110232 508778
2207 508778 131917 -199289 -14883 -42170 -205312 -72854 -493417 -213319 -17039 85124
2197 85124 241778 118172 112479 396273 400358 226554 51387 -224178 -88279 -547478 -222825
2186 -222825 95815 -136161 91076 -243414 162767 -240704 -713468 -136095 152839 123179
2176 123179 610562 299500 -37316 308690 -175457 -100262 -234355 -474146 -432761 -241866
2166 -241866 -442941 -490195 -80207 -169780 -278716 -238105 -363565 123961 68863 77187 -235362
2155 -235362 -179558 -160478 -265252 -190700 76659 -80656 -329697 91987 298412 -43817
2145 -43817 -231965 -410706 -113537 -131453 54564 -76529 171868 133260 -108230 82912
2135 82912 -66199 11207 -155587 -360427 -335784 -51658 -11138 71019 -258700 135072 -284070
2124 -284070 -542291 -181382 -79623 69123 -116558 -45393 -181007 255515 481902 413378
2114 413378 -53216 -247986 -61203 147228 241502 560063 312341 -168162 -104802 378611
2104 378611 774895 741601 616879 953871 838985 328972 457453 632290 595249 -1934
2094 -1934 -258994 -189596 197256 228579 28125 371627 217873 257163 25908 -218736 26199
2083 26199 -110268 -27852 221618 -108261 -200650 -202175 -20463 36725 335411 228956 -82228
2072 -82228 -109919 -252024 213604 602800 631057 408954 123567 -216529 -248943 36662
2062 36662 79165 185584 423734 265030 330888 119724 153443 449710 424245 -70259 -242908
2051 -242908 -159700 44033 175965 -83528 -265125 -225535 -182585 -66428 -161202 -180624 -164649
2040 -164649 -143249 -200180 -596515 -478579 -94630 -200864 -229426 -473470 -406129 -305878
2030 -305878 -422314 16757 -63542 -17826 186862 -39619 -202870 -118821 -76154 -92786 -211992
2019 -211992 -132040 33251 45157 96126 -152023 -52153 -271741 -143832 -20084 -140184
2009 -140184 -368790 -631576 -465807 -392721 140966 -42350 -229029 -44550 -277107 -417552
1999 -417552 -233948 -165560 -634518 -190414 14483 86975 -31212 -370681 -236901 105952
1989 105952 335760 309021 -14910 -473663 -387710 -86179 -456501 -716524 -609681 -468014
1979 -468014 -419502 -75698 -95713 -301190 -567634 -491249 -137760 27647 -43383 -149045
1969 -149045 -219499 -165316 -327165 -422876 -62850 218963 422073 323321 94212 71630 -294491
1958 -294491 139495 332432 39174 -131717 -192052 -264247 -121340 11959 -201195 -198049
1948 -198049 -217484 -95120 -476060 -533945 -191411 -47906 -268477 -50062 -262409 -249777
1938 -249777 -438047 -322832 140821 -28024 -238106 -613661 -361167 -164123 -1314 35097
1928 35097 -22923 200819 -151437 144785 36370 89221 64320 -173845 -231437 -65721 -119326
1917 -119326 -143010 41118 -191637 -350130 92439 77240 -107400 175441 253405 316470
1907 316470 80768 24126 396698 568484 215895 -30981 -251463 -237354 -250450 -66396
1897 -66396 -69780 -392818 -3125 -9434 -277087 -212024 -3769 -363963 -186612 103573 -95622
1886 -95622 -341130 -295004 -204831 -508802 -414491 -223896 -631037 -327504 -674382 -624389 -284499
1875 -284499 -407207 -273967 -273611 -499407 -606789 -393207 -64983 285097 299034 366321 474413
1864 474413 62415 -344863 -308161 -256883 -73818 -163640 -332648 -554576 -497917 -318145
1854 -318145 -128423 -76542 -292789 205556 277721 27967 122883 -237753 -761674 -397684
1844 -397684 224767 -111434 -196580 -174234 -254400 -220468 -262673 -190982 -81323 -241625 -46274
1833 -46274 -86690 -69311 -187258 356915 289325 -89734 -262172 -447680 -211821 -10418
1823 -10418 -3573 -319092 -111483 287757 476896 401831 204122 550845 356191 251340
1813 251340 111389 38485 1022470 415959 -3882 180661 249884 -84082 -125642 -190523
1803 -190523 -317874 137058 192746 231660 -67224 -161177 -281255 -54105 -12449 308576
1793 308576 329234 432120 213086 -232831 -188572 -93886 133062 342490 -184484 -537569
1783 -537569 -320594 68664 343298 -32382 -125665 -287900 -386965 40978 -153119 -316749
1773 -316749 -575047 -540954 -245305 -335216 -620159 -519060 40390 37568 50354 124373 461317
1762 461317 179692 -426366 -271205 -349680 -339388 65480 -120222 -394301 -20258 -132343
1752 -132343 -154336 52981 20320 -153767 -347519 -479262 -915149 -367840 -77239 -149759
1742 -149759 30772 79304 81276 -265402 -329674 -228858 -386788 -467026 -71764 91847 -132660
1731 -132660 -145964 -297799 -192771 113398 349595 280032 -350185 -272271 -228851 -59075
1721 -59075 373743 257303 91451 169143 106184 188011 657775 256521 389200 324015 346930
1710 346930 128904 132425 219460 140664 142467 -67805 -403333 -242720 286400 355814 78873
1699 78873 284430 222601 -168490 241772 -104009 -95060 199763 338962 368953 318612 268111
1688 268111 16969 58127 221998 -120550 144948 -13592 -328505 373238 49516 127565
1678 127565 245912 188374 79306 221005 17349 -47294 299436 -92695 393174 98001
1668 98001 237079 232170 336763 221238 54613 209569 -24415 -84064 13445 112082 -439729
1657 -439729 -11090 -233834 -323039 -315068 45151 408663 182008 151917 299491 336489 -219271
1646 -219271 -256772 -559468 -465781 2010 109797 -45306 -307292 114994 139228 -296130
1636 -296130 -346737 -233011 -562863 -467628 -331924 -374473 -291611 -12082 213403 194326 -402651
1625 -402651 -84391 -21150 -387287 -402746 -555671 -250362 -22712 -318556 -14400 139445
1615 139445 -181671 -367239 -30751 448443 381702 207913 57014 52072 13481 28203 -40514
1604 -40514 -500980 -244261 -55298 148914 18943 -726309 -377775 -504127 -282848 132907
1594 132907 293491 69986 2825 -58802 342458 163969 311068 315392 463771 428064 265060
1583 265060 254918 287835 42759 76416 66420 -90438 -36544 404776 605054 481326 138812
1572 138812 -282967 -444769 -482053 -383199 -549674 66813 -29983 -91427 192172 -315534
1562 -315534 -323539 -18807 186735 485539 4524 -11612 -631350 -444799 -234046 -271173
1552 -271173 -172642 8177 188791 -496941 -705064 -467779 -613760 -830738 -322742 -152793
1542 -152793 -425856 -439848 -371978 -368900 -312342 -497713 -201289 -19097 425431 -31073 -349561
1531 -349561 -337307 -110391 199743 473502 366197 -68043 27068 210855 51653 32785
1521 32785 67643 -159694 318063 267615 -199635 -550157 -327582 -218147 -486050 -797497
1511 -797497 -134531 142901 92736 -63746 100329 19648 -169801 -309773 -336666 -118719
1501 -118719 111771 50404 -89655 170557 274696 355942 736671 476460 -47863 251555
1491 251555 307995 316853 377599 206227 372362 796386 299525 15070 -164564 -285837
1481 -285837 -64963 265732 291797 71115 -316709 49323 226219 209979 489736 347467
1471 347467 334790 137476 174758 346718 275058 -75381 167374 65173 144499 379744
1461 379744 320117 -14430 -125976 98474 72272 284914 341331 385737 128113 433745
1451 433745 600850 207387 105808 52195 -171192 -126045 -93292 -227577 -147073 211901
1441 211901 161335 46435 -136124 181017 310801 -73990 -163529 -76757 -163766 -248740 -15920
1430 -15920 -103731 -69334 247556 351203 70394 349986 244048 267526 58696 257658
1420 257658 464421 245840 91146 -116466 -248309 -252164 21123 -33260 -375820 -372527 -178508
1409 -178508 -85189 55278 45147 -45976 -189904 -177060 -103400 141658 244686 548209 355465
1398 355465 -62608 -236549 -257702 187360 346059 274667 307628 83259 -111549 -78725
1388 -78725 138997 20219 -141257 -355593 -260645 277745 270884 881261 791579 294068 267763
1377 267763 459123 -50572 54139 -67168 -155474 -343096 -480934 -602394 -379772 -301156
1367 -301156 -220965 169229 -91866 -107424 -213875 53248 189267 141157 37873 132101
1357 132101 193000 179199 319359 277580 -26828 -78171 329142 363340 249893 132639 -425659
1346 -425659 -456592 -383566 -144673 -224501 -270780 162042 228196 -90094 -90257 56895 -233630
1335 -233630 -169973 -160068 -406618 54780 -13382 -66948 71 113159 121670 195286 202134 171142
1323 171142 56484 285096 97999 130272 42448 102201 -240367 -209922 -189370 -358920 -448664
1312 -448664 -254808 -310598 -190680 201638 -80010 -7575 234352 167136 282267 506683
1302 506683 266772 -33874 128363 -16948 -236740 -38310 -143773 190722 299026 127274
1292 127274 -142798 -177240 -415801 -201864 -232839 -469879 -102853 -108849 -238506 -7080
1282 -7080 211622 227776 -57825 101347 -182533 -380477 24389 209412 -1563 -110787
1272 -110787 1654 44310 -316722 -160859 395336 247348 435904 345971 119945 209569
1262 209569 149778 356659 168689 -97724 -321741 -211502 122267 407656 144825 -86378
1252 -86378 34899 -269325 -390125 -296053 58004 463809 323171 33770 -180250 -198072
1242 -198072 85686 386752 333789 114635 -200125 46275 356304 -289601 -264318 171858
1232 171858 586482 424556 413746 215058 65969 314512 463727 303099 551844 257479
1222 257479 -11916 47186 -372532 246850 28745 -188920 -123403 5824 78525 12043
$$ [...]
##END NTUPLES=NMR SPECTRUM
##END=
