##TITLE=11H_EC-3268(2)
 CDCl3
 8 sc, 
 15.11.2021
##JCAMPDX= 6.0         $$ Bruker NMR JCAMP-DX V2.0
##DATA TYPE= NMR SPECTRUM
##DATA CLASS= NTUPLES
##ORIGIN= UXNMR, Bruker Analytische Messtechnik GmbH
##OWNER= root
$$ XWIN-NMR		Version 3.5
$$ Mon Nov 15 11:00:05 2021 Russian Standard Time (UT+4h)  she@DPX200
##.OBSERVE FREQUENCY= 200.131346
##.OBSERVE NUCLEUS= ^1H
##.ACQUISITION MODE= SIMULTANEOUS
##.ACQUISITION SCHEME= undefined
##.AVERAGES= 8
##.DIGITISER RES= 18
##SPECTROMETER/DATA SYSTEM= spect
##.PULSE SEQUENCE= zg30
##.SOLVENT NAME= D2O
##.SHIFT REFERENCE= (INTERNAL, D2O, 0, 15.7171)
##AUDIT TRAIL= $$ (NUMBER, WHEN, WHO, WHERE, WHAT)
$$ ##TITLE= Audit trail, XWIN-NMR		Version 3.5
$$ ##JCAMPDX= 5.01
$$ ##ORIGIN= Bruker BioSpin GmbH
$$ ##OWNER= she
$$ F:/spectra/data/she/nmr/H-F/1/pdata/1/auditp.txt
$$ ##AUDIT TRAIL=  $$ (NUMBER, WHEN, WHO, WHERE, WHAT)
(   1,<2021-11-15 10:58:55.51 +0400>,<she>,<DPX200>,
      <created by zg, POWCHK disabled, PULCHK disabled
       configuration hash MD5:
       00 E9 B6 7A A2 85 ED C7 34 08 36 98 17 FE 4E 26
       data hash MD5: 16K
       DB 75 AB 2F 63 33 CB E1 09 CD 79 EC 7A BA F6 10>)
(   2,<2021-11-15 10:58:59.85 +0400>,<she>,<DPX200>,
      <Start of raw data processing
       efp BC_mod = 2 LB = 0.24 FT_mod = 6 PKNL = 1 PHC0 = -15509.68 PHC1 = 7.400809 SI = 16K 
       data hash MD5: 16K
       99 00 7F 54 38 58 51 6A 95 62 A8 F2 05 ED 87 7C>)
(   3,<2021-11-15 10:59:15.37 +0400>,<she>,<DPX200>,
      <pk PHC0 = -3.062813 PHC1 = 5.8 
       data hash MD5: 16K
       07 00 3F 57 1C 59 77 8D 12 5C FD 49 A3 8D DC D7>)
(   4,<2021-11-15 10:59:18.32 +0400>,<she>,<DPX200>,
      <abs ABSG = 5 
       data hash MD5: 16K
       02 58 52 F8 7B C9 DD 0F 60 1D 36 06 E8 D3 CD 52>)
$$ ##END=
$$ 
$$ hash MD5
$$ 43 57 1A 90 68 57 F8 C2 E6 BD 6C 45 03 F0 49 59
##$RELAX= 
##$RELAX= 
##$RELAX= 
##$RELAX= 
##$RELAX= 
##$RELAX= 
$$ Bruker specific parameters
$$ --------------------------
##$DU= <F:/spectra>
##$EXPNO= 1
##$NAME= <H-F>
##$PROCNO= 1
##$TYPE= <nmr>
##$USER= <she>
##$AMP= (0..31)
100 100 100 100 100 100 100 100 100 100 100 100 100 100 100 100 100 100 
100 100 100 100 100 100 100 100 100 100 100 100 100 100 
##$AQSEQ= 0
##$AQ_mod= 1
##$AUNM= <au_zg>
##$AUTOPOS= <>
##$BF1= 200.13
##$BF2= 200.13
##$BF3= 200.13
##$BF4= 200.13
##$BF5= 200.13
##$BF6= 200.13
##$BF7= 200.13
##$BF8= 200.13
##$BYTORDA= 1
##$CFDGTYP= 0
##$CFRGTYP= 5
##$CHEMSTR= <none>
##$CNST= (0..31)
1 1 145 1 1 1 1 1 1 1 1 1 1 1 1 1 1 1 1 1 1 1 1 1 1 1 1 1 1 1 1 1 
##$CPDPRG= <>
##$CPDPRG1= <>
##$CPDPRG2= <>
##$CPDPRG3= <>
##$CPDPRG4= <mlev>
##$CPDPRG5= <mlev>
##$CPDPRG6= <mlev>
##$CPDPRG7= <mlev>
##$CPDPRG8= <mlev>
##$CPDPRGB= <>
##$CPDPRGT= <>
##$D= (0..31)
0 1.2 0 0 0 0 0 0 0 0.06 0 0.03 0 0 0 0 0.0002 0 0 0 0 0 0 0 0 0 0 0 0 
0 0 0 
##$DATE= 1636959534
##$DBL= (0..7)
120 120 120 120 120 120 120 120 
##$DBP= (0..7)
150 150 150 150 150 150 150 150 
##$DBP07= 0
##$DBPNAM0= <>
##$DBPNAM1= <>
##$DBPNAM2= <>
##$DBPNAM3= <>
##$DBPNAM4= <>
$$ [...]
##$SUBNAM2= <"">
##$SUBNAM3= <"">
##$SUBNAM4= <"">
##$SUBNAM5= <"">
##$SUBNAM6= <"">
##$SUBNAM7= <"">
##$SUBNAM8= <"">
##$SUBNAM9= <"">
##$SW= 18.0517287032376
##$SWIBOX= (0..15)
0 0 2 0 0 0 0 0 0 0 0 0 0 0 0 0 
##$SW_h= 3612.71676300578
##$TD= 16384
##$TD0= 1
##$TE= 0
##$TE2= 300
##$TE3= 300
##$TEG= 300
##$TL= (0..7)
0 120 120 120 120 120 120 120 
##$TP= (0..7)
150 150 150 150 150 150 150 150 
##$TP07= 0
##$TPNAME0= <>
##$TPNAME1= <>
##$TPNAME2= <>
##$TPNAME3= <>
##$TPNAME4= <>
##$TPNAME5= <>
##$TPNAME6= <>
##$TPNAME7= <>
##$TPOAL= (0..7)
0.5 0.5 0.5 0.5 0.5 0.5 0.5 0.5 
##$TPOFFS= (0..7)
0 0 0 0 0 0 0 0 
##$TUNHIN= 0
##$TUNHOUT= 0
##$TUNXOUT= 0
##$USERA1= <user>
##$USERA2= <user>
##$USERA3= <user>
##$USERA4= <user>
##$USERA5= <user>
##$V9= 5
##$VALIST= <valist>
##$VCLIST= <CCCCCCCCCCCCCCC>
##$VD= 0
##$VDLIST= <DDDDDDDDDDDDDDD>
##$VPLIST= <PPPPPPPPPPPPPPP>
##$VTLIST= <TTTTTTTTTTTTTTT>
##$WBST= 1024
##$WBSW= 4
##$XGAIN= (0..3)
0 0 0 0 
##$XL= 0
##$YL= 0
##$YMAX_a= 211740
##$YMIN_a= -274942
##$ZGOPTNS= <>
##$ZL1= 120
##$ZL2= 120
##$ZL3= 120
##$ZL4= 120
##$ABSF1= 15.94301
##$ABSF2= -2.108843
##$ABSG= 5
##$ABSL= 3
##$ALPHA= 0
##$AQORDER= 0
##$ASSFAC= 0
##$ASSFACI= 0
##$ASSFACX= 0
##$ASSWID= 0
##$AUNMP= <proc_1d>
##$AZFE= 0.1
##$AZFW= 0.1
##$BCFW= 0
##$BC_mod= 2
##$BYTORDP= 0
##$COROFFS= 0
##$CY= -3
##$DATMOD= 1
##$DC= 0
##$DFILT= <>
##$DTYPP= 0
##$F1P= 0
##$F2P= 0
##$FCOR= 1
##$FTSIZE= 16384
##$FT_mod= 6
##$GAMMA= 0
##$GB= 0
##$INTBC= 1
##$INTSCL= 0
##$ISEN= 128
##$LB= 0.24
##$LEV0= 0
##$LPBIN= 0
##$MAXI= 10000
##$MC2= 0
##$MEAN= 0
##$ME_mod= 0
##$MI= 1.114404
##$NCOEF= 0
##$NC_proc= -7
##$NLEV= 6
##$NOISF1= 3.799351
##$NOISF2= 2.8
##$NSP= 0
##$NTH_PI= 0
##$NZP= 0
##$OFFSET= 15.71714
##$PC= 1
##$PHC0= -15512.74
##$PHC1= 13.20081
##$PH_mod= 1
##$PKNL= yes
##$PPARMOD= 0
##$PSCAL= 0
##$PSIGN= 0
##$REVERSE= no
##$SF= 200.130006887033
##$SI= 16384
##$SIGF1= 3
##$SIGF2= 2
##$SINO= 5.538805
##$SIOLD= 16384
##$SREGLST= <1H.CDCl3>
##$SSB= 0
##$STSI= 16384
##$STSR= 0
##$SW_p= 3612.71676300578
##$SYMM= 0
##$S_DEV= 0
##$TDeff= 16384
##$TDoff= 0
##$TI= <>
##$TILT= no
##$TM1= 0
##$TM2= 0
##$TOPLEV= 0
##$USERP1= <user>
##$USERP2= <user>
##$USERP3= <user>
##$USERP4= <user>
##$USERP5= <user>
##$WDW= 1
##$XDIM= 16384
##$YMAX_p= 435979020
##$YMIN_p= -599149
$$ End of Bruker specific parameters
$$ ---------------------------------
##NTUPLES= NMR SPECTRUM
##VAR_NAME=  FREQUENCY,     SPECTRUM/REAL,   SPECTRUM/IMAG
##SYMBOL=    X,             R,               I
##VAR_TYPE=  INDEPENDENT,   DEPENDENT,       DEPENDENT
##VAR_FORM=  AFFN,          ASDF,            ASDF
##VAR_DIM=   16384,         16384,           16384
##UNITS=     HZ,            ARBITRARY UNITS, ARBITRARY UNITS
##FACTOR=    0.220516191357247, 1,           1
##FIRST=     3145.47137602095, 0,            0
##LAST=      -467.245386984828, 0,           0
##MIN=       -467.245386984828, -599149,     0
##MAX=       3145.47137602095, 435979020,    0
$$ Real data points
##PAGE= N=1
##DATA TABLE= (X++(R..R)), XYDATA
$$ [...]
6440g2000J49286O121J68505k92905o4676j74934p5471K82288k4860J85286q680
6429G7960j03837j05084K673M9888J20995K2167j45049J1866M4810L7499Q6025
6418I9913n4734M5636l834O3005j76562L1601J7713L731j20793j42776J35121
6407a01979M52235j77308k17307O7627J17716J65077j35707L131n9394j61443
6397d7352Q1595r5456j31158Q0632m8109n5535N6449l6273P252J79833K1964j06348
6385i2506J15635j11752R9607R3046K9623p661n5979J5459J01823M0050m8779
6374A78566k30539k35921J75665J5245L0263p5796j2403J66591M6587j34940O3065
6363a3617K7940j0154j53523r821J80381q697n7206J1448J12669R4171J54507
$$ plain form
6440 -72000 77286 83407 251912 -40993 -105669 -280603 -356074 -73786 -98646 86640 77960
6429 77960 -25877 -130961 -128288 -78400 42595 64762 -80287 -68421 -23611 13888 99913
6418 99913 45179 90815 86981 149986 -26576 5025 22738 26469 -94324 -237100 -101979
6407 -101979 350256 172948 -44359 23268 140984 306061 170354 173485 114091 -47352
6397 -47352 34243 -61213 -192371 -111739 -159848 -215383 -158934 -195207 -187955 -8122 13842 -92506
6385 -92506 23129 -88623 10984 104030 133653 125992 70013 85472 187295 227345 178566
6374 178566 -51973 -287894 -112229 -96984 -66721 -142517 -154920 11671 58258 -76682 -13617
6363 -13617 14323 4169 -149354 -159175 21206 12509 -44697 -33249 79420 173591 328098
6352C28098j58431o2661k16365O4222j16402J60590R048o8835P5527N0147j05043
6341d0105m2554P2376p2065L6659M4997J15416o9069J81091o3958p7493p3643
6330A1652n637J16506K27676j13014k21574k01497J10989J54276r4057j27272
6320a41952J39703n4553p9864K33324k0939l6710q4233q7444J03581J07491J834
6309H0238o7619J7489l7046k4894m1209q1668J42984R9344J2936L2360K21780
6298C54695j78140j61368O7761j07292M5275j32900j30864J17444J81376p8208
6288b2221J0355K9293L78J18360j63630P0337L04539k2600j20336j75312M3171
6277G2334Q8901j05800m834J32922L0606o0674R8952J49270k86299K8534p9569
$$ plain form
6352 328098 169667 107006 -109359 -45137 -161539 -949 8099 -60736 14791 64938 -40105
6341 -40105 -82659 -10283 -82348 -45689 -692 114724 45655 226746 162788 85295 11652
6330 11652 6015 122521 350197 237183 15609 -185888 -74899 79377 -14680 -141952
6320 -141952 -2249 -56802 -136666 96658 75719 39009 -45224 -132668 -29087 78404 80238
6309 80238 12619 30108 -6938 -31832 -73041 -154709 -11725 87619 100555 132915 354695
6298 354695 176555 15187 82948 -24344 20931 -111969 -242833 -125389 55987 -22221
6288 -22221 -11866 17427 17805 136165 -27465 42872 347411 324811 204475 29163 72334
6277 72334 161235 55435 50601 183523 214129 153455 252407 401677 115378 143912 64343
6266F4343M1424J49583l1176J83927n8438l41149J00008N4822k05100L3118m8477
6255e7115J83963J39448R3002j02383J57170L01155k99847j95869p2024q1455
6245F6045Q5300j5436R7089J96966o6361N6314N2157k53316J30309J29523Q1318
6234E59908J03517k92114J28464j65491q0143Q022K2036r4165J04994J19181j5453
6223C98756O3501j80276k2867K03687J76367k11777Q3705J21362j82823K56410
6213G06045p5971q5285J2443R086Q1595n1995P149j59098q0092M2633L0988j37830
6201B99668P3379J91955m2104P0830J00948j7355j73130j34527L0541K06801j11205
6190D95801j03086J10325n3777J27870q4780j5714k5258q3776j5674J10825j73173
$$ plain form
6266 64343 105767 255350 224174 408101 349663 8514 108522 163344 -41756 -8638 -57115
6255 -57115 126848 266296 359298 256915 414085 715240 415393 219524 147500 66045
6245 66045 151345 135909 232998 429964 363603 419917 472074 218758 349067 478590 559908
6234 559908 663425 371311 499775 334284 254141 262163 284199 190034 295028 414209 398756
6223 398756 462257 281981 259114 462801 639168 427391 511096 632458 449635 706045
6213 706045 630074 544789 557232 566318 647913 595918 603067 443969 363877 406510 437498 299668
6201 299668 373047 565002 522898 593728 694676 677321 504191 369664 400205 607006 495801
6190 495801 392715 503040 449263 577133 492353 476639 451381 367605 351931 462756 289583
6179B89583J6730k6323k8237J82928J54397l58576P6843q8872r7617q6623j5606
6168A8627K18391P5767k7201M0518j48423m9832P5090P3925J0403j98780m6183
6157D2302L13743j01197j00272J42123k1368L4289r6684o678m7349m078J28019
6146B82850M2111L6437N5967M5122j02591k7439n1523M4597N5293j37795O3997
6135C07026N0685p5676j3278j52051J05830j3814K79636J5035J4343m49m4195
6124D73092m6773M0340K2653O2700j18639M7123J97934j04134j03141j7177R4089
6113E48067N5411K12490k07301N4183M5750O3916l6844k12862j75656K45284r9582
6102D92856j9373j26864O663q5Q2046K5213J14697j581j10755r6249Q9138K68449
$$ plain form
6179 289583 306313 279990 251753 434681 589078 230502 307345 218473 120856 34233 18627
6168 18627 237018 312785 285584 326102 177679 127847 202937 276862 287265 88485 42302
6157 42302 356045 254848 154576 296699 275331 309620 212936 206258 158909 154831 282850
6146 282850 324961 361398 417365 462487 359896 332457 280934 325531 380824 243029 307026
6135 307026 357711 282035 268757 116706 222536 208722 488358 503393 517736 517287 473092
6124 473092 426319 466659 489312 552012 433373 480496 678430 574296 471155 453978 548067
6113 548067 603478 815968 608667 662850 708600 772516 735672 522810 347154 592438 492856
6102 492856 473483 346619 353282 353197 435243 460456 575153 573572 462817 366568 455706 724155
6090G24155L1695J18022n0619k59075J88695q3907J08634j85340J0801j9356J35230
6079G18935O8972j21052J31471m8742j22082J47318M5115j77007J657O2938m2552
6068F64971L8464K0319J30611j91990K13271O1966m2205j47444J0125J97028N6734
6057A011850K29478R4790q8521q1105Q356q8055j0505K0315k02163J39594J64777
6046A198811j28074J98938o7577O4649J6094J07464k07610q8187J33363J96501
6036A424372J10927l7522K13206J10136m8793L4962o8351n450k4205j6118p217
6025A685947P0151O3717n0407j21259R0860O0542j83664J28212k6119p470K60632
6014A971142j60756q057k37908Q1333K66719O2678J29347k12882N0503L37788
$$ plain form
6090 724155 755850 873872 823253 564178 752873 668966 777600 592260 603061 583705 718935
6079 718935 787907 666855 798326 749584 627502 774820 819935 642928 644585 707523 664971
6068 664971 703435 723754 854365 662375 875646 937612 895407 747963 758088 955116 1011850
6057 1011850 1241328 1336118 1247597 1166492 1174848 1086793 1076288 1096603 894440 1034034 1198811
6046 1198811 1070737 1269675 1202098 1266747 1282841 1390305 1182695 1094508 1227871 1424372
6036 1424372 1535299 1497777 1710983 1821119 1772326 1807288 1738937 1733487 1709282 1693164 1685947
6025 1685947 1756098 1819815 1769408 1648149 1739009 1799551 1615887 1744099 1717980 1710510 1971142
6014 1971142 1810386 1802329 1564421 1645754 1912473 1975151 2104498 1891616 1942119 2279907
6004B279907K36795Q8811l2001j24382m5450r364m346K79832m0291J95665Q4136
5993B909312M2783k51135J82435j98470J87383J64273N3727J57777J85595J04627
5983C538307k16288K7501K28891L76796K177j1228J90511J25860K18895J8495
5973D499917o0454M1051N4327J59920K08055J63484K17442n5741J72058K79513
5963E679572Q2729M1050J91945K47566k5766K03209J71039J23099J82031K65498
5953G161972J15632L17857J92271K37488L14009R7390J88951L68334J73563J12079
5943I279546K70647L66987M83602K70251L44159O06723M70531N15476N83641M42981
5933A3634544N77266O16826R22392J109196J190827J348897J204448J602362J505941
$$ plain form
6004 2279907 2516702 2605513 2573512 2449130 2403680 2394316 2389970 2669802 2629511 2825176 2909312
5993 2909312 2952095 2700960 2883395 2684925 2872308 3036581 3090308 3248085 3433680 3538307
5983 3538307 3322019 3349520 3578411 3955207 3957384 3946156 4136667 4262527 4481422 4499917
5973 4499917 4439463 4480514 4534841 4694761 4902816 5066300 5283742 5228001 5400059 5679572
5963 5679572 5762301 5803351 5995296 6242862 6217096 6420305 6591344 6714443 6896474 7161972
5953 7161972 7277604 7595461 7787732 8025220 8339229 8436619 8625570 8993904 9167467 9279546
5943 9279546 9550193 9917180 10400782 10671033 11015192 11621915 12092446 12607922 13191563 13634544
5933 13634544 14211810 14828636 15751028 16860224 18051051 19399948 20604396 22206758 23712699
5924B3712699J978646K289490K305125K754703K899822L318403L685100M075317
5916D7019305M192579M408108L880485J924733m79121k886998m058624m008616
5908D9991851l607980k905756j815429j361108n86283m98200L18861O56133J317258
5899D1509347J750926K159685K648412L090464L631054M172136M908962N501708
5891F9372694O301230P006276P904185Q175208P543607M912667j36595o046081
5883A05033191j0234069j1646188j0399132q199159o416340m961567l771679l015630
5875D6389427k414899j432634j140258q83882k03382J44037L10310Q13373J198389
5866D2780481J703609K180142K398899K387746K917089L282916L053288K338096
$$ plain form
5924 23712699 25691345 27980835 30285960 33040663 35940485 39258888 42943988 47019305
5916 47019305 51211884 55619992 59500477 61425210 60946089 58059091 54000467 49991851
5908 49991851 46383871 43478115 41662686 40301578 39715295 39217095 39535956 40192089 41509347
5899 41509347 43260273 45419958 48068370 51158834 54789888 58962024 63870986 69372694
5891 69372694 75673924 82680200 90584385 98759593 106303200 111215867 111079272 105033191
5883 105033191 94799122 83152934 72753802 64554643 58138303 53176736 49405057 46389427
5875 46389427 43974528 42541894 41401636 40517754 40314372 40458409 40768719 41582092 42780481
5866 42780481 44484090 46664232 49063131 51450877 54367966 57650882 60704170 63042266
5858F3042266J18500k437424n025954o197812n804174n229436m301830l656375
5850C0507761k788871k092223j894616j519720j362993j229640r54742j178962
5842A7485994j013057q19913n92019n68218n15705o57389l86557k59376l15902
5833A2357858r2157l02128j26204o2122m798R5356O0320r2417N0393N43296N20927
5822A2948324L53663M45987Q64534J197412J167659J380890Q84665k80013j529575
5813A7433546k441778k368774j737217r96783n46893o04213m36425m87048j86182
5804G628233j09777l92299p4751p5239k72119j909q2733k26991k8186J14434l27447
5793F151216j39184k42434k55908k83270l24810l22417k35355j62738o9039p9596
$$ plain form
5858 63042266 63160766 60723342 55697388 49499576 43695402 38465966 34164136 30507761
5850 30507761 27718890 25626667 23732051 22212331 20849338 19619698 18664956 17485994
5842 17485994 16472937 15653024 15061005 14492787 13977082 13319693 12933136 12673760 12357858
5833 12357858 12265701 11963573 11837369 11775247 11770449 11865805 11926125 11833708 11884101 12427397 12948324
5822 12948324 13301987 13747974 14612508 15809920 16977579 18358469 19243134 18963121 17433546
5813 17433546 14991768 12622994 10885777 9888994 9342101 8737888 8301463 7814415 7628233
5804 7628233 7518456 7126157 7051406 6976167 6704048 6702139 6619406 6392415 6364229 6478663 6151216
5793 6151216 6012032 5769598 5513690 5230420 4905610 4583193 4347838 4185100 4116061 4036465
5783D036465k7682k66067j49276m4227n3370J88414n9721k40255j85327k22009
5773B976945n3285P3041L4467n4693J05955j83952l1203l3635k05089J5385q4587
5762B559349j69619J79507k30615L4910n492p0572j16189Q3831K1018k8008Q92
5751B259012o021j55558M7704j28078p0013p0365l99O2897n8009K68106m328L0990
5739B175938l5688M0901j74201o5542l0457K43390k76121q3005J27817R4167p914
5728B009285j28337J4474M2700J4088O654r8509J83621k363l93908k33030J52281
5717A566956O9002j46363M3026O6508j89235o8016Q773J80144J8754j05670R8597
5706A542476p7097j25363L22916M6328k13365k80577o8173J38155j3242O1129
$$ plain form
5783 4036465 4008783 3742716 3593440 3549213 3495843 3684257 3624536 3384281 3198954 2976945
5773 2976945 2923660 2996701 3031168 2976475 3082430 2898478 2867275 2833640 2628551 2643936 2559349
5762 2559349 2389730 2569237 2338622 2373532 2368040 2297468 2181279 2265110 2286128 2258120 2259012
5751 2259012 2252991 2097433 2145137 2017059 1947046 1876681 1876282 1939179 1881170 2149276 2144948 2175938
5739 2175938 2140250 2181151 2006950 1941408 1910951 2154341 1878220 1795215 1923032 2017199 2009285
5728 2009285 1880948 1895422 1938122 1952210 1958864 1860355 2043976 2041613 1647705 1414675 1566956
5717 1566956 1635958 1489595 1532621 1599129 1409894 1341878 1350651 1530795 1549549 1443879 1542476
5706 1542476 1465379 1340016 1662932 1709260 1495895 1215318 1147145 1285300 1272058 1333187
5696A333187m5347J80199j14481l4779r3568k60921M8359l336J71457j93814M7421
5685A034377J27045k0282P108O7216p1566j5410O4818J64994q4966J19633k9575
5674A363392m7855J29135j85372m0291J09571k10680j65684J25392m9627m6427
5664I81554J70718j04339J5474K1609n5940J9473O9604m997q4505m2884n5106
5653I30661m2123J72108K30343p0019p3183j3105r1583R3343k3653j37205K53539
5642A229123J32616k42515o9050j53269J12861q400p8380p803M5007J83330J1787
5631A155307K24565j22568j15042L3239r7150l3649J04828K18527R7573L3879
5621A499509r7451r2140j26776l7678J25882J01441o2492q4005J1907k84861R2576
$$ plain form
5696 1333187 1287840 1468039 1353558 1318779 1225211 964290 1012649 1009313 1180770 986956 1034377
5685 1034377 1161422 1141140 1148248 1215464 1143898 1128488 1193306 1358300 1273334 1392967 1363392
5674 1363392 1315537 1444672 1259300 1219009 1328580 1117900 952216 1077608 1027981 981554
5664 981554 1152272 1047933 1063407 1085016 1029076 1048549 1118153 1113156 1028651 985767 930661
5653 930661 888538 1060646 1290989 1220970 1147787 1134682 1043099 1136442 1112789 975584 1229123
5642 1229123 1361739 1119224 1050174 896905 1009766 1001366 922986 915183 960190 1143520 1155307
5631 1155307 1379872 1257304 1142262 1175501 1078351 1044702 1149530 1368057 1465630 1499509
5621 1499509 1402058 1309918 1183142 1145464 1271346 1372787 1310295 1226290 1238197 953336 1045912
5610A045912J75723J11647o7595J49452J54833J0107l0542l1141P9551J96415
5600A794362K8242Q152j2336o3944J29993N4986R7152K30966R0607K82867J1391
5589B652438Q8299K99280L45833K15215K9290K82421M97891K47369N23146N15993
5579E697175P11613N36115O52723O84293R97934J165094J412321J661229J819351
5570A5337848K431658K589550J337920j330185l359335l321355k766752j942600
5562H976749j172247q91153q28030l77764m94348m53272j39326j13118j54302
5553D353189k36843k16724J0767j64271j79682m6381q5496J72451l8779K06687
5543C774918J37667k4650K78279M56098M8645j02723l95597m87642l56601k36793
$$ plain form
5610 1045912 1221635 1333282 1265687 1415139 1569972 1580079 1549537 1518396 1597947 1794362
5600 1794362 1822604 1830756 1818420 1754476 1884469 1939455 2036607 2267573 2358180 2641047 2652438
5589 2652438 2740737 3040017 3385850 3601065 3630355 3912776 4410667 4658036 5181182 5697175
5579 5697175 6408788 6944903 7597626 8281919 9279853 10444947 11857268 13518497 15337848
5570 15337848 17769506 20359056 21696976 20366791 17007456 13686101 10919349 8976749
5562 8976749 7804502 6913349 6085319 5707555 5213207 4759935 4620609 4507491 4353189
5553 4353189 4116346 3899622 3910389 3746118 3566436 3520055 3434559 3607010 3568231 3774918
5543 3774918 3912585 3887935 4166214 4622312 4670957 4568234 4172637 3684995 3328394 3091601
5533C091601j95540j85403m5657l19783j15795M3077k05954Q3337j22945k67958
5523A758980k06000j17334L3918o6403R466J31637l3076M2992r2376l5647j97566
5512A228591R672j95970j45392N8082N0037m0542K57101j94037j76748r0771o0239
5501F99784j63559J43975J72721J0313J95415k7115Q9173j58331M1380j87455
5491H16301r9147m7705J04992K49144K5904l2631j92385Q0768n1036n358j99272
5480F49575m6872J04602j99717J31974Q0221p3692L5372p4209j7728J10306J68553
5469H68385j14200j81869m0308J45889O2003p0558M4271m1290n994j26161J14793
5458F54961P3896O3456J20280n5616j54485k05325N8893R0638J21029J49717r3574
$$ plain form
5533 3091601 2896061 2710658 2665001 2345218 2229423 2272500 2066546 2149883 2026938 1758980
5523 1758980 1552980 1435646 1469564 1403161 1412627 1544264 1511188 1554180 1461804 1426157 1228591
5512 1228591 1238263 1042293 896901 954983 1005020 964478 1221579 1027542 850794 760023 699784
5501 699784 536225 680200 852921 863234 1058649 1031534 1120707 962376 1003756 816301
5491 816301 717154 669449 774441 1023585 1049489 1016858 824473 905241 854205 848847 649575
5480 649575 602703 707305 507588 639562 719783 646091 681463 607254 589526 699832 868385
5469 868385 754185 572316 532008 677897 739900 669342 713613 672323 666329 540168 654961
5458 654961 728857 792313 912593 856977 702492 497167 556060 646698 767727 917444 823870
5447H23870M0502L4341l5367J23221j7031p0652N0892j05341j08209j60576L1451
5436F07101Q8041O441O2898k01255J12994M668J51201k42341m2703J48355j9590
5425F75810j38981j52320J38323K0112K09776k18487k80418J96465n1754p9192
5415C19334K07649J48516p6967j28929O5980O8907R0512R557o0147p2706O7049
5404F38755j11335P1244p3358k56005J68593l6037j10596l9810K61823K9923j73797
5393C69400k9230R4995K00712p2096L777j5703J80290k930j43558j00388K15367
5382G00636j73188m5387J00819j18389J0818q5640o7255J27779R048j10523J41524
5371D90242q8093q8083J95469l2543r9841J40395J42441l26461j56663L8294L32257
$$ plain form
5447 823870 864372 898713 863346 986567 969536 898884 949776 844435 736226 575650 607101
5436 607101 695142 701583 764481 563226 676220 680888 832089 589748 547045 695400 675810
5425 675810 536829 384509 522832 542944 752720 534233 253815 450280 398526 319334
5415 319334 526983 675499 598532 469603 535583 604490 695002 704559 644412 571706 638755
5404 638755 527420 598664 525306 269301 437894 401857 291261 251451 513274 543197 369400
5393 369400 340170 435165 635877 563781 567558 551855 732145 729215 585657 485269 700636
5382 700636 527448 482061 582880 464491 475309 389669 322414 450193 459241 348718 490242
5371 490242 402149 314066 509535 476992 377151 517546 659987 333526 176863 215157 547414
5360E47414j7666m4003M4876M2197r5660j51885M4654j9403m4077j8410L1751
5349C19788O1866r4589J19964M1356j24977k2606m2160J32981M5755J05033K926
5338E45337l4083P8396k27989k8394K68926J55137J15414j72093j52942k03252
5328C44457J08256O5768k5660J90595m1188K5217j87715j53732p0015K41166P964
5317E05113j62115N9143j61420K9114J14583J89474M4300p6367k04834K24201
5307E61192j0998Q041J9252j32429p4687J67187j9616J29165N3248j43860l5130
5296E21365O9004J5315L5216j16329j38918J33414n9974J68084k869n6680q635
5285E58993K83259M0971k21869j6718k65055K8249J03309K4096K64484N3937o3152
$$ plain form
5360 547414 529748 485745 530621 572818 477158 325273 369927 350524 306447 288037 319788
5349 319788 381654 287065 407029 448385 323408 300802 258642 391623 437378 542411 545337
5338 545337 511254 589650 361661 333267 602193 757330 872744 700651 547709 344457
5328 344457 452713 518481 492821 683416 642228 667445 479730 325998 255983 497149 505113
5317 505113 342998 402141 240721 269835 384418 573892 618192 541825 336991 561192
5307 561192 550194 558235 577487 445058 370371 537558 517942 647107 700355 556495 521365
5296 521365 590369 605684 640900 524571 385653 519067 459093 627177 624308 567628 558993
5285 558993 842252 883223 661354 644636 379581 407830 511139 535235 799719 853656 790504
5274G90504j39590o183J05958J74989k3830j3373J13586R8378p4949P2154R1447
5263A189091o2625J0643P4670J79011N3362J92880K48524K59803J69510J4146
5253B329015L74396O47138L76547n1991l40483m28943l91405j69190j44594j90300
5243B010190j27926j91232k5132l02570r2773J51315m27701j1669Q1261Q0119
5233A143882k79225q7288K93205k00019N3565K65457l18053k3659k2224j79668
5223F45973j43131P972o9769K58634N2011M682O2408j56598j3940k646M8476M2483
5211G36555j31402r4514o33n3765j27306P0748N1946J67049n4195j13694J02553
5200E53342o5160p7168O941Q1216j12519q7221n6680N1735J01312k4386k66056
$$ plain form
5274 790504 650914 644731 750689 925678 901848 888475 1002061 1100439 1025490 1097644 1189091
5263 1189091 1126466 1137109 1211779 1390790 1444152 1637032 1885556 2145359 2314869 2329015
5253 2329015 2703411 3350549 3727096 3675105 3334622 2905679 2514274 2345084 2200490 2010190
5243 2010190 1882264 1691032 1665900 1363330 1270557 1421872 994171 982502 1063763 1143882
5233 1143882 864657 777369 1070574 870555 924120 1189577 871524 847865 825641 645973
5223 645973 502842 510814 441045 699679 751690 756372 818780 662182 648242 645596 694072 736555
5211 736555 605153 510639 510006 456241 328935 399683 451629 618678 564483 450789 553342
5200 553342 488182 411014 417955 499171 386652 299431 242751 294486 395798 371412 105356
5189A05356K01530K44404k95622n5450Q8556q8412k8044j33338J16087J69451
5179C24518J45454r8546K27009L0043K8210j42197j88913J2012j09220n1301m0293
5168A36776M3845O4327L9099P5265l9215j22621R9940j17449J75166J8967n4833
5157C19267q3581q2488P3968p8947J78128j59363K4489K07086n8907j51143P0040
5146B58549R5640K79607j78666j91270L4698P6158l4618l4039m0063j02283k27742
5135f4029M089J45632J10498J63981l6615N2294J28696k2082k67739k0030R4925
5124B89620k2348j34375l204J69378k25n7062K5725J35738J12729Q029j75074
5113C48931r4168J19517J8315k80610P1119R4564j90821n0864J04098K41780J89468
$$ plain form
5189 105356 306886 551290 255668 200218 288774 200362 172318 38980 155067 324518
5179 324518 469972 371426 598435 628478 656688 514491 325578 337590 228370 177069 136776
5168 136776 180621 244948 284047 359312 320097 197476 297416 179967 355133 374100 319267
5157 319267 235686 153198 227166 148219 326347 166984 191473 398559 339652 188509 258549
5146 258549 354189 633796 455130 263860 298558 374716 340098 306059 265996 163713 -64029
5135 -64029 -59940 85692 196190 360171 323556 375850 504546 482464 214725 194695 289620
5124 289620 267272 132897 129693 299071 298846 241784 267509 403247 515976 524005 348931
5113 348931 254763 374280 392595 111985 183104 277668 86847 35983 140081 381861 571329
5102E71329m2632j62175j47000n2074j426J62446O3724o3345J3342K670L27709
5091F72568n4032j13323j64656j25142M6847J01570o5636o7044k14781j27282
5081a10911M5453J8673J98915K44207J16282R81L6123j63266k06486L8876J42173
5070C61020m0121j06611J22399q2578M7505o2765n7396J8997P970N343L4728l7654
5058B10837j3652L3435O9774k11233J16306K50368j78977p7140q474j0682L2639
5047B13201j8737o0657j65748J39584R5376j7219O5756k04815J16859K6518J53646
5036C43764k9412q7309q1181J07830L30910j10379j16299l1953K02512j84774
5026C43709l32358n6825j6694K51067j0238P5639k2672J06789o5130O529k14833
$$ plain form
5102 571329 528697 366522 219522 167448 166022 328468 392192 328847 342189 344859 672568
5091 672568 618536 505213 340557 215415 262262 363832 298196 231152 16371 -110911
5081 -110911 -65458 -46785 152130 396337 512619 513600 549723 386457 179971 218847 361020
5070 361020 320899 214288 336687 254109 301614 238849 181453 200450 208420 213763 248491 210837
5058 210837 197185 230620 300394 89161 205467 455835 276858 199718 191244 180562 213201
5047 213201 194464 133807 -31941 107643 203019 185800 251556 46741 163600 190118 343764
5036 343764 314352 227043 145862 253692 584602 474223 357924 325971 528483 343709
5026 343709 11351 -45474 -62168 188899 178661 254300 231628 338417 273287 279816 64983
5015F4983o1413m3489J74472K29579j35645P8512J7813K194j25543n9365J67879
5004C09977J2723j24074Q6134m9348q4800m3684k0973k9688J52480J19435N0189
4993C78371k29841K47461n2520l4598J9359J8497J3867j68861L9026O2217J7830
4982C10808j6871L5665j00471K4538k0246P0209k26378r667L88063J0490k30243
4971B35897m2604J5795K02943K8914o9388q4837Q2431J11885j24872j30837j66855
4960E8472K10799R1068K06243N0010Q3092l02314j83147K8719Q7593k7388J81609
4949D84756j4231k6054J5242m7934L1556L6904q0201M0803J42330j80860J44448
4938E46759j0825R2613r0963j17283M2566Q8401J24332o5826q1667N4828o7259
$$ plain form
5015 64983 3570 -39919 134553 364132 228487 306999 324812 327006 201463 142098 309977
5004 309977 322700 198626 284760 235412 150612 106928 85955 56267 208747 328182 378371
4993 378371 148530 395991 343471 308873 328232 346729 360596 191735 230761 292978 310808
4982 310808 293937 329602 229131 253669 233423 303632 77254 67587 455650 466140 235897
4971 235897 193293 209088 412031 440945 371557 286720 369151 481036 356164 225327 58472
4960 58472 269271 360339 566582 616592 699684 397370 214223 242942 330535 303147 484756
4949 484756 470525 444471 459713 411779 443335 480239 400038 440841 583171 402311 546759
4938 546759 535934 628547 537584 420301 462867 551268 675600 609774 528107 582935 515676
4927E15676j32569m696K12022P1421J2776j10658J0733N0615l3098j22583m5442
4916D24197J31319J69694P2978K27213O8316M4623J06618N4606j63992j46974
4906I88598j40120l21833J07036K10918j85107q3229J7888j81141Q8198J14947
4896F16155n7976p6200J00251J52779o3795r0032j9045k4574J89741J8445l03843
4885D41906l7029q5393q16J23441L40344q7050l7586P6737K42651j43164j87994
4874F46047r714J9379J19062J66639k03652j23707k36591l6196K99541J39918
4864G80726p0630j7461p4926k18949L6691J32659K34195J30812k35799n8139o5186
4853E73993q9531J68641n1367j57718J15315J39032j41001l3942k7897L8894O313
$$ plain form
4927 515676 383107 378411 590433 661854 674630 563972 574705 625320 592222 469639 424197
4916 424197 555516 725210 798188 1025401 1093717 1138340 1244958 1299564 1135572 988598
4906 988598 848478 526645 633681 844599 659492 576263 594151 413010 501208 616155
4896 616155 558179 481979 582230 735009 671214 581182 562137 537563 727304 745749 441906
4885 441906 404877 319484 318668 442109 782453 695403 657817 734554 977205 834041 646047
4874 646047 636333 655712 774774 941413 737761 614054 377463 341267 640808 780726
4864 780726 710096 692635 617709 398760 435451 568110 802305 933117 697318 639179 573993
4853 573993 484462 653103 601736 444018 559333 698365 557364 523422 495525 534419 540732
4842E40732o1222m4030M8274r1277J89654K29457J3090k22217N7187J61567K8883
4831H50098N9837k7783j51557R2953j26608K1786L0930J60926J30174j7929J18909
4820A141736j02066j66990K31702J85874j66153n8209J4830j2546k14659j77265
4810F76254R3811Q0085J43905k8189O0565K3647Q6880m9299j41113l0677J86170
4799A102039O3120r9223J20288r6229o9909R0334j07755J01667q6225N8861p5014
4788A001954m7662j45983Q3040K18421k492n7508J30485n9731Q0294P0370J77476
4777A448664j37268j46064K13911q6687j03335l5225J82824j9322k6630m0045
4767A250823j53033Q298J72857n2809j86037O7287j0554J67160P5398L6756J93294
$$ plain form
4842 540732 479510 435480 483754 392477 582131 811588 824678 602461 659648 821215 850098
4831 850098 909935 882152 730595 823548 696940 718726 749656 910582 1040756 1022827 1141736
4820 1141736 1039670 872680 1104382 1290256 1124103 1065894 1080724 1068178 853519 676254
4810 676254 770065 850150 994055 965866 1026431 1050078 1136958 1087659 946546 915869 1102039
4799 1102039 1165159 1065936 1186224 1089995 1020086 1110420 1002665 1104332 1018107 1076968 1001954
4788 1001954 954292 808309 891349 1109770 1107278 1049770 1180255 1120524 1200818 1271188 1448664
4777 1448664 1311396 1165332 1379243 1292556 1189221 1153996 1336820 1317498 1290868 1250823
4767 1250823 1097790 1106088 1278945 1226136 1040099 1107386 1096832 1263992 1339390 1376146 1569440
4756A569440O304k18291o2065O5714q8552O0900J92212J05567L7493R7714j45439
4745A620997n2322K5439K01785l121J8627k8570O6652Q5667K9653k17084m8881
4734A698842J36565L22553J21535K8109k34946J05303K71619K7775n8802j56216
4724B262337r5982K9350J40647J8166K39436J57840n6975J77846j13315K1857
4714B781207n8658m7086K49612K20098n1120J83346K5655P2216J50687J63129
4704C689086L8790L00985j81218j04736m975m2995L76926L70691k5384j69350
4694D247820K00450k0502J4021J44502L85635J42821J05003l1975M6314L13881
4684E547970k8282K27417K31679K7862L38963K22367J08046j1522L55490K41737
$$ plain form
4756 1569440 1575744 1357453 1295388 1361102 1272550 1333450 1525662 1631229 1668722 1766436 1620997
4745 1620997 1568675 1594114 1795899 1792778 1811405 1782835 1849487 1935154 1964807 1747723 1698842
4734 1698842 1835407 2157960 2279495 2307604 2072658 2177961 2449580 2477355 2418553 2262337
4724 2262337 2166355 2195705 2336352 2354518 2593954 2751794 2694819 2872665 2759350 2781207
4714 2781207 2722549 2675463 2925075 3145173 3094053 3277399 3303054 3375270 3525957 3689086
4704 3689086 3727876 4028861 3847643 3742907 3737932 3694937 4071863 4442554 4417170 4247820
4694 4247820 4448270 4427768 4441789 4586291 4971926 5114747 5219750 5187775 5234089 5547970
4684 5547970 5519688 5747105 5978784 6006646 6345609 6567976 6676022 6664500 7019990 7261727
4674G261727M17275J63709J70450K32719M30108L62827K94500K91865L23915M45868
4664A0394963J75078K68712N53982O04019M06482N21289O55565Q88862O81744
4655A5150696J104038J410758J324295J381349J592035J738769K040200K146361
4647B7888501K244859K761889L216452L310606L400408L746857L690891K560253
4639E2820716J080702p31103k721799l702804l784119l010500k460597j989038
4631C5501458j466177j183531n42459j64918k3503K07989Q19426R63313J235561
4622C5347159J775452K169089K521279K831362L380198L339152M110999M676104
4614F0150794N061444O030586O784822O944946P227374O551485M740921R66475
$$ plain form
4674 7261727 7679002 7842711 8013161 8245880 8675988 9038815 9333315 9625180 9949095 10394963
4664 10394963 10570041 10838753 11392735 11996754 12403236 12924525 13580090 14468952 15150696
4655 15150696 16254734 17665492 18989787 20371136 21963171 23701940 25742140 27888501
4647 27888501 30133360 32895249 36111701 39422307 42822715 46569572 50260463 52820716
4639 52820716 53901418 53170315 50448516 46745712 42961593 39951093 37490496 35501458
4631 35501458 34035281 32851750 32309291 32144373 32120870 32328859 33148285 34111598 35347159
4622 35347159 37122611 39291700 41812979 44644341 48024539 51363691 55474690 60150794
4614 60150794 65212238 71242824 78027646 84972592 92199966 98751451 103492372 104458847
4606A04458847l792103p710883r818902r686206q676170p086887n405668m187961
4598D8094067l225257k953881k275082j787629j158910q91187o63555l29441j50329
4589C4658796K22435N62017P09857J290834J396309J760882K235662K451573K614668
4580D7903033L014168L309210L254964K642934J107355r27152l186721m870013
4572E2247778n558039n395023m669594l774551l350983k478817k184443k070388
4564B2765940j506062j355552j651615j147015p09030o08751q16897p45764q88153
4555A3337101p84728l58408m20010m38405m82555n06278m46683l18675k19651
4546I361708l64857k06521r5667k35695k44823k82782o0441k57553l00636j16548
$$ plain form
4606 104458847 100666744 92955861 83136959 73450753 64774583 57687696 52282028 48094067
4598 48094067 44868810 41914929 39639847 37852218 36693308 35802121 35138566 34809125 34658796
4589 34658796 34881231 35443248 36153105 37443939 38840248 40601130 42836792 45288365 47903033
4580 47903033 50917201 54226411 57481375 60124309 61231664 60304512 57117791 52247778
4572 52247778 46689739 41294716 36625122 32850571 29499588 27020771 24836328 22765940
4564 22765940 21259878 19904326 18252711 17105696 16396666 15787915 14971018 14225254 13337101
4555 13337101 12552373 12193965 11773955 11335550 10852995 10346717 9900034 9581359 9361708
4546 9361708 8996851 8790330 8694663 8458968 8214145 7931363 7870922 7613369 7312733 7196185
4536G196185k30158J45925R054k65170l87401j99153r7588k02833m4146k3151
4526E901564j72212l31489l5314P2192k60510j67300j00887k09984N5342j17807
4516D633595l16503J07954j54164k09489q0038J50332j79460j67118l8859q0854
4506C665396K92517j63050k66652P5227J48961N0245o5402M3668L596j30670j60345
4495C493491K59683j13410l6122l4794k0876O226r6031j63878q4297K30031J09391
4484C549414p2132j52353K5995p6444p8554j05615J86252K78868r1787l2342n4046
4473C377256J3809L17566J54009P0040J58993J64452K233j33071l77621l68674
4463C378992k09294l41841k24895J36469j17492l28767j13740K80311j69764n2923
$$ plain form
4536 7196185 6966027 7111952 7121006 6855836 6468435 6269282 6171694 5968861 5924715 5901564
4526 5901564 5729352 5397863 5362549 5434741 5174231 5006931 4906044 4696060 4751402 4633595
4516 4633595 4317092 4425046 4270882 4061393 3981355 4131687 3952227 3785109 3746250 3665396
4506 3665396 3957913 3794863 3528211 3603438 3752399 3802644 3737242 3780910 3784506 3653836 3493491
4495 3493491 3753174 3639764 3603642 3568848 3547972 3554198 3458167 3294289 3209992 3440023 3549414
4484 3549414 3477282 3324929 3350924 3274480 3195926 3090311 3276563 3555431 3463644 3431302 3377256
4473 3377256 3391065 3708631 3862640 3932680 4091673 4256125 4258358 4125287 3747666 3378992
4463 3378992 3169698 2827857 2602962 2739431 2621939 2293172 2179432 2459743 2289979 2237056
4453B237056M9649k23813q5655j25822K3324J83438J84171k63330n7757K0739
4443A942000R9512P8835q2821q3293q8697M7340j74989J31787k1462J83581n7634
4432A974159j90768J18092K7531Q4576l3097j35405J47235n7973n9839k2255j68638
4421A683618J52252J24763k00775n0655J95733O5600m5684k33739J71723J29458
4411A992294k539j36142l45j49924j17488J13144J91964n897r2039J76736O7701
4400B037465j96844K4041J79616j27569J23189k8733j32038M3971j04893M9807
4390A868012J10766P8382M5517R9432o2299k88523R8142n7519J1645o3948J24814
4379A964421P9027r9777K48957O2571j4296n3697L8979R6708p6255R0336r8528
$$ plain form
4453 2237056 2286705 2062892 1977237 1851415 1874739 2058177 2242348 1979018 1921261 1942000
4443 1942000 2041512 2120347 2037526 1954233 1865536 1912876 1737887 1869674 1848212 2031793 1974159
4432 1974159 1783391 1901483 1929014 2013590 1980493 1845088 1992323 1934350 1874511 1852256 1683618
4421 1683618 1835870 1960633 1759858 1709203 1904936 1970536 1924852 1691113 1862836 1992294
4411 1992294 1989755 1853613 1853268 1703344 1585856 1699000 1890964 1885067 1793028 1969764 2037465
4400 2037465 1840621 1864662 2044278 1916709 2039898 2011165 1879127 1923098 1818205 1868012
4390 1868012 1978778 2057160 2102677 2202109 2139810 1851287 1949429 1891910 1903555 1839607 1964421
4379 1964421 2043448 1943671 2192628 2255199 2240903 2187206 2226185 2322893 2246638 2336974 2238446
4368B238446J89187P7509j69962J7650J65021J32731N3056j32758M0315K16340
4358B827535j59583j65268J04935N8531J91910J06000j03483o2360P661o27m5192
4347B760059J21435L955k74483j51098j7989J15581L99956J56381k63178j08900
4337B741719R1644j40645K04915P7835m6473N7587J63513r3956J5600J161K04723
4326C277623J89971P0985l9294J595R3436j28933J9390J04900n7026K04955P0919
4315C808521J091q5791m7601R7782Q5629J29759m6391J819j8166L04259J22593
4304D353504M8218N6668j45936j02750K31671J94796j47420O1832K67308k34255
4294D583636j48966j23998n1848K32874J96509R7315P6310J48653R0401j43559
$$ plain form
4368 2238446 2427633 2505142 2335180 2352830 2517851 2650582 2703638 2570880 2611195 2827535
4358 2827535 2667952 2502684 2607619 2666150 2858060 2964060 2860577 2798217 2805878 2805251 2760059
4347 2760059 2881494 2885449 2610966 2459868 2441879 2557460 2957416 3113797 2850619 2741719
4337 2741719 2833363 2692718 2897633 2975468 2928995 2986582 3150095 3056139 3071739 3072900 3277623
4326 3277623 3467594 3538579 3499285 3500880 3594316 3465383 3484773 3589673 3532647 3737602 3808521
4315 3808521 3809612 3723821 3676220 3774002 3859631 3989390 3942999 3944818 3926652 4230911 4353504
4304 4353504 4401722 4458390 4312454 4209704 4441375 4636171 4488751 4550583 4817891 4583636
4294 4583636 4434670 4310672 4258824 4491698 4688207 4785522 4861832 5010485 5100886 4957327
4284D957327J78912J68275M5011J48354K04990M5538K32634K75983J2185P5509
4274F344718K49010M5852n4655K13978j32729N2859P9929J02478K28162J73289
4264G302891r51L84198K42633l6026K1060K42030J117J65193J61655l6665L18134
4253H765269K40035J52412L02704L43939J34635K64505M19146K69049J25878L24565
4243A1342137L63562J71497L52421L50460j15464K40307L41896M387K13692M51350
4233A3716245J48734K69630K60511J47422J03147L99051M30914L07766K40888
4224A6024308L51771M56594L70213N21950P74931N49326N42386R92887Q64486
4215B1448852N52240P57254J219602Q80630J143049J046331R87630J037134J157289
$$ plain form
4284 4957327 5136239 5304514 5349525 5497879 5702869 5748407 5981041 6257024 6269209 6344718
4274 6344718 6593728 6639580 6584925 6798903 6666174 6719033 6798962 6901440 7129602 7302891
4264 7302891 7301940 7686138 7928771 7892745 7913805 8155835 8156952 8322145 8483800 8447135 8765269
4253 8765269 9005304 9157716 9460420 9804359 9938994 10203499 10622645 10891694 11017572 11342137
4243 11342137 11705699 11877196 12229617 12580077 12464613 12704920 13046816 13051203 13264895 13716245
4233 13716245 13864979 14134609 14395120 14542542 14645689 15044740 15475654 15783420 16024308
4224 16024308 16376079 16832673 17202886 17724836 18499767 19049093 19591479 20584366 21448852
4215 21448852 22001092 22758346 23977948 24858578 26001627 27047958 28035588 29072722 30230011
4206C0230011J573362J738850J581905K103653K507262K846193L216746L552495
4198D9350477L923295M245454N160798N981065P177137Q659230J0013606J0720492
4190A05231554J1444813J3180277J5581495J7862811K0594523K3214931K6828723
4183B33939127L1647119L6791428L3173251J7451609j1273441l8874123n0741680
4176B52113290m7911766l6058815k6254736j8854863j4358820j1881750r941992
4169H6850548q265526o818378n239519m326426l894693l769642l394978k993384
4161D8148002k950598k308746j773905j846327j781332j500197j184318j268470
4153C3534109j039581j073620j182668j001441r86957j044368q94707j026839
$$ plain form
4206 30230011 31803373 33542223 35124128 37227781 39735043 42581236 45797982 49350477
4198 49350477 53273772 57519226 62680024 68661089 75838226 84497456 94511062 105231554
4190 105231554 116676367 129856644 145438139 163300950 183895473 207110404 233939127
4183 233939127 265586246 302377674 335550925 353002534 341729093 302854970 252113290
4176 252113290 204201524 168142709 141887973 123033110 108674290 96792540 86850548
4169 86850548 78585022 71766644 66527125 62200699 58306006 54536364 51141386 48148002
4161 48148002 45197404 42888658 41114753 39268426 37487094 35986897 34802579 33534109
4153 33534109 32494528 31420908 30238240 29236799 28249842 27205474 26310767 25283928
4145B5283928q44068r85330p69366o65751q43496n63828o71054o67528o68503
4136A8605004o59989l88886p58641o31510k47665l69766n54971m66537j86418
4127A4340621k98902l70383n45366l70201k11906o2376k14590k75926j20489j18535
4117A1751947j69286r5534l43372k39851J55514J7326j07216K63682j51913O4610
4107A1145907k91498k38260R6972r1157j91879k74684j32828j58181j6182k56150
4097I592060j92895K2138J2654J50150p0958P7347p9248j52647J53022l4369o1176
4086I416078j35521j50766J61895m1741M1899j65554m7217J44678J06841n3685
4076I276907j57170L40794k0475l4782K46141L1724m8611J70453O646R9117K53829
$$ plain form
4145 25283928 24439860 23454530 22685164 22019413 21175917 20612089 19941035 19273507 18605004
4136 18605004 17945015 17556129 16797488 16165978 15918313 15548547 14993576 14527039 14340621
4127 14340621 14041719 13671336 13125970 12755769 12543863 12481487 12266897 11990971 11870482 11751947
4117 11751947 11582661 11487127 11143755 10903904 11059418 11076744 10969528 11233210 11081297 11145907
4107 11145907 10854409 10616149 10713121 10621964 10430085 10155401 10022573 9864392 9848210 9592060
4097 9592060 9399165 9421303 9433957 9584107 9513149 9590496 9511248 9358601 9511623 9477254 9416078
4086 9416078 9280557 9129791 9291686 9249945 9291844 9126290 9079073 9223751 9330592 9276907
4076 9276907 9119737 9460531 9440056 9405274 9651415 9683139 9634528 9804981 9811627 9910744 10164573
4065A0164573k4539P558J3538k46721M3271K63596L01723j6954k19966L91610
4055A0677689J5179m2797K90622K17523J51856k9195K65756l0878K40211L28583
4045A2084549J60656J24541K65025R8799K81191L64912J68810J68062K71079L18227
4035A4305851K68422K43869N73539O18756L60437K50319J58214L39855M68403
4026A7587665O63413O38482N45333N98722P44344P57595J011459P82794R39461
4017B4269268J062012J013177R14415J014782J271412J381439J288973J229021
4009C3444499J364623J421215J784245J788656J809180J985971K471075K463750
4001D8533214K228252K320895K634338K700947K593958K625775K763233K777840
$$ plain form
4065 10164573 10140034 10147592 10161130 9914409 9957680 10221276 10522999 10506045 10286079 10677689
4055 10677689 10692868 10650071 10940693 11158216 11310072 11280877 11546633 11515755 11755966 12084549
4045 12084549 12245205 12369746 12634771 12733570 13014761 13379673 13548483 13716545 13987624 14305851
4035 14305851 14574273 14818142 15391681 16010437 16370874 16621193 16779407 17119262 17587665
4026 17587665 18251078 18889560 19434893 20033615 20777959 21535554 22547013 23329807 24269268
4017 24269268 25331280 26344457 27258872 28273654 29545066 30926505 32215478 33444499
4009 33444499 34809122 36230337 38014582 39803238 41612418 43598389 46069464 48533214
4001 48533214 50761466 53082361 55716699 58417646 61011604 63637379 66400612 69178452
3993F9178452K802435K922466L027152L132426L010645L242227L167790L006498
3985I3490091L125128K965273K791476K778518K360880K338182K061914K121551
3977A14033013K039930K042697J871385J515560J285516J043435J061147O86246
3969A25578929K81975Q9815m03800o83984q31736j142484j167751j090897j442686
3960A19187381j312688j263896j802924k044230k251883k440605k785279k741004
3952A02544872k788009l074894l112121k692617k869648k850418k697357k407295
3944H0052513k350605k159667k209344j789837j902179j872472j715548j768690
3936F4284171j182034j346274j159098r42888j017133j293899j512370k095579
$$ plain form
3993 69178452 71980887 74903353 77930505 81062931 84073576 87315803 90483593 93490091
3985 93490091 96615219 99580492 102371968 105150486 107511366 109849548 111911462 114033013
3977 114033013 116072943 118115640 119987025 121502585 122788101 123831536 124892683 125578929
3969 125578929 125860904 125950719 125546919 124862935 124031199 122888715 121720964 120630067 119187381
3960 119187381 117874693 116610797 114807873 112763643 110511760 108071155 105285876 102544872
3952 102544872 99756863 96681969 93569848 90877231 88007583 85157165 82459808 80052513
3944 80052513 77701908 75542241 73332897 71543060 69640881 67768409 66052861 64284171
3936 64284171 63102137 61755863 60596765 59653877 58636744 57342845 55830475 53734896
3928E3734896k104071k011582k017942j469512j228625j192596r42003p16565
3920D2052000l03416k26762P9031M10476K20054L20710N23692R88017J265418
3911D5329220J629503J992729K252742K359111K643922K968699K966585K445346
3903F4587857J616517P32463m44487j395323j871614k519265k845732k889323
3895E4971093k564802k207071j677260j016554n88879l88565l01362j945M90085
3886D6714740O69937J001156J386487J834110J875953K382043K813326L098291
3878F1776043L369011L559573L401172L198155K632984J281746K33350j400535
3870G8051499k891478m118153m370337m354744m283069l713838l295040k745468
$$ plain form
3928 53734896 51630825 49619243 47601301 46131789 44903164 43710568 42768565 42052000
3920 42052000 41748584 41521822 41600853 42011329 42231383 42552093 43075785 44063802 45329220
3911 45329220 46958723 48951452 51204194 53563305 56207227 59175926 62142511 64587857
3903 64587857 66204374 66936837 66492350 65097027 63225413 60706148 57860416 54971093
3895 54971093 52406291 50199220 48521960 47505406 46916527 46527962 46226600 46224655 46714740
3886 46714740 47384677 48385833 49772320 51606430 53482383 55864426 58677752 61776043
3878 61776043 65145054 68704627 72105799 75303954 77936938 79218684 79452034 78051499
3870 78051499 75160021 71041868 66671531 62316787 58033718 54319880 51024840 48279372
3862D8279372k233902j872455j196024q91258q87331m10899j48015J89582O24557
3853D1453627O81192Q49489J233592J440806J660854K023591J988726K009496
3845E3341373J306024Q18277m0208r35984j672188k231642k730316k746722l370000
3836D1738614l041752k602172k432182k027892j579517j286178j169980j022352
3828B6576589r89570q14900p27481o30245j60111k09109k1559m8717j29295J01132
3818B2946734P3577Q2296K41005Q6456q5845j27912m77177r22744j160268j455778
3808A9200344j274068r19940r51155o19251q39981n20014k79258n88934m45847
3799A2761896j60779n58299k50556k45009j36254p3162k57378m25284j68876j44467
$$ plain form
3862 48279372 46045470 44173015 42976991 42085733 41198402 40787503 40639488 40829070 41453627
3853 41453627 42134819 42984308 44217900 45658706 47319560 49343151 51331877 53341373
3845 53341373 54647397 55465674 55425466 54489482 52817294 50585652 47855336 45108614 41738614
3836 41738614 38696862 36094690 33662508 31634616 30055099 28768921 27598941 26576589
3828 26576589 25587019 24772119 24044638 23414393 23254282 23045173 23023614 22974897 22845602 22946734
3818 22946734 23020311 23102607 23343612 23430068 23344223 23216311 22739134 21816390 20656122 19200344
3808 19200344 17926276 17006336 16055181 15435930 14595949 14075935 13796677 13207743 12761896
3799 12761896 12601117 12042818 11792262 11547253 11410999 11337837 11080459 10655175 10486299 10341832
3789A0341832j49358j14648k21117j2248k50103j76321j14534R0929j29174k17017
3779I048241K50380P1599M9731l04707l0718O6885q6195L6408j99382P1968m6815
3768H927395j85163K66397K16386l14195j47O0049j84945M6586J4406j3355R5112
3757H928526p6374j36033P2219J02662J401L2493q3964J06122J37715J59334R3545
3746I337646k79604J1362l3294J9377L5860J86242k0319L2764O3367J8361k1097
3735I350665O2982l7877J43388J92381J01625N1187K43426l5297l6092J25032
3725A0161420L04640L73071M1617k2618J57571K39672K08862M6621Q3965k0182
3715A1574639J48413P7445J40651R4572J88655K42049J69951J04094J52103L070
$$ plain form
3789 10341832 10192474 10077826 9856709 9844461 9594358 9418037 9303503 9394432 9265258 9048241
3779 9048241 9298621 9370220 9419951 9115244 9084526 9151411 9065216 9101624 8902242 8974210 8927395
3768 8927395 8742232 9008629 9225015 8910820 8910673 8970722 8785777 8832363 8846769 8833414 8928526
3757 8928526 8852152 8716119 8788338 8891000 8892401 8924894 8840930 8947052 9084767 9244101 9337646
3746 9337646 9058042 9069404 9036110 9055487 9091347 9277589 9257270 9290034 9353401 9371762 9350665
3735 9350665 9413647 9375770 9519158 9711539 9813164 9864351 10107777 10072480 10036388 10161420
3725 10161420 10466060 10839131 10880748 10858130 11015701 11255373 11464235 11510856 11594821 11574639
3715 11574639 11723052 11800497 11941148 12035720 12224375 12466424 12636375 12740469 12892572 12895642
3705A2895642K84208M20513J71075L2061K54578M09614L07502J26876M66678M92098
3695A5860845J41646M60884L17057L88908K31566N64803N86118O59103K47518
3686A9458448M70562P60889L80586P84204Q41391O61656P68646P04698J210436
3677B6041516J095146J272125J113152J353449J520055J488205J337579J443849
3669C6665076J128487J466951J237047J418379J538830J078018J351809J221065
3661D7105662J100699R01695J206901J176707Q29547Q84314Q10160P54119N42876
3652E5312680M22143m4546j25362m832n2583P729k41660k1866r3893r2988Q4999
3641E5149821j00154J71962q6819M46525J91667L82505M45783N26832Q15566P94541
$$ plain form
3705 12895642 13179850 13600363 13771438 13803499 14058077 14467691 14775193 14902069 15368747 15860845
3695 15860845 16002491 16463375 16780432 17169340 17400906 17965709 18551827 19210930 19458448
3686 19458448 19929010 20689899 21070485 21854689 22696080 23357736 24126382 24831080 26041516
3677 26041516 27136662 28408787 29521939 30875388 32395443 33883648 35221227 36665076
3669 36665076 37793563 39260514 40497561 41915940 43454770 44532788 45884597 47105662
3661 47105662 48206361 49108056 50314957 51491664 52321211 53205525 54015685 54769804 55312680
3652 55312680 55734823 55690277 55564915 55560083 55507500 55515229 55273569 55251703 55157810 55064822 55149821
3641 55149821 55049667 55221629 55134810 55581335 55773002 56155507 56601290 57128122 57943688 58738229
3631E8738229J069331J387688J308082J618271J742156J974772K710320K673820
3623G3222669L137131L533554L535588L939156M385037M372633M611852M892978
3615A05630598M846276M768742M923771M524966M429182M198216M043382M156518
3607A41521651M259896M138946M155036M161111M344494M025155L613614L365392
3599A73585295K829306K271061J821451J250182Q55707L60911O43212L61214L67319
3590A84345658N82548P51986J061834J035810J493987J665718J649416K013501
3582A94600458J766952J838897J878341J875453J799299J716018J890810J895014
3574B09261242K200443K491892L006049L638622L929131M478676N146298N600158
$$ plain form
3631 58738229 59807560 61195248 62503330 64121601 65863757 67838529 70548849 73222669
3623 73222669 76359800 79893354 83428942 87368098 91753135 96125768 100737620 105630598
3615 105630598 110476874 115245616 120169387 124694353 129123535 133321751 137365133 141521651
3607 141521651 145781547 149920493 154075529 158236640 162581134 166606289 170219903 173585295
3599 173585295 176414601 178685662 180507113 181757295 182613002 182973913 183617125 183978339 184345658
3590 184345658 184928206 185680192 186742026 187777836 189271823 190937541 192586957 194600458
3582 194600458 196367410 198206307 200084648 201960101 203759400 205475418 207366228 209261242
3574 209261242 211461685 213953577 216959626 220598248 224527379 229006055 234152353 239752511
3566B39752511N900281O343494O771242P068765P491842Q379099Q935709R949814
3558C00592757J0807597J1864480J3079647J3976288J4477783J5267047J5019651
3551C95085250J3856439J1633075Q742893N140360J521003k099235m652733o168848
3543D23058204o862461o559709o413245n537762n164001n105054n807187p107157
3535C74501628r097120j1590144j4442669j7142455j8758081j9907493k0153887
3528B63409779j9876582j8633796j6662014j4840899j2895725j1253001r756168
3521A59491594q537507p438882o499336n768366n157691m338433m174956l733219
3513A13843204l256197k819775k979968k615797k469047k423064k613808k671246
$$ plain form
3566 239752511 245652792 251996286 258767528 265836293 273328135 281707234 290642943 300592757
3558 300592757 311400354 323264834 336344481 350320769 364798552 380065599 395085250
3551 395085250 408941689 420574764 429317657 434458017 435979020 433879785 429227052 423058204
3543 423058204 416195743 409636034 403222789 397685027 392521026 387415972 381608785 374501628
3535 374501628 365404508 353814364 339371695 322229240 303471159 283563666 263409779
3528 263409779 243533197 224899401 208237387 193396488 180500763 169247762 159491594
3521 159491594 150954087 143515205 137015869 131247503 126089812 121751379 117576423 113843204
3513 113843204 110587007 107767232 104787264 102171467 99702420 97279356 94665548 91994302
3505I1994302k808479k565302k644011k602352k573191k419338k459281k444202
3497G1478146k104811k111934k131393k068281j933867k186919j897172j878951
3489E5164818j964244j854567j909160j730929j470136j680829j623456j370370
3481D1561127j384180j250479j041517j058202j024021p90151q12297q98302n59643
3472C2742335q07679m52547n78558q77668m73599p08451o02679m44249k91149
3463B7505756l96950m84219n47813m25696n01868l05500l80893l98361l91392
3454B3673064k99676j97489k93778k45267l02822k44349m52588j28335l57063
3445B1151697k5066j04885l39192l04726j97574l05588j53707p7577k91951j08495
$$ plain form
3505 91994302 89185823 86620521 83976510 81374158 78800967 76381629 73922348 71478146
3497 71478146 69373335 67261401 65130008 63061727 61127860 58940941 57043769 55164818
3489 55164818 53200574 51346007 49436847 47705918 46235782 44554953 42931497 41561127
3481 41561127 40176947 38926468 37884951 36826749 35802728 35012577 34200280 33301978 32742335
3472 32742335 31934656 31482109 30903551 30025883 29552284 28843833 28241154 27796905 27505756
3463 27505756 27108806 26624587 26076774 25651078 25149210 24843710 24462817 24064456 23673064
3454 23673064 23373388 23175899 22882121 22636854 22334032 22089683 21637095 21508760 21151697
3445 21151697 21126631 21021746 20682554 20377828 20180254 19874666 19720959 19643382 19351431 19242936
3435A9242936j83755q553m1564j57677k06660j31883j28316j32987r8537j092
3425A8151912k25190j23108q692k7944j58486K8324J55647j03545k73918L5990
3415A7450990Q1400j71784j96919j6746O9972m8325o7022j28731m3264o0712m3744
3404A6825115p1005k1850k36021k1903J85346L09700J10880k07841J11008k4194
3394A6959235k19625r0379N2411l4940p3316K705j13871K40535Q1017L2988j22664
3383A6714096J79078L093k85652o1416J00930o9024j51180Q5668l7720Q2894N78
3372A6561345K11505o5697j05062l1257l2066N0270r9676J44750J35017N2308
3362A6821437j80290j45861M5422p4278P6514M7647j29592m9508K468j85120j6813
$$ plain form
3435 19242936 19059181 19050628 19009064 18851387 18644727 18512844 18384528 18251541 18153004 18151912
3425 18151912 17926722 17803614 17794922 17766978 17608492 17636816 17792463 17688918 17415000 17450990
3415 17450990 17532390 17360606 17163687 17146941 17216913 17168588 17101566 16972835 16929571 16868859 16825115
3404 16825115 16754110 16732260 16496239 16474336 16659682 16969382 17080262 16872421 16983429 16959235
3394 16959235 16739610 16649231 16701642 16666702 16593386 16596091 16482220 16722755 16803772 16836760 16714096
3383 16714096 16893174 16896267 16610615 16549199 16650129 16581105 16429925 16515593 16477873 16560767 16561345
3372 16561345 16772850 16707153 16602091 16570834 16538768 16589038 16489362 16634112 16769129 16821437
3362 16821437 16641147 16495286 16540708 16466430 16542944 16590591 16460999 16411491 16413959 16228839 16212026
3351A6212026J96399j00009j72323K17848l9339M7070j83081j69835j59412n980
3341A5843364k1480M6758J24748L4139M0390l93476j08045P0156K6842j04091
3331A5559305j06635m9340O1517n6356j28188j86052K25659m1721k54661m065
3321A5019463L0326j19127o6821J7123q1420p2450k9727O6895j03985n8191p8397
3310A4523689o955P1693k35374J44913m705j57341j92270O8226k6418K3037p1309
3299A4137186j86240l17355j43930n7657j59531K84828j65707j15903n05529p0270
3289A2699892M0602J61459r1248k81218n3282m801J77940k9215k66141j45280
3279A2208708m0841J78233O1282p0365l8340M3277O2863j73577r8855J84031J64326
$$ plain form
3351 16212026 16408425 16308416 16136093 16353941 16314602 16361672 16178591 16008756 15849344 15843364
3341 15843364 15821884 15868642 15993390 16027529 16067919 15674443 15566398 15636554 15663396 15559305
3331 15559305 15452670 15403330 15464847 15408491 15280303 15094251 15319910 15278189 15023528 15019463
3321 15019463 15049789 14930662 14863841 14880964 14799544 14727094 14697367 14764262 14660277 14602086 14523689
3310 14523689 14516734 14588427 14353053 14497966 14493261 14335920 14143650 14211876 14185458 14208495 14137186
3299 14137186 13950946 13633591 13489661 13432004 13272473 13557301 13391594 13275691 12770162 12699892
3289 12699892 12740494 12901953 12810705 12529487 12476205 12471404 12649344 12620129 12353988 12208708
3279 12208708 12167867 12346100 12407382 12337017 12298677 12341954 12404817 12231240 12132385 12316416 12480742
3268A2480742o3721K21134j5151q9445J21336O0108J05837j05747J46773J27750
3258A2989616p9706k43101j30936O8627j54154k99267l37374j41816l59201l03644
3248A1009044l45889j04577j22089k04595j01386k51967k24569k88210k30808
3239I134954j07242l090j02489j77961k46137O9471m6446k02143m6359q693r3984
3228H169881k63915r3494j42822j17356k32609K7785j09925j26085K6728j8530
3218G119658L221j1291k37307k20525k4702k65567q5165p0184j02358J49527k20609
3207F034698j11132m0702j35163L6543J03403l2885j15976r5918R6810L8795L1280
3196E809753j45794o4701q1588j10798L9230q3007J7422k4242j44158j28904j06835
$$ plain form
3268 12480742 12417021 12638155 12623004 12533559 12654895 12715003 12820840 12715093 12861866 12989616
3258 12989616 12909910 12666809 12535873 12604500 12450346 12151079 11813705 11671889 11312688 11009044
3248 11009044 10663155 10558578 10436489 10231894 10130508 9878541 9653972 9365762 9134954
3239 9134954 9027712 9024622 8922133 8744172 8498035 8567506 8521060 8318917 8272558 8263865 8169881
3228 8169881 7905966 7812472 7669650 7552294 7319685 7347470 7237545 7111460 7138188 7119658
3218 7119658 7122879 7111588 6874281 6653756 6629054 6363487 6278322 6208138 6105780 6255307 6034698
3207 6034698 5923566 5882864 5747701 5784244 5887647 5854762 5738786 5642868 5739678 5778473 5809753
3196 5809753 5663959 5599258 5517670 5406872 5446102 5363095 5380517 5356275 5212117 5083213 4976378
3185D976378o9303j83795k07856k612Q217j5462l6307q7741p2926j2955l5673
3174D259965q3889k61907K8733J73915M0447r5941j39233k9046O2826l8789q3700
3163C833381p7126J25185k0045j79291k8593k9424k2501J39822k85355l3648J8030
3152C440435J08994p7401q1279L5011M0842j08063j10113J4285n5929N656j53825
3141C058613j29191m980L9623J26646K19210m402k39166l0861O5187q3593R12
3130C017998J62014m7679p4328L0599k1418Q1038p8505j85892J70568j23648M6350
3119B977097j92074r2430R5847j98649J81325n4217r7808j14019n425K05790P3506
3108B778943k093j39906j96576j5666l2872j01373O8657N0678m7140J2349q0950
$$ plain form
3185 4976378 4907075 4723280 4515424 4512812 4521029 4505567 4469260 4381519 4308593 4295638 4259965
3174 4259965 4176076 3914169 3942902 4116817 4157264 4061323 3922090 3893044 3955870 3917081 3833381
3163 3833381 3756255 3881440 3861395 3682104 3653511 3624087 3601586 3741408 3456053 3422405 3440435
3152 3440435 3549429 3472028 3390749 3425760 3466602 3358539 3248426 3262711 3206782 3212438 3058613
3141 3058613 2929422 2924442 2964065 3090711 3309921 3305519 3066353 3035492 3100679 3017086 3017998
3130 3017998 3180012 3132333 3058005 3088604 3067186 3148224 3069719 2883827 3054395 2930747 2977097
3119 2977097 2785023 2692593 2788440 2589791 2771116 2716899 2619091 2505072 2499647 2705437 2778943
3108 2778943 2776850 2636944 2440368 2424702 2391830 2290457 2359114 2409792 2362652 2375001 2294051
3097B294051J07884P6513K21279k62099l45341J16654j41093j30429K14320m25
3087B151314l1143p8635j03728l39244l1650J68067J5936J8352o3154J86924m2822
3076A850217k13036Q0636l4423J31175P4025L964K0053m7551J82429o2055n22152
3065A463282J13709J13312n5096J8937o8161j6947k06806j3575O9460J89689N6983
3054A664787k13550k1525N1116J67784K5589J3684j58696J9737j1765j16465q6635
3043A334061m8341j27735L9586N8857J15676j77056m4387J60834N215q6016p6482
3032A154212K92396j31343r0688J7233j62223j04672J01931J32387J64389K6571
3022A400193q5972J0740j54484n7526K52311L2796o7412L8978J2573j28396J87599
$$ plain form
3097 2294051 2401935 2478448 2699727 2437628 2092287 2208941 2067848 1937419 2151739 2151314
3087 2151314 2120171 2041536 1937808 1598564 1566914 1734981 1750917 1769269 1706115 1893039 1850217
3076 1850217 1637181 1717817 1683394 1814569 1888594 1892558 1912611 1865060 2047489 1985434 1463282
3065 1463282 1576991 1690303 1635207 1654144 1585983 1569036 1362230 1348655 1418115 1607804 1664787
3054 1664787 1451237 1429712 1480828 1648612 1674201 1687885 1529189 1548926 1537161 1420696 1334061
3043 1334061 1285720 1157985 1197571 1256428 1372104 1195048 1150661 1311495 1316710 1230694 1154212
3032 1154212 1446608 1315265 1224577 1241810 1079587 974915 1076846 1209233 1373622 1400193
3022 1400193 1314221 1324961 1170477 1112951 1365262 1398058 1330646 1369624 1382197 1253801 1441400
3011A441400n0144q9397j7808M0261r7758Q3112J18649k47011n7970J84861k6838
3000A281357K56386o451k11249J06847L0125j19612j09074O4025M3890j56860
2990A179384o9127N9920J09648L3943R1096N212O5966J78732m2311l1219J76705
2979A757949j28204j31952J37187p7499J30013q6214j69693j12316j26433J29164
2969A322002j30617J25359J4319q5947l348j4752r094j0211j0871K9985M0793
2958A267618j65459J29030l0801K7159J21529j88293P0109J7955k68523K11352
2948A191676R2091J633j61592Q0372K10963J8775p8523m8605k32062k1885K00243
2937A253086l3924N0886j28360j96692K7113J98763j30806Q7547J4947J6476p6791
$$ plain form
3011 1441400 1391256 1301859 1284051 1324312 1226554 1309666 1428315 1181304 1123334 1308195 1281357
3000 1281357 1537743 1531292 1320043 1426890 1457015 1337403 1228329 1292354 1336244 1179384
2990 1179384 1110257 1170177 1279825 1313768 1404864 1410076 1476042 1654774 1612463 1581244 1757949
2979 1757949 1629745 1497793 1634980 1557481 1687494 1601280 1431587 1319271 1192838 1322002
2969 1322002 1191385 1316744 1331063 1245116 1241768 1227016 1217922 1207711 1196840 1226825 1267618
2958 1267618 1102159 1231189 1200388 1227547 1349076 1160783 1230892 1248847 980324 1191676
2948 1191676 1283767 1285400 1123808 1204180 1415143 1433918 1355395 1306790 1074728 1052843 1253086
2937 1253086 1219162 1270048 1141688 944996 972109 1170872 1040066 1127613 1142560 1159036 1082245
2926A082245K6109O8933J01156m4066j81261q9357J23284p6424L2754J21640N4907
2915A219920r5956k01487J1782Q3439K9084j15152j05483p5307J87763P7073L2793
2904A048469l4388m1284j99413N8050J96820Q2780j19804j37858J41883j14346
2894H80909j20830J20377P1698O1913j27181J6837j02014j8738p5737K4530l4417
2883F97347K5276p0772L5547J396J09691O089l2051J6718k01681K213q5137Q1997
2871E86633J16380N5490j02377j72552P80J47753j16997k6774j72036j3567J82756
2860D85489J35508L8745J9118M0645j03737n213J32370j58824j48752J00043m4619
2849D90773J58889k56968j79837J01879N790N9656J6438K27362j64720j36119
$$ plain form
2926 1082245 1108354 1177287 1278443 1234377 1053116 963759 1087043 1010619 1043373 1165013 1219920
2915 1219920 1123964 922477 934259 1017698 1046782 931630 826147 750840 938603 1015676 1048469
2904 1048469 1014081 972797 773384 831434 1028254 1111034 991230 853372 995255 880909
2894 880909 760079 880456 952154 1014067 886886 903723 801709 782971 707234 731764 697347
2883 697347 722623 651851 687398 688794 798485 804574 772523 789241 587560 589773 504636 586633
2871 586633 703013 758503 656126 483574 484354 632107 515110 488336 316300 302733 485489
2860 485489 620997 659742 678860 719505 615768 610555 742925 584101 435349 535392 490773
2849 490773 649662 392694 212857 314736 320526 380182 396620 623982 459262 323143
2839C23143J82370K9320j83028J67916j58761q7302J72355m1793J23216k44005
2829B83431J30312j85061P0178J78648r6487J562K6064K4612j1739j00629o4157
2818B56734k6732J36844Q8995m629J09831q6601j08070R9475j79259j06215K75029
2807D55402j08634J333O0284J01758j67814j1384j3533k61804K50839K05660J7139
2796E29246L2395j26620j22849J22424j27160j14785o3850J13065J7672r4586
2786A64952m8707J47038j05631q1504R1778j50279R0590K2604J39905j58076R3557
2775B06227k07778j17108Q9685K8987L0643j78949J9185K44766R7735j35948J18139
2764A95584R2733j7948K4242R258P8111j42452k12682p5989j04080j01960J17707
$$ plain form
2839 323143 505513 534833 351805 519721 360960 273658 446013 404220 527436 283431
2829 283431 413743 228682 298860 477508 381021 382583 408647 433259 421520 320891 256734
2818 256734 230002 366846 455841 451212 561043 474442 366372 465847 286588 180373 455402
2807 455402 346768 348101 408385 510143 342329 330945 317412 55608 306447 512107 529246
2796 529246 561641 435021 312172 434596 307436 192651 128801 241866 259538 164952
2786 164952 116245 263283 157652 76148 167926 17647 108237 130841 270746 112670 206227
2775 206227 -1551 -118659 -28974 13 30656 -148293 -129108 115658 213393 77445 195584
2764 195584 288317 270369 294611 303869 381980 239528 26846 -49143 -153223 -255183 -137476
2753a37476J42356J12478j22753l1775J23423m8909L590j18185N1663R5513o5870
2742D055J06617j00089J99293J30166k31968k48618J16743j616k8502J81125r2465
2731C4741l6881k2299l3394p6139M339p2562K74284N8846r1131J23146q2087k5707
2719E5156J81530m2492l04519j06491l9140l79O2477J500J39519K71671J04582
2708C23414o2463m9475j08214j93874J20254J34472R6523k85755j02328J45836
2698A8390j31853Q6089J27693P3610L5361M107n9081j10200m3256O4358M1283
2687A06501j2177J10056Q4272j84276R4445L0573J55918K5030o1911J05579j23982
2676C30028l6439j72804J55222o5392l6631J06083O2812k15k34098m7031n0160
$$ plain form
2753 -137476 4880 117358 -5395 -37170 86253 37344 40934 -77251 -25588 69925 4055
2742 4055 110672 10583 209876 340042 108074 -140544 -23801 -25417 -53919 127206 34741
2731 34741 -2140 -24439 -57833 -133972 -129633 -202195 72089 130935 39804 162950 80863 55156
2719 55156 236686 194194 -110325 -216816 -255956 -256335 -193858 -192358 -52839 218832 323414
2708 323414 260951 211476 103262 -90612 29642 164114 260637 -25118 -127446 18390
2698 18390 -113463 -27374 100319 173929 209290 213397 154316 44116 860 65218 106501
2687 106501 94324 204380 288652 104376 198821 229394 385312 410342 348431 454010 330028
2676 330028 293589 120785 276007 210615 173984 280067 342879 342664 108566 61535 11375
2665A1375J22059Q2182J12650j31553j5496n7139k1382L5232j11318J02423J2772
2654A41805J38471J01255l3610J11689r0821k26062L9412q9352M135J42756J6259
2643B55937K0251j24028k2997N7426q5221K2381K22567o1373l7823K18562j37857
2632C27825M1994j34581m8274J02989k5414J81863q1060j86655j52277J80137
2622B06547j00856J9480j5888k9685q368r924J7507n660J68761R4077j09362p8027
2610A48602J25016q0239j38096R7585N1720Q0570K04576l8146q64r805O8309K6498
2598E35726k43446k8821j36587J7933O4745n8988J56363k6657q3561N3088M6154
2587B95949j91128k0723l4085j8813K34388K2488j65325N2169J14640m3255l7351
$$ plain form
2665 11375 133434 215616 328266 196713 181217 124078 102696 137928 26610 129033 141805
2654 141805 280276 381531 347921 459610 368789 142727 182139 92787 96922 239678 255937
2643 255937 276188 152160 129163 186589 101368 123749 346316 284943 247120 465682 327825
2632 327825 369819 235238 186964 289953 264539 446402 365342 178687 26410 206547
2622 206547 105691 125171 109283 79598 71230 61306 78813 73153 241914 335991 226629 148602
2610 148602 273618 193379 55283 152868 204588 285158 489734 451588 450724 440919 509228 535726
2598 535726 292280 263459 126872 144805 209550 150562 306925 280268 196707 249795 295949
2587 295949 104821 84098 50013 31200 265588 288076 122751 174920 289560 246305 208954
2576B08954p7985l0734J36047K0697M3877P5238l44039r6539K29776Q5704O673
2565B57669m6678K5466O7473Q8130k24620j20926q298q5977P9817j40268K22119
2554A13907K0013j34722p1111N3969k5133J04342P758K9118J4981n2857J71454
2543B31719k06315j70034R4080L1369J36369J00254k16863J06802p9943k559j4455
2532A0424K29333o778p9033q0761K08583j37473l23070J26065L8881L7717j15951
2521i2063m2401k4725M0475J0214k3488J01524J92649j9617o5289m7529n7581
2510b7831o7565j5457k8075J37175o2487N971L3374N2590J42244j77614k38066
2499b45741O9315L59826n0904j51073N5691J15704j48135m1715k4181J3505m4112
$$ plain form
2576 208954 130969 100235 236282 256979 300856 376094 32055 -64484 165292 250996 257669
2565 257669 210991 236457 303930 392060 167440 46514 38216 -47761 32056 -108212 113907
2554 113907 133920 -802 -71913 -17944 -43077 61265 69023 98141 113122 60265 231719
2543 231719 25404 -144630 -50550 -19181 117188 217442 579 107381 27438 24879 10424
2532 10424 239757 232979 153946 73185 281768 144295 -178775 -52710 -13829 23888 -92063
2521 -92063 -134464 -159189 -118714 -108500 -131988 -30464 162185 142568 77279 29750 -27831
2510 -27831 -95396 -110853 -138928 -1753 -64240 -58269 -24895 27695 169939 -7675 -245741
2499 -245741 -176426 183400 132496 -18577 37114 152818 4683 -37032 -61213 -47708 -91820
2488i1820j40105J55034J04099o7449m7363O3650J05588L9131M8912j15480m5125
2477I072L9226j11012r5069j8253l8355J57537K45688j13451o852L0909j19260
2466a9820J6600o2199R2843k23060m5318Q0410q654k22947J05406J45427O5906
2455g5406O0039r6757j05526k5304J38374L4888K12222L3335k96950n5067L68576
2444A92424j50526J4583M1800k89127R2626J59941k8448l5232J3666P5717K5188
2433A12612Q2494j49281R688n6892j21753O6317Q960j33379K35374j004O491J41229
2421B00856k26907M7004q0527n1013K48172J07651k17284j14472J16450J70789
2411B00719P5155j71400J0107k24089k261R5240n2648J25775j01671l8719N716
$$ plain form
2488 -91820 -231925 -76891 27208 -40241 -87604 -23954 81634 120765 169677 54197 9072
2477 9072 48298 -62714 -157783 -176036 -214391 -56854 188834 75383 68531 99440 -19820
2466 -19820 -3220 -65419 27424 -195636 -240954 -160544 -169198 -392145 -286739 -141312 -75406
2455 -75406 -15367 -112124 -217650 -242954 -104580 -69692 142530 175865 -121085 -176152 192424
2444 192424 41898 56481 98281 -190846 -98220 61721 33273 -1959 11707 87424 112612
2433 112612 195106 45825 55513 -1379 -123132 -56815 -47855 -181234 54140 53136 59627 200856
2421 200856 -26051 20953 -59574 -110587 137585 245236 27952 -86520 29930 200719
2411 200719 275874 104474 114581 -109508 -111769 -16529 -69177 56598 -45073 -83792 -78076
2400g8076J46791l607Q2662J85980j83710M2175o4106p0595J22061J38937L1879
2389C50391J08969j92725K4891L07737k79965Q8667l2680n0625J60885k36388
2379B49157L2019p0394o1319J16427K426l8450o0472j28399M952r6518j26389
2368a76960R7593J86067N4569k14280p0874J0006k03151L0269K14119m8243O1010
2357e9875P2066j14187K9611J37123L3431P2464q214m4990q9946r6887k5200J34476
2345C9872K91366O6585j4491j30293j08520r2597p3002J19085K998j0971k311
2334H7721j28785k6020K49348n3871k70855M4585K91093p0222N0762M8849j8991
2323B03614m7623k06690O0291J50796M0266M289K32389M1639j44145j79411j5562
$$ plain form
2400 -78076 68715 65108 147770 333750 150040 192215 128109 57514 179575 318512 350391
2389 350391 459360 266635 291526 599263 319298 407965 375285 324660 485545 249157
2379 249157 281176 210782 149463 265890 268316 229866 169394 40995 45947 -50571 -176960
2368 -176960 -79367 106700 161269 -53011 -123885 -113879 -317030 -286761 -72642 -120885 -59875
2357 -59875 12191 -101996 -72385 64738 98169 170633 162419 117429 27483 -69404 -94604 39872
2345 39872 331238 397823 383332 253039 144519 51922 -21080 98005 101003 90032 87721
2334 87721 -41064 -67084 182264 128393 -142462 -97877 193216 122994 173756 222605 203614
2323 203614 155991 -50699 9592 160388 200654 204943 437332 478971 334826 155415 139853
2312A39853k5031J68222Q6950l2297k91521m064k3500k9952L0465q3938J2325
2301e2488J97895Q6071k163J2649o2827j63525J45769n1415n1407J26803J18734
2290C04096O0429r7714k7887q3177R0315l817K91427k18746k2958P7161j25054
2279B44075Q433N901O4255j25871k5915J62860j24379j51370J61403R1786j69691
2268A41487R5883O3999O8682k55845J74857J26683q2032k2879J53182L8241p223
2257D95035k02007K97l8128N1965k02045J47609j1767K10550J34165p1768O6255
2246E80161l54408K01368r805K3857R6741J10551j82950j67804R1292M1858J3740
2235D44601j49699J735l7991J98586n6685p8678J40906R4061J50346l5085r9915
$$ plain form
2312 139853 114822 283044 369994 337697 46176 42112 18612 -11340 19125 -64813 -52488
2301 -52488 145407 231478 229315 241964 179137 15612 161381 109966 58559 185362 304096
2290 304096 364525 266811 238924 155747 246062 242245 533672 314926 291968 369129 244075
2279 244075 252508 258409 322664 196793 170878 333738 209359 57989 219392 311178 141487
2268 141487 237370 301369 370051 114206 289063 415746 333714 310835 464017 502258 495035
2257 495035 293028 293325 255197 307162 105117 252726 240959 451509 585674 513906 580161
2246 580161 225753 427121 417316 441173 537914 648465 465515 297711 389003 430861 444601
2235 444601 294902 296637 258646 457232 400547 321869 462775 556836 707182 672097 572182
2224E72182n752J33543J19411m0078Q9533q583j2886P2349m9790J0249l1857K00522
2212A048843r8896q1663p639J77090j11669P8043R8708J21693R2860J59726J7104
2201A494200m5047n9367J66405J33572o5241R0744n9895J77948K77304j21235
2191A989388l9951K18472k0948P2275k21038k5756J08141L45117J82031k68731
2181B339000J23184J80947J3633n4485P0955K48347O6283P5991L85n6022J01549
2170C109767J29633n5970K9386K74585O729R1844j17585K43512K20239L06135
2160D238275J6057K18852J31152M1564K40248K40346n4576J66335J35376K06247
2150E579876M92192M35882J90556L60566N21699M20054J83810J83725L98668Q42229
$$ plain form
2224 572182 566430 699973 819384 779306 868839 860256 847370 919719 869929 880178 848321 1048843
2212 1048843 949947 868284 860645 1037735 926066 1004109 1102817 1224510 1317370 1477096 1494200
2201 1494200 1449153 1389786 1556191 1689763 1624522 1715266 1655371 1833319 2110623 1989388
2191 1989388 1949437 2167909 2146961 2219236 1998198 1972442 2080583 2425700 2607731 2339000
2181 2339000 2462184 2643131 2656764 2602279 2673234 2921581 2987864 3063855 3064240 3008218 3109767
2170 3109767 3239400 3183430 3212816 3487401 3494130 3585974 3468389 3711901 3932140 4238275
2160 4238275 4254332 4473184 4604336 4645900 4886148 5126494 5071918 5238253 5373629 5579876
2150 5579876 6072068 6507950 6698506 7059072 7580771 8000825 8184635 8368360 8767028 9609257
2140I609257R02103Q53357J024406J096296P88883J320637J682820J803926J576553
2131B0658238K130652K167421K694197K912821L471569L992945N090167N814130
2123D8932140O407509P073533R007786J0625761J4601404J1884299j019921j3896580
2115I3615931k1531417j5561445j0611111p348384n212524l788840k993012k583032
2107B3986166k296303j546645j099156q51526j144649j055149j130622j221673
2099A3640443r92560p48006p57560p73693n24548m31556m93139n00385l48808
2090H070188k24890l42236m32608l01234m13784k21671j75440l3317k09656l09588
2080E405764o8128k70223l61594j44877p6933j54279j3021l67989j97381j46559
$$ plain form
2140 9609257 10511360 11364717 12389123 13485419 14274302 15594939 17277759 19081685 20658238
2131 20658238 22788890 24956311 27650508 30563329 34034898 38027843 43118010 48932140
2123 48932140 55339649 62413182 71420968 82046729 96648133 108532432 107512511 93615931
2115 93615931 72084514 56523069 45911958 38563574 33351050 29562210 26569198 23986166
2107 23986166 21689863 20143218 19044062 18192536 17047887 15992738 14862116 13640443
2099 13640443 12647883 11899877 11142317 10368624 9844076 9412520 8919381 8418996 8070188
2090 8070188 7845298 7503062 7070454 6769220 6355436 6133765 5958325 5925008 5715352 5405764
2080 5405764 5337636 5067413 4705819 4560942 4484009 4329730 4316709 3948720 3751339 3604780
2070C604780o7668M5466k25971k68415L7637Q0387L3944r3293l43643l58553J97788
2059B642459n8915k06743k00793R8127J20394j29650p1j5282j25847r1028k9487
2048B003164j36867K5735K2100O0774J05728p1324j30256o833k16350j9581j89449
2037A446841j64888Q4145J25043j45018M1706j62212j32348J26366N9379j59169
2027A119845k6718j10610j77364r834M6347m3188K29025o7980k21784J94267k0666
2016I11340J14194O4130k9081j22268j24094m8107j4789r410p9457j1299L02136
2005I53295O4895l28048J06375j19829L0684j30414k765P700l9885n8320O7843
1994E51531j15589J11822j19623J91718K24846k61906l67218k65699M19098J15324
$$ plain form
2070 3604780 3537112 3582578 3356607 3088192 3125829 3206216 3240160 3146867 2803224 2444671 2642459
2059 2642459 2583544 2376801 2176008 2274135 2394529 2264879 2264808 2249526 2123679 2032651 2003164
2048 2003164 1866297 1892032 1914132 1974906 2080634 2009310 1879054 1872221 1655871 1636290 1446841
2037 1446841 1281953 1366098 1491141 1346123 1387829 1225617 1093269 1219635 1279014 1119845
2027 1119845 1093127 982517 805153 795319 841666 798478 1027503 959523 737739 932006 911340
2016 911340 1025534 1089664 1060583 938315 814221 766114 751325 741915 662458 651159 953295
2005 953295 1018190 690142 796517 676688 707372 576958 574193 581893 542008 483688 551531
1994 551531 435942 547764 428141 619859 844705 582799 215581 -50118 368980 484304
1984D84304j27631R1431n921J8191N5245k8861m3262j0679j40169J21319P4502
1973D88469j05597m7900j61112K12082K08415o8788j68278N3348j55826J25033
1963C79846M6211o150K07729j88729J6976M1010k26181j66433J71623m544M2907
1952C14265j7854j07092j55025R5423Q2626k20171O0583R6937k4977L1631O2551
1941B18897J62627m9892j01026J6537k4755m9268N8846m3927j144l4106j39276
1930A3513l9550J09097J22581j85409J91454J53109m7518O1586M1303l01809K7882
1919A46239J04961j53075O7766J00833j73429j28583k220P6527Q1555R9366J25655
1908C45595k80883K7871n5152j54817Q8299o4515J70059r1413J03049l6403m1534
$$ plain form
1984 484304 356673 448104 442183 460374 515619 486758 443496 432817 292648 413967 488469
1973 488469 382872 334972 173860 385942 594357 525569 357291 410639 254813 379846
1963 379846 426057 419907 627636 438907 455883 496893 270712 104279 275902 271358 314265
1952 314265 296411 189319 34294 129717 212343 -7828 52755 149692 124715 156346 218897
1941 218897 381524 331632 230606 247143 222388 173120 231966 188039 186895 152789 13513
1930 13513 -26037 83060 205641 20232 211686 364795 317277 378863 420166 118357 146239
1919 146239 251200 98125 165891 266724 93295 -35288 -37508 39019 120574 219940 345595
1908 345595 64712 92583 37431 -117386 -29087 -93602 76457 -14956 88093 51690 10156
1897A0156K46334M2878J5103p3153n0362k12532n0037J6081L7536J06052r669
1886G8387O8850j5640q0939J31997j6648k28783J91285j14106j83947j35744J33725
1875a71563J65653N3655J69094J65953k2934q4988K9241o6408J08438L6940j87984
1864A95097J18027j8783o662p2944l2137J34470K3304j67232K03131J03077j82994
1853B96354K22471l2338j38497J32280M7985L07663p3604j39226k30874k34305
1843A57909J20671J96078j31556K5770K5941j55102J2806k14438K1824j66181
1833a06278J67391P735k02634O2989K7923l277J01782p2423l6674N5264l620Q6689
1821H4867k8121J5753j96024O828P5741J46134r1672l3889N4308K7693M8982N9331
$$ plain form
1897 10156 256490 299368 314471 241318 190956 -21576 -71613 -55532 -17996 88056 78387
1886 78387 147237 131597 50658 182655 166007 -62776 128509 14403 -169544 -305288 -171563
1875 -171563 -5910 47745 216839 382792 359858 274870 304111 237703 346141 383081 195097
1864 195097 313124 294341 287679 214735 182598 317068 340372 173140 376271 479348 296354
1853 296354 518825 486487 347990 480270 528255 835918 762314 623088 392214 157909
1843 157909 278580 474658 343102 368872 394813 239711 252517 38079 59903 -106278
1833 -106278 61113 68848 -133786 -70797 -42874 -46151 55631 -16792 -53466 1798 -1822 84867
1821 84867 56746 72499 -123525 -116697 -40956 105178 13506 -20383 33925 61618 110600 169931
1809A69931k4506j56794r3947r1770k7256P0639M3435N1383J30862K12887J8025
1798C02889j50458M9720j48745j62700l1049J06770j17256J69159j07984k7097
1788a16751j1404j1003O9441O4802j5718L4521J82461J63082j80290l23541k9360
1777a73760K67001N6072j8509l91921J46225L5962j02982J57289n2019o6252j26612
1766b69506M4205L0833n2574n9079M0048K30598j03051J27811J05819j30690M7996
1755A2410j4293M9176O3920j32869j60484J5416o473P144R538n419k6877J70360
1743a8451P7157o7589q3137o5754N0007P0711m6795p3968J41240P0652j88177
1732a34104O82l2261q0553J14694O1567j10150K021l9868J21089M875m540l7228
$$ plain form
1809 169931 145425 -11369 -105316 -197086 -224342 -153703 -110268 -58885 71977 284864 302889
1798 302889 152431 202151 53406 -109294 -140343 -33573 -150829 18330 -89654 -116751
1788 -116751 -128155 -139158 -69717 -4915 -20633 13888 196349 359431 179141 -144400 -173760
1777 -173760 93241 149313 130804 -261117 -114892 -78930 -181912 -24623 -76642 -142894 -269506
1766 -269506 -225301 -194468 -247042 -306121 -266073 -35475 -138526 -10715 95104 -35586 12410
1755 12410 -1883 47293 111213 -21656 -182140 -166724 -173197 -166053 -156515 -161934 -188811 -18451
1743 -18451 58706 -8883 -92020 -157774 -107767 -37056 -83851 -157819 -16579 54073 -134104
1732 -134104 -133422 -165683 -246236 -131542 -69975 -180125 -178104 -217972 -96883 -92008 -96548 -133776
1720a33776J42646L2103K413k11816j95535J06310o2713J89911m3720j95756J416
1709c68517J30513O2212j0592n2238J03943L4565p2010O4662K177R316N608Q4143
1697f218j22675J35648R8269j13514j90141K267J98670k5445r9224K3574l7727
1686a36516K56645J16205j81938o0626q809o7451K0239J43717j86998J0458M7213
1675d7861n9447O9531j0382L7004P7822k4420N268o8503l03191M7815L0891K46491
1663A018J92585k15974j18016J51620O4583j86633l1324l761l1341K36246M179
1652F3182j34243J35515k4017J34506j30018j84862n4476p2958J94984l1960j37601
1641b41948p978J20787r7780q9384J56578j30515k9829p0639K81556N3926q4550
$$ plain form
1720 -133776 8870 40973 43386 -168430 -363965 -257655 -320368 -130457 -174177 -369933 -368517
1709 -368517 -238004 -175792 -186384 -238622 -134679 -100114 -172124 -107462 -105285 -95969 -90361 -6218
1697 -6218 -128893 6755 105024 -8490 -198631 -196364 2306 -23139 -122363 -98789 -136516
1686 -136516 120129 236334 54396 -6230 -15039 -82490 -62251 81466 -105532 -95074 -47861
1675 -47861 -107308 -37777 -48159 -11155 66667 42247 47515 -20988 -324179 -276364 -245473 1018
1663 1018 193603 -22371 -140387 11233 75816 -110817 -142141 -145902 -177243 59003 63182
1652 63182 -71061 64454 40437 174943 44925 -139937 -194413 -267371 -72387 -104347 -241948
1641 -241948 -249926 -129139 -226919 -316303 -159725 -290240 -320069 -390708 -109152 -55226 -139776
1630a39776j7318K4585J12291j8842K71967j02064k01016j32205J3707J20539
1620f8132J44474K6510q2567q8269l6352j20438q6188L19422K8916M1652l3081
1609D5947j6855l2968O4269L0750K9457p3765R8904k44555l646j71227m0706R6810
1597b17585j29669K47481P2708q886j38082O0083j53799J96853j15509j32126
1587c18531j48997P8779L16625K63940j3440l08775j80335Q4517L374J19717p5331
1576a78457Q2006m1850l2635q1778j75851J27543j245J55174k505l0230p645O7242
1564a20231M4688l1412J8637j4854p6606o2110J6022N9636Q589K2765q616j61584
1552c05076k6947K54738N7487P1131r8022O5549k05261k10584O5511J29043J09316
$$ plain form
1630 -139776 -157094 -132509 -20218 -39060 232907 130843 -70173 -202378 -188671 -68132
1620 -68132 76342 102852 20285 -67984 -104336 -224774 -310962 8460 37376 79028 45947
1609 45947 29092 -3876 60393 91143 120600 46835 145739 -98816 -102462 -273689 -314395 -217585
1597 -217585 -347254 -99773 -27065 -35951 -174033 -113950 -267749 -70896 -186405 -318531
1587 -318531 -467528 -388749 -72124 191816 178376 -130399 -310734 -226217 -222843 -103126 -178457
1576 -178457 -96451 -138301 -170936 -252714 -428565 -301022 -302267 -147093 -149598 -179828 -187473 -120231
1564 -120231 -75543 -106955 -88318 -103172 -179778 -241888 -225866 -166230 -157641 -134876 -143492 -305076
1552 -305076 -332023 -77285 -19798 51333 -46689 18860 -186401 -396985 -331474 -202431 -93115
1541i3115N1218q6489q4181K4440j27809J19457J03414M1993j5542p5217j1927
1530a53758m8769K24712j42279j4636k376o8200K62306k68583j47037J78340J35044
1519d5236O202q7832j59886J40835R9646p5475j21109j83685j72609J77888K27956
1508a93305P6239J24160j47085J51722L11654n5480j57204k21183n1266J16053
1498d5695j10962J3358p4097p2583O8086K57343p0149j43090m7112J52077m4663
1487a17487M9400R1907n2072o1186J12765k41j50098o692j44889L1886M0094k1311
1475b27924M9548j05095K18248K56917J018j02074m3702J02259q4772n0209J10971
1464A25185p4779k96878n7046Q0303J64715J07490j29345Q725J30532j19494j31114
$$ plain form
1541 -93115 -41897 -128386 -212567 -188127 -315936 -196479 -93065 -51072 -66614 -141831 -153758
1530 -153758 -202527 22185 -120094 -134730 -137106 -205306 57000 -211583 -358620 -180280 -45236
1519 -45236 -39034 -126866 -286752 -145917 -46271 -121746 -242855 -426540 -599149 -421261 -193305
1508 -193305 -117066 7094 -139991 11731 323385 267905 110701 -110482 -161748 -45695
1498 -45695 -156657 -143299 -217396 -289979 -221893 35450 -34699 -177789 -224901 -72824 -117487
1487 -117487 -68087 23820 -28252 -89438 23327 23086 -127012 -133704 -278593 -246707 -206613 -227924
1475 -227924 -178376 -283471 -65223 191694 192712 90638 46936 149195 64423 14214 125185
1464 125185 50406 -246472 -303518 -223215 -58500 48990 -80355 -71630 58902 -60592 -191706
1453a91706L5327L0243j333J23582k00277K52530M4111J7087k67160j65555J04058
1442b19093J87757n5346o104K0958j31518P9652O3701n0068k02800J02798J12871
1431i7192j2411M5758j01294n8359J01317j51799J13373J49476m5968j83605R2006
1420a48698n4326O0010j4258L4184j15738J01390M5335m9013O1072n1157K15235
1409H4036J58063k8525k71567j59304l8672K36098j6881L1727j0582Q4309Q3351
1398A52053M4841j01247K5426K824k1116j53539q0623K34456j00989r9548J54510
1387E7048m1489M9084R5856K2640L1522o0921n0587p3752J95201k39602k31356
1376b46356J11884J10969J16908j32672j7256M5355o3718k04146R5734J72476
$$ plain form
1453 -191706 -156379 -126136 -127469 -3887 -204164 48366 92477 109564 -157596 -323151 -219093
1442 -219093 -31336 -86682 -92786 -71828 -203346 -123694 -59993 -110061 -312861 -210063 -97192
1431 -97192 -109603 -63845 -165139 -223498 -122181 -273980 -160607 -11131 -57099 -240704 -148698
1420 -148698 -203024 -143014 -157272 -123088 -238826 -137436 -92101 -141114 -80042 -131199 84036
1409 84036 242099 213574 -57993 -217297 -255969 -19871 -36752 -5025 -15607 68702 152053
1398 152053 196894 95647 121073 123897 102781 -50758 -131381 103075 2086 -97462 57048
1387 57048 15559 64643 160499 183139 214661 153740 103153 29401 224602 -15000 -246356
1376 -246356 -134472 -23503 93405 -39267 -56523 -11168 -74886 -279032 -183298 -10822
1366a0822K3147k3067j71421k0082J61098o349j01912J22172J00278j11400R3090
1355E4732N1400p3674R7968m3873J05816J34045j53106j31573j91212k18422K03225
1344a64674O6036L7600o6734n376K01358J01479q0773P3722k29293J4921P1816
1333B0082o2996M5501K739j10284J188Q3914Q9400N1043j49958Q2644Q0113r399
1321A23987j82225J89923o2984j34414O7962K42j07356k27472j5478K97319n5641
1310a06137k2305J08315j07146J41671J3980o080R5074o6824L4921Q0803k9246
1299A37026P9998k0752k16353P0161J62349l4362j93683p5376L01848J09707k53070
1288F7493k20086J25497L8298q1060K16462J4457j59694r0973K4784J05174p8388
$$ plain form
1366 -10822 12325 -10742 -182163 -202245 -41147 -47496 -149408 -27236 73042 -38358 54732
1355 54732 106132 32458 130426 86553 192369 326414 173308 41735 -149477 -367899 -164674
1344 -164674 -98638 -61038 -127772 -133148 68210 169689 88916 162638 -66655 -51734 20082
1333 20082 -42914 2587 5326 -104958 -103770 -19856 69544 120587 -29371 53273 133386 123987
1321 123987 -58238 131685 68701 -65713 2249 2491 -104865 -332337 -347815 -50496 -106137
1310 -106137 -128442 -20127 -127273 14398 28378 22298 117372 50548 85469 166272 137026
1299 137026 217024 196272 -20081 50080 212429 178067 -15616 -90992 210856 320563 67493
1288 67493 -152593 -27096 11202 -69858 146604 161061 1367 -89606 -64822 40352 -38036
1277c8036m5429o4386L9592K4283J95475j57621o7279j23014L8940J15146q167
1266i0496p7125J9330J61323J584m8613p1706N4144J92178P4115j53273j11500
1255e0039j34970r0027n891K78699p3686J36020n096r8897K25601j36705k9434
1244A5575k1112R9161J26058k69957j23271L12746J7521m6951k04681O0660J37227
1233A02976k1650j33934n4852K04996K9729Q3337j49824k0773O172K9127r6520
1222b1216m6600l9815m4515j69969o485J78575P6577r365R5374J24195J0944j68481
1210b0781j51728p4068K1456J20996L1493k7686j67634j07732K80541n3968J08400
1199d0711n0293j14584l3242M9242J27253J35187L753k13207k9164p076J55463
$$ plain form
1277 -38036 -83465 -147851 -108259 -83976 111499 -46122 -113401 -236415 -197475 -82329 -90496
1266 -90496 -167621 -148291 13032 14616 -33997 -105703 -51559 140619 214734 61461 -50039
1255 -50039 -185009 -275036 -280927 -2228 -75914 60106 55010 -43887 181714 45009 15575
1244 15575 -5537 93624 219682 -50275 -173546 139200 156721 109770 -94911 -34251 102976
1233 102976 81326 -52608 -107460 97536 127265 210602 60778 40005 46177 75304 -21216
1222 -21216 -67816 -107631 -152146 -322115 -328600 -150025 -73448 -82813 12561 136756 147700 -20781
1210 -20781 -172509 -246577 -225121 -104125 -72632 -100318 -267952 -375684 -95143 -149111 -40711
1199 -40711 -91004 -205588 -238830 -189588 -62335 72852 76605 -136602 -165766 -172842 -17379
1188a7379j0044j69841p8656J46909k3991k4854K497o5075O6187J83834j63486
1177a53899O4136J28782n7305J8335m9787O5770J31765j26001K1832j05025k28736
1166b90133K15104p5370m0046M0485Q8640K15034R875j94756k39485K10146K225
1155e8281m2723J46914o4096j7960J20944m2552L4545o7376J30213j75299L3996
1144a675Q8397j1614R4695j80206J1395j97658K48563K16936p1139q5801r8694
1133A3199p4952Q6449o9492o8149K6874P4270l45818J1903J29982J3918Q5843
1122a15973J682M2464n7397k9827J12346q1726K8490L0520j07286l811L7600r5212
1110b38130P4249l8843j61115J32037P5055J43533O7277R5401j05900k64385o6184
$$ plain form
1188 -17379 -27423 -197264 -275920 -129011 -153002 -177856 -175359 -240434 -174247 9587 -153899
1177 -153899 -89763 39019 -18286 49 -49738 16032 147797 21796 43628 -61397 -290133
1166 -290133 -75029 -150399 -190445 -149960 -61320 153714 163589 -31167 -270652 -60506 -58281
1155 -58281 -101004 45910 -18186 -36146 84798 42246 76791 9415 139628 -35671 -1675
1144 -1675 86722 75108 169803 -10403 992 -196666 51897 268833 197694 111893 13199
1133 13199 -61753 24696 -44796 -112945 -86071 -11801 -357619 -345716 -215734 -201816 -115973
1122 -115973 -114291 -71827 -129224 -159051 -46705 -128431 -99941 -69421 -176707 -180518 -142918 -238130
1110 -238130 -163881 -202724 -363839 -231802 -156747 -13214 54063 149464 43564 -220821 -287005
1099b87005J73657M837Q1768n241J8336o5942j71983J12949J14848L1214M0315
1088D7753j21621J18849q2153R1864m6995k4928j75275J5271Q9983q3813N1087
1077a19978J50601k5620j42301j0514Q8021L6269k466J85857j14756k8539k27253
1066b10679M762R574R872Q992j44737L72062R4504j35573k2280J65708j02623
1055D9582r7501q955J61536M3102M6285j10049j11740k3016j23156p0941J06295
1044a38558L11445j31935P7630j27160j0899J2995K7829j25347k1135K03261n2632
1033B5494N9774m2130O7456K9273j58580O1056O036Q6347m2823J05209J23417
1022C20529k5239j51627j22198Q0713L5881k51253J39917J56812q9391j41123
$$ plain form
1099 -287005 -113348 -108511 -26743 -31984 -13648 -79590 -251573 -138624 -23776 7438 47753
1088 47753 -73868 44981 -37172 54692 7697 -17231 -192506 -177235 -87252 -171065 -119978
1077 -119978 30623 5003 -137298 -147812 -59791 -23522 -25988 159869 45113 16574 -210679
1066 -210679 -205917 -196343 -186471 -177479 -322216 49846 144350 8777 -13503 152205 49582
1055 49582 -47919 -56874 104662 147764 194049 84000 -27740 -50756 -173912 -244853 -138558
1044 -138558 172887 40952 118582 -8578 -19477 -6482 21347 -104000 -125135 78126 25494
1033 25494 85268 43138 110594 139867 -18713 42343 48379 134726 91903 197112 320529
1022 320529 295290 143663 21465 102178 138059 -113194 26723 183535 94144 -46979
1012d6979j2017J40091o9199r3920k9594M8422J29258k23098R5770K5194K0434
1001a5638J72911j33284m8443r6116J22185q8471J38198o6211j68771O5472r2683
990b10851j779O2174O8487L136k988P5644J12843q5505j80612r8855L7634J64361
978e6311J9281J9707l3469k197M8533K13096J2581o25k8651j23536L6084j7643
966H6850r0943o411q7909J30700N8154r3928R6637j75245r1048J08954J30680
955F6491Q3949q1815j47476p6154K23470j81781J0176P2014j74276J13609J86921
944I5128j24808r5639O3185k3897L05817r4245j17313J06436J1026r9709J8336
933D4317P9397j16737o9543j5809r3845J07644l1426J17711L5209J10920m1231
$$ plain form
1012 -46979 -58996 81095 11896 -82024 -111618 -63196 66062 -157036 -61266 -36072 -15638
1001 -15638 157273 23989 -24454 -120570 1615 -86856 51342 -14869 -183640 -118168 -210851
990 -210851 -212630 -150456 -81969 -78833 -81821 -6177 106666 21161 -159451 -258306 -220672 -56311
978 -56311 -37030 -17323 -50792 -52989 -4456 208640 221221 220596 191945 68409 104493 86850
966 86850 -4093 -10504 -98413 32287 90441 -3487 93150 -82095 -173143 -64189 66491
955 66491 150440 68625 -78851 -155005 68465 -113316 -103140 -31126 -205402 -91793 95128
944 95128 -29680 -125319 -62134 -86031 219786 125541 8228 114664 125690 25981 44317
933 44317 123714 6977 -62566 -78375 -172220 -64576 -96002 21709 56918 167838 126607
922A26607k69141O7593J99191J21412j75979o4587n0829n6543J42159R743j26458
911g6832J34329J58264r932j54110k45576L4399Q0833k06203J58036J10437p3936
900i0291N9702Q0636n1614J63995J85819j22842j18944j57964j17826N4629O1060
889e3640O4170P2535N6797R7220k18107q4953Q5669j9085j08066R6906l1573o409
877d8536R183J05942k1034q0594j0689k26346m4434J52647J9745K34721N6606
866A47211k53054j05481Q3008J36544J4421n4605J63833k0730j10296J23051j18178
855E724q7631j77870M6976K45247j6917q4066m9689j41737J89887k6498J89096
844I2522j31928j31181j44342K28511R1957j15747k5225j0232K86798r2279m2520
$$ plain form
922 126607 -142534 -74941 124250 245662 69683 5096 -45733 -102276 39883 49626 -76832
911 -76832 57497 215761 205829 51719 -193857 -159458 -78625 -284828 -126792 -16355 -90291
900 -90291 -30589 50047 -1567 162428 348247 225405 106461 -51503 -169329 -114700 -53640
889 -53640 10530 83065 139862 237082 18975 -65978 19691 606 -107460 -10554 -42127 -48536
877 -48536 -39353 66589 45555 -35039 -45728 -272074 -316508 -163861 -144116 90605 147211
866 147211 -105843 -211324 -128316 8228 22649 -31956 131877 111147 851 123902 5724
855 5724 -81907 -259777 -212801 32446 15529 -68537 -118226 -259963 -70076 -96574 92522
844 92522 -39406 -170587 -314929 -86418 5539 -110208 -135433 -145665 141133 48854 6334
833F334j76341O4053J85560l351q0731l8965p7729J30428P2267J5823p4622J31914
821A54640j79918j39657J18299J00159p5302j2344Q7652l2951j8984K8516J84443
810B14553j48740r2492p4556j17008k5662J99342L03319j22058k09939J95203
800A21962m5002R9835k20534n4486p4382m4674K37307j70289J08084J18795R4684
789A71300j73091p3034J16497J26161j320k44070m3044O1986O1616n9927J2747
778d4179j8408L5473l022P3711J0722r1109N3596P9208k18979q0703K09109K9066
766C4485J23110K1530k02780J06210J48576q2231j0202r3825q9165L1442n841
755a8691N1490j63751q3073m6363J16543R7731J50032j09100j19561P5656k2751
$$ plain form
833 6334 -170007 -105954 79606 76255 -4476 -43441 -121170 9258 81525 97348 22726 154640
821 154640 -25278 -164935 -46636 53523 -21779 -34123 53529 20578 1594 30110 214553
810 214553 65813 -26679 -101235 -218243 -243905 -44563 258756 136698 -73241 121962
800 121962 76960 176795 -43739 -98225 -172607 -217281 20026 -150263 -42179 76616 171300
789 171300 -1791 -74825 41672 167833 166513 -77557 -120601 -58615 3001 -56926 -44179
778 -44179 -62587 -27114 -30136 43575 54297 -36812 16784 95992 -122987 -203690 5419 34485
766 34485 157595 179125 -23655 82555 231131 148900 138698 44873 -44292 -12850 -18691
755 -18691 32799 -130952 -214025 -260388 -143845 -46114 103918 -5182 -124743 -49087 -71838
744g1838p0802l732K88919r60k09797J35383K20472m1715k61542l7866n9667P4364
732c8781J53345k46277J0503n7266J71638j52929J01843J14639j9749K1387j4591
721D3762k13057J54673l5906n0409Q1446J07041k90260j45582R6269Q7098J27578
710c7347L4922K55923q2989l0932k7390K09734o9399j01713n9809K0581l6213
699G5368J788m3457k04088R5648q5333K64101K5067j63199j49693K36156J47138
688A99496r8967j65286K8488J62420j01046P3844J28497q9816r0598L9855J29948
677B16835J81676o4844l88124l6830j1002Q1007R3927m9645r973n389L16958j59022
665A65574k22321r388J06965o6274j35864J26172J60177j14058J22080k7416J1221
$$ plain form
744 -71838 -142640 -146372 142547 141587 -68210 67173 287645 245930 -15612 -53478 -113145 -38781
732 -38781 114564 -131713 -121210 -178476 -6838 -159767 -57924 56715 36966 58353 43762
721 43762 -169295 -14622 -50528 -100937 -19491 87550 -202710 -348292 -252023 -164925 -37347
710 -37347 -2425 253498 170509 139577 112187 321921 252522 150809 91000 111581 75368
699 75368 77156 33699 -170389 -74741 -160074 104027 129094 -34105 -183798 52358 199496
688 199496 100529 -64757 -36269 126151 25105 98949 227446 137630 47032 86887 216835
677 216835 398511 333667 -54457 -91287 -102289 -21282 72645 23000 13027 7638 324596 165574
665 165574 -56747 -66135 40830 -25444 -161308 -35136 125041 10983 133063 105647 116868
654A16868m3398R4128p2507R9545J4349j83856k04578J24846J46570j19518J06358
643G8807J20794j04229n3822J03131j06501n9317j86625k640J39229K1660K5918
632b3595m535J7147n5883l2294n4431M1790L59980k8441k64839j7358k9036J65166
620G3671l2833J1239m0359n3275m2355L1209R387R3477J13954j7375J07851j15222
608A39369j82934j31063j44986P1842J20384K05914O1674O3298L2415j15068R062
597A29907N3780j22743R7973m9992n48O6728p281k17213J9588J08102o7612K60395
585B71084k07278j19586k5727j77694K51755O4939j1380J30261k51688K11764
575A36450O711L9747m6472l10230J40677J20058j4212P9095p6680j22110j62387
$$ plain form
654 116868 73470 167598 95091 194636 208985 25129 -179449 -54603 91967 -27551 78807
643 78807 199601 95372 41550 144681 38180 -21137 -207762 -210402 -71173 -49513 -23595
632 -23595 -28130 -10983 -66866 -99160 -153591 -111801 248179 219738 -45101 -62459 -91495 73671
620 73671 40838 52077 11718 -41557 -83912 -52703 -43316 50161 164115 146740 254591 139369
608 139369 -43565 -174628 -319614 -247772 -127388 78526 140200 203498 235913 120845 129907
597 129907 183687 60944 158917 108925 108377 175105 167824 -49389 -29801 78301 10689 271084
585 271084 63806 -55780 -81507 -259201 -7446 57493 46113 176374 -75314 136450
575 136450 143161 182908 136436 -173794 -33117 86941 72729 151824 75144 -46966 -209353
564b09353Q9586K62810R2866l55777K60790J81152j64748j74223K8293M3764J48866
553B04026k46559q4989J46230J1037L4200J02922m1598j01951j24249J64618k5434
542C8253Q4498J07445j25428N5156N6690K79351k12190j13307j57771m2480O5564
531C5781Q6204o7378N6529L9288J8594Q505m7597j02598n3521K719P3104O9150
519A18780J01678n6651j84244p5839j05530L8122l9294P3035R9207L9889K6421
508C5574J62785q9763r9419J59022R8243k17946k27134J45141r1891j53428j145
497b79961J24187J10648P0437O1703l4614j73130j19903J58397J32272K7824j3315
486F4545P4853j44461j39936r451N9357J38520o8778J92385j20044j93030Q0693
$$ plain form
564 -209353 -119767 143043 235909 -119868 140922 322074 157326 -16897 11396 55160 204026
553 204026 -42533 -127522 18708 29745 63945 166867 125269 23318 -100931 63687 38253
542 38253 122751 230196 104768 159924 216614 495965 283775 170468 12697 -29783 35781
531 35781 121985 54607 111136 150424 169018 177523 129926 27328 -26193 -23474 49630 118780
519 118780 220458 163807 -20437 -96276 -201806 -163684 -202978 -129943 -30736 9153 35574
508 35574 198359 108596 9177 168199 266442 48496 -178638 -33497 -125388 -278816 -279961
497 -279961 -155774 -45126 25311 87014 52400 -120730 -240633 -82236 50036 77860 64545
486 64545 139398 -5063 -144999 -154450 -95093 43427 -25351 167034 46990 -146040 -65347
475f5347o1178Q0510J72596p9505l0849P9841J955k94647R2109K006J32741r9166
463f8934K8402K2669Q2206J23648k29371n5440K1226Q22M9853J55614n4181l9568
451C6946Q7511J8089k9916p8125j44889k1935K03695N9165j92373j86088j1700
440b59620J77198J80904N3529K4025l6237O8686q0451K7797k90k22183r2102J31390
428b7354J289K3841N3156m8558L09944k89782j65879L0442m9234J57541j00853
417a05447k8157J48203K33354J32184k73962K3193J03055L6772j68796l3488J22638
406A89549j60006M8062P2522n6782L5201R7085P0631j39381j8394q4445j6365
$$ plain form
475 -65347 -126525 -46015 126581 47076 16227 96068 98023 -196624 -104515 -102509 30232 -68934
463 -68934 -40532 -17863 64343 187991 -41380 -96820 -75594 -74772 -24919 130695 76514 36946
451 36946 124457 142546 112630 34505 -110384 -132319 71376 130541 -61832 -247920 -259620
440 -259620 -82422 98482 152011 176036 139799 208485 128034 155831 155541 -66642 -158744 -27354
428 -27354 -26065 -2224 50932 2374 312318 22536 -143343 -112901 -162135 -4594 -105447
417 -105447 -133604 14599 247953 380137 106175 129368 232423 269195 100399 66911 189549
406 189549 29543 77605 150127 93345 128546 225631 296262 156881 138487 54042 37677
$$ [...]
##END NTUPLES=NMR SPECTRUM
##END=
