##TITLE=1H_EC-3268(1)
 CDCl3
 8 sc, 
 15.11.2021
##JCAMPDX= 6.0         $$ Bruker NMR JCAMP-DX V2.0
##DATA TYPE= NMR SPECTRUM
##DATA CLASS= NTUPLES
##ORIGIN= UXNMR, Bruker Analytische Messtechnik GmbH
##OWNER= root
$$ XWIN-NMR		Version 3.5
$$ Mon Nov 15 11:08:53 2021 Russian Standard Time (UT+4h)  she@DPX200
##.OBSERVE FREQUENCY= 200.131346
##.OBSERVE NUCLEUS= ^1H
##.ACQUISITION MODE= SIMULTANEOUS
##.ACQUISITION SCHEME= undefined
##.AVERAGES= 8
##.DIGITISER RES= 18
##SPECTROMETER/DATA SYSTEM= spect
##.PULSE SEQUENCE= zg30
##.SOLVENT NAME= D2O
##.SHIFT REFERENCE= (INTERNAL, D2O, 0, 15.7171)
##AUDIT TRAIL= $$ (NUMBER, WHEN, WHO, WHERE, WHAT)
$$ ##TITLE= Audit trail, XWIN-NMR		Version 3.5
$$ ##JCAMPDX= 5.01
$$ ##ORIGIN= Bruker BioSpin GmbH
$$ ##OWNER= she
$$ F:/spectra/data/she/nmr/H-F/1/pdata/1/auditp.txt
$$ ##AUDIT TRAIL=  $$ (NUMBER, WHEN, WHO, WHERE, WHAT)
(   1,<2021-11-15 11:06:47.84 +0400>,<she>,<DPX200>,
      <created by zg, POWCHK disabled, PULCHK disabled
       configuration hash MD5:
       00 E9 B6 7A A2 85 ED C7 34 08 36 98 17 FE 4E 26
       data hash MD5: 16K
       81 16 CD 95 1C CC 14 73 D8 FB 8C B5 30 7A 6D B4>)
(   2,<2021-11-15 11:07:33.75 +0400>,<she>,<DPX200>,
      <Start of raw data processing
       efp BC_mod = 2 LB = 0.24 FT_mod = 6 PKNL = 1 PHC0 = -15512.74 PHC1 = 13.20081 SI = 16K 
       data hash MD5: 16K
       57 45 07 C8 C1 F7 35 5E F5 EB B0 78 63 D6 DC 12>)
(   3,<2021-11-15 11:07:51.76 +0400>,<she>,<DPX200>,
      <pk PHC0 = -1.096495 PHC1 = 2.799999 
       data hash MD5: 16K
       94 B1 C0 54 C4 4F FC 6A F3 C0 EC 82 7D CE 2F 8D>)
(   4,<2021-11-15 11:07:54.70 +0400>,<she>,<DPX200>,
      <abs ABSG = 5 
       data hash MD5: 16K
       5E 44 8C F8 86 EF 91 A1 1F 2B B6 2D 95 B9 10 34>)
$$ ##END=
$$ 
$$ hash MD5
$$ 95 63 4D 95 D1 69 45 0C FB 88 B4 14 94 60 73 AB
##$RELAX= 
##$RELAX= 
##$RELAX= 
##$RELAX= 
##$RELAX= 
##$RELAX= 
$$ Bruker specific parameters
$$ --------------------------
##$DU= <F:/spectra>
##$EXPNO= 1
##$NAME= <H-F>
##$PROCNO= 1
##$TYPE= <nmr>
##$USER= <she>
##$AMP= (0..31)
100 100 100 100 100 100 100 100 100 100 100 100 100 100 100 100 100 100 
100 100 100 100 100 100 100 100 100 100 100 100 100 100 
##$AQSEQ= 0
##$AQ_mod= 1
##$AUNM= <au_zg>
##$AUTOPOS= <>
##$BF1= 200.13
##$BF2= 200.13
##$BF3= 200.13
##$BF4= 200.13
##$BF5= 200.13
##$BF6= 200.13
##$BF7= 200.13
##$BF8= 200.13
##$BYTORDA= 1
##$CFDGTYP= 0
##$CFRGTYP= 5
##$CHEMSTR= <none>
##$CNST= (0..31)
1 1 145 1 1 1 1 1 1 1 1 1 1 1 1 1 1 1 1 1 1 1 1 1 1 1 1 1 1 1 1 1 
##$CPDPRG= <>
##$CPDPRG1= <>
##$CPDPRG2= <>
##$CPDPRG3= <>
##$CPDPRG4= <mlev>
##$CPDPRG5= <mlev>
##$CPDPRG6= <mlev>
##$CPDPRG7= <mlev>
##$CPDPRG8= <mlev>
##$CPDPRGB= <>
##$CPDPRGT= <>
##$D= (0..31)
0 1.2 0 0 0 0 0 0 0 0.06 0 0.03 0 0 0 0 0.0002 0 0 0 0 0 0 0 0 0 0 0 0 
0 0 0 
##$DATE= 1636960007
##$DBL= (0..7)
120 120 120 120 120 120 120 120 
##$DBP= (0..7)
150 150 150 150 150 150 150 150 
##$DBP07= 0
##$DBPNAM0= <>
##$DBPNAM1= <>
##$DBPNAM2= <>
##$DBPNAM3= <>
##$DBPNAM4= <>
$$ [...]
##$SUBNAM2= <"">
##$SUBNAM3= <"">
##$SUBNAM4= <"">
##$SUBNAM5= <"">
##$SUBNAM6= <"">
##$SUBNAM7= <"">
##$SUBNAM8= <"">
##$SUBNAM9= <"">
##$SW= 18.0517287032376
##$SWIBOX= (0..15)
0 0 2 0 0 0 0 0 0 0 0 0 0 0 0 0 
##$SW_h= 3612.71676300578
##$TD= 16384
##$TD0= 1
##$TE= 0
##$TE2= 300
##$TE3= 300
##$TEG= 300
##$TL= (0..7)
0 120 120 120 120 120 120 120 
##$TP= (0..7)
150 150 150 150 150 150 150 150 
##$TP07= 0
##$TPNAME0= <>
##$TPNAME1= <>
##$TPNAME2= <>
##$TPNAME3= <>
##$TPNAME4= <>
##$TPNAME5= <>
##$TPNAME6= <>
##$TPNAME7= <>
##$TPOAL= (0..7)
0.5 0.5 0.5 0.5 0.5 0.5 0.5 0.5 
##$TPOFFS= (0..7)
0 0 0 0 0 0 0 0 
##$TUNHIN= 0
##$TUNHOUT= 0
##$TUNXOUT= 0
##$USERA1= <user>
##$USERA2= <user>
##$USERA3= <user>
##$USERA4= <user>
##$USERA5= <user>
##$V9= 5
##$VALIST= <valist>
##$VCLIST= <CCCCCCCCCCCCCCC>
##$VD= 0
##$VDLIST= <DDDDDDDDDDDDDDD>
##$VPLIST= <PPPPPPPPPPPPPPP>
##$VTLIST= <TTTTTTTTTTTTTTT>
##$WBST= 1024
##$WBSW= 4
##$XGAIN= (0..3)
0 0 0 0 
##$XL= 0
##$YL= 0
##$YMAX_a= 116755
##$YMIN_a= -181865
##$ZGOPTNS= <>
##$ZL1= 120
##$ZL2= 120
##$ZL3= 120
##$ZL4= 120
##$ABSF1= 15.71714
##$ABSF2= -2.334709
##$ABSG= 5
##$ABSL= 3
##$ALPHA= 0
##$AQORDER= 0
##$ASSFAC= 0
##$ASSFACI= 0
##$ASSFACX= 0
##$ASSWID= 0
##$AUNMP= <proc_1d>
##$AZFE= 0.1
##$AZFW= 0.1
##$BCFW= 0
##$BC_mod= 2
##$BYTORDP= 0
##$COROFFS= 0
##$CY= -3
##$DATMOD= 1
##$DC= 0
##$DFILT= <>
##$DTYPP= 0
##$F1P= 0
##$F2P= 0
##$FCOR= 1
##$FTSIZE= 16384
##$FT_mod= 6
##$GAMMA= 0
##$GB= 0
##$INTBC= 1
##$INTSCL= 0
##$ISEN= 128
##$LB= 0.24
##$LEV0= 0
##$LPBIN= 0
##$MAXI= 10000
##$MC2= 0
##$MEAN= 0
##$ME_mod= 0
##$MI= 1.114404
##$NCOEF= 0
##$NC_proc= -8
##$NLEV= 6
##$NOISF1= 3.799351
##$NOISF2= 2.8
##$NSP= 0
##$NTH_PI= 0
##$NZP= 0
##$OFFSET= 15.71714
##$PC= 1
##$PHC0= -15513.84
##$PHC1= 16.00081
##$PH_mod= 1
##$PKNL= yes
##$PPARMOD= 0
##$PSCAL= 0
##$PSIGN= 0
##$REVERSE= no
##$SF= 200.130006886935
##$SI= 16384
##$SIGF1= 3
##$SIGF2= 2
##$SINO= 5.538805
##$SIOLD= 16384
##$SREGLST= <1H.CDCl3>
##$SSB= 0
##$STSI= 16384
##$STSR= 0
##$SW_p= 3612.71676300578
##$SYMM= 0
##$S_DEV= 0
##$TDeff= 16384
##$TDoff= 0
##$TI= <>
##$TILT= no
##$TM1= 0
##$TM2= 0
##$TOPLEV= 0
##$USERP1= <user>
##$USERP2= <user>
##$USERP3= <user>
##$USERP4= <user>
##$USERP5= <user>
##$WDW= 1
##$XDIM= 16384
##$YMAX_p= 385512133
##$YMIN_p= -1256168
$$ End of Bruker specific parameters
$$ ---------------------------------
##NTUPLES= NMR SPECTRUM
##VAR_NAME=  FREQUENCY,     SPECTRUM/REAL,   SPECTRUM/IMAG
##SYMBOL=    X,             R,               I
##VAR_TYPE=  INDEPENDENT,   DEPENDENT,       DEPENDENT
##VAR_FORM=  AFFN,          ASDF,            ASDF
##VAR_DIM=   16384,         16384,           16384
##UNITS=     HZ,            ARBITRARY UNITS, ARBITRARY UNITS
##FACTOR=    0.220516191357247, 1,           1
##FIRST=     3145.47137601941, 0,            0
##LAST=      -467.245386986368, 0,           0
##MIN=       -467.245386986368, -1256168,    0
##MAX=       3145.47137601941, 385512133,    0
$$ Real data points
##PAGE= N=1
##DATA TABLE= (X++(R..R)), XYDATA
$$ [...]
8632 27199911 26118396 25124880 24475222 23802504 22249288 21219917 20599374 19958906 19145042
8623 19145042 18690899 18697510 18447805 17870299 17307423 17212398 16811439 16257681 16178218 15806986
8613 15806986 15535983 14884776 14939546 14598386 13903850 13441390 12837199 12394118 12422142 12498711
8603 12498711 12177092 12355289 11917861 11796878 12141063 11629226 11300496 11141439 10815125
8594 10815125 10766601 9912715 9610177 9820139 9454458 9025615 9409644 9279070 9374765 9032260
8584 9032260 9023865 9070493 8642913 8524154 8523925 8090960 7991277 7541570 7463192 7409830 7048911
8573 7048911 6724354 6544131 6162289 6068702 6198054 6118532 5715966 5479006 5451525 4875641
8563 4875641 4982441 5094474 4713929 4745827 4814203 4599927 4622113 4622279 4221941 4372370 4802567
8552 4802567 4866402 4908886 4369696 4280448 4310486 3861643 3290986 3453912 3452151 3284189 3569777
8541 3569777 3501403 3453113 3778451 3369300 3347306 3240090 3203658 3103938 3136757 2906496 3116624
8530 3116624 3038035 2948082 2763366 2556420 2372934 2412179 2844554 2791122 2589710 2266414
8520 2266414 2303180 2232416 1988480 2231696 2527792 2676044 2761346 2241960 2160594 2494630
8510 2494630 2795848 2584477 2369147 2260262 2336590 2457863 2438752 2217165 2355353 2140983
8500 2140983 2148919 2588298 2335711 2258394 2361206 2207575 2337046 2075207 2081621 1949512
8490 1949512 2257995 2136986 2604822 2660911 2310408 2488566 2202085 2262170 2133934 2205289
8480 2205289 2117462 1936092 1758024 1552223 1610046 1737259 1578222 1892349 2437461 2472183
8470 2472183 1954836 1844331 1902410 1660342 1510838 1874569 2284345 2365019 2025334 1884340
8460 1884340 1814633 1763363 1961982 2267726 2107650 2088854 1754885 1542617 1869091 1769543
8450 1769543 1411519 1309859 1415615 1181953 1000201 1006020 1253198 1159782 1105638 1462425
8440 1462425 1710022 1246319 1121897 1416683 1503107 1212508 1454873 1450449 912781 1140748
8430 1140748 1069260 928848 1172514 1354371 1128433 797560 840051 1062295 858025 1161577
8420 1161577 899561 857746 1089336 1212112 1296840 907203 592669 781939 806660 914367
8410 914367 721050 832151 997791 640073 957987 822468 818978 343944 550753 746605
8400 746605 357701 163663 250872 505352 763623 620210 445700 486939 586425 625147
8390 625147 435609 223746 302605 321945 328654 118502 60272 408018 518999 578630 760492
8379 760492 640010 559064 821924 672106 641973 494198 475103 335426 8758 361032
8369 361032 287624 299459 738296 636472 873115 434924 440227 432651 252817 206468 380552
8358 380552 262221 83343 319696 674403 710602 451814 298633 472889 392601 411320
8348 411320 1011895 625977 571512 519951 545996 667783 320241 132830 609042 676803
8338 676803 658502 1151558 985014 1069488 941219 774452 447915 247352 591502 612336
8328 612336 927169 1134991 801044 462555 201084 902816 709606 421551 781962 1023636
8318 1023636 777205 269974 549876 538965 727612 442863 462597 865320 774697 378137
8308 378137 573494 726449 727517 870394 1336116 1067426 981596 826227 905491 730109
8298 730109 604505 615917 492256 751093 822691 963012 969317 751435 863436 791815 975548
8287 975548 946541 580363 302004 408330 985830 981217 787955 475395 277057 700229
8277 700229 579802 383232 538119 713671 858141 563220 353257 -23172 560442 788001
8267 788001 1049583 1048387 824381 991350 879386 860308 841793 484132 324168 672495
8257 672495 523659 714639 1201836 669038 399147 726637 1008671 1048952 1114321 1162787
8247 1162787 1232052 1016149 1257627 1060557 790639 671651 641983 875237 781301 556184
8237 556184 729853 383573 489147 419740 503237 384264 535643 644596 400640 -91372
8227 -91372 -315300 -142585 -167368 25874 105158 812460 711222 504305 506134 647180 379558
8216 379558 382465 700278 1145937 1235537 1355414 1010199 800736 620573 479949 771014
8206 771014 976070 599825 550960 704576 852273 739278 533866 -62966 30607 -24945
8196 -24945 -61672 11360 40553 -1256168 -312003 1551156 767497 694324 623034 829116
8186 829116 402872 520480 627408 503597 306427 180200 602267 775466 491169 445524
8176 445524 661334 998578 766745 864898 838443 363035 265618 499032 934185 1048816
8166 1048816 718748 275374 435147 554319 527625 308387 20197 266863 -211296 -504850
8156 -504850 -468237 176236 170469 -18793 113458 27542 -55944 -264374 -599901 -152740 -566492
8145 -566492 -524710 -373900 -514770 -237907 -686705 -398930 19788 -208865 -344900 -32564
8135 -32564 -66724 265405 272174 139948 -213382 44460 162379 -102226 133482 216739 -23733
8124 -23733 -511258 -631386 -223676 -170246 187972 423166 66839 77007 -226114 -191823
8114 -191823 51014 144601 263485 29755 50075 -288099 -97954 -36318 80175 -121438
8104 -121438 170383 150330 623416 430120 -292874 -216110 -155001 -278656 186792 600602
8094 600602 434469 84482 347399 707585 274866 48420 165126 479162 289650 108468
8084 108468 -71344 -139460 -90267 289920 -118276 -429856 -188841 -53247 -357028 26851
8074 26851 -169735 -93537 -5046 -201843 75448 94890 -39382 -271140 -274429 -80936 -85713
8063 -85713 164219 -104705 -36645 168049 219183 80491 -305773 -293795 -204202 -194307 -50893
8052 -50893 -72138 -195734 131441 468543 377935 246787 118744 140652 -81606 -490314
8042 -490314 -504381 -435257 -657675 -146289 6617 345986 -26341 -305158 -158885 -309700
8032 -309700 -83361 52218 95091 261732 283661 49289 -37211 -131808 -208248 -277364 -504456
8021 -504456 -868110 -512927 -241688 -272242 -310081 -107770 24620 161369 -149373 -222060
8011 -222060 -46283 -131638 -65053 61826 -229852 -404971 -838924 -979125 -818136 -432006
8001 -432006 -506334 -744993 -712445 -263786 -470931 140313 190185 -136398 -179940 -214818 -361269
7990 -361269 -429294 -310099 -521398 -914430 -478050 -98662 -464336 -275796 -311957 -44336
7980 -44336 196980 -110624 -122948 -367331 -482536 -453815 -446653 -354884 -419461 -394721 -523183
7969 -523183 -514389 -219435 -53272 -242793 -70148 -107105 -123679 -33718 30499 49165 -166050
7958 -166050 -305795 -463339 -161806 194861 427062 -24178 -405436 -536600 -168803 276826
7948 276826 250129 -139040 -410209 -516356 -603330 -430141 -682426 -533423 -374440 -416304
7938 -416304 -301545 -239828 -512908 -719440 -763519 52401 55202 -272580 -518654 -520485 -778605
7927 -778605 -501937 -231778 -308186 -241932 -47886 -166176 -391985 43961 212961 -109005
7917 -109005 -71391 -768 209950 307876 48937 -183034 -351588 -426493 -507061 -165977 -66800
7906 -66800 -173507 -316347 -310375 -118293 117985 -139190 -234135 -169417 -604639 -532585 -106570
7895 -106570 96218 -31826 -93139 238887 188567 -191048 -392803 -420317 81378 -250194
7885 -250194 -724966 -607040 -345707 -469752 -601704 -665080 -860993 -973514 -721147 -480327
7875 -480327 -309028 -710582 -653965 -267315 -258151 -328620 -240869 -485725 -503040 -669906 -413072
7864 -413072 -648050 -789128 -296941 -144896 53148 -261110 -191054 -170484 -103150 -516625
7854 -516625 -310178 -404044 -166808 -151629 -574127 -492641 -96429 41979 14023 33251 -177654
7843 -177654 -205656 -728949 -920156 -671162 -771395 -865895 -539742 -662432 -412475 -399006
7833 -399006 -755458 -404150 -330723 -61567 -110321 103009 -210210 -240403 59232 -177450
7823 -177450 -55428 138348 -21521 119810 184203 -430163 -730607 -474530 -382498 -303738
7813 -303738 -179225 -409266 -357876 293622 282496 18420 -201095 -74737 -1189235 -922271
7803 -922271 -292449 -330093 -506886 -634032 -367498 -450987 -644651 -663628 -266254 -278302
7793 -278302 -8049 15861 -197483 -276325 -685429 -1004377 -536707 -638700 -716927 -583511
7783 -583511 -386371 -242237 -388391 -373035 -449608 -249322 -88197 -185351 -194650 -445270 -157847
7772 -157847 -85953 -112338 -186220 -391507 -432916 -636625 -611989 -696255 -558292 -486276 -424414
7761 -424414 -422205 -384297 -501255 -41872 -163898 -330837 -267786 109510 -145729 -485772
7751 -485772 -671058 -785531 -429078 -482132 -613206 -394465 -338622 -820983 -680572 -334427
7741 -334427 -471802 -457068 -255347 -37165 -506369 -1015996 -563157 -434011 -473719 -455356
7731 -455356 -100939 17021 59340 -215551 -311861 -436793 -109416 -217763 -133554 -102044
7721 -102044 -51354 -301347 -112569 -172936 -480648 -736789 -412648 32582 233195 233436 312663
7710 312663 20653 -515400 -255061 7373 -433328 -568147 -258143 -558016 -909800 -772228
7700 -772228 -354675 -354322 -653297 -508731 -133104 225475 -46015 -428187 -472858 -99740
7690 -99740 157334 -53169 82297 -187007 -265329 -250513 -412837 191346 485100 -197743
7680 -197743 -532122 -375598 -161649 -168015 -208279 -119555 -385849 -418294 -658050 -742861 -488113
7669 -488113 -370995 -414681 -365969 -242911 -329058 -4591 -191531 -210181 -236592 -250916 101330
7658 101330 -706121 -1027541 -502896 -81677 -37344 -171249 -264411 -120460 306558 -86300
7648 -86300 -550361 -427822 -88838 151087 125463 124530 -315299 -538484 -13726 -144996 -248444
7637 -248444 -368860 -101745 -236762 -181550 -375820 -291737 -328608 -214302 -197703 -474865
7627 -474865 -371854 -417366 -275729 -16862 -268626 -585439 -589526 -288127 -397959 -185100
7617 -185100 -238046 -641492 -610038 -725262 -681534 -435323 -37447 -177551 -237709 -489921
7607 -489921 -512039 -88267 -67200 223090 -29732 -300575 -371171 -396459 -412177 -341300 -185279
7596 -185279 69087 214511 -82499 -28609 -488214 -671177 -585648 -254331 -145402 -88484
7586 -88484 -173007 -217763 -193352 -108795 -238982 -243891 92135 57977 186536 -70392 -333123
7575 -333123 -611674 -223148 -293810 -360376 -120669 -75316 -103818 -268677 -347133 -545412 -466590
7564 -466590 -306787 -393434 -323681 -105535 -33959 -274986 -93953 -238085 -325376 -188276
7554 -188276 -239985 -500352 -717572 -516924 -103898 -162083 -351488 -158016 -38055 -339030
7544 -339030 -419070 -110656 -224401 -384405 -132639 193076 -96646 -65205 -122951 -151151
7534 -151151 64192 -50367 -246520 -252740 -223273 -142683 279616 349871 197909 645417 379271
7523 379271 248439 399649 602353 137494 47191 194919 -98115 313579 71517 51218
7513 51218 438148 616382 82285 -262299 311307 229218 400173 429926 -36808 -205590
7503 -205590 204744 94757 110565 120736 46351 195471 343289 550018 349512 303124
7493 303124 769078 185857 206700 418075 392564 665128 559569 112709 -26456 178297
7483 178297 110222 -100949 -140559 -382278 -299717 -112045 -262394 -67695 238502 294543
7473 294543 71400 -244309 -287440 53227 -10657 33160 84128 -316532 -258824 -31916 -207323
7462 -207323 -434846 -216997 -115967 -179458 -170306 28934 -33505 57200 -189200 -293189 -127714
7451 -127714 -253713 -357325 -353510 -445757 -576641 -315823 -424784 -70946 39863 2085
7441 2085 43956 -141005 133611 57292 -115530 -78276 247440 307542 98276 484156 140431
7430 140431 87579 -163803 -70203 -134514 -11356 -442793 -277169 -339249 -291074 83183 189409
7419 189409 490840 217773 244719 -189944 -408612 -501486 -522127 -47370 364079 695154
7409 695154 228281 215222 387925 346862 325295 217863 157963 -109386 209425 -138308
7399 -138308 -674483 -507265 -351447 -3905 214535 -55353 19992 25944 161001 131849
7389 131849 39736 118021 286597 -128156 -89210 44528 -189901 -202819 -630520 -405444
7379 -405444 -130592 3885 221344 -26915 64514 475551 209501 -189931 78312 198357
7369 198357 6582 129662 336173 344977 -18685 -173616 -174905 -161947 94899 152871 -12529
7358 -12529 -202991 -9992 -106116 -143125 42196 127904 -122853 -488499 -302840 -312484 -240635
7347 -240635 -151338 135136 86692 256782 323892 285344 -4222 333149 307415 294511 64012
7336 64012 -250632 -525765 -449062 -179171 219397 297281 69506 170308 -136733 -309647
7326 -309647 2029 183303 114200 244894 238206 132025 59190 354265 8719 -130453
7316 -130453 72552 -7736 100190 153614 188625 89297 -274 312608 282317 -116160 -129240
7305 -129240 162436 170401 390248 194673 -42811 436807 393563 138393 341845 -39336
7295 -39336 -268551 55435 462931 223665 309024 203359 340373 335539 77897 -22917
7285 -22917 51646 43502 61676 -190320 -223445 100723 615842 376296 -59858 -113699 48662
7274 48662 31699 77075 -275564 -118885 257190 61773 179204 235523 -528 -14295 -54851
7263 -54851 -148974 117057 292283 581956 589792 453554 733236 448143 135387 469476
7253 469476 550475 43138 68989 521552 605772 151680 133201 313733 785398 975697
7243 975697 596530 890948 801519 709471 692684 699673 321125 332790 693210 275164 313663
7232 313663 301518 325154 808517 709080 425214 781857 815149 151146 165738 431997 459802
7221 459802 441458 382879 514441 272324 51922 480346 225822 723869 940256 492523
7211 492523 132623 776296 592107 605846 805348 538394 913673 1178739 573983 122093
7201 122093 744695 1090800 1211657 1197187 1344106 1161183 1176466 1232738 1123877 1485638
7191 1485638 1630888 1683869 1349767 1768399 1537613 1507763 2021255 2034214 2068316 2013200
7181 2013200 1937281 1506224 1971605 2014606 1917991 1907925 2263839 2206708 1996505 2219802
7171 2219802 2164667 2234242 2591471 2782015 2779626 2939386 2924460 3445376 3403840 3657163 3451504
7160 3451504 3362476 3446544 3828006 3610446 3597582 4374807 4622082 4106475 4032678 4378804
7150 4378804 4394735 4833181 4836014 4873879 5450983 5718655 5996601 6469891 6419422 6989339
7140 6989339 7505070 7651415 8083284 8295233 9004352 9628757 9621423 10037110 10901374 11624909
7130 11624909 12413660 13258913 14314106 15889919 17084655 18935811 20714977 22772300
7122 22772300 25238705 27660314 30308043 32906263 34158184 34854971 35190542 34618970 34115652
7113 34115652 34084196 34791958 35792303 37376579 39761517 42911680 46705955 50851368 55744373
7104 55744373 61934419 68502154 74668863 79436331 81080845 78186469 71272335 62596204
7096 62596204 53440717 44894138 38306320 33411380 29471887 26241959 22995136 20920031
7088 20920031 19507914 18271799 17109022 15975183 15219566 14823698 14215101 13870093 13098065
7079 13098065 13035411 12978616 12341858 12178701 12289273 12381728 11832997 11089721 10625307 9799597
7069 9799597 9258987 8613130 7824604 7489342 6701606 6393668 6279040 6046851 6072561 5895638
7059 5895638 5636243 5610225 5184256 5079599 5004454 4983335 5031077 4871964 4754653 4803610
7049 4803610 5084757 4725055 4747746 4346924 3961013 4335295 4077148 4031686 4099730 3942217
7039 3942217 3677029 3639625 3480106 3525114 3445564 3359492 3399660 3531096 3377219 3148423
7029 3148423 3515345 3675763 3525724 3497141 3779613 4011179 3680067 3627791 3571602 3364852
7019 3364852 3278798 3397299 3589164 3474934 3241405 3165756 3684010 3459573 3740530 3647652
7009 3647652 3434602 3490597 2926467 2534280 2351363 2265919 2033569 1998899 2020294 1763119
6999 1763119 1807109 2099122 1879894 1457590 1748038 1686650 1560341 1769483 2239313 2004153
6989 2004153 1914657 1953808 1780750 1602318 1396139 1555596 1499057 1390207 1433233 1391340
6979 1391340 1300099 1679956 1400627 1146532 884395 1209067 1382145 1034881 931827 1245470
6969 1245470 807360 836166 932498 907698 963109 1424538 1627739 1579631 1438990 1325741
6959 1325741 1519890 1571928 1304594 1080449 1284803 1244954 1360831 1337666 1175543 1606949
6949 1606949 1819780 1779812 1520278 1299105 1814403 1531364 809816 895276 976743 1014501
6939 1014501 1352515 1229611 1325498 1387559 1130827 945664 1143973 1245901 1367801 1537267
6929 1537267 1070054 997765 1390745 1365297 1725652 1815908 1482269 1620931 1337787 1482567
6919 1482567 1746796 1877469 2137623 2303343 2412547 2129635 1487374 1557697 1597241 1176326
6909 1176326 1052359 1032371 867911 842718 834166 797938 988007 799810 715918 413068 314080
6898 314080 432354 593483 650687 884128 1303361 1430527 1491091 1222878 1110715 1074531
6888 1074531 1125763 1536629 1475659 1225818 1529751 1687947 1550067 1298692 1249405 1259140
6878 1259140 1216368 1070234 1031428 1107135 694355 546968 815624 1002531 918654 666562
6868 666562 636540 477338 216202 527908 279306 44592 -244716 -88022 422219 445626
6858 445626 200196 369896 271692 -224626 32058 176008 332714 486934 674492 419714
6848 419714 313998 595514 470691 363853 -101344 323354 521612 -122038 -13755 362362
6838 362362 394559 24270 65816 -287 -15229 -155169 -227457 -238279 -33387 622282 405156
6827 405156 249450 271501 258018 204846 293821 8688 80221 -5396 74215 125887 237404
6816 237404 197234 258143 84332 -414679 -593107 -25149 -4738 -242598 -88639 -133212
6806 -133212 -4170 103616 417834 244541 -20264 110009 112221 -254817 -146265 103775
6796 103775 446915 367223 350524 -134749 -162204 -30508 146445 -103844 83858 262642
6786 262642 1465 157870 415219 326966 178537 171879 -243074 26007 44302 50980 192198
6775 192198 212652 135329 385892 547421 219059 154927 248163 472750 236859 -184297
6765 -184297 247009 78870 202803 261384 332994 251591 -108560 172989 3510 147137
6755 147137 207979 -65457 -347604 -397502 -120807 51560 -252194 57119 88928 -158210
6745 -158210 -225490 -22896 363306 325261 220125 374654 509012 527886 386014 198019
6735 198019 235717 -73880 -398387 161266 572536 673886 521725 33647 -103904 216201
6725 216201 204543 -139522 -332715 -230414 -35708 156984 206285 -202226 -122014 -43889
6715 -43889 -103137 -95589 -79478 248840 123349 58620 174918 57374 -235149 -82998 103109
6704 103109 221001 118912 516484 916753 949899 533637 250303 200932 -242144 3141
6694 3141 165631 387958 400445 265747 171441 240219 52506 -3026 171875 218051 44278
6683 44278 -158017 -63065 52340 356856 221780 -17702 1448 192833 239817 65752
6673 65752 -369219 -71160 179633 279314 -44655 -279649 -89931 -181602 -53576 228873
6663 228873 331942 80984 408385 201119 -21749 -68605 -273863 63486 376303 215101
6653 215101 159593 248193 -15280 -263105 -27161 21499 170749 208371 -230746 -674532
6643 -674532 -337508 330368 118452 -36086 -238185 -290738 -374441 -436716 35512 115240
6633 115240 -67579 -335116 -264404 -22141 64996 246400 224240 63755 42971 -338357
6623 -338357 -126896 -36116 -169959 -46850 194406 138359 -52498 -430351 -70640 538516
6613 538516 322811 -145157 -336412 -610275 -334624 -111322 -221394 106727 265510 -357216
6603 -357216 -442031 -464450 -70158 -23093 -211936 -35216 152100 318130 310784 -153952 -32995
6592 -32995 -113725 331885 -49560 -690026 76572 484968 455521 -3375 -52759 -580747
6582 -580747 -455774 -603019 -424575 -319238 -153217 -221985 -558936 -373397 -178575 -273645
6572 -273645 228271 620609 518848 107950 55879 -179417 -104865 -1705 81673 -368282
6562 -368282 -414067 -182154 -167459 -185443 87226 247228 62558 -34629 -260600 43154
6552 43154 -75752 -219104 240117 140269 371472 367407 -395468 -345046 -148845 -225816 6815
6541 6815 -432455 -673436 -276604 -336960 -123207 210876 395851 43279 -293173 -585444
6531 -585444 -8943 -39923 -113694 86804 84294 204915 341048 444098 212032 87662
6521 87662 276713 443151 410564 165274 104751 147808 39371 236252 346286 222339
6511 222339 -315864 -392295 -69099 308200 543528 -150421 101957 372052 430161 220733
6501 220733 -25005 -290835 -116999 376605 -38095 -93661 6921 131842 159772 52041
6491 52041 52711 173097 -23899 -16520 28646 -113522 -448380 -370822 -48739 148601 31468
6480 31468 -14581 190987 -119881 -495085 -403942 -462081 -231804 -208577 -354721 -295176 -276304
6469 -276304 -96299 -156936 -436041 -484242 -570823 -680439 -558183 -317901 -399015 116249
6459 116249 101400 -310991 -550198 -338216 -302567 -238324 -284947 -272536 227622 559309 137707
6448 137707 99312 -66330 -234892 3050 -281706 -690461 -518987 -51398 155338 -12187
6438 -12187 -447778 -272550 -60929 191681 45260 -261243 -244717 -80591 -33646 -75869
6428 -75869 -198982 27781 -119041 -81641 -225913 -122808 -225744 -111000 384202 355735
6418 355735 -103061 70600 -47966 201836 137403 -97715 -337966 -235833 -325308 -224983
6408 -224983 202996 212094 -1771 -191116 -200890 -399652 -512494 -136306 123542 104613 312437
6397 312437 372495 16812 -269629 -199554 -204224 7723 -312409 -96245 351036 474865
6387 474865 245940 32071 85107 267170 139550 -166023 611295 766669 332178 870548
6377 870548 728584 193278 356280 442575 784732 847459 722045 285968 119033 123321
6367 123321 224080 478775 211761 96701 230015 -44062 -152117 991 56644 -388486
6357 -388486 -316680 -237642 -409070 85381 279237 39881 -271465 -141210 -182975 -257746
6347 -257746 42078 160154 174763 476413 280395 290871 252471 486295 502960 170142
6337 170142 52316 224080 -22185 10893 209828 76356 183496 288633 -173468 -196388
6327 -196388 93803 157567 -183552 -215122 218750 -15242 -376443 -34964 63512 48877
6317 48877 156515 344984 141265 163324 325276 233 -96600 60247 328207 124470
6307 124470 164657 -72207 429220 560642 103732 -44862 -172852 -93305 139771 39992
6297 39992 142638 112591 90448 -288285 -511468 -276469 -130039 320297 338962 117288
6287 117288 -226856 293148 279338 510295 122429 74033 350091 513471 155894 -1319
6277 -1319 294780 301600 96233 280761 146354 -78480 213567 -164548 113249 632159
6267 632159 334955 1064 101684 33542 19169 490652 456492 168413 -29533 -103551
6257 -103551 -189210 -162790 -57472 28921 409884 140932 129145 181346 -206317 91530 705940
6246 705940 837229 739981 772226 758761 767670 702425 592560 714259 273930 -94924 -33095
6235 -33095 130305 9409 82422 291763 261329 325982 230991 -382773 -138399 298165 636715
6224 636715 453229 726554 842406 782285 430666 -73837 -282407 54384 546756 592172
6214 592172 593229 280181 133430 450487 174140 154420 -32596 -199177 -54179 -4843
6204 -4843 252006 401773 -118316 120382 287700 218446 300635 238683 141902 -216951 -67191
6193 -67191 324610 355842 481083 892029 1017225 703405 273683 635702 244762 -347880
6183 -347880 16709 494240 685755 753658 580100 582910 800640 540929 542859 513471 415046
6172 415046 468861 688007 731836 605629 216705 125411 227277 276350 597556 760452
6162 760452 375599 189846 491734 507828 322832 599812 795163 926186 1001734 728391
6152 728391 799375 506285 814540 824351 789978 713498 548064 258740 252887 110918 357380
6141 357380 230614 526054 596563 497434 542497 529934 621905 615746 815931 624643 774278
6130 774278 827820 15022 -135975 297255 139291 116074 522905 739548 588994 549586
6120 549586 254296 361515 337633 242690 588309 661367 547864 872941 859449 1201893
6110 1201893 992678 415507 439420 412729 346702 545489 692303 260726 778372 509222
6100 509222 159108 206365 943991 974501 733814 547161 800196 721519 841787 817813
6090 817813 1148490 1379051 1375267 935571 765439 544018 689790 1138236 1219941 909985
6080 909985 543773 930294 1046197 643207 860193 1416431 889119 1051642 1075446 1355599
6070 1355599 1539017 1611729 1189323 972100 1606626 1862046 1705085 2315913 2022845 2074905
6060 2074905 2341396 2344064 2044263 2128112 2181148 1944585 1899775 2072538 1889051 2203755
6050 2203755 1961283 1751887 1845855 2012869 1893663 1967477 2186608 2655333 2917218 3205477
6040 3205477 3385625 3599700 3475186 3687067 3315214 2963690 2905963 3126566 3059060 3410520
6030 3410520 3292843 3058042 3375649 3594146 3760372 3153381 2981681 2796346 2751678 2857606
6020 2857606 3400437 3253679 3379554 3221236 3463318 4066615 3997275 3810841 3776564 3630383
6010 3630383 3766577 3583553 3707834 3746175 4113010 4027988 3852342 3787637 3935660 3893076
6000 3893076 3989798 4221887 4229804 4611536 4322463 4489936 4550742 4640850 4644905 4470228 4280199
5989 4280199 4258939 4606429 4780133 4848006 5083545 4914632 5194668 5379949 5668621 6338539
5979 6338539 6253620 6546065 6341624 6522282 7197656 7897824 8256781 8449552 8628186 8914513
5969 8914513 9551239 10093828 10558780 11148586 10721575 10346676 9821866 9577469 9776581 9583933
5959 9583933 9492980 9918974 10204937 10191727 10961776 11256337 11205402 12109434 12930912 13738181
5949 13738181 13927535 14720709 16105667 17239317 18328626 19709068 20960332 21952635 23571683
5940 23571683 25042215 25210051 24873448 23787047 22201657 20791605 19695029 19369750 18964257
5931 18964257 18921696 18748381 18846444 19510121 19702212 20015696 20685195 21606236 22643450 23782169
5921 23782169 24965797 26573846 28177036 29956995 31753426 33869667 36658495 39087343
5913 39087343 42086628 44040000 45187994 45317622 45322679 44845542 44893931 45465221 46542428
5904 46542428 47629768 48784976 49585894 49159892 48366308 46988544 45351597 43723182 42510169
5895 42510169 41311372 40798706 40302634 40834890 41037348 41511093 43084886 44671011 47060587
5886 47060587 49079509 51623623 54353977 56579204 58752970 61048974 63496919 66371961
5878 66371961 69428875 72227389 74830890 75731514 75439443 73425945 69784689 65000157
5870 65000157 59593256 55006806 51052873 47837693 44578943 42039735 40301637 39187660
5862 39187660 38581273 37963962 37962537 38358566 39087240 39655653 40009601 40336351 41209537 42748973
5852 42748973 43829514 44947648 45621337 46491751 46833276 46336034 44936134 42497133 40083927
5843 40083927 36798214 33950599 32027151 29966001 28358194 27002673 25702452 24920804
5835 24920804 24287649 23692319 23390300 23312593 23688504 23868225 24326599 24986371 25846845 26514884
5825 26514884 27640817 28419485 30062747 31778681 32987835 33069932 31327647 28100828 24099328
5816 24099328 21219135 19133147 18005483 17112698 16073546 15636532 15276481 14932693 14850804
5807 14850804 15137708 15647484 15419190 15518767 15294801 15142149 15073943 15206216 15179652 14548235
5797 14548235 14915673 14567388 13612029 13285557 12401796 12037499 11444222 10677586 10106643
5788 10106643 10161343 9735047 9573855 9491255 9241362 9603127 9858339 9815452 9549078 9344231
5778 9344231 9634390 10078389 9940312 9989019 10016439 9785314 9998777 9673109 9717349 9893842
5768 9893842 10287421 10368475 10390940 9887493 9379693 9551833 9479327 9051942 8819036 8647758
5758 8647758 8363695 8370286 8445289 8639789 8576027 8495039 8620240 8537103 8925402 8904802 8429228
5747 8429228 9012843 9224374 9408664 9538137 9676376 9824808 10424581 10561247 10518565 10907603
5737 10907603 11088461 10990707 10820729 11046324 10957509 10864610 10747783 10237555 10285246 10444960
5727 10444960 10385494 10060886 9938736 10385726 10579786 10777800 11133190 11530042 12197388 12541312
5717 12541312 12538910 12384268 12045330 12029760 11776826 11218199 11009103 10746676 10703442 10799459
5707 10799459 10833400 10976157 10412586 9601265 9239107 8642773 8396270 7914712 7641101 7451758
5697 7451758 7359342 7334674 7098458 6894449 6992255 7242215 6994159 7123513 7331245 7873796
5687 7873796 7871084 7210232 7353321 7558397 7580820 7762138 7462944 7322470 7375062 7487513
5677 7487513 7176693 6975833 7029871 7062023 6870377 6633315 6767838 6207429 6211169 6306788
5667 6306788 6627528 6597927 6655586 6581102 6486011 6655597 6776055 6655056 6585456 6831840
5657 6831840 6761938 6475417 6565629 6953505 7063983 7172976 7071423 6881033 6741943 6605022
5647 6605022 6470210 6428555 6434356 6299272 6454703 6118892 5570982 5598922 5590342 5557304 5449474
5636 5449474 5669256 6104171 6084575 5967820 6163711 5696283 5919502 6075658 5987506 5867899
5626 5867899 5604844 5611783 5475658 5287851 5212993 4880314 5326693 5915002 5459947 5427006
5616 5427006 5205050 5677035 5644603 5503432 5486189 5578835 6004390 5792448 5428962 6073319
5606 6073319 5996435 5588805 6353406 6793714 6756390 6747091 6425417 6900218 7509609 7410022
5596 7410022 7754488 8528090 8846306 9052951 9783152 9939244 10533457 10943887 11968417
5587 11968417 12374940 13398421 14722248 16120688 16945903 17663924 18694661 20094807 21170719
5578 21170719 22926896 24900450 27245609 30274660 33733458 36355156 36064941 32733759
5570 32733759 27598708 23357128 20111334 17908395 16473095 15532651 15175044 15682315 15700565
5561 15700565 15314821 15134471 15192445 15692535 15482708 14763184 14012919 12965598 12265125
5552 12265125 11316759 10919940 10655643 10489384 10884547 10638714 10781838 10856562 11103336 11809751
5542 11809751 11577960 11176708 10743418 10369795 9884858 9909190 9773478 9536983 9436317 9610418
5532 9610418 9760547 10063138 9908703 9861554 8842111 8366996 7909170 7551854 7500759 7058406
5522 7058406 6402497 6268106 6453337 6321061 5852628 5833034 5835668 5550092 5179637 5303936
5512 5303936 5448613 5264843 5586433 5132751 4754004 4684344 4832191 5166479 5438813 5330318
5502 5330318 5162342 5162894 5334037 5040140 5119080 5106038 4915369 4869080 4952913 4950502 5042442
5491 5042442 4926744 4957231 4873357 4478239 4459061 4292208 4053675 4594196 4501161 4624758
5481 4624758 4180154 3998478 4134527 4189913 4455661 4342771 4220452 3932578 4490210 4398358
5471 4398358 4794113 5161618 4900233 4975303 5070025 5114096 5024827 4995944 4763280 4334401
5461 4334401 4562607 4180124 3986623 4005101 4124761 4341764 4354288 4558893 3976079 3851532
5451 3851532 4006265 4175534 3718290 4132139 4302857 4006230 3939761 3515127 3354376 3705416
5441 3705416 3654944 3429585 3801101 3980607 3803832 4109875 3776450 3698876 4285961 4298513
5431 4298513 4046382 3374247 3341651 3586159 4159689 3873015 3660614 3849350 3457571 3388016
5421 3388016 3528144 3513567 3306801 3423516 3571383 3828322 3622686 3494313 3487439 3462091
5411 3462091 3365260 3588810 3819679 3887193 4056821 3811716 3656244 4044085 4096248 3654738
5401 3654738 3834505 3931021 4525920 4532699 4664105 4726632 4612154 4437552 4628221 5230877
5391 5230877 5313691 5002236 5258126 5603132 5502888 5669504 5953460 5687397 5650628 5694573
5381 5694573 5599402 5715727 5881515 5839124 5992141 5982334 5985235 6328497 6925911 7649375 7806729
5370 7806729 8277557 8580337 8988136 9744397 11042712 11833427 12937809 13598202 13935421
5361 13935421 14180086 14016477 14148657 13482370 12524508 11586795 10676214 10282321 9951374
5352 9951374 9501742 9465526 9435897 9457819 9600185 10219877 10419394 10756652 11445136 12169939
5342 12169939 13005021 13678126 14764409 15572874 16699602 17983393 20162871 22104570 23247532
5333 23247532 23059977 22083961 20749185 19180921 17433534 15561158 13760268 12152061
5325 12152061 11628678 10795586 10161659 9764647 9389233 9204848 9370181 9514890 9657447
5316 9657447 10023436 10106456 10279731 10631925 10932559 11404883 11933154 12586661 13205950 14177604
5306 14177604 14764670 15111043 14886439 14201496 13090521 11912497 10625459 9599820 8881318
5297 8881318 8454499 7696126 7564880 7542794 6983551 6091157 5978158 6167605 6098152 6216016
5287 6216016 6039616 6042374 5860931 6084863 5903799 5923943 6471709 6772178 6262523 6053035
5277 6053035 5952089 6254430 7009506 6712504 6098008 6396733 6372607 6342422 6157555 6318455
5267 6318455 6197370 6277659 6913954 7510203 7723855 7947954 8154844 8703167 9010169 8720636
5257 8720636 8535512 8530397 9108316 9162159 8099735 7722957 7396506 6669666 6125958 5970254
5247 5970254 5899218 5545655 5402460 5065249 5337570 4940929 4809233 5326134 5244791 4954198
5237 4954198 4894104 4893375 4485287 4775050 5375454 4889503 4210281 3879020 3806120 3772597 4114263
5226 4114263 3834831 3629921 3581708 3417640 3552480 3850123 3893763 3890361 3761807 3445817
5216 3445817 3474697 3482329 3552564 3389534 3408612 3423770 3131302 2821661 2740806 2780096 3256190
5205 3256190 3361073 3028383 2833485 2938012 2928714 2897241 2945975 2958034 3127980 3239174
5195 3239174 3402958 3516091 3909493 3605733 3349890 3539496 3519261 3135048 3123953 3252432
5185 3252432 2946533 2727601 2811397 2585463 2173182 2218162 2119047 2433272 2259724 2118351
5175 2118351 2156192 2421237 2428857 2273820 2140944 2322224 2911224 2897371 3064673 2537594
5165 2537594 2460332 2581430 2521944 2640901 2776089 2703412 2602109 2640995 2579114 2983475
5155 2983475 2837333 2527413 2733686 2597903 2502769 2911170 2929202 2891715 2687059 2412456
5145 2412456 2427869 2324586 2644308 2434613 1896766 2052757 2134722 2267573 2609064 2544207
5135 2544207 2300282 2299548 2557227 2384758 2743935 2552429 2532838 2365580 2296161 2528317
5125 2528317 2088725 2452745 2323163 2324221 2605140 2694938 2984214 2936657 2947487 3278265
5115 3278265 3388087 3619162 3322911 3239756 3178065 3614582 3442872 2587984 2384691 2215843
5105 2215843 2375794 2372936 2400893 2342277 2614816 2681710 2078158 2166554 2227170 2406184 2410541
5094 2410541 2467127 2346886 2081437 2220188 2226241 2456877 2581893 3046893 2654157 2095414
5084 2095414 1993600 2105238 2220488 2905761 3032256 3120595 2954188 2730059 2569340 2145310
5074 2145310 2420892 2402875 2301842 1808207 1840594 2043194 1787528 1463516 1148826 1830698
5064 1830698 2408235 2086526 1780400 1688461 1362352 1467172 1700825 1844798 1976323 1712322
5054 1712322 1792529 1322682 1268062 1548006 1799879 2033491 1823654 2026075 1946391 2103649
5044 2103649 2221305 2219877 2106888 1833273 1593288 1154608 1133321 1429868 1173397 1371057
5034 1371057 1647645 1467947 2015446 1818578 1511772 1773972 1208076 1087491 1359015 1220762
5024 1220762 1634433 1549575 1457915 1523531 1551045 1498701 1343906 1196542 1630746 1250159
5014 1250159 1474431 1889496 1684523 1462651 1279688 1107318 1427204 1637993 1557254 1456676
5004 1456676 1616889 1871170 1448205 1568558 2059505 1625192 1809824 2066110 1882019 1825866
4994 1825866 1683137 1833179 1907965 1636683 1286948 1477865 1382735 1475004 1832808 1264241
4984 1264241 1465862 1412663 1171413 1295296 1338164 1356888 1535856 1574170 1648473 1971926
4974 1971926 1776346 1784827 1886017 1958662 1636391 1954654 2280770 2431449 2099136 1703891
4964 1703891 2084537 2292673 1839966 2033338 2045084 2112284 1723900 1617026 1565630 1625497
4954 1625497 1645341 1842640 2098710 1790785 1567121 1400036 1390018 1200368 1615519 1842933
4944 1842933 1640159 1578347 1590443 1602236 1505646 1924782 1685640 1656821 2066085 2205580
4934 2205580 2138029 2225088 2280382 2143405 2333553 2240181 2456965 2418616 1964087 2026081 1648867
4923 1648867 1656109 2042371 2309151 2887700 2586668 2331693 2416215 2360835 2497096 2320179
4913 2320179 2218271 2241846 2371722 2450446 2284738 2144346 2424202 2518567 2714842 2424850
4903 2424850 2771443 2702401 2804288 2936634 3055066 2671817 2860911 3066888 3065966 3163569
4893 3163569 3260548 3236003 3218188 3298736 3237373 3628158 3686598 4134715 4382924 4629333 4707551
4882 4707551 5214703 5309156 5509156 6463415 7374240 7536988 8494273 9461557 10885955 11679063
4872 11679063 13195389 14577285 15988479 17857725 19488101 19984203 18334730 15359825
4864 15359825 12164883 10208223 9028959 7786034 6713948 6379439 5962880 5422202 5242294
4855 5242294 5204838 5110543 4779576 4665064 4071142 3803813 3533432 3731410 3748965 3870793
4845 3870793 3796260 3641989 3541724 3613934 3616392 3453435 3537282 3145391 3168377 3389585 3166573
4834 3166573 3131576 3283370 2995403 3102188 2577532 2894117 2901930 3026284 3399709 3629282
4824 3629282 3818781 3289338 3072023 3018046 3049502 3256733 3158570 2971613 3127524 3420817
4814 3420817 3143526 3566554 3918919 3814839 3759178 3608532 3846944 3751214 3444965 3688761
4804 3688761 3772189 3290818 3330278 2989362 2932085 3309126 3151559 3018091 3241269 3037680
4794 3037680 3105584 3056990 2732129 2850979 2891116 3062849 2995996 2665151 3137906 2944743
4784 2944743 3175970 3460832 3011501 3030245 3011596 3269579 3562693 3214725 3383219 3668938
4774 3668938 3521235 2985460 2948864 3122679 3303003 3210881 3082559 3016324 3191184 3120633
4764 3120633 3193546 3482173 3306276 3286953 3090627 2957975 2889496 3172551 3040853 3269781
4754 3269781 3131761 3454929 3637920 3644775 3453184 3094579 3519075 3492588 3305835 3488566
4744 3488566 3432403 3194956 3343987 4046831 3888305 4051548 3526149 3853025 3994510 4122681
4734 4122681 3952705 3719384 4218791 4313801 3923529 3647281 4236662 4536478 4240569 4128586
4724 4128586 4559692 4767292 4811885 5057169 4999423 5253671 5444969 5372773 5492054 5474374
4714 5474374 5425651 5607502 5801216 6132286 6149486 6090761 6171858 6823244 6949638 6694832
4704 6694832 6811940 6692093 6818420 6995314 7289333 7224182 7624377 7958026 8175345 8710023
4694 8710023 8607669 9028514 9713131 10341669 10542093 10721570 11086315 11604407 12702167
4685 12702167 13022208 13168636 12680495 12357295 12134306 12165731 12610151 12544634 13089501 14123736
4675 14123736 14344593 14702744 15408770 15914500 16383041 16893223 17647335 19433378 20692694
4666 20692694 22263108 23478014 24890576 26415189 28134189 30404648 32343328 34153082
4658 34153082 35920394 36809880 37387326 37437036 36534837 35206510 33947094 32809156 31051462
4649 31051462 30111051 29473676 29188325 28991732 28786844 28667424 28735214 29506321 29959307 30685764
4639 30685764 31799654 33363965 34987496 36492215 38128462 40792826 43545595 46609028
4631 46609028 49903702 52593911 55419651 59373614 62563693 65430767 67239395 67787399
4623 67787399 67189652 64676717 60843101 56474070 52328812 48588096 44893152 41563358
4615 41563358 39302353 37247698 35982642 34818979 33525181 32923461 32116265 31798402 31611730
4606 31611730 31802516 32423417 32576044 33620275 34413416 35091796 35954998 37372869 38851925
4597 38851925 40394452 42079695 44083286 45570936 46157065 45661153 44781165 42933214 40290554
4588 40290554 37603680 34775959 32477374 30549933 28383409 26564714 25624699 24226123
4580 24226123 23025929 22147163 21171857 20811036 20464480 19757182 19126010 18939080 18134740
4571 18134740 17357298 17325654 16789274 16380761 16004505 15692124 15552552 15335857 15382946 15601320
4561 15601320 15519004 14917353 15356901 14923795 14527096 14526592 14313715 14209444 14476646 14684963
4551 14684963 14487956 14409301 14754559 14805837 14469556 14486219 14309335 14459853 14271457 14342034
4541 14342034 14485166 14145546 13784826 13880933 13821581 13863391 13999187 13430624 13527062 13399971
4531 13399971 13330968 13276278 13018505 13266381 13100480 13118038 13477648 13103749 12881984 12720143
4521 12720143 12834056 12964302 13110780 13367545 13090033 12915785 13443823 13378805 12907437 12788778
4511 12788778 12978069 13230154 13201047 13235646 13066744 12735582 12857805 13012026 13016989 12964771
4501 12964771 13031784 12767900 12673431 12758205 12731437 12774634 12494421 12410225 12595816 12823417
4491 12823417 12916501 13073849 12973687 12918656 12892068 12758220 12745263 12339072 12245004 12336608
4481 12336608 11955716 11878538 12061881 12614637 12162243 12059347 12208120 12053830 12031095 12501294
4471 12501294 12699950 12517122 12319339 12726885 12829303 13066331 12595290 12205778 12519452
4462 12519452 12597112 12190300 11954778 11911265 11741994 11387098 11644054 12101876 11931923 11998840
4452 11998840 11232991 11368734 11516026 11333586 11108754 10912212 11053691 11323269 10864073
4443 10864073 11086205 10939600 11050849 11093878 11132494 11428174 11497487 11893893 11529198 11538194
4433 11538194 11354693 11456913 11461935 11743812 11492364 11295302 11885725 11687704 11331177 11835038
4423 11835038 12424175 12550521 12567813 11906583 11896600 11748319 11804093 11671410 11705631 12110890
4413 12110890 12191791 12401623 11881251 11939587 12073838 12154501 12331242 12247193 12058986 12329654
4403 12329654 12335862 12847651 12886257 12499731 12754660 12899568 13404865 13743403 13561328 13600997
4393 13600997 13429785 13388695 13361227 13442597 13246770 13039636 12848323 12803350 12772918 13261755
4383 13261755 13307270 13401543 13556563 13039333 13232887 13016783 12901518 12942656 13131903 13219761
4373 13219761 12873758 13098489 13249562 13126215 13198920 13590260 13597645 14003816 14128436 14037709
4363 14037709 13884869 13712173 13685605 13433071 13720324 13702761 13801714 13706049 13725258 13720673 13591248
4352 13591248 13423964 13218932 12939303 13299783 13275490 13149246 13394719 13725745 13568743 13599250
4342 13599250 13715195 13653730 13605531 13702087 13295748 13695908 13773006 13970778 14115484 13942649
4332 13942649 13809783 14016336 14378456 14526801 14349855 14362619 14381544 14155936 14292000 14094649
4322 14094649 13964712 14264118 14221093 13957303 13707065 13532299 13423072 13359897 13533057 14063967
4312 14063967 14387101 14035626 13864129 13881299 13906002 13811044 14060387 14260609 14243285 14269275
4302 14269275 14251833 14559756 14685723 14585280 14636760 14530785 14231918 14088770 14357953 14282568
4292 14282568 14164570 14111559 14040617 14035842 14475609 14576520 14668044 15034629 15373643 15370006 15544532
4281 15544532 15634926 15704305 15766569 15852283 16209683 16597883 16829183 17144654 17118019 17463644
4271 17463644 17626660 17687266 17891637 17515125 17365353 17499770 17491595 17330712 17357693 17166452
4261 17166452 17315482 17857297 17769867 17767199 18047827 18305374 18353512 18747154 18994245 18994949 18905833
4250 18905833 19258435 19010661 19247724 19455236 19701555 19941707 20355054 20670112 20707830 20767124
4240 20767124 20706510 20781676 20615794 21054353 21228618 21496391 21482875 22059759 22698987 22862993
4230 22862993 23495208 24266467 24816875 24938470 25611377 26114640 26119233 27128987 27609592 28515901
4220 28515901 28831828 29610146 30552068 32153008 33585313 34311194 35619159 36431332 37675740
4211 37675740 39159793 40452540 42206493 43740150 45274715 47780637 50284908 52618090
4203 52618090 55194623 57822001 60816982 64610399 68522207 72686218 78124198 84039261
4195 84039261 90669457 98392409 107342137 117841151 129481687 143245436 159442062 177545875
4187 177545875 197268394 219300914 243273939 269054453 295735929 320166393 337932163
4180 337932163 344555014 332619878 302184871 261139407 220605933 187022136 161131409
4173 161131409 141840330 127011063 115937035 106787309 100084609 94263431 89148784 84952155
4165 84952155 81062981 77850186 74928025 72091380 69188209 66737766 64673876 63461792
4157 63461792 62000489 61220401 60180756 58748730 57783915 57075051 56419335 55400425 54784945
4148 54784945 54562555 54597047 54377024 54018375 53415426 52558571 52016499 51171923 50091259
4139 50091259 48618380 47013354 45794145 45245305 44485380 44229709 44123324 43813856 43347857
4130 43347857 43010359 42352051 41413414 40943866 39904404 39034944 37858317 36722162 35831671
4121 35831671 35285456 34043416 33076101 32614369 32845243 32582526 32623668 32701446 32460906 32135085
4111 32135085 32382493 32057732 31692178 31838209 31732550 31407940 31355557 31076130 31148642 31108908
4101 31108908 30979629 31051353 30611209 30436835 30443536 29760082 29728843 29964693 29576505 29088260
4091 29088260 29169673 29446115 29018625 29108748 28920395 29271443 29600122 29365693 29312929 29201219
4081 29201219 28724596 28999073 28998220 28771807 28596548 28746514 28808096 28840388 29173443 29060105
4071 29060105 29281978 29693490 29744354 29891861 30515274 30981469 31599306 32157470 32698178 33920755
4061 33920755 34478338 34958650 35307525 35463053 36002470 36734578 37011676 37807675 38241282
4052 38241282 38822573 39419354 39938906 40639371 41137845 41590452 42005663 41116563 40172304
4043 40172304 39958448 40419022 40572359 40552608 40888032 41259349 41735988 42049528 42612167 43015191
4033 43015191 43681182 44055485 44622968 45412989 45951569 46372437 47280884 47762642 49072268
4024 49072268 50094062 51859754 53405853 55111909 56185064 56706389 57388039 58296986 59552145
4015 59552145 61215496 63144001 64887166 66569288 68109832 69413495 69653441 70288441
4007 70288441 71153004 72263799 74081076 76290715 78074659 80666166 83304085 85984672
3999 85984672 88212583 90343528 91962152 94098132 96768974 99188736 101632565 103104639
3991 103104639 104154620 105642534 107533870 109315947 110763046 112584310 114531400 116650924
3983 116650924 119111877 120975283 123141501 125404200 127149425 129566406 132445292 135089006
3975 135089006 137671691 139921703 142382521 144912332 146998120 149286552 151398442 153374194
3967 153374194 155207890 156277374 155878080 154588439 153426341 151045650 148937363 146243985
3959 146243985 142378749 138122246 133170986 128962917 125259566 122187166 119132274 116755807
3951 116755807 114756917 112866456 111131719 109765499 108936093 108402015 107729557 107226099 106853443
3942 106853443 106979383 106999613 106498072 106020147 105124689 102775402 100329456 97349115 94027312
3933 94027312 90769161 88056938 85023398 81885384 79499223 77291307 76024325 74833078
3925 74833078 73456223 72046822 72134271 72213060 72064613 72607847 73333171 74473354 75912627
3916 75912627 76999014 78200604 79253760 80808642 82114590 83494245 85194295 86213144
3908 86213144 86524172 86597566 86400279 85557905 84444222 83437919 81966615 80471088 77912893
3899 77912893 75957139 74173297 72153002 70652773 69136948 67809076 67536450 67030916
3891 67030916 66585992 65973055 65766560 65673108 65515017 65582094 65316813 64885053 64685090 64219150
3881 64219150 63383023 62558876 61436730 60540566 59326322 57894133 56227960 54606140 52598182
3872 52598182 50969761 49089247 47225161 45589816 44471787 43525960 42198465 41097401
3864 41097401 40247385 39555227 38898334 38642892 38530514 38123239 37618685 37435560 37397768 37052361
3854 37052361 36474338 36568222 36544623 36440292 36309382 36108912 35442765 34390900 34649363 34337164
3844 34337164 33121423 32164385 31552705 30631300 29691895 28978542 28438219 27799600 27024788
3835 27024788 26831701 26619696 26315321 25575348 25118304 24808583 24470459 24093369 23684473
3826 23684473 23562703 22946127 22611082 22273954 22360802 21847586 21547636 21817078 21672167 21352785
3816 21352785 21323648 21126797 21099093 20941496 20689117 20805640 21113439 21170539 20905553 20798099
3806 20798099 21032404 21290874 21157152 21020543 21132504 21141484 21632283 22040525 21711699 21703743
3796 21703743 22009841 21912092 22190295 22512514 22693742 22515892 22721864 22782076 22628918 22804999
3786 22804999 22629401 22610891 22297728 22124639 22862052 23278847 22940044 22773214 22576093 22480188
3776 22480188 22575656 22699418 22860889 23083101 22973674 22478792 22600571 22308009 22542882 22669926
3766 22669926 22634448 22870468 22991356 23566753 23841831 23807108 24300801 24271051 24010650 23886178
3756 23886178 24059240 24381701 24348609 23778947 23447320 23892031 23826235 23862898 23626460 23218381
3746 23218381 23171399 23129674 22695105 22757031 22923132 22871199 22879032 22524516 22214072 22073767
3736 22073767 22049564 22606814 22438206 22569116 22151390 22637196 22716363 22718122 22696330 22868451
3726 22868451 23297284 23650203 23811679 23891555 23985283 24159937 24106794 24039229 24184087 24825677
3716 24825677 25165002 25067337 25511832 25844040 26139920 26208488 26919270 27063861 27356028 27881650
3706 27881650 27906312 28237705 28770111 29072244 29286102 29675845 29979721 30890267 31351038 31506610
3696 31506610 31535689 32073825 32583028 33106808 33230941 33578148 34138861 34374603 34914072 35684534
3686 35684534 36470062 36621547 36978816 37504785 38720567 39955503 40556794 41287271 42415776
3677 42415776 43294514 44455590 45464175 46680534 47809763 49303288 49967122 51344790
3669 51344790 53393739 54352236 55214942 56353556 57802225 59323560 60131140 61819053 63236388
3660 63236388 64539543 65424452 66528457 67668910 68701249 69800546 71010288 71808229
3652 71808229 72734321 73591686 74305946 75730030 76327407 77216390 77927572 78974774 80142711
3643 80142711 80575881 81026631 81957530 82808953 83779685 84212389 85250531 86176475 87797795
3634 87797795 89136218 89804806 90845047 91640144 92846043 94123059 94754486 95504533 96638086
3625 96638086 97362689 98689937 100473428 102590499 104902384 106927802 109429141 112493084
3617 112493084 115585506 118582991 121869162 125332675 128433796 131795236 135528999 139297283
3609 139297283 143285888 147428146 151322310 155594536 159308404 163686601 167967118 172402148
3601 172402148 177222378 181739635 186304371 190513684 194678798 199102766 204070131 208450012
3593 208450012 212973891 218060688 223369941 228975193 235113834 241958797 249308396 257649655
3585 257649655 266918348 276538741 287789706 299218593 310645046 322999106 334755582
3578 334755582 346353889 356378399 365481474 372404167 378073898 382870280 385031871 385512133
3570 385512133 385325749 385230905 384851434 384169976 383526178 382808979 380883448 378302617 374740598
3561 374740598 369608098 361854529 352936643 342904861 331295274 318202687 304801125
3554 304801125 291590411 278361980 265906052 253943418 242892304 232269812 222545145
3547 222545145 213588640 205045320 196572616 188879234 181366131 174223703 167695300 161097165
3539 161097165 154357159 147529478 141600059 135795844 130346354 124953948 119992436 115099370
3531 115099370 110431626 106663213 102868698 99452318 96772156 93851871 91130855 89128844
3523 89128844 87088598 85318952 84046762 82320938 81116149 79263088 78003552 77161188
3515 77161188 76295734 75008073 73624832 72768648 72205753 71407184 70652629 69934402 68848173
3506 68848173 67747475 66955106 65986556 64640319 63926829 62836172 61772303 60270847 59041000
3497 59041000 57575559 56220580 54639014 52906657 51858022 50801184 49334157 47822649
3489 47822649 46265087 44990953 43901605 42809515 41847392 40102966 38824244 37892818
3481 37892818 36920879 35804920 34965899 33758897 32982614 32234845 31059469 30762636 29833454
3472 29833454 28933860 28533161 28099456 27627983 27322083 27058581 26819390 26258937 25833792
3463 25833792 25031697 24515975 23952619 23362001 23223734 23071156 22420617 22088506 21475232
3454 21475232 21046027 20985806 20820714 20628427 20026788 19644977 19455397 18876301 18780702 18749614
3444 18749614 18062711 18100736 17532979 17264108 17105955 17017195 16843922 16127977 15695501 16175527
3434 16175527 15994669 15288115 14990115 14742314 14804748 14514410 14513535 14371659 14594301 14107723
3424 14107723 14055378 13898047 13690953 13363910 13269366 13177926 12805266 12578944 12614267 12732803
3414 12732803 12099291 12230711 12331606 12313062 11953807 11894189 11936824 11720966 11845828 11731157
3404 11731157 11767298 12036350 11602269 11464959 11451740 11750109 11543186 11301436 11093095 11284152
3394 11284152 11590683 11468850 11496848 11491861 11197977 11207953 10993905 10740454 10257774 10350922
3384 10350922 10652973 10346310 10248805 10554928 10245906 10106887 10436310 10322778 10325374 10125755
3374 10125755 10359026 10542730 10777777 10753090 11024520 10870406 10715858 10752797 10748794 10683794
3364 10683794 10671662 10949272 10918962 10268287 10617718 10444941 10445289 10244623 10423029 10403120
3354 10403120 10170327 10356789 10164174 10514718 10183290 10137182 10359377 10491278 10528212 10889969
3344 10889969 10576794 10850764 10991903 10948910 11142060 11026774 11068752 11118386 10541176 10879936
3334 10879936 11069805 11140896 11196346 11177468 11678733 11718112 11529484 11389181 11349385 11343511 11973545
3323 11973545 12402385 12561036 12545481 12991694 12723114 12786429 13785251 14033921 13991357 14361627
3313 14361627 14652505 15030780 15381810 15984635 15694162 15154909 15023791 14946037 14591015 14675874
3303 14675874 14620516 14654242 15063851 14543620 14606855 15131150 15691923 16146800 16273196 16507922
3293 16507922 16498238 16632468 16521756 17050454 17769624 18275942 18751502 19142565 19936059 20597116
3283 20597116 20635492 21025455 21583684 21742277 21743573 21742112 22309232 22674556 23511693 24519240
3273 24519240 25589212 25981367 27014742 27874174 28843218 30072844 30761374 31387209 32137732
3264 32137732 33097518 33621437 34260533 35279769 36109965 36701112 36703058 36435111 35460676 34735276
3254 34735276 33600096 31864419 30025571 28188690 26890787 25606732 24450736 23740848
3246 23740848 22965156 22754640 21803771 21157411 20949267 21209339 20999189 21177441 21566870
3237 21566870 21327177 21129568 20300912 19609648 19643303 19639995 19162721 19351707 19703590 19685396
3227 19685396 20129383 20499508 20873513 21281406 20603840 19859161 19363468 18590083 18285294
3218 18285294 17927388 17456255 17020524 16526278 16227766 15843938 15820122 15645761 15587272 15521081
3208 15521081 15809618 16262857 16728814 17035349 17462952 17774614 18296039 18657921 19235215
3199 19235215 19391794 20022568 21113938 21238412 20643962 20256168 19496997 18711805 18354110
3190 18354110 18248112 17624015 17504064 17347065 17319450 17261823 17741279 18192420 18107469 18027867
3180 18027867 17998751 18682652 20117863 20959511 21724937 23289736 25142144 27132773 29191679
3171 29191679 31891678 34754471 37429234 40816957 44364742 48514986 52985517 58208577
3163 58208577 62245371 62956531 57476191 49300740 42089059 36775171 32959880 30033985
3155 30033985 28148347 26970781 26332401 25293941 25120700 24932517 25375349 25863231 26481883
3146 26481883 27198126 28542683 30112501 32109449 34242059 36146148 38997870 42190756
3138 42190756 46238118 50947181 55576719 58813102 57808945 51591486 43526780 36998437
3130 36998437 31614314 27872099 25519010 23665181 22034291 21366942 20326957 19511788
3122 19511788 18520427 18121605 17384591 16833341 16175219 15774784 15427916 14134367 12982575
3113 12982575 12447809 12222731 11829652 11606191 11250883 10936120 10763389 10771402 10918345 10692728
3103 10692728 10548326 9797518 9752850 9654872 9957363 9830406 9487509 9800872 9516446 9290380
3093 9290380 9148956 9290180 9639018 9031249 8673941 8525963 8447539 8491936 8236629 7739033
3083 7739033 7672560 7459326 7346698 7471788 7610755 7137361 7236370 7614874 7237328 7461997
3073 7461997 7268772 7098787 6954264 6912149 6894164 6807897 6482506 6219471 6196845 6163260
3063 6163260 6134014 5939195 5858641 5734417 5755108 5632897 5665178 5870754 5965787 6034584 6220336
3052 6220336 6278631 5743883 5666780 6076959 6377939 6319417 6502907 6185324 6311112 6580932
3042 6580932 6940376 7113105 7051906 6898723 6827668 6249842 6562222 6531434 6181298 6020602
3032 6020602 6009274 5721295 5729556 5356296 5698638 5725080 5555272 5826957 5892941 5775689
3022 5775689 6062166 5995918 6277841 6915138 6628252 6686030 6966590 7298785 7291403 7119764
3012 7119764 6938226 6860425 7269411 7534844 6967478 7081149 7504934 7624009 7358220 7202532
3002 7202532 7144910 6174361 6255622 6334321 6539281 6508987 6159163 6823398 7092241 6757236
2992 6757236 6951631 7127818 7113823 7594497 7673399 7686351 8190395 8560239 8941963 9063069
2982 9063069 9407541 9358698 8981516 9585817 9479420 9506121 9190852 8462407 8307646 8208310
2972 8208310 7874579 8013755 7985704 7581125 7579636 7155651 6876389 7367687 7706385 7346826
2962 7346826 7018715 6575759 6596211 7198916 7224791 7057490 6922964 7261326 7378092 7776460
2952 7776460 7856219 8118852 8051610 8315661 8461868 8569533 8380443 8561270 8597012 8853388
2942 8853388 8829950 8458956 8420632 8357043 8367625 8181063 7556924 7716957 7794715 7800421 7462047
2931 7462047 7318952 6991678 7048346 7610354 7562001 7417327 7509212 7614016 7588073 7647369
2921 7647369 7563839 7478981 7464222 7776968 8065099 7600381 7006312 6973258 6723449 6513714
2911 6513714 6592409 6743695 6850439 6435827 6300152 6597462 6490685 6220397 5882755 5722849
2901 5722849 5781115 5809678 5896626 6536861 6695511 6506312 6050502 6268420 6403365 6304006
2891 6304006 5839841 6304997 6314835 5696769 5254433 5256145 5552001 5477433 5427386 5440770 5447531
2880 5447531 5063777 4940832 4874110 4826294 5014614 4832677 4141205 4158813 4142454 4257845
2870 4257845 4315566 3836525 3914744 3740138 3905453 3724325 3957317 4202204 4125626 3823348
2860 3823348 3804594 3443734 3445476 3426877 3305648 3635732 3717161 3364472 2932831 3078889
2850 3078889 3348599 3034625 2969724 2188097 2305075 2425731 2627652 3233390 2749597 2761866
2840 2761866 2707341 2751530 2670434 2890795 2631764 2390967 2306942 2470809 2596371 2206358
2830 2206358 2220190 2359843 2336097 2098042 2260427 2169996 1880061 2211338 2293271 2264155
2820 2264155 2204656 1720398 1502297 1348624 1718583 1926688 1302775 1402389 2041723 2079719
2810 2079719 1764962 1831992 1802728 1853321 2117150 2193434 1750290 1199622 1396017 1590780
2800 1590780 1594751 1456336 1452435 1447121 1433611 1100133 939545 1371577 1515174 1731096 1576763
2789 1576763 1673770 1482994 1650489 1094337 1139250 1281039 1605316 1391623 1378398 1031280
2779 1031280 851113 1259811 1221381 1142186 1097519 1194844 951189 1178503 1089870 949079
2769 949079 1208309 1031951 756578 905741 1018818 1140025 1331033 1567205 1459565 998101
2759 998101 796789 818155 1361856 1196411 1078354 916574 823946 1145882 1297556 1051536
2749 1051536 1013947 861701 508290 464979 739050 1008334 1454745 1128296 979355 1229740
2739 1229740 1207800 1165157 715115 853708 854824 803734 378642 518858 600347 633663 657331
2728 657331 879751 912891 817914 764200 611710 863211 747836 294005 274074 462082
2718 462082 556547 732377 953856 619791 458456 868953 538855 622851 1006912 767017
2708 767017 517864 141135 137493 210597 724727 358304 534220 483339 549561 660300 566688
2697 566688 207417 279234 705245 553754 912814 1203945 932633 748486 862971 837538
2687 837538 551778 748420 1055887 1146919 1212815 1403229 913110 685095 480949 789109
2677 789109 1074577 1045960 1246875 737672 756081 768694 837894 1009707 1165556 1335383
2667 1335383 1185121 996721 1003709 1199438 1015085 1095704 1446807 1475520 1150848 1294636
2657 1294636 1512110 1553611 1529632 1638623 1684584 1436353 1593280 1571056 1368810 1261708
2647 1261708 1628916 1552192 1478898 1315468 1205130 1622606 2095873 1817984 1949933 1903352
2637 1903352 1964867 2091751 1915437 1691688 1708840 1495251 1782177 1869302 1950084 1593990
2627 1593990 1651583 2047039 1828481 1902157 1928127 1780292 1937616 1844734 1751523 2054770
2617 2054770 2691286 2369208 2046433 1926440 1817616 1828800 1546510 1510949 1723628 2198251
2607 2198251 2210073 2189527 2570780 2528090 2574676 2600458 2347683 2382763 1989544 2188181 2289073
2596 2289073 2311578 2189612 2150643 1894356 2123990 1758786 1753076 1805096 1750958 2153970 2047112
2585 2047112 1876236 1763048 1697779 1628933 1498689 1754449 1848464 1672378 1962344 2390940
2575 2390940 1735948 1560006 2222840 1732603 1410228 1494916 1602722 1987586 2331240 1776701
2565 1776701 1876204 2046746 1791915 1455819 1425109 1574759 1756639 1360995 1258246 1437517
2555 1437517 1437042 1329005 1011951 1042493 977654 1061042 891870 821498 1005248 891131 682021
2544 682021 958444 1061916 935492 1415941 1274588 1101150 1268076 1141876 877197 866909
2534 866909 978322 1000677 1166899 931178 933478 1018845 812897 733095 970752 1027273 524842
2523 524842 441782 681695 698891 691678 495986 532974 169105 301059 564722 487188 162328
2512 162328 241037 171388 216889 244766 241772 23371 -362127 60381 134677 95105 265950
2501 265950 114030 -79083 205673 430255 427025 491676 578969 -75897 -315499 -131238
2491 -131238 -149494 -70467 416273 487775 312306 377393 458987 480064 463550 637154 235925
2480 235925 320435 347119 321304 433240 201788 147610 408135 636462 375216 278122 246285
2469 246285 349002 117061 -409406 -297460 42408 154784 -106496 -155318 -37717 45798
2459 45798 -252556 29309 217115 -175081 -42174 299005 380851 227250 299302 513360
2449 513360 24361 364547 341949 -271753 -379708 -265922 115461 363618 596925 294941
2439 294941 286645 222221 9408 -230337 118660 -41041 390007 629184 461217 580978
2429 580978 606258 369829 116568 -22584 -206951 457264 272572 153368 549517 342379
2419 342379 349180 371756 618038 477263 581622 366407 10254 337525 559507 385871
2409 385871 174008 314080 -57485 64637 208833 -338841 -52303 275750 436220 860582
2399 860582 740172 789544 245096 173678 574466 575172 496126 944384 1190154 1224834 1071595
2388 1071595 1247781 1498083 1452372 1311994 893335 463325 522003 647315 426511 501838
2378 501838 841613 760180 548557 375972 275438 378727 20633 14618 249803 329173
2368 329173 296144 -222073 -233671 424883 149377 -194366 403680 548696 337257 396531
2358 396531 569274 429691 579348 420527 -245234 200474 269778 154458 136648 130696
2348 130696 347996 485474 569781 1235788 1157474 893857 533326 450826 763614 704658
2338 704658 361943 642416 184997 380337 623937 569621 565453 410729 467943 450823 571555
2327 571555 512337 716170 614895 220002 -99448 542384 702357 258999 378265 551867
2317 551867 592019 553437 350885 312067 388724 403572 724115 470819 313469 395381 466545
2306 466545 333012 -180227 -241335 -349634 98407 -91392 341731 616452 193457 81395
2296 81395 369592 266063 65734 211840 -230022 -124474 395964 271121 327012 278960
2286 278960 418843 400098 472963 504875 -41634 122668 654312 744094 873552 961934 570248
2275 570248 903204 1015446 544043 838366 1059802 887974 903393 778458 721958 711161
2265 711161 930485 1018826 791365 933160 999642 903439 502804 607872 1039097 604247
2255 604247 528750 694403 689200 678017 723370 783312 600055 559894 555080 1163143 1036247
2244 1036247 665490 874002 817227 568378 1018531 912283 843651 1221492 1097115 740845
2234 740845 548369 1121030 1096601 1232252 1506912 1200575 1252731 1046954 1152384 1203635
2224 1203635 1292546 1218585 1205057 1131321 1287141 1497928 1487840 1577509 2079510 1762730 1911159
2213 1911159 2086398 2033737 2296561 2023650 2223197 2371623 2439333 2394403 2220422 2251969
2203 2251969 2552016 3108362 3304087 3241813 3154081 3000703 2951479 2908352 3740931 4166771
2193 4166771 4000324 3610902 3734617 3526806 3907956 4269861 4388258 4283838 4251014 4303746
2183 4303746 4398220 4751990 4954464 4689146 4882752 4717155 4876568 4689050 5024351 5151067
2173 5151067 5342362 5206269 5732938 6470339 5989659 5916148 6251879 6708276 7394645 7985004
2163 7985004 7703856 7657847 7811721 7719372 8399006 8916766 9481561 9667314 9824084 10762597
2153 10762597 10712088 11445249 12358015 12580598 12956446 13777262 14640973 15640470 16844540
2144 16844540 18194387 19303111 20819657 21897544 23811775 25614294 27810484 30246072
2136 30246072 33202666 37050603 41197339 45225527 49542692 55425110 61840797 69091904
2128 69091904 78678243 90708526 102382750 114332713 129126869 146778329 168438321
2121 168438321 193189242 215541250 218236562 188594112 148147102 116811154 94177535
2114 94177535 77630282 66218264 57654098 51298669 46712777 43343978 40863765 38464371
2106 38464371 37125971 35377731 33537581 30768454 27898410 25348622 23166173 21714327
2098 21714327 20529660 19541679 18622703 17184965 16709229 15936427 15231653 14964800 14564046
2089 14564046 14204230 13100237 12437413 12609509 12067744 11591577 11195563 10691148 10318265
2080 10318265 9874811 9546330 9397675 9307289 8791003 8716062 8517861 8325483 7911549 7687806
2070 7687806 7562380 7632051 7600575 7605497 7007961 6935474 7162110 6709272 6480702 6114790
2060 6114790 5777276 5425858 5189166 4808753 4335099 4953406 5197892 5181705 5039458 4460422
2050 4460422 4327355 4363696 4277574 4297496 4074136 3692601 3298193 3298915 3393671 3560815 3464614
2039 3464614 2722923 3008552 3301906 3263748 2738747 2673584 2793138 3009649 2996521 2688563
2029 2688563 2748823 2879818 2863045 3154798 3162038 2472858 2561037 2829292 2635328 2550730 2562032
2018 2562032 2322392 2302609 2190936 2213810 2009676 2266226 2414993 2198366 1581888 1668088
2008 1668088 2109073 2065246 2440525 2265393 1920254 1954236 2055112 1646215 1777527 1622010
1998 1622010 1506511 1930794 2131496 2234668 1828275 1743463 1656505 1688238 1660370 1637717
1988 1637717 1493452 1493586 1504589 1419493 1734172 1369963 999937 999016 1469806 1780623 1475442
1977 1475442 1206635 1464533 1609541 1326542 857248 461302 589643 835566 550170 458596
1967 458596 664356 608457 499928 591488 697833 548299 1021904 1248997 1014211 957997
1957 957997 1093344 977197 1226608 1622847 1338609 1218418 1268727 1301460 1357405 1041400
1947 1041400 777571 582350 571149 722351 480146 535238 390875 354144 631814 1010246
1937 1010246 960924 994621 1243492 1128401 819852 461172 892996 742189 349651 872448
1927 872448 785163 499243 634870 739061 796609 930674 866052 875589 608855 462504 301290
1916 301290 475138 718822 568655 897366 643316 553840 1143618 953016 366923 105150
1906 105150 785841 781466 423655 437731 801211 762272 298875 445341 171279 312659
1896 312659 440579 522564 753560 811267 447053 700124 813492 574702 566505 713993
1886 713993 599346 464090 622722 402666 295780 310094 265713 521111 506814 378665
1876 378665 729433 802415 554768 238926 514937 598521 473798 782308 645157 340700
1866 340700 410261 893212 824574 751883 703928 522989 552656 582677 639316 1247683 1300706
1855 1300706 569396 699612 969195 1461944 1687279 1588913 1563379 1390418 1178456 937686
1845 937686 677973 368334 541754 602128 704611 450409 386450 385716 492000 661225 454597
1834 454597 245978 249806 439035 677589 719819 616343 374877 514234 521497 450662 704078
1823 704078 702748 463552 522884 261430 240402 429317 543750 402604 177816 315618
1813 315618 -89159 -25114 408507 442526 440118 779724 379551 624978 692994 458059 548668
1802 548668 331495 176491 191868 402707 313577 290264 25948 -114025 -406598 -100212
1792 -100212 809420 700739 71147 -48189 93482 -26967 -83508 -359927 -63225 78110
1782 78110 401789 247045 141101 472000 -63193 -274525 197857 -87237 -96073 -314225
1772 -314225 67021 94573 268391 252549 -78815 -276687 -413914 -28181 -270194 -342402
1762 -342402 -341123 103492 426786 268719 62122 74778 341655 126490 31513 283480
1752 283480 157262 151075 -210633 -500008 -42422 145109 221578 314970 432422 205112
1742 205112 -12475 298729 518978 225517 119139 196215 217287 156247 -69698 409649
1732 409649 528153 279573 220379 -105023 -79259 139486 287803 -69991 -336317 -85530
1722 -85530 318153 -18792 -9608 -72463 38846 391761 141061 217384 159510 308589 36172
1711 36172 -127566 214835 301618 133719 -65017 -251280 -66749 283601 495302 -13695
1701 -13695 -293768 -60049 -124564 65132 460605 122652 122158 229195 388098 320817 378257
1690 378257 54387 -418721 -504693 -372589 -271154 -297557 -13605 209344 52405 -183640
1680 -183640 -254502 165477 262220 15001 369199 764602 265701 -252261 -592491 -339362
1670 -339362 -674085 -165345 -57129 180138 -114829 -70357 -101185 13596 261196 328078
1660 328078 60201 10319 421518 239060 272891 296909 303975 149091 -114012 -348063 258281
1649 258281 -57586 40536 -13540 149691 184382 466425 604093 377198 -11197 -421382
1639 -421382 -569302 -173132 -329136 -199572 -341456 -488148 -389174 -325017 86351 -70532
1629 -70532 -61050 203552 29788 -172470 -116257 -74095 213548 156146 249488 166827 -166177
1618 -166177 370070 322935 -96255 240634 219371 107498 549028 291719 107418 116089
1608 116089 374249 135781 12965 343357 147731 -125793 -388040 -24802 185978 57716
1598 57716 105291 11031 -396773 -451018 -196742 -183330 -330097 -48325 -193633 62479 39354
1587 39354 -347791 -129332 405424 409137 194295 753415 737205 579993 148966 231705 332560
1576 332560 13762 -154554 227518 228715 364731 136307 54809 140130 171976 607295 96653
1565 96653 -103230 -160592 -354873 -159082 111153 204229 -245400 -202069 -141200 -214 73109
1554 73109 243629 -44402 51867 174519 -60774 135416 -96936 -107480 -2085 -113374
1544 -113374 -122859 109449 -64275 308572 79507 178116 320899 89998 -112098 -90690
1534 -90690 197096 112255 308522 221531 341477 263777 311136 234765 245226 -46949 127981
1523 127981 12024 130894 225290 -561296 -213036 175464 232267 29765 -150229 132318
1513 132318 238784 -94099 -163534 -553047 -332069 -170633 -129972 437015 177203 -46576
1503 -46576 229320 166889 -158813 118522 268290 394747 769635 714860 658017 487875
1493 487875 152636 105300 267720 335340 462485 809644 653297 -113154 -263485 -188555
1483 -188555 -203516 -171648 8888 -80765 -42048 -282926 -406346 -361671 -76615 -343328 -156481
1472 -156481 130733 -371349 -147766 213519 268348 109815 -163743 777 174777 179045
1462 179045 -95429 -240893 -146509 -163500 -199718 -4248 186668 471639 214436 -152019
1452 -152019 -474267 49029 -179016 -353561 137772 -66293 -106250 350600 160162 261432
1442 261432 -242795 -71396 20054 -168664 -7255 -64507 -154878 -284670 -15496 -49318
1432 -49318 -86095 -49567 29681 -84791 -213761 -225722 -502576 -460225 -159218 81997 -92632
1421 -92632 1881 244268 -322863 -326800 -58361 252294 46447 151907 -210556 -308107 -275791
1410 -275791 105932 115953 74565 155959 375387 170644 28085 312795 89652 -9667
1400 -9667 10209 -148657 -492048 -477941 -320568 -384299 -231696 -200770 711910 672744 251283
1389 251283 -241442 -86109 307509 368147 310113 -206579 65479 277573 97429 456926
1379 456926 200570 193916 124731 348327 571565 610681 503198 555007 552501 -66514 -114469
1368 -114469 -118701 185759 -113892 37367 325478 115591 155817 21375 -119542 -144197
1358 -144197 90826 43365 -83178 -312219 -417937 -548630 -515831 -250395 -607282 -472428
1348 -472428 -455832 43321 281622 55597 -2820 -89242 -356003 -573034 -122082 -141669
1338 -141669 -359150 -518401 -370678 -384605 -528747 -401232 -357450 -93757 64633 -106685
1328 -106685 550436 521530 170972 47100 157700 -15902 39773 6510 -345061 50100
1318 50100 34284 161236 143768 -11499 94318 213950 252308 11109 -154437 -263861
1308 -263861 -635588 -455106 -605087 -312177 -393843 -476676 -379118 -384926 -66641 191133 124683
1297 124683 430413 53532 -371687 -212931 98339 -94443 -645010 -748194 -537963 -59570
1287 -59570 77256 212014 390809 -64267 182747 134098 -487024 -430958 -234142 -167013
1277 -167013 -58718 144330 -187027 -419967 -426461 -113668 -169263 -254315 -396288 32610
1267 32610 677222 436274 538783 222080 118616 213889 154744 -115842 207455 554473
1257 554473 462918 96222 -146719 946 -589045 -217908 204844 -22310 -165110 -42861
1247 -42861 48160 91176 71627 -75225 -181835 -388027 5183 124138 6745 -155999
1237 -155999 -246563 -196834 -326990 -325645 -384964 -265014 -289857 -613610 -520545 -214271 74074
1226 74074 -489637 -274021 -56243 316113 133716 -49031 204791 29298 362673 88034
1216 88034 27903 92961 228730 285473 -162032 -84278 -25088 -116197 -565377 -733587 -734275
1205 -734275 -736042 -422932 -465764 -464697 -530224 -343564 -249877 -351506 -301269 14671 343304
1194 343304 89906 -332627 -546000 -404080 -199243 -68490 -147913 -227915 -402639 -624141
1184 -624141 -49151 -140827 -118248 40310 151145 -127776 -23147 -29599 -61300 3925 -151864
1173 -151864 -382096 -382557 -391790 -261674 -258004 -132837 -162129 -535692 -463955 -508971 -216062
1162 -216062 151714 207649 -296851 -761145 -259377 -241252 -604013 -112231 178461 373726
1152 373726 194744 -237754 -165442 -30194 300728 -116504 107666 276853 -254079 91042
1142 91042 114006 -132132 98223 157181 49616 201544 -255417 -340590 -90921 318242
1132 318242 270390 301351 682141 403906 394934 100659 22460 60947 -110205 -320100 -518240
1121 -518240 -574021 -374906 -342935 -249094 35667 181430 -100044 163271 259874 308252 365473
1110 365473 128342 -71430 208273 86839 -155662 -39648 250528 -42511 -239826 -93697
1100 -93697 -58283 139947 4069 -7913 -127941 -241855 50548 -28875 -449327 -610090
1090 -610090 -320457 -183751 97300 256879 -41736 -103992 -202687 -291397 199773 215622
1080 215622 362483 440048 -58303 -203623 -60043 113923 172760 -28637 -241508 283083
1070 283083 256360 563865 59112 -17488 -97220 -17639 5143 173649 35468 -53560 44284
1059 44284 61633 172882 138309 116337 32924 -48749 -57712 146502 311200 73881 -436974
1048 -436974 -129582 -49437 54248 339955 304316 542915 458751 445223 179470 294947
1038 294947 138451 -159321 -275301 -175213 211143 363544 -80726 6829 211890 292336
1028 292336 85952 -276112 -142831 -162740 -96155 108097 119399 -93952 -2562 89529 -164802
1017 -164802 -280799 -621808 -22124 -155727 -165801 112101 -39587 -170583 -386908 -161865
1007 -161865 94175 148021 133065 4836 -250173 -278564 -338114 -314307 156891 -11764 -204201
996 -204201 190224 281292 418491 70629 199760 133939 -141729 -126276 84552 -116158
986 -116158 -33757 128307 -22954 -195471 -281485 -377167 129640 52521 -55789 299878 279905
975 279905 320461 113132 15819 -19032 -35539 -99376 -142275 -238204 -304008 -372532 -369561 -183961
963 -183961 -174366 33415 -530681 -37945 -109580 -139214 234540 76873 -374279 -363024 -133346
952 -133346 -241125 -261554 -363079 -474974 -467275 -274101 -268905 -446194 -267922 -52129 -299865
941 -299865 -159778 75066 -334311 38254 97576 19586 268360 128107 -160507 -89815
931 -89815 -74705 -106354 -333129 -403466 26602 -268904 -418090 -564965 -545765 -295356 -68750
920 -68750 6292 -6715 184615 181041 414949 356252 366428 386770 1083 32620 73145 -142395
908 -142395 20052 343216 338169 5347 -213835 -259955 -47511 -408756 -440528 88197 -10961
897 -10961 -392992 -190706 479914 350490 418213 358970 214733 51458 28495 -151971 -171499
886 -171499 -109906 -210558 -424946 -317006 -139341 299011 292464 14394 -40124 -157630 -413555
875 -413555 -778266 -602037 -312990 130122 -2008 -53161 46026 196581 220664 -260580
865 -260580 -78825 -200988 -384911 -175148 -317524 -380877 -416800 8495 188955 141421
855 141421 336171 262115 500818 267253 -180336 -311810 -361415 -94290 -67912 -432647
845 -432647 -7275 293642 239453 29416 -251469 -234525 -124943 -219589 -363112 -271052 -248646
834 -248646 -552094 -157874 -9929 62504 146610 -181713 -640424 -689105 -163737 161591
824 161591 -158200 -283351 -423104 -319841 -138627 -215842 -398184 -43626 91886 -134487
814 -134487 -186476 -258191 19068 17135 -356607 -110355 -182923 -462846 37283 -54827 191688
803 191688 490750 -36294 -405393 -656971 -679211 -20980 229529 243365 252626 -135189 -47235
792 -47235 -316832 -193693 -61393 -65638 80585 -163289 34249 115060 104168 351324 99898
781 99898 -521919 -177702 52008 309920 538067 353699 284386 397794 338998 139546
771 139546 -15030 -138384 87306 40220 -250510 -224402 -126834 -121975 95532 131790 -43387
760 -43387 47371 17654 -164075 -354901 74729 159845 28806 176969 117780 -225343 -380928
749 -380928 -626002 -351572 -266826 -108231 52885 156756 293355 108939 -175168 132713
739 132713 314159 158923 -130226 -289147 -149211 -81110 279605 364817 -5932 -195449
729 -195449 -369620 -311919 130908 -200257 -363498 -15104 76719 -35899 27493 332138
719 332138 212142 -35685 115486 -32259 -10133 377565 -80339 -172404 164470 45175
709 45175 -274098 -52949 77388 -305891 -527581 -661582 -521680 -137624 74512 265342
699 265342 101553 -293190 -443908 -353338 107324 154908 -222489 -429372 -78139 299894
689 299894 239719 -218078 -288767 -261866 -394699 -347214 -303655 -459732 -516174 -602983 -310448
678 -310448 -71994 -410111 -328102 -116532 334320 381461 246226 -174359 -378220 -482005
668 -482005 -578181 -229337 397767 369561 116548 -102170 -148218 186731 203249 -50181 431627
657 431627 755647 340533 171878 -112688 -28091 156774 -102523 235172 483063 153852
647 153852 546502 -83960 117419 7781 28013 75798 -243117 177629 -20191 333600
637 333600 247707 -212709 -32115 132291 128575 -66998 -187478 -345582 8488 -48632 163984
626 163984 -7739 -169007 89791 450984 246947 -69924 -53779 -84427 -158790 -30813
616 -30813 -241280 -184672 154042 201489 278760 91689 -79421 6469 -266351 -758811 -156520
605 -156520 280991 388771 460359 18252 61280 97326 25322 260558 31312 156119 -160284
594 -160284 -56807 -413842 -289496 -264588 -17855 83469 69709 277156 271636 256841 7165
583 7165 -100477 -93733 99456 31405 -155105 80674 225093 316715 118406 -103119 -109824
572 -109824 -170777 -223038 112325 299740 112452 80941 -204608 -626431 -233305 36181
562 36181 -390384 -165034 -370362 -776852 -312301 -193056 -163965 245341 -150113 -391773
552 -391773 -274217 60076 -163242 4407 -252826 62425 -108614 -238179 -254008 52280
542 52280 -721 -32113 -15754 -23314 -103219 157786 301635 64192 1218 -329852 -416101
531 -416101 -12766 246449 11789 182177 174570 218750 485349 235896 -30921 -81040 347489
520 347489 398212 -78438 36743 -212249 374502 304730 288792 505060 356379 295260 314126
509 314126 -166688 -151491 -229963 -118296 -83836 75947 230140 -11471 -20297 -8215 -35492
498 -35492 -89139 -70680 -61308 -19421 -93301 -254738 -3759 -338824 81333 285175 233322
487 233322 61330 -245895 -206797 -364116 -243514 -244407 -593255 -244618 194864 249477 57964
476 57964 -286792 -309574 -11164 271512 -5403 -351063 -247705 144984 65654 88559 10224
465 10224 213262 438404 273757 328299 89312 25918 -12685 336217 9516 35568 -258068
454 -258068 -379295 -328655 -678865 -193035 -273348 77524 -296566 -440786 -174156 -255859
444 -255859 -24357 259205 173749 -114576 -203348 -242143 -192161 -292070 -287100 -17751 -39182
433 -39182 55156 -110739 191199 318995 154182 365505 510834 336042 97714 70428
423 70428 146750 -270640 54591 29709 -228986 -218678 261231 550085 199277 93253 118244
412 118244 3368 -245047 -101819 154760 137677 -457021 -368322 -9591 -282993 -410039
402 -410039 -263241 -337539 -454079 -438281 -190614 13768 70430 367875 -114774 -371194
392 -371194 81615 -59012 -102437 -146841 -25514 -133883 174340 28689 340770 729171
382 729171 329618 62864 66218 201269 102384 325983 84039 -230943 -422433 -414305 -32979
371 -32979 -342117 -419812 -416429 47395 -22701 -461180 -301186 -319956 -246876 -418606 -348143
360 -348143 -243308 -408968 -371596 -316601 -273379 -324930 -254163 -248670 -288253 -218159 -212055 -2271
348 -2271 -90885 410291 -49490 -257915 -248116 -374811 -339912 223118 178414 233524 547343
337 547343 359780 -51448 -283950 -255086 153231 9918 287796 17040 -901005 -634252
327 -634252 -307490 -120679 -200993 -358777 -108460 -245066 -227812 -539936 -424931 -249144
317 -249144 -278147 247896 399900 71995 27341 -371444 -390939 352374 37580 -21629 355241
306 355241 351353 267366 -74480 -349363 -18676 -156953 -351337 -309484 46553 -17655 -294953
295 -294953 -466732 -333832 -152639 -353821 -229278 245425 351541 273794 301646 597565
285 597565 411452 54939 -290000 112764 13580 146683 -66583 183751 265585 227765
275 227765 61945 122915 -206195 -425922 -439028 -397044 -642727 -356461 3242 63681 423005
264 423005 256959 226584 233966 -61628 -259792 -118580 -274223 -656488 -662475 -403948 -466054
253 -466054 -347362 -460203 -422412 -71818 125708 136454 104128 158789 -142279 37363 -239285
242 -239285 -317260 -484205 -491319 -347616 -309587 -82656 271746 357034 143358 103633 -122434
231 -122434 -314828 -509956 -420192 -220431 -256598 -336209 -398724 -592020 -409339 -658250 -337234
220 -337234 138871 305163 304779 -143550 -251122 -183214 -398883 -188261 -16405 -171040 -291689
209 -291689 -216072 -209572 -219674 -87117 122245 -235515 -298592 -367983 -30238 124892 -90011
198 -90011 -229478 69169 31696 -196243 -221885 -256365 36883 191489 42744 -113408 65451
187 65451 53631 58273 197759 270931 231757 -406088 55823 -122267 -275447 -312894 -1082936
176 -1082936 -869010 356037 464072 209630 2888 115978 340626 159636 -101472 280936
166 280936 366679 567998 229210 30478 -163421 -309509 -413969 -239841 18337 -109161
156 -109161 -187622 -184032 -92351 4377 -60711 301741 167781 -238904 -261116 -222552 -240574
145 -240574 -299291 -142602 -357907 -68942 -407592 -176983 -63534 -224551 -679709 -274563
135 -274563 -102579 -51310 -182593 -276908 -69017 280027 283064 212097 500405 354606 318757
124 318757 324256 132765 147790 -53771 119468 -143760 -555605 -298448 262004 14556
114 14556 -4728 7410 -91393 11163 319152 136630 -50533 -217681 -464240 -536363 -354846
103 -354846 -227482 -93331 63426 -402290 -476116 -47114 -236474 -370530 -492002 14476
93 14476 128594 -279279 -309783 -343727 -277915 -102862 -39512 148050 208652 186338 -127027
82 -127027 -204243 -97626 -152915 -19134 40052 -115658 -286378 -155074 -52442 -237762 -343874
71 -343874 -51688 -170069 2944 -290784 -84789 31054 138381 -70426 -390816 -178173
61 -178173 -169199 -76426 32558 -197885 -215248 91198 -53567 -281333 57504 207251 4453
50 4453 66109 287341 154200 -102615 -152253 230192 151039 154528 71730 -279639 -589288
39 -589288 -190890 -205473 -312667 -309727 -244622 63524 11482 80036 278614 228568 76394
28 76394 -96640 -35494 -166249 -493459 -415460 -33824 372292 185141 24301 -179254 -264221
17 -264221 -175405 -293700 -142341 -28932 77582 -126381 -198422 -45405 -251059 -127382
7 -127382 -54169 -148200 -38132 -167928 100321 293043 -70646
0 -70646
$$ Imaginary data points
##PAGE= N=2
##DATA TABLE= (X++(I..I)), XYDATA
16383 -2709441 -2988332 -2583949 -2557051 -2652555 -2454343 -2333060 -2132085 -2348914 -2262004 -2060379
16373 -2060379 -2117871 -2125034 -1932941 -1900285 -1923689 -1752886 -1871653 -1736951 -1882138 -1861953
16363 -1861953 -1928135 -1906324 -1608083 -1267766 -1340249 -1441186 -1339283 -1371828 -1356847 -1397473
16353 -1397473 -1261876 -1257399 -1345843 -1397462 -1360432 -1480518 -1265197 -1188712 -1185289 -1001173 -862553
16342 -862553 -895218 -968967 -1007732 -887865 -692712 -928666 -936931 -748548 -683516 -795562 -747711
16331 -747711 -767812 -793566 -685070 -682192 -488849 -233294 -201706 -394808 -357963 -106435 -438099
16320 -438099 -329839 -274212 -125414 -150593 -71859 195635 61117 119808 340861 656255
16310 656255 1049502 579206 3659 187738 383391 447852 534529 346499 376386 581717
16300 581717 794195 605349 742899 597320 325203 541527 578350 582123 676511 917249
16290 917249 621483 696301 968833 1162392 1332106 1178913 915255 965817 1035175 1043164
16280 1043164 1308991 1616125 1375553 1204648 1084408 1393125 1090324 1213398 1546996
16271 1546996 1293236 1268340 1439317 1503826 1398652 1440923 1872439 1766088 1780582 1539662
16261 1539662 1335320 1382195 1326799 1377509 1665576 2055577 2008259 2034525 2041813 2049945 2009608
16250 2009608 2039718 1917443 1779557 1915211 2276430 2240156 2409560 2574373 2554199 2418494
16240 2418494 2273990 2186329 2332158 2301865 2252485 2061021 2098414 2410281 2678247 2442391
16230 2442391 2723406 2615880 2528227 2397318 2335149 2494395 2677411 2656028 2932306 2968112
16220 2968112 2512600 2611580 2636217 2419848 2210884 2628427 2546619 2646691 2606539 2707148
16210 2707148 2847820 2767357 2709064 2894383 3137051 2652256 2711758 2819155 2759267 3077921
16200 3077921 3138561 3292459 3059227 3321225 3092662 3038643 3202256 3266947 3022941 3026436
16190 3026436 3020082 2946894 2994766 2936133 3012228 3382855 3224703 3015960 3188161 3424029
16180 3424029 3541742 3096325 2989059 2770251 2890473 3446405 3492559 3198692 3200155 3290535
16170 3290535 3382533 3382793 3394395 3441689 3476337 3216939 3207452 3086101 3377117 3408006 3359011
16159 3359011 3583262 3873009 3686226 3756607 3400730 3417168 3546573 3364491 3306147 3348426
16149 3348426 3712885 3637816 3622350 3630525 3412338 3714487 3578443 3143796 3130527 3095988
16139 3095988 3329101 3433779 3506299 3292131 3589532 3575290 3578970 3472805 3475189 3356809
16129 3356809 3290912 3471399 3507636 3266462 3816142 3861044 3638793 3424710 3578461 4010772
16119 4010772 3662150 3497997 3714084 3585098 3860999 3623478 3458528 3322520 3086218
16110 3086218 3668716 3518759 3426665 3684589 3778802 3953199 3773991 3392728 3352537 3317291
16100 3317291 3654608 3751844 3784293 3631568 3851684 4034149 3585630 3226403 3763579 3877579
16090 3877579 3769218 3727609 3473113 3516491 4152787 3674360 3796810 3995805 4010329 3770040
16080 3770040 3952225 4149413 3927414 3520997 3514374 3429023 3224497 3595961 3470862 3482361
16070 3482361 3473973 3902292 3918787 3641774 3531191 3612711 3648393 4037232 3939593 3923013 3387135
16059 3387135 3260755 3247176 3169293 3482480 3680168 4001193 3608338 3565747 3761713 3721666
16049 3721666 3283367 3333972 3355979 3797819 3810122 3604225 3612258 3940293 4317308 4185183
16039 4185183 4210078 4435472 4284323 4369115 3843969 3289412 3686775 3748534 3521306 3551334
16029 3551334 3492217 3740194 4288412 4003021 3878436 3627870 3880468 3895965 4198993 4142664
16019 4142664 4179994 3969776 3972237 3918379 3585091 3764972 4195695 4064653 4045044 4011469
16009 4011469 3975163 3936955 3655218 3794919 4066620 3855912 3594277 3524537 3906506 3735675
15999 3735675 3778406 3904160 4135479 3856897 3926493 3973358 3966552 3996539 3968444 3860532 3547537
15988 3547537 3921370 3905442 4015551 4020912 3713349 3879906 4203931 4032326 3966310 3848852
15978 3848852 3796672 3813542 3586078 3536544 3864929 3517691 3610398 3656558 4076452 4018287
15968 4018287 4289640 4023986 3791378 4000171 4035580 4113880 4226971 3897829 4110824 4495357
15958 4495357 4641248 4473384 4298478 3735144 4002364 4596387 4311352 4290654 4064943 3985321
15948 3985321 3592436 3851724 3907914 3705482 3911547 3935759 3837461 3953796 3960298 3765656
15938 3765656 3875830 3681237 3595383 4100684 4103410 3984592 4040363 3992109 4002036 3951637 4075331
15927 4075331 3841965 3115820 3407728 3674872 3870844 3880486 3937585 4181792 4040445 4051274
15917 4051274 4104488 3627956 3734060 3927894 3784118 3766650 3777876 3760752 3948738 4188362
15907 4188362 3966653 4028658 4035120 3692114 3528797 3908433 3647259 3757634 4017914 3951074
15897 3951074 3936039 3888408 3925048 4120093 3839833 3564957 4252962 4382780 3934292 3744374
15887 3744374 3418618 3414455 3955267 4056744 3795249 3855984 3952418 3948272 3955332 3536996 3381580
15876 3381580 3511372 3529234 3495893 3778010 3616901 3666706 3677448 3537065 3806195 4004206
15866 4004206 3857956 4030198 4113089 4144409 4071550 3817411 4275405 4122600 3959425 4006722
15856 4006722 3912456 3840646 3806049 3987255 3795559 3775778 3714488 3544646 3692528 3806272
15846 3806272 3996452 4222637 4225194 4191455 4069792 4100266 3897615 4044376 4151034 4079132
15836 4079132 3833094 3625100 3602690 3446893 4004513 3830831 3838380 4195124 3919296 3965824
15826 3965824 3563114 3508000 4036587 3730284 3903423 4256145 3893247 3727462 4062423 3899084
15816 3899084 3796445 3837885 3991294 4058937 3713095 3606122 3288450 3326792 3828909 4049202
15806 4049202 4054519 3743848 3799016 3616389 3396236 3705517 3913490 3898182 4229671 4191316
15796 4191316 4066767 4150088 4307869 4225128 4057322 4130225 3778228 3973590 4226202 4215609
15786 4215609 4290875 3955342 4208967 4150125 3746019 4050321 4087890 3542516 3574846 3606554
15776 3606554 3705164 3515100 3483897 3605460 3920243 4006908 3791212 4159180 4561466 4394235
15766 4394235 4224029 4289476 3952627 4462190 4430568 3935097 3671258 3784463 3699782 3752748
15756 3752748 3737145 3622427 3616125 3728631 3808611 3804017 3730700 3515848 3692650 3690535 3859357
15745 3859357 4049047 4057105 4115826 3722635 3927427 4285234 4258583 4198341 4014196 4170166
15735 4170166 4211241 3984072 3788444 4158929 4206354 4258188 3650637 3579118 4122213 4232256
15725 4232256 4043300 3736132 3764066 3829066 4292056 3844873 4127579 4055997 4150129 3936922
15715 3936922 3682831 3780323 4296791 4236971 3809277 3440857 3524921 4009500 4033490 3887910
15705 3887910 3754724 4017217 4198329 4013100 3662554 3480181 4014655 3977883 3879416 4400938
15695 4400938 4296567 4097183 3894199 3908274 3419364 3449945 3796880 4243474 4175847 4345883
15685 4345883 3962671 3948731 4329634 3846226 4055921 4113393 3970335 4147060 3874489 3829586
15675 3829586 4208487 3757183 3706045 3919152 4329552 3982663 3937962 3717146 3277177 3595040
15665 3595040 3761120 4113783 4124771 4078185 3841883 3985098 3851316 3806914 3927994 3751868
15655 3751868 3602086 3947806 4675218 4249713 4083918 4295848 4073989 3925298 3765546
15646 3765546 4176681 4132663 4200205 3871351 3917455 4096114 3983823 4048955 4009681 3845510
15636 3845510 3632791 3781539 4159639 4103356 3983876 4027482 3845654 4104077 4077677 3911273
15626 3911273 3903010 3657185 3666082 3819095 4285616 4168314 3696726 3691576 4060580 4011901 3935883
15615 3935883 3728018 3915751 3662544 3502169 3755088 3805709 3895848 4273085 4261065 4180089
15605 4180089 4341461 4323863 4288803 4234284 4246329 3717746 3861012 4074044 3983560 4087382
15595 4087382 4262107 4266028 4394317 4262386 4067406 4201567 4280073 4298160 4203406 4258315
15585 4258315 4272647 4631060 4505942 4486306 4060113 3962690 4057275 4056535 4153146 4547841 4553390
15574 4553390 4304824 4229258 3619600 3820728 3652764 3791555 4331960 4321755 3999962 3999743
15564 3999743 4192463 4338475 3807712 3873992 3880650 3762643 3810324 3756523 4315427 4667353
15554 4667353 4420375 4326756 3940526 3806233 3875396 4410522 4231789 3991634 3862248 3662880
15544 3662880 3518553 3677840 3958824 4127244 3882297 3771065 3947946 4115403 4102428 3775195
15534 3775195 3930751 4122485 4077754 4378821 4225152 4315690 3970061 3711419 4139800 4160575
15524 4160575 4557875 4303207 3965097 4136686 4225529 3940954 4148493 4223789 3721207 4116935
15514 4116935 4206854 4429861 4172504 3549147 3627739 3794107 4140911 3972803 3938787 4469318
15504 4469318 4428236 4107740 3570369 3621663 3860034 3656768 4067506 4125306 4296979 4099022
15494 4099022 3941730 3772437 3784560 4161533 4182510 4278314 4184618 3887770 3892893 4082691
15484 4082691 4273680 3859257 3412587 3029363 3560738 3908699 3960182 4251310 3951530 3942518
15474 3942518 3928767 3774338 3789352 4264426 4289125 3855370 4034946 3805180 3537604 3898749
15464 3898749 4060215 4644217 4753782 4733530 4842135 4442331 4088117 3717561 3621540 4330322
15454 4330322 4477831 4544019 4435608 4169960 4158345 4197547 3978046 3717288 3943170 4080371
15444 4080371 4324540 4611138 4453716 4366053 4600210 4426489 4735582 4480397 4151010 4175031
15434 4175031 4516763 4125678 4255288 4265607 4421526 3866762 4007941 3723774 3360225 3673518
15424 3673518 3885010 4095595 4003730 4039595 4191225 4118819 3699829 3416167 4038269 4010515
15414 4010515 4168937 4564580 4290995 4404535 3869357 3764128 4105811 4326761 4116437
15405 4116437 4295689 3977169 4141076 4187237 3973504 4002599 4343036 4296969 3996878 3996804 4206539
15394 4206539 4056532 3990510 4313073 4028448 4104746 4294833 3846198 3903140 3925594 3888834
15384 3888834 3699504 4004262 4386288 4489598 4260857 4018812 4155212 4299949 4168752
15375 4168752 3950802 4067061 4036157 3987607 3576221 4144532 4432961 4171632 3731441 3697667
15365 3697667 3738652 3905063 4297147 4337607 4447085 4148966 4623696 4917500 4511437 4037129
15355 4037129 3893283 3912343 3982422 4175833 4006629 3977534 4018977 4319572 4697129 4563886
15345 4563886 4411879 4587168 4614268 4128080 4044460 3968765 3777902 3715030 4026090 3995100
15335 3995100 3678590 3784357 4275555 4255798 4284968 4137557 3774962 3603438 3900514 4320638
15325 4320638 4533685 4334333 4364565 3814491 3558648 4034809 3860158 3995026 4285375 4149271
15315 4149271 3998119 3723467 3701539 4149136 4173154 3896688 4032011 4314294 4331570 3839461
15305 3839461 3931565 4000783 4278788 4219483 4091145 4216925 3665295 3819888 3983163 3995894
15295 3995894 4125139 4271247 4433939 4321296 4222377 4252270 4238102 4052527 3730151 4001852
15285 4001852 4261268 4421925 4401175 4001788 3825782 3912519 4097665 4063843 3915076 4210483
15275 4210483 4128786 4055759 4269673 4386397 4581423 4464934 4282646 4124535 3912009 3725479
15265 3725479 4008480 4218479 3923733 4289640 4212794 3971655 3803075 3971012 3988576 3931662
15255 3931662 4258954 4291153 4371597 4114254 4252182 4505457 4118689 4283423 4108269 3865366
15245 3865366 3838860 4172296 4227913 4194934 3588045 3849259 4430695 4313095 4226746 4145445
15235 4145445 4370671 4420956 4245038 4141592 3884050 3979099 4123790 3946419 4023168 4248826
15225 4248826 4352989 4074549 4341145 4274420 4179422 4032456 3996652 4264666 4396876 4114525
15215 4114525 3876971 4349716 4076412 4044958 4191146 4210847 4576807 4669862 4242577 4611463
15205 4611463 4626693 4127269 3860599 3801620 3806729 3798009 3960037 4406298 4420847 4226169 4064862
15194 4064862 4199892 4165421 3837071 4395227 4205627 4434329 4624088 4368820 4231131 4263244
15184 4263244 4453732 4593177 4122888 4109278 4316830 4562808 4283675 4515317 4590366 4370616
15174 4370616 4212447 4160161 4338558 4591887 4502690 4088619 4422584 4056079 3983525 4433129
15164 4433129 4607483 4860622 4890956 4403807 4337506 4015329 4396103 4540027 4212031 4305503
15154 4305503 4470558 4202274 4045218 4032849 3856343 4017940 4204900 4374056 4356051 4398428
15144 4398428 4522153 4515423 4303734 4295102 4461844 4388675 4428097 4460229 4660628 4849972 4449011
15133 4449011 4492826 4751333 4666871 4287882 4170230 4157384 4409419 4338067 4441003 4293038
15123 4293038 4277133 3953855 3922255 4293935 4453978 4231234 4385872 4135717 4159080 4348931
15113 4348931 4076901 3928536 4134964 4303755 4490528 4490179 3999336 4273206 4097014 4476555
15103 4476555 4265255 4052400 4024863 3922404 4043825 3900061 3977010 4205373 4330074 4296141
15093 4296141 4439659 4490185 4297844 4150028 4290858 4332910 4476911 4541692 4785389 4825613
15083 4825613 4543910 4117926 4160140 4267891 4247517 4524621 4370908 4243483 4295113 4281231
15073 4281231 4241508 4520258 4731912 4496936 4067249 4262850 4267735 4224066 4081495 4036228
15063 4036228 4114698 4189953 4748011 4737917 4359097 4146098 4615933 4718646 4690071 4579546
15053 4579546 4677548 4768998 4702809 4674823 4488044 4444804 4587883 4450207 4171213 4294803
15043 4294803 4415902 4546032 4248505 4436688 4654378 4632290 4466111 4421430 4272465 4406816
15033 4406816 4269493 4660601 4340511 4190057 4319110 4483179 4780110 4635941 4565207 4105406
15023 4105406 3838583 4209768 4139300 3915768 3487561 3974407 4041732 3720087 4050993 4113533
15013 4113533 4213294 4386088 4754995 4465412 4295560 4329066 4165591 3811688 4304941 4163963
15003 4163963 4068935 3901031 4051593 4486938 4669441 4798451 4626697 4217436 4005218 4523921
14993 4523921 4850869 4735099 4782388 4829682 4491055 4503299 4258125 3989060 3975504 4134175
14983 4134175 3976092 4211135 3970289 4066526 4009484 4258437 4570548 4282208 4311860 4571064
14973 4571064 4359329 4199958 4546266 4256285 4027001 3988542 4020783 3908656 4215691 4413765
14963 4413765 4044013 4099049 4565473 4373425 4201433 4271513 4559570 4447700 3977242 3752348
14953 3752348 4196422 4241646 4205842 4462883 4750007 4515389 4403804 3946061 4005795 4107447
14943 4107447 4141196 4081008 3841193 3872563 4067820 4261191 4463797 4232296 4253167 4513175
14933 4513175 4532931 4425446 4358703 4623525 4541016 4540785 4720148 4891661 4785692 4225739
14923 4225739 4124622 3956124 3616613 3554315 3757801 4111789 3980020 4126106 4264566 4328404
14913 4328404 4185891 4149837 4429988 4468995 4633635 4659354 4159822 4326965 4368478 4560983
14903 4560983 4956880 4835472 4927394 5007886 4458310 4223647 4181413 4276126 4485569 4595109
14893 4595109 4257461 4164261 4120367 4000336 4054384 4399480 4487711 4977054 4778422 4388618
14883 4388618 4116307 3890256 4229735 4299256 4148703 4705174 4420947 4612253 4513034 4152442
14873 4152442 4002723 3679244 4282643 4005297 4455862 4157953 3908833 3990810 4283490 4234684
14863 4234684 4124217 4101486 4327758 4362594 4595955 4590511 4409164 4357073 4279617 3928862
14853 3928862 4055663 4207376 4536352 4736242 4646975 4639798 4678571 4392446 4307104 4044080
14843 4044080 3994624 3870707 4166939 4762913 4757285 4804769 4500443 4271217 4458206 4283433
14833 4283433 4245168 4146026 4285810 4438018 3704966 3896464 4177642 4178752 3960284 4224703
14823 4224703 4215732 4081155 3940672 4090256 4151266 4241128 4343380 4447446 4247323 3849612
14813 3849612 4354751 4702685 4375343 4741893 4690242 4371407 4195275 4074717 3978574 4164408
14803 4164408 4082904 4662245 4471722 4421791 4267430 4624464 4608446 4397408 4547845 4681154
$$ [...]
##END NTUPLES=NMR SPECTRUM
##END=
