##TITLE=1H_EC-3267(1-4)
 CDCl3
 8 sc, 
 9.11.2021
##JCAMPDX= 6.0         $$ Bruker NMR JCAMP-DX V2.0
##DATA TYPE= NMR SPECTRUM
##DATA CLASS= NTUPLES
##ORIGIN= UXNMR, Bruker Analytische Messtechnik GmbH
##OWNER= root
$$ XWIN-NMR		Version 3.5
$$ Tue Nov  9 11:22:55 2021 Russian Standard Time (UT+4h)  she@DPX200
##.OBSERVE FREQUENCY= 200.1313468511
##.OBSERVE NUCLEUS= ^1H
##.ACQUISITION MODE= SIMULTANEOUS
##.ACQUISITION SCHEME= undefined
##.AVERAGES= 8
##.DIGITISER RES= 18
##SPECTROMETER/DATA SYSTEM= spect
##.PULSE SEQUENCE= zg30
##.SOLVENT NAME= D2O
##.SHIFT REFERENCE= (INTERNAL, D2O, 0, 15.7238)
##AUDIT TRAIL= $$ (NUMBER, WHEN, WHO, WHERE, WHAT)
$$ ##TITLE= Audit trail, XWIN-NMR		Version 3.5
$$ ##JCAMPDX= 5.01
$$ ##ORIGIN= Bruker BioSpin GmbH
$$ ##OWNER= she
$$ F:/spectra/data/she/nmr/H-F/1/pdata/1/auditp.txt
$$ ##AUDIT TRAIL=  $$ (NUMBER, WHEN, WHO, WHERE, WHAT)
(   1,<2021-11-09 11:21:36.54 +0400>,<she>,<DPX200>,
      <created by zg, POWCHK disabled, PULCHK disabled
       configuration hash MD5:
       00 E9 B6 7A A2 85 ED C7 34 08 36 98 17 FE 4E 26
       data hash MD5: 16K
       40 C8 25 A3 D3 6B F6 A0 26 36 FF 56 F0 AC DB B6>)
(   2,<2021-11-09 11:21:41.14 +0400>,<she>,<DPX200>,
      <Start of raw data processing
       efp BC_mod = 2 LB = 0.24 FT_mod = 6 PKNL = 1 PHC0 = -15511.29 PHC1 = 12.20082 SI = 16K 
       data hash MD5: 16K
       36 FD 94 03 18 90 D1 CD 66 65 B6 DA 05 48 93 E8>)
(   3,<2021-11-09 11:21:57.07 +0400>,<she>,<DPX200>,
      <pk PHC0 = 0.6165948 PHC1 = -1.2 
       data hash MD5: 16K
       F6 46 CA 22 4F 40 C1 61 77 B9 54 82 3D AF 40 5C>)
(   4,<2021-11-09 11:22:00.29 +0400>,<she>,<DPX200>,
      <abs ABSG = 5 
       data hash MD5: 16K
       F5 66 94 44 85 13 42 88 D9 3B DA 44 E0 3E A8 71>)
$$ ##END=
$$ 
$$ hash MD5
$$ 71 1F 14 A9 9A 44 1D 33 9C 53 1E 12 8F 4F 47 FA
##$RELAX= 
##$RELAX= 
##$RELAX= 
##$RELAX= 
##$RELAX= 
##$RELAX= 
$$ Bruker specific parameters
$$ --------------------------
##$DU= <F:/spectra>
##$EXPNO= 1
##$NAME= <H-F>
##$PROCNO= 1
##$TYPE= <nmr>
##$USER= <she>
##$AMP= (0..31)
100 100 100 100 100 100 100 100 100 100 100 100 100 100 100 100 100 100 
100 100 100 100 100 100 100 100 100 100 100 100 100 100 
##$AQSEQ= 0
##$AQ_mod= 1
##$AUNM= <au_zg>
##$AUTOPOS= <>
##$BF1= 200.13
##$BF2= 200.13
##$BF3= 200.13
##$BF4= 200.13
##$BF5= 200.13
##$BF6= 200.13
##$BF7= 200.13
##$BF8= 200.13
##$BYTORDA= 1
##$CFDGTYP= 0
##$CFRGTYP= 5
##$CHEMSTR= <none>
##$CNST= (0..31)
1 1 145 1 1 1 1 1 1 1 1 1 1 1 1 1 1 1 1 1 1 1 1 1 1 1 1 1 1 1 1 1 
##$CPDPRG= <>
##$CPDPRG1= <>
##$CPDPRG2= <>
##$CPDPRG3= <>
##$CPDPRG4= <mlev>
##$CPDPRG5= <mlev>
##$CPDPRG6= <mlev>
##$CPDPRG7= <mlev>
##$CPDPRG8= <mlev>
##$CPDPRGB= <>
##$CPDPRGT= <>
##$D= (0..31)
0 1.2 0 0 0 0 0 0 0 0.06 0 0.03 0 0 0 0 0.0002 0 0 0 0 0 0 0 0 0 0 0 0 
0 0 0 
##$DATE= 1636442495
##$DBL= (0..7)
120 120 120 120 120 120 120 120 
##$DBP= (0..7)
150 150 150 150 150 150 150 150 
##$DBP07= 0
##$DBPNAM0= <>
##$DBPNAM1= <>
##$DBPNAM2= <>
##$DBPNAM3= <>
##$DBPNAM4= <>
$$ [...]
##$SUBNAM2= <"">
##$SUBNAM3= <"">
##$SUBNAM4= <"">
##$SUBNAM5= <"">
##$SUBNAM6= <"">
##$SUBNAM7= <"">
##$SUBNAM8= <"">
##$SUBNAM9= <"">
##$SW= 18.0517286264689
##$SWIBOX= (0..15)
0 0 2 0 0 0 0 0 0 0 0 0 0 0 0 0 
##$SW_h= 3612.71676300578
##$TD= 16384
##$TD0= 1
##$TE= 0
##$TE2= 300
##$TE3= 300
##$TEG= 300
##$TL= (0..7)
0 120 120 120 120 120 120 120 
##$TP= (0..7)
150 150 150 150 150 150 150 150 
##$TP07= 0
##$TPNAME0= <>
##$TPNAME1= <>
##$TPNAME2= <>
##$TPNAME3= <>
##$TPNAME4= <>
##$TPNAME5= <>
##$TPNAME6= <>
##$TPNAME7= <>
##$TPOAL= (0..7)
0.5 0.5 0.5 0.5 0.5 0.5 0.5 0.5 
##$TPOFFS= (0..7)
0 0 0 0 0 0 0 0 
##$TUNHIN= 0
##$TUNHOUT= 0
##$TUNXOUT= 0
##$USERA1= <user>
##$USERA2= <user>
##$USERA3= <user>
##$USERA4= <user>
##$USERA5= <user>
##$V9= 5
##$VALIST= <valist>
##$VCLIST= <CCCCCCCCCCCCCCC>
##$VD= 0
##$VDLIST= <DDDDDDDDDDDDDDD>
##$VPLIST= <PPPPPPPPPPPPPPP>
##$VTLIST= <TTTTTTTTTTTTTTT>
##$WBST= 1024
##$WBSW= 4
##$XGAIN= (0..3)
0 0 0 0 
##$XL= 0
##$YL= 0
##$YMAX_a= 143414
##$YMIN_a= -223408
##$ZGOPTNS= <>
##$ZL1= 120
##$ZL2= 120
##$ZL3= 120
##$ZL4= 120
##$ABSF1= 15.72375
##$ABSF2= -2.328099
##$ABSG= 5
##$ABSL= 3
##$ALPHA= 0
##$AQORDER= 0
##$ASSFAC= 0
##$ASSFACI= 0
##$ASSFACX= 0
##$ASSWID= 0
##$AUNMP= <proc_1d>
##$AZFE= 0.1
##$AZFW= 0.1
##$BCFW= 0
##$BC_mod= 2
##$BYTORDP= 0
##$COROFFS= 0
##$CY= -3
##$DATMOD= 1
##$DC= 0
##$DFILT= <>
##$DTYPP= 0
##$F1P= 0
##$F2P= 0
##$FCOR= 1
##$FTSIZE= 16384
##$FT_mod= 6
##$GAMMA= 0
##$GB= 0
##$INTBC= 1
##$INTSCL= 0
##$ISEN= 128
##$LB= 0.24
##$LEV0= 0
##$LPBIN= 0
##$MAXI= 10000
##$MC2= 0
##$MEAN= 0
##$ME_mod= 0
##$MI= 1.114404
##$NCOEF= 0
##$NC_proc= -8
##$NLEV= 6
##$NOISF1= 3.799351
##$NOISF2= 2.8
##$NSP= 0
##$NTH_PI= 0
##$NZP= 0
##$OFFSET= 15.72375
##$PC= 1
##$PHC0= -15510.67
##$PHC1= 11.00082
##$PH_mod= 1
##$PKNL= yes
##$PPARMOD= 0
##$PSCAL= 0
##$PSIGN= 0
##$REVERSE= no
##$SF= 200.13000641421
##$SI= 16384
##$SIGF1= 3
##$SIGF2= 2
##$SINO= 5.538805
##$SIOLD= 16384
##$SREGLST= <1H.CDCl3>
##$SSB= 0
##$STSI= 16384
##$STSR= 0
##$SW_p= 3612.71676300578
##$SYMM= 0
##$S_DEV= 0
##$TDeff= 16384
##$TDoff= 0
##$TI= <>
##$TILT= no
##$TM1= 0
##$TM2= 0
##$TOPLEV= 0
##$USERP1= <user>
##$USERP2= <user>
##$USERP3= <user>
##$USERP4= <user>
##$USERP5= <user>
##$WDW= 1
##$XDIM= 16384
##$YMAX_p= 387803770
##$YMIN_p= -3224925
$$ End of Bruker specific parameters
$$ ---------------------------------
##NTUPLES= NMR SPECTRUM
##VAR_NAME=  FREQUENCY,     SPECTRUM/REAL,   SPECTRUM/IMAG
##SYMBOL=    X,             R,               I
##VAR_TYPE=  INDEPENDENT,   DEPENDENT,       DEPENDENT
##VAR_FORM=  AFFN,          ASDF,            ASDF
##VAR_DIM=   16384,         16384,           16384
##UNITS=     HZ,            ARBITRARY UNITS, ARBITRARY UNITS
##FACTOR=    0.220516191357247, 1,           1
##FIRST=     3146.7942112585, 0,             0
##LAST=      -465.922551747284, 0,           0
##MIN=       -465.922551747284, -3224925,    0
##MAX=       3146.7942112585, 387803770,     0
$$ Real data points
##PAGE= N=1
##DATA TABLE= (X++(R..R)), XYDATA
$$ [...]
$$ plain form
6939 2087965 2389695 2489998 2735017 2744418 2967941 3226684 2648406 2509171 2654842 3140440
6929 3140440 3000098 3255709 3448644 3466535 3670874 3728786 3644155 3581177 3511431 3695282
6919 3695282 3845077 3662600 3849405 3543772 3498217 3737616 3365997 2936771 2930096 3111784
6909 3111784 2975446 2870961 2783395 2905212 3432829 2859348 2582055 2392691 2267701 2018362
6899 2018362 1926883 2237829 1697342 1711311 1352282 1520751 1309867 1542712 1543382 1106665
6889 1106665 977841 1102839 1214174 995869 904387 1133007 1144277 1259803 809882 1295526
6879 1295526 1215125 773371 926673 381231 505711 747207 618584 388777 753744 752173
6869 752173 733907 372546 198865 267726 627767 576040 664525 660015 553498 428187 754239
$$ packed form
6939B087965L01730J00303K45019R401K23523K58743n78278j39235J45671M85598
6929C140440j40342K55611J92935J7891K04339N7912q4631o2978o9746J83851
6919C695282J49795j82477J86805l05633m5555K39399l71619m29226o675J81688
6909C111784j36338j04485q7566J21817N27617n73481k77293j89364j24990k49339
6899B018362r1479L10946n40487J3969l59029J68469k10884K32845O70m36717
6889A106665j28824J24998J11335k18305r1482K28620J1270J15526m49921M85644
6879A295526q0401m41754J53302n45442J24480K41496j28623k29807L64967j571
6869G52173j8266l61361j73681O8861L60041n1727Q8485m510j06517j25311L26052
$$ plain form
6858 754239 469549 413532 671906 389567 -19771 211838 284597 629285 351376 130844
6848 130844 181443 449186 437532 537919 487744 576901 541257 585137 760564 432199 402381
6837 402381 356937 479581 365289 516708 612709 662942 757466 497214 383341 234558
6827 234558 122022 211258 599028 419152 496830 303717 -27699 107222 330146 549794
6817 549794 40757 87855 329352 474471 113504 483072 444168 277779 513755 762774
6807 762774 490955 597918 964378 915782 612697 759250 827680 806885 425036 616929
6797 616929 556912 563814 725844 389576 142037 191576 40198 157276 539504 707257
6787 707257 244545 419173 423749 117715 375350 111155 -47674 332763 234822 -242414
$$ packed form
6858G54239k84690n6017K58374k82339m09338K31609P2759L44688k77909k20532
6848A30844N0599K67743j1654J00387n0175Q9157l5644M3880J75427l28365k9818
6837D02381m5444J22644j14292J51419R6001N0233R4524k60252j13873j48783
6827B34558j12536Q9236L87770j79876P7678j93113l31416J34921K22924K19648
6817E49794n09037M7098K41497J45119l60967L69568l8904j66389K35976K49019
6807G62774k71819J06963L66460m8596l03085J46553O8430k0795l81849J91893
6797F16929o0017O902J62030l36268k47539M9539j51378J17078L82228J67753
6787G07257m62712J74628M576l06034K57635k64195j58829L80437r7941m77236
$$ plain form
6777 -242414 -60136 -269416 -345920 -3332 -82707 -495454 -263611 267103 -60235 -301185
6767 -301185 -176247 -57923 89993 63892 358011 110458 49228 350694 616382 319714
6757 319714 -29547 -216143 168297 299265 142192 4807 -60412 77921 228294 518951
6747 518951 478723 92235 57166 155196 53628 212610 356761 243976 553352 673278
6737 673278 335448 167993 -142257 -76225 -59449 197260 263341 112712 200325 218885 453449
6726 453449 149805 -413197 328203 589478 395037 194948 139513 401162 214391 385491
6716 385491 162564 432601 615923 456219 307602 136923 321268 463618 261959 130527
6706 130527 501562 534831 433032 599505 1009763 842696 718791 967072 905108 907350
$$ packed form
6777b42414J82278k09280p6504L42588p9375m12747K31843N30714l27338k40950
6767c01185J24938J18324J47916k6101K94119k47553o1230L01466K65688k96668
6757C19714l49261j86596L84440J30968j57073j37385o5219J38333J50373K90657
6747E18951m0228l86488l5069R8030j01568J58982J44151j12785L09376J19926
6737F73278l37830j67455l10250O6032J6776K56709O6081j50629Q7613J8560K34564
6726D53449l03644n63002P41400K61275j94441k00089n5435K61649j86771J71100
6716C85491k22927K70037J83322j59704j48617j70679J84345J42350k01659j31432
6706A30527L71035L3269j01799J66473M10258j67067j23905K48281o1964K242
$$ plain form
6696 907350 1077450 876607 981728 1002578 617537 239360 113936 293650 16728 -174062
6686 -174062 221880 120440 352565 366108 582510 413794 276492 265483 552846 693061
6676 693061 308170 201707 -70974 85042 -379 511624 412567 244813 592563 822727
6666 822727 306092 408324 554420 290476 506034 164258 262017 203987 -19678 209890
6656 209890 419688 669538 512098 282186 315333 643082 647538 634712 526463 268651
6646 268651 135399 404165 511957 337793 -93928 481411 337581 91487 326532 223499
6636 223499 64515 321584 507857 344269 139836 823616 990242 577137 737700 381689
6626 381689 580487 443903 437022 711293 1128313 1142793 921286 868113 1026791 814174
$$ packed form
6696I07350J70100k00843J05121K0850l85041l78177j25424J79714k76922j90790
6686a74062L95942j01440K32125J3543K16402j68716j37302j1009K87363J40215
6676F93061l84891j06463k72681J56016q5421N12003r9057j67754L47750K30164
6666H22727n16635J02232J46096k63944K15558l41776R7759n8030k23665K29568
6656B09890K09798K49850j57440k29912L3147L27749M456j2826j08249k57812
6646B68651j33252K68766J07792j74164m31721N75339j43830k46094K35045j03033
6636B23499j58984K57069J86273j63588k04433O83780J66626m13105J60563l56011
6626C81689J98798j36584o881K74271M17020J4480k21507n3173J58678k12617
$$ plain form
6616 814174 694308 1078061 969366 1001763 1224399 990319 984108 1479248 1215883 1132936
6606 1132936 1238769 1469175 1679755 1944448 2253230 2186973 2036696 1790575 1595021 1574443
6596 1574443 1859391 2144428 2466812 2212641 1930317 2340490 2435554 2168026 1975964 1863639
6586 1863639 2066317 2113475 2699760 2526960 2587386 2431415 2220387 2333800 1880589 1647622
6576 1647622 1684351 2049895 2297425 2098125 1758784 1913226 2113504 2444050 2709575 1904349
6566 1904349 1790480 1933767 1818557 1753397 1713455 1521426 1760621 1946222 2085594 2048833
6556 2048833 1949164 1717052 1597409 1899705 1964810 2006026 2133114 2185099 2002043 1902633
6546 1902633 1942485 1860670 1975342 1833782 1696467 1782832 1644674 1573826 1697504 1451028
$$ packed form
6616H14174j19866L83753j08695L2397K22636k34080o211M95140k63365q2947
6606A132936J05833K30406K10580K64693L08782o6257j50277k46121j95554k0578
6596A574443K84948K85037L22384k54171k82324M10173R5064k67528j92062j12325
6586A863639K02678M7158N86285j72800O0426j55971k11028J13413m53211k32967
6576A647622L6729L65544K47530j99300l39341J54442K00278L30546K65525q05226
6566A904349j13869J43287j15210o5160l9942j92029K39195J85601J39372l6761
6556B048833r9669k32112j19643L02296O5105M1216J27088N1985j83056r9410
6546A902633L9852q1815J14672j41560j37315Q6365j38158p0848J23678k46476
$$ plain form
6536 1451028 1547180 2089277 2048742 1972804 1694315 1691583 1785512 1915125 2030544 2046267 2012644
6525 2012644 1891995 1765983 1990739 2242800 2016519 1918879 1889223 1456700 1487246 1636335
6515 1636335 1555291 1743896 1860647 1876265 1902022 1837590 1850883 1699751 1652120 1498483 1499714
6504 1499714 1434396 1933560 1867536 1593585 1492335 1582809 1370066 1054079 1092099 1500125
6494 1500125 1296661 1448436 1301084 1178026 1112810 848884 810720 764901 1135808 1134430
6484 1134430 966313 901591 1266012 1433190 1325650 1047408 1190559 695185 834451 908746
6474 908746 665781 954009 1106018 902207 873381 718631 624119 636117 543758 357100
6464 357100 284750 262981 594064 742655 453181 500864 468964 535327 569817 677346 717756
$$ packed form
6536A451028R6152N42097m0535p5938k78489k732R3929J29613J15419J5723l3623
6525B012644j20649j26012K24756K52061k26281r7640k9656m32523L0546J49089
6515A636335q1044J88605J16751J5618K5757o4432J3293j51132m7631j53637J231
6504A499714o5318M99164o6024k73951j01250R0474k12743l15987L8020M08026
6494A500125k03464J51775j47352j23058o5216k63926l8164m5819L70907j378
6484A134430j68117o4722L64421J67178j07540k78242J43151m95374J39266P4295
6474I08746k42965K88228J52009k03811k8826j54750r4512J1998r2359j86658
6464C57100p2350k1769L31083J48591k89474M7683l1900O6363L4490J07529M0410
$$ plain form
6453 717756 411970 645203 327868 92408 549747 586475 732921 641991 300432 593431
6443 593431 414059 120875 351567 307760 456715 1050300 1063685 750516 840117 883100
6433 883100 767749 531324 482956 614942 480936 474643 757723 526797 417982 808402
6423 808402 727826 660822 883966 550360 822030 688696 882039 871101 1049148 636984
6413 636984 293948 611210 811128 769634 644548 452569 369448 456712 310588 242049
6403 242049 559164 690932 439951 312010 302406 790584 317737 611084 810842 316149
6393 316149 437365 557298 429588 419842 448881 620699 398020 626461 544585 642539 583009
6382 583009 564707 705344 908176 565665 287394 161897 66145 262759 625102 694627
$$ packed form
6453G17756l05786K33233l17335k35460M57339L6728J46446r0930l41559K92999
6443E93431j79372k93184K30692m3807J48955N93585J3385l13169Q9601M2983
6433H83100j15351k36425m8368J31986j34006o293K83080k30926j08815L90420
6423H08402q0576o7004K23144l33606K71670j33334J93343j0938J78047m12164
6413F36984l43036L17262J99918m1494j25086j91979q3121Q7264j46124o8539
6403B42049L17115J31768k50981j27941r604M88178m72847K93347J99758m94693
6393C16149J21216J19933j27710r746K9039J71818k22679K28441q1876R7954n9530
6382E83009j8302J40637K02832l42511k78271j25497r5752J96614L62343O9525
$$ plain form
6372 694627 676574 631636 593958 596626 740887 722392 917686 815198 679110 888835 998133
6361 998133 1154933 950600 1040626 718097 711011 555446 577293 746717 999700 884819
6351 884819 838228 1059530 1073094 885109 926539 1094642 1061731 1027833 1107000 679051 723381
6340 723381 433960 657677 1073555 1445459 988877 776928 877807 752570 1014521 870642
6330 870642 652498 814367 733015 742299 334281 815123 1338451 983232 989167 1048083 653655
6319 653655 708764 765043 868053 1088063 901477 1498952 1253290 1401635 1406615 1089998
6309 1089998 1368068 1404017 957216 1138197 728511 1307326 1235591 815866 1103988 846894
6299 846894 883552 982676 940443 1088530 1326809 1324431 953036 659373 1379528 1344061 1106408
$$ packed form
6372F94627j8053m4938l7678K668J44261j8495J95294j02488j36088K09725J09298
6361I98133J56800k04333R0026l22529p086j55565K1847J69424K52983j14881
6351H84819m6591K21302J3564j87985M1430J68103l2911l3898P9167m27949M4330
6340G23381k89421K23717M15878L71904m56582k11949J00879j25237K61951j43879
6330H70642k18144J61869q1352R284m08018M80842N23328l55219N935N8916l94428
6319F53655N5109N6279J03010K20010j86586N97475k45662J48345M980l16617
6309A089998K78070L5949m46801J80981m09686N78815p1735m19725K88122k57094
6299H46894L6658R9124m2233J48087K38279k378l71395k93663P20155l5467k37653
$$ plain form
6288 1106408 1603533 1809468 1544902 1273209 1542417 1219564 995322 932969 1291261 1351896
6278 1351896 1128318 1552877 1454730 1402198 1630315 1692301 1426030 1138692 1281835 1547674
6268 1547674 1379139 1553204 2085694 2270437 1860374 1903505 1755986 1227918 1249624 1342477
6258 1342477 1106513 1083021 1361312 1304375 1214133 1174837 1415521 1409907 1564475 1623039 1822732
6247 1822732 1748267 1679889 1284630 1307880 1530810 1760951 1706619 1291262 1240165 1537713
6237 1537713 1651225 1885185 2077773 1623323 1318413 1705536 1649542 1579575 1881818 1418300
6227 1418300 1587397 1733401 1792968 1962363 1688827 1481878 1541119 1568581 1717176 1726720
6217 1726720 1758092 1407749 1610304 1756077 1889694 1899966 1918530 2022971 1994780 1708812
$$ packed form
6288A106408M97125K05935k64566k71693K69208l22853k24242o2353L58292O0635
6278A351896k23578M24559r8147n2532K28117O1986k66271k87338J43143K65839
6268A547674j68535J74065N32490J84743m10063M3131j47519n28068K1706R2853
6258A342477k35964k3492K78291n6937r0242l9296K40684n614J54568N8564J99693
6247A822732p4465o8378l95259K3250K22930K30141n4332m15357n1097K97548
6237A537713J13512K33960J92588m54450l04910L87123n5994o9967L02243m63518
6227A418300J69097J46004N9567J69395k73536k06949N9241K7462J48595R544
6217A726720L1372l50343K02555J45773J33617J0272J8564J04441k8191k85968
$$ plain form
6207 1708812 1483642 1975402 2178787 2009128 1803126 1784948 1436880 1571727 1997711 1829234
6197 1829234 2005603 2091015 2198105 1973227 2076126 2018500 1929199 1985290 1628771 1786624
6187 1786624 1917782 2041637 2224729 2367649 2437978 2106080 1987173 2207325 2164440 1787469
6177 1787469 1785508 2057983 2114122 1833289 2389099 2820283 3077384 2875995 2679634 2326512
6167 2326512 2218915 2391942 2689443 2792697 2621183 2316696 2136597 2255504 2362778 2555271
6157 2555271 2544931 2536775 2886388 3220158 3246179 3138234 2892091 2870923 2920332 3180937 2972815
6146 2972815 3306054 3099320 3146034 3217073 3153159 3531669 3626889 3452216 3488066 3658074
6136 3658074 3889702 4123980 3887711 3953533 4109248 3802288 3999958 3857183 3821386 4279490
$$ packed form
6207A708812k25170M91760K03385j69659k06002j8178l48068J34847M25984j68477
6197A829234J76369Q5412J07090k24878J02899n7626q9301N6091l56519J57853
6187A786624J31158J23855J83092J42920P0329l31898j18907K20152m2885l76971
6177A787469j961K72475N6139k80833N55810M31184K57101k01389j96361l53122
6167B326512j07597J73027K97501J03254j71514l04487j80099J18907J07274J92493
6157B555271j0340q156L49613L33770K6021j07945k46143k1168M9409K60605k08122
6146B972815L33239k06734M6714P1039o3914L78510R5220j74673L5850J70008
6136C658074K31628K34278k36269O5822J55715l06960J97670j42775l5797M58104
$$ plain form
6126 4279490 4653680 4648122 4869972 4776061 4757766 4575768 4719192 4604334 4612424 4583015 5093452
6115 5093452 5096146 5031677 5329783 5599014 5964516 5953073 5991274 6214352 6581522 6561283 6606876
6104 6606876 6908182 7667981 8030485 8342616 8437315 8565104 8929407 9412496 9831037 10082928
6094 10082928 9763147 10236782 10657330 11183762 10912795 11137524 11633076 11552800 11396485 11117322
6084 11117322 11110352 11210933 11391701 11792047 12310603 12612079 12723905 13280313 14263405 14754890
6074 14754890 15532216 16264110 17240662 18211425 19042027 20165635 21603315 23148312 24105278
6065 24105278 25880572 27578633 29388883 30419270 31343290 31943201 31745998 31049885 29804806
6056 29804806 28827072 27327323 26052300 25419578 24909505 24637392 24656153 24627103 25411608
$$ packed form
6126D279490L74190n558K21850r3911j8295j81998J43424j14858Q090k9409N10437
6115E093452K694o4469K98106K69231L65502j1443L8201K23078L67170k0239M5593
6104F606876L01306P59799L62504L12131R4699J27789L64303M83089M18541K51891
6094A0082928l19781M73635M20548N26432k70967K24729M95552q0276j56315k79163
6084A1117322o970J00581J80768M00346N18556L01476J11826N56408R83092M91485
6074A4754890P77326P31894R76552R70763Q30602J123608J437680J544997R56966
6065B4105278J775294J698061J810250J030387R24020N99911j97203o96113j245079
6056B9804806r77734j499749j275023o32722n10073k72113J8761k9050P84505
$$ plain form
6047 25411608 25928917 26628672 27150571 28687671 29952391 31291478 33168131 35372205 38080437
6038 38080437 40738417 43709373 47095029 50409014 54021964 57509148 60112114 62102962
6030 62102962 62806984 62014453 60898364 59225723 57463004 56484046 54559231 52776536 50484487
6021 50484487 48002185 45850916 44098551 42571879 42148719 41703583 41876125 42628696 43400126
6012 43400126 44340995 45467582 47115160 48765773 51238042 54639900 57675412 60234690
6004 60234690 63711521 67511159 70486910 72365365 74534745 76226940 77027947 76796481
5996 76796481 74686212 70921080 66225405 61734379 56689341 52219968 48932801 46712452
5988 46712452 44455368 42558169 41656608 40655716 40183973 39615817 39571197 39433362 39861583
$$ packed form
6047B5411608N17309O99755N21899J537100J264720J339087J876653K204074K708232
6038C8080437K657980K970956L385656L313985L612950L487184K602966J990848
6030F2102962P04022p92531j116089j672641j762719r78958j924815j782695k292049
6021E0484487k482302k151269j752365j526672m23160m45136J72542P52571P71430
6012D3400126R40869J126587J647578J650613K472269L401858L035512K559278
6004F0234690L476831L799638K975751J878455K169380J692195Q01007k31466
5996G6796481k110269l765132m695675m491026n045038m469373l287167k220349
5988D6712452k257084j897199r01561j000892m71743n68156m4620j37835M28221
$$ plain form
5979 39861583 40647315 41028143 41952978 42559971 43987710 45940724 47175966 48872704 50323036
5970 50323036 51169294 51143328 50715429 48984821 46741927 44477148 42547313 40842149 39400550
5961 39400550 38374411 37527284 36842671 36500246 36719524 37254047 37514317 38063800 38783947
5952 38783947 39484723 40597996 41926068 43515883 44968992 47053153 49123673 51269089
5944 51269089 53914811 57343197 60629341 64141250 68484285 72512808 75719940 77631605
5936 77631605 76446685 71772169 66064740 60898487 57256170 55574283 54129744 53394990
5928 53394990 53334427 53465176 54275002 55485490 57260979 59502269 62299412 65237274 67733840
5919 67733840 71324086 75451742 79829361 85275610 91222804 98040747 105342549 112772686
$$ packed form
5979C9861583P85732L80828R24835O06993J427739J953014J235242J696738J450332
5970E0323036Q46258k5966m27899j730608k242894k264779j929835j705164j441599
5961C9400550j026139q47127o84613l42425K19278N34523K60270N49483P20147
5952C8783947P00776J113273J328072J589815J453109K084161K070520K145416
5944E1269089K645722L428386L286144L511909M343035M028523L207132J911665
5936G7631605j184920m674516n707429n166253l642317j681887j444539p34754
5928E3394990o0563J30749Q09826J210488J775489K241290K797143K937862K496566
5919F7733840L590246M127656M377619N446249N947194O817943P301802P430137
$$ plain form
5911 112772686 119756642 125052515 126031455 119768504 108090513 95218752 84112032 75745991
5903 75745991 69056753 63974549 60492456 57980309 56425739 54906841 54169786 53757318
5895 53757318 53277650 53540561 53927878 54948381 56459334 57818643 59735824 62129940 64989416
5886 64989416 68406087 71836836 75088816 78173663 80498728 79811535 75450209 68683945
5878 68683945 61689008 55799045 50568117 46347098 42737087 39438164 36818316 35018260
5870 35018260 33446794 32037472 30631832 29600528 28971676 28017044 27090680 27109111 26609884
5861 26609884 26122514 25916261 25350947 24704046 24444279 24622948 24954749 25250315 25447464
5852 25447464 25666545 25822860 25495609 24996969 24806781 24400422 23397231 22307633 21474678
$$ packed form
5911A12772686O983956N295873R78940o262951j1677991j2871761j1106720q366041
5903G5745991o689238n082204l482093k512147j554570j518898p37055m12468
5895E3757318m79668K62911L87317J020503J510953J359309J917181K394116K859476
5886F4989416L416671L430749L251980L084847K325065o87193m361326o766264
5878F8683945o994937n889963n230928m221019l610011l298923k619848j800056
5870C5018260j571466j409322j405640j031304o28852r54632r26364J8431m99227
5861B6609884m87370k06253n65314o46901k59767J78669L31801K95566J97149
5852B5447464K19081J56315l27251m98640j90188m06359j003191j089598q32955
$$ plain form
5843 21474678 20935263 21005814 20916051 20532766 20172932 20047438 20162220 20376909 19665503 19596716
5833 19596716 19831715 19840924 19870660 19655400 19169756 19765790 20363442 20579564 21013440 21283770
5823 21283770 21818207 22379609 23382976 23952994 24498377 25590471 26180917 27647728 29116726
5814 29116726 30504714 32602748 34517821 35964109 36535313 35159889 33395576 32312250
5806 32312250 31389329 31062079 30771389 30366820 30057199 29896605 29388372 28974544 28887826 28705887
5796 28705887 28747241 29321026 29456911 29745785 29798845 29528329 29551675 29821624 30255023 30380874
5786 30380874 30323655 30406567 31248910 31604568 32443699 33522254 34590939 36147263 37359173
5777 37359173 38727920 39877015 40520293 40724796 39934796 39160021 38706632 38252570 38159769
$$ packed form
5843B1474678n39415P0551q9763l83285l59834j25494J14782K14689p11406o8787
5833A9596716K34999R209K9736k15260m85644N96034N97652K16122M33876K70330
5823B1283770N34437N61402J003367N70018N45383J092094N90446J466811J468998
5814B9116726J387988K098034J915073J446288N71204j375424j764313j083326
5806C2312250r22921l27250k90690m04569l09621j60594n08233m13828q6718j81939
5796B8705887M1354N73785J35885K88874N3060k70516K3346K69949M33399J25851
5786C0380874n7219Q2912Q42343L55658Q39131J078555J068685J556324J211910
5777C7359173J368747J149095O43278K04503p90000p74775m53389m54062r2801
$$ plain form
5768 38159769 37972669 38082049 38116226 37847290 37398599 36706163 36410322 35276500 34522740
5759 34522740 34577071 34080073 33942708 34153571 34719751 35321892 35654365 35952022 36874482 37438204
5749 37438204 38545296 39645012 40189205 40985491 41795001 41958057 42351139 43366638 44276891
5740 44276891 45670620 47444929 48360967 49721080 51101290 52180327 52824072 51778531
5732 51778531 51291707 50740744 49883042 49242354 48045144 46375020 44791925 43307303 41569905
5723 41569905 40493551 40171243 39819949 39864422 39740578 40584625 41540817 42736346 43814648
5714 43814648 45923995 48813368 51638529 55092464 58551753 61670487 64739830 66566814
5706 66566814 66325584 64566944 62096601 59429661 57063208 54150291 50037643 45956728
$$ packed form
5768C8159769j87100J09380L4177k68936m48691o92436k95841j133822p53760
5759C4522740N4331m96998j37365K10863N66180O02141L32473K97657R22460N63722
5749C7438204J107092J099716N44193P96286Q09510J63056L93082J015499R10253
5740D4276891J393729J774309R16038J360113J380210J079037O43745j045541
5732E1778531m86824n50963q57702o40688j197210j670124j583095j484622j737398
5723D1569905j076354l22308l51294M4473j23844Q44047R56192J195529J078302
5714D3814648K109347K889373K825161L453935L459289L118734L069343J826984
5706F6566814k41230j758640k470343k666940k366453k912917m112648m080915
$$ plain form
5698 45956728 42884916 40742460 38402246 37082092 36090151 35502124 34921864 34481401 34109947
5689 34109947 34091660 34557106 35398587 36069262 37457467 38313191 39310577 40893889 42113357
5680 42113357 42584528 42376463 41688377 40548037 38737264 36369542 33553023 31323670 29182545
5671 29182545 27438228 25781068 24641587 23961962 23156947 22704447 22255981 21887783 21541497
5662 21541497 21218182 21357677 20974493 20563611 20593324 19731687 19534711 19215479 18646408 18838833
5652 18838833 18754320 18588572 18236180 18132619 18269808 18688149 18849518 18638311 18679555 18774591
5642 18774591 18586281 18524014 18317157 17899129 17764412 17176569 16815161 16817932 17217747 17266612
5632 17266612 17202699 16677026 16780057 16942616 16798598 16759370 16745301 16760252 17184930 17404969
$$ packed form
5698D5956728l071812k142456k340214j320154r91941n88027n80260m40463l71454
5689C4109947j8287M65446Q41481O70675J388205Q55724R97386J583312J219468
5680D2113357M71171k08065o88086j140340j810773k367722k816519k229353k141125
5671B9182545j744317j657160j139481o79625q05015m52500m48466l68198l46286
5662B1541497l23315J39495l83184m10882K9713q61637j96976l19232n69071J92425
5652A8838833q4513j65748l52392j03561J37189M18341J61369k11207M1244R5036
5642A8774591j88310o2267k06857m18028j34717n87843l61408K771L99815M8865
5632A7266612o3913n25673J03031J62559j44018l9228j4069J4951M24678K20039
$$ plain form
5622 17404969 17537633 17873780 18350305 18593351 18915478 18989076 19290150 19599892 19564848 19536517
5612 19536517 19354094 19051476 18668625 18241407 18388812 18178100 18547449 18255480 18149029
5603 18149029 18285110 19014097 18946270 18801297 19255111 19468821 19811460 20107962 20629838 20606017
5593 20606017 20904538 21388937 22348418 22808926 23419928 23964138 24478314 24955271 25170899
5584 25170899 25609843 26167391 26892441 27668187 28303112 28852146 29520587 30790327 32413391
5575 32413391 33716955 34664850 36679553 38970367 41622682 44530306 47315267 50650774
5567 50650774 54370094 58600446 63408003 68474208 73473424 78072076 82090993 84128253
5559 84128253 82158151 77111965 70845375 65515370 61871214 59212037 56997804 55410219
$$ packed form
5622A7404969J32664L36147M76525K43046L22127P3598L01074L09742l5044k8331
5612A9536517j82423l02618l82851m27218J47405k10712L69349k91969j06451
5603A8149029J36081P28987o7827j44973M53814K13710L42639K96502N21876k3821
5593B0606017K98521M84399R59481M60508O11002N44210N14176M76957K15628
5584B5170899M38944N57548P25050P75746O34925N49034O68441J269740J623064
5575C2413391J303564R47895K014703K290814K652315K907624K784961L335507
5567E0650774L719320M230352M807557N066205M999216M598652M018917K037260
5559H4128253j970102n046186o266590n330005l644156k659177k214233j587585
$$ plain form
5551 55410219 54612792 54152947 54243499 54567383 55405765 56809187 58564459 61113796 64338127
5542 64338127 68028702 72043446 76328286 81098465 86339358 92119590 96927603 101653010
5534 101653010 105936826 108515735 108957152 105847329 100327025 94210450 87759176 81569451
5526 81569451 76858029 73770917 70915468 68740094 67775515 66803239 66122191 65600397 65212576
5517 65212576 64857930 64982339 65798004 66397106 67227539 68742626 70303795 72309502 74668648
5508 74668648 76746601 78168404 79231455 78992339 77313752 74971660 71912182 69164090
5500 69164090 66263595 63822326 61963041 60618458 59578596 58816233 57935841 57180692 56187169
5491 56187169 55116729 52859757 50692301 48697575 46348988 45139657 44100574 43266452
$$ packed form
5551E5410219p97427m59845R0552L23884Q38382J403422J755272K549337L224331
5542F4338127L690575M014744M284840M770179N240893N780232M808013M725407
5534A01653010M283816K578909M41417l109823n520304o116575o451274o189725
5526H1569451m711422l087112k855449k175374r64579r72276o81048n21794l87821
5517F5212576l54646J24409Q15665N99102Q30433J515087J561169K005707K359146
5508G4668648K077953J421803J063051k39116j678587k342092l059478k748092
5500F9164090k900495k441269j859285j344583j039862p62363q80392p55149r93523
5491E6187169j070440k256972k167456j994726k348587j209331j039083q34122
$$ plain form
5483 43266452 42869909 42389129 41788924 41066126 40905593 40340937 40209690 39551429 39165148
5474 39165148 38873679 38715407 38715134 38083035 38018889 38111643 38434698 38293123 37764337 37496838
5464 37496838 36603534 36266781 35690020 34891953 34398402 33935785 32975569 32767927 32824293 32881417
5454 32881417 33285894 33299770 33425053 33042380 33003414 32488695 32346871 31266533 30395295 29385524
5444 29385524 28767243 27904417 27113402 26613286 25970443 25379298 24869396 24508205 24315966
5435 24315966 24376599 24303649 24574475 24440011 24625640 24960514 24649945 24827167 25306842 25468636
5425 25468636 25210350 25316811 25893973 26138415 25823267 26242115 26201011 25909359 25597588 25366006
5415 25366006 25115109 24608807 23850716 23768975 23333761 22794644 22198271 21503872 21033108 20977140
$$ packed form
5483D3266452l96543m80780o00205p22798j60533n64656j31247o58261l86281
5474C9165148k91469j58272k73o32099o4146R2754L23055j41575n28786k67499
5464C7496838q93304l36753n76761p98067m93551m62617r60216k07642N6366N7124
5454C2881417M04477J3876J25283l82673l8966n14719j41824j080338q71238j009771
5444B9385524o18281q62826p91015n00116o42843n91145n09902l61191j92239
5435B4315966O0633p2950K70826j34464J85629L34874l10569J77222M79675J61794
5425B5468636k58286J06461N77162K44442l15148M18848m1104k91652l11771k31582
5415B5366006k50897n06302p58091q1741m35214n39117n96373o94399m70764n5968
$$ plain form
5405 20977140 21065115 21184917 20926775 21149498 21054842 20912248 20600920 20983077 21351244 21419314
5395 21419314 21556743 21977164 22436163 22861708 23383890 23458901 23626879 24082483 24208583 23683607
5385 23683607 23078743 22328154 22105551 21364001 21160638 20317572 20432002 20506235 20560116 20878828
5375 20878828 21122340 21056025 21291914 21998292 22966919 23220040 23265131 23744184 23573266 23389642
5365 23389642 23396583 23774648 24212377 24564169 23836447 22955513 22038035 20785097 20357054 20165420
5355 20165420 19783621 19565223 19659064 19582052 19824210 20087774 20897475 21065879 21321320 21444800
5345 21444800 21963842 23057074 23997805 24377641 24443721 24080783 23449786 22850406 22369262
5336 22369262 22123729 21739903 21362876 21059970 20592994 19941710 19463303 18825086 18025937
$$ packed form
5405B0977140Q7975J19802k58142K22723r4656j42594l11328L82157L68167O8070
5395B1419314J37429M20421M58999M25545N22182P5011J67978M55604J26100n24976
5385B3683607o04864p50589k22603p41550k03363q43066J14430P4233N3881L18712
5375B0878828K43512o6315K35889P06378R68627K53121M5091M79053j70918j83624
5365B3389642O941L78065M37729L51792p27722q80934r17478j252938m28043j91634
5355B0165420l81799k18398R3841p7012K42158K63564Q09701J68404K55441J23480
5345B1444800N19042J093232R40731L79836O6080l62938o30997n99380m81144
5336B2369262k45533l83826l77027l02906m66976o51284m78407o38217p99149
$$ plain form
5327 18025937 17324639 16792298 16476567 16225269 16008736 15800242 15461254 15630331 15776673
5318 15776673 16120049 16443226 16956597 17117947 16575419 16099142 16079608 16260772 15680928 15163484
5308 15163484 14374918 14442218 14612014 14948953 15170333 14700835 14652242 14521605 14238381 13702185
5298 13702185 13677948 13757574 13337034 13012880 12685525 12399511 12003339 11826707 11914995 11952973
5288 11952973 11597957 11601448 11533399 11232370 11424743 11657330 11667038 11865612 11871035 11926617 12122193
5277 12122193 12050980 12219857 12623917 12838145 12563031 12683672 12533565 12300817 12434648 12376358
5267 12376358 12147265 11896501 12471532 12956090 12993851 13003905 12678097 12228295 11907004 11742915
5257 11742915 11684034 11636891 11639169 11718775 11402800 11616106 11225063 11375230 11642567 12047679
$$ packed form
5327A8025937p01298n32341l15731k51298k16533k08494l38988J69077J46342
5318A5776673L43376L23177N13371J61350n42528m76277j9534J81164n79844n17444
5308A5163484p88566O7300J69796L36939K21380m69498m8593j30637k83224n36196
5298A3702185k4237P9626m20540l24154l27355k86014l96172j76632Q8288L7978
5288A1952973l55016L491o8049l01029J92373K32587R708J98574N423N5582J95576
5277A2122193p1213J68877M04060K14228k75114J20641j50107k32748J33831n8290
5267A2376358k29093k50764N75031M84558L7761J0054l25808m49802l21291j64089
5257A1742915n8881m7143K278P9606l15975K13306l91043J50167K67337M05112
$$ plain form
5247 12047679 12171324 11790280 11792770 12317631 12367912 12550730 12839510 12522419 12050357 11566513
5237 11566513 10995355 10774584 10652478 10511619 10239022 10438662 10244036 10459823 9788660
5228 9788660 9707888 9236755 9074747 8922794 8672006 8589873 8081047 8421450 8360712 8246654
5218 8246654 8020275 7654064 7427554 7166434 6948927 7434696 7037067 7010305 6571751 6620977
5208 6620977 6707791 6761571 6681789 6350564 6350057 6475659 6523895 6041636 6019373 5643019 5763045
5197 5763045 5931722 5689401 5858364 5923175 5666766 5498529 5093488 5030193 5515145 5377881
5187 5377881 5453571 5393623 5388453 5341593 5459636 5483377 5778838 5571381 5563302 5894347 5859351
5176 5859351 5793451 5736006 5793456 6015491 5973506 5842428 5792379 5654591 5660767 5785341 5881278
$$ packed form
5247A2047679J23645l81044K490N24861N0281J82818K88780l17091m72062m83844
5237A1566513n71158k20771j22106j40859k72597J99640j94626K15787o71163
5228I788660q0772m71133j62008j51953k50788q2133n08826L40403o0738j14058
5218H246654k26379l66211k26510k61120k17507M85769l97629k6762m38554M9226
5208F620977Q6814N3780p9782l31225n07J25602M8236m82259k2263l76354J20026
5197E763045J68677k42321J68963O4811k56409j68237m05041o3295M84952j37264
5187E377881P5690n9948n170m6860J18043K3741K95461k07457q079L31045l4996
5176E859351o5900n7445N7450K22035m1985j31078n0049j37788O176J24574R5937
$$ plain form
5165 5881278 5891094 5950539 5421607 5729955 5957037 5584108 5250053 5504833 5662244 5130593
5155 5130593 4734285 4464176 4642421 4646927 4489411 3866709 3881768 4234826 4915659 5068299
5145 5068299 5432390 5502014 5347697 5273673 5291252 4981692 5085531 5265347 5825724 6214984
5135 6214984 5641784 5531449 5756300 5420330 4968782 4523197 4201281 4465683 4486085 4732312
5125 4732312 4690425 4371659 4337989 4092579 4228226 4194577 4244658 4079698 4250103 4716454
5115 4716454 4515003 3997459 4174965 4082419 4064805 4125157 4533281 4793527 4850105 5136913
5105 5136913 4831181 4593144 4396179 4513912 4247978 4065073 3607701 3750499 3781675 3673751
5095 3673751 4039489 4300144 3633299 3189255 3410218 3689152 3663658 3180191 2877904 3361906
$$ packed form
5165E881278R816N9445n28932L08348K27082l72929l34055K54780J57411n31651
5155E130593l96308k70109J78245M506j57516o22702J5059L53058O80833J52640
5145E068299L64091O9624j54317p4024J7579l09560J03839J79816N60377L89260
5135F214984n73200j10335K24851l35970m51548m45585l21916K64402K0402K46227
5125D732312m1887l18766l3670k45410J35647l3649N0081j64960J70405M66351
5115D716454k01451n17544J77506r2546j7614O0352M08124K60246N6578K86808
5105E136913l05732k38037j96965J17733k65934j82905m57372J42798L1176j07924
5095C673751L65738K60655o66845m44044K20963K78934k5494m83467l02287M84002
$$ plain form
5085 3361906 3128023 3531921 3690560 3678672 3358111 3282596 3362919 3281481 3227075 3351556
5075 3351556 3534997 3178969 3172573 3342625 3257211 2824654 2994120 2962944 2694846 3138228
5065 3138228 3368209 3136977 2773436 2979007 2840492 3028340 3410029 3881328 3898898 3871604
5055 3871604 3824047 3789278 3720138 3796893 3640371 3721767 3857332 4205960 3874371 3664367
5045 3664367 3974835 3827208 3990016 3658932 3884812 3426513 3213820 3314504 3601398 3525378
5035 3525378 3717092 3806223 3558870 3366536 3542284 3075733 3158694 3488823 3380093 3124509
5025 3124509 3024196 3159292 3263720 3613480 3799745 3461543 3652672 4199315 3967301 3847601
5015 3847601 3310392 3548386 3450860 3733242 4213511 4255011 4410609 4651737 4304548 4495228
$$ packed form
5085C361906k33883M03898J58639j1888l20561p5515Q0323q1438n4406J24481
5075C351556J83441l56028o396J70052q5414m32557J69466l1176k68098M43382
5065C138228K29981k31232l63541K05571j38515J87848L81689M71299J7570k7294
5055C871604m7557l4769o9140P6755j56522Q1396J35565L48628l31589k10004
5045C664367L10468j47627J62808l31084K25880m58299k12693J00684K86894p6020
5035C525378J91714Q9131k47353j92334J75748m66551Q2961L30129j08730k55584
5025C124509j00313J35096J04428L49760J86265l38202J91129N46643k32014j19700
5015C847601n37209K37994r7526K82382M80269M1500J55598K41128l47189J90680
$$ plain form
5005 4495228 4468733 4057775 3964808 3933672 3776493 3750792 3590948 3632774 3943789 3924052 4168932
4994 4168932 4211510 4082296 3819210 3867868 3741949 3954105 4385770 4522035 4335973 4274048
4984 4274048 4218109 4051270 4371346 3932932 3908409 4309715 4250278 3799231 3976124 4241292
4974 4241292 3996400 3631303 3792287 3947783 3818293 4228477 4108072 4053452 3970043 4235036
4964 4235036 3949411 4393817 4249148 4433170 4225891 4215464 4278182 5014194 4694349 5067996
4954 5067996 5501575 4939483 4367712 4382947 4697184 4963861 4812318 5067161 5236583 5487804
4944 5487804 5951838 5671840 5552673 5424934 5583994 5831483 6284554 6554359 6626462 6955947
4934 6955947 7168698 6813501 6970305 7341460 7668527 7922940 7468580 6912227 7055853 7552981
$$ packed form
5005D495228k6495m10958r2967l1136j57179k5701j59844M1826L11015j9737K44880
4994D168932M2578j29214k63086M8658j25919K12156M31665J36265j86062o1925
4984D274048n5939j66839L20076m38414k4523M01306n9437m51047J76893K65168
4974D241292k44892l65097J60984J55496j29490M10184j20405n4620q3409K64993
4964D235036k85625M44406j44669J84022k07279j0427O2718P36012l19845L73647
4954E067996M33579n62092n71771J5235L14237K66677j51543K54843J69422K51221
4944E487804M64034k79998j19167j27739J59060K47489M53071K69805P2103L29485
4934F955947K12751l55197J56804L71155L27067K54413m54360n56353J43626M97128
$$ plain form
4924 7552981 7578343 7713077 8200516 7894930 7807415 8063785 8368272 8918357 9359660 9285060
4914 9285060 9305182 9248507 9609024 9670365 9554239 9742065 10498547 10335529 10876932 11323075
4904 11323075 11313890 11580978 11618974 11861698 12602612 12652398 13309215 13936841 14685546 15382146
4894 15382146 15848136 16220523 16727367 17502819 18313050 18817616 19510095 20105898 21055757
4885 21055757 21867370 22921241 23723808 24973074 26046431 27602538 29188422 31542809
4877 31542809 33871191 35777964 38467844 41341436 45929462 50633357 55606001 61552102
4869 61552102 68854553 77370112 85834716 95545260 107701998 121072387 135860546 150331358
4861 150331358 166309240 175410844 172816190 166800056 159438682 144064395 123468678 105799035
$$ packed form
4924G552981K5362J34734M87439l05586q7515K56370L04487N50085M41303p4600
4914I285060K0122n6675L60517O1341j16126J87826P56482j63018N41403M46143
4904A1323075r185K67088L7996K42724P40914M9786O56817O27626P48705O96600
4894A5382146M65990L72387N06844P75452Q10231N04566O92479N95803R49859
4885B1055757Q11613J053871Q02567J249266J073357J556107J585884K354387
4877C1542809K328382J906773K689880K873592M588026M703895M972644N946101
4869F1552102P302451Q515559Q464604R710544J2156738J3370389J4788159J4470812
4861A50331358J5977882R101604k594654o016134p361374j5374287k0595717j7669643
$$ plain form
4853 105799035 93326165 84257684 77626568 73423860 70765354 69890955 69083559 68783025
4845 68783025 68474210 67808869 67377885 64700958 60241440 54762806 49487398 46444572 43996277
4836 43996277 42255524 40553035 39747238 39583976 39598173 39721248 40305793 40960808 41170307
4827 41170307 42362555 43749037 45567441 46860487 48340823 50293269 51556562 52406549
4819 52406549 53873466 56272014 58957945 61874461 64681560 66706570 64907459 59874756
4811 59874756 54091572 49876270 47250284 45541385 45011464 44751370 45477101 46469766 47891414
4802 47891414 50257338 53097455 55923526 59443514 64274973 69679186 75722230 82782597
4794 82782597 90918312 99091625 105844846 113546480 114753093 105003080 91689047 81626641
$$ packed form
4853A05799035j2472870r068481o631116m202708k658506q74399q07396l00534
4845F8783025l08815o65341m30984k676927m459518n478634n275408l042826k448295
4836D3996277j740753j702489q05797j63262J4197J23075N84545O55015K09499
4827D1170307J192248J386482J818404J293046J480336J952446J263293Q49987
4819E2406549J466917K398548K685931K916516K807099K025010j799111n032703
4811E9874756n783184m215302k625986j708899n29921k60094P25731R92665J421648
4802D7891414K365924K840117K826071L519988M831459N404213O043044P060367
4794H2782597Q135715Q173313O753221P701634J206613r750013j3314033j0062406
$$ plain form
4786 81626641 75802861 73035701 71902679 72452610 73318037 73323978 72771766 72726424 74336632
4777 74336632 77069614 80769427 86029668 91885421 98656293 105460568 109832861 109563767
4769 109563767 104971652 98033698 90347435 84153340 80789221 78906312 76222250 72314484
4761 72314484 67393510 63346712 60292977 58544886 57696219 57541077 55799141 53240008
4753 53240008 51068834 49653165 49745903 50332895 51638605 53616866 56109127 58951231 62641546
4744 62641546 66459007 70908319 76258816 81091249 83250708 83283152 83602051 80399199 71886775
4735 71886775 61446146 53180541 47436511 43179855 39961555 37847113 35466675 33688816
4727 33688816 32897529 32113841 31206502 30680720 30313056 29777206 30532283 31042730 31810267
$$ packed form
4786H1626641n823780k767160j133022N49931Q65427N941n52212m5342J610208
4777G4336632K732982L699813N260241N855753O770872O804275M372293k69094
4769A09563767m592115o937954p686263o194095l364119j882909k684062l907766
4761G2314484m920974m046798l053735j748091q48667j55142j741936k559133
4753E3240008k171174j415669R2738N86992J305710J978261K492261K842104L690315
4744F2641546L817461M449312N350497M832433K159459L2444L18899l202852q512424
4735G1886775j0440629q265605n744030m256656l218300k114442k380438j777859
4727C3688816p91287p83688r07339n25782l67664n35850P55077N10447P67537
$$ plain form
4718 31810267 33422654 34953011 37046732 39464543 42165200 45069907 48290263 53001656
4710 53001656 58364565 63643718 69193275 75189982 78938980 77170816 73196748 67375395
4702 67375395 58464824 49431154 42114078 37192926 33831891 31190275 28970268 27587708
4694 27587708 26850731 25779374 25383131 25436362 25551672 25936464 26860621 27758129 28133447
4685 28133447 29127811 29155970 27371543 24891381 21971770 19397373 17822428 16448883 15296885
4676 15296885 14684596 14095567 13780190 13663128 12842123 12042554 11498699 10890694 10568788
4667 10568788 10143488 10201837 10449226 10122994 9495774 9321989 9104330 8932682 8795590 8194056
4657 8194056 8074549 7960887 7582148 7132386 7274087 7799134 7634960 7566377 7832861 7716042
$$ packed form
4718C1810267J612387J530357K093721K417811K700657K904707L220356M711393
4710E3001656N362909N279153N549557N996707L748998j768164l974068n821353
4702F7375395q910571r033670p317076m921152l361035k641616k220007j382560
4694B7587708p36977j071357l96243N3231J15310L84792R24157Q97508L75318
4685B8133447R94364K8159j784427k480162k919611k574397j574945j373545j151998
4676A5296885o12289n89029l15377j17062q21005p99569n43855o08005l21906
4667A0568788m25300N8349K47389l26232o27220j73785k17659j71648j37092o01534
4657H194056j19507j13662l78739m49762J41701N25047j64174o8583K66484j16819
$$ plain form
4647 7716042 7397910 7178693 7228221 7182470 7028931 6695541 6186657 6096690 6111690 6140597
4637 6140597 6144122 6045697 5935998 5884093 5912398 5864259 5843420 5743712 5904302 5724600 5141516
4626 5141516 5262017 5135233 5301599 5403636 5491389 5415558 5612804 5767723 5524843 5374781
4616 5374781 5465911 5198375 4799860 4718636 5028468 4897139 4488239 4474407 4082905 4365129
4606 4365129 4109328 4462315 4452922 3708440 4043455 4336678 4295317 3635048 3578423 3797624
4596 3797624 3913888 4026498 3820417 3783868 3881910 3619485 3276064 3755636 3481119 3431235
4586 3431235 3325102 3384551 3382857 3585418 3449105 3205730 3646412 3445148 3341831 3823962
4576 3823962 3856050 3508251 3419917 3473770 3685681 3938839 4052687 3729046 3402168 3420299
$$ packed form
4647G716042l18132k19217M9528m5751j53539l33390n08884q9967J5000K8907
4637F140597L525r8425j09699n1905K8305m8139k0839r9708J60590j79702n83084
4626E141516J20501j26784J66366J02037Q7753p5831J97246J54919k42880j50062
4616E374781R1130k67536l98515q1224L09832j31329m08900j3832l91502K82224
4606D365129k55801L52987r393p44482L35015K93223m1361o60269n6625K19201
4596C797624J16264J12610k06081l6549R8042k62425l43421M79572k74517m9884
4586C431235j06133N9449j694K02561j36313k43375M40682k01264j03317M82131
4576C823962L2088l47799q8334N3853K11911K53158J13848l23641l26878J8131
$$ plain form
4566 3420299 3419505 3477681 3348155 3418145 3404138 3447379 3752698 3782925 3785123 4108518 4005665
4555 4005665 3601391 3706371 3773661 4032365 4442285 4439406 4148229 4385865 4406825 4616328
4545 4616328 5172143 5546797 5238399 5309757 5299336 5112915 5493876 5022487 4995137 5059167
4535 5059167 4941612 4769853 4517001 4726409 4940364 5152446 5224882 5429666 5517541 5419925
4525 5419925 5123647 5089812 4968808 4945440 5256729 5468060 5131127 5060444 5187650 5504227
4515 5504227 5254201 5156216 5847747 5535192 5276163 5502510 5898346 5599517 5946406 6117269
4505 6117269 6625064 6631301 5926534 6331255 6866406 6434045 6545783 7061520 7175889 7176262
4495 7176262 7143207 7585255 7490234 8027356 8182508 8213567 8728523 8830221 9098303 9426922
$$ packed form
4566C420299p94N8176j29526O9990j4007M3241L05319L0227K198L23395j02853
4555D005665m04274J04980O7290K58704M09920k879k91177K37636K0960K09503
4545D616328N55815L74654l08398P1358j0421j86421L80961m71389k7350O4030
4535E059167j17555j71759k52852K09408K13955K12082P2436K04784Q7875r7616
4525E419925k96278l3835j21004k3368L11289K11331l36933p0683J27206L16577
4515E504227k50026r7985O91531l12555k59029K26347L95836k98829L46889J70863
4505F117269N07795O237p04767M04721N35151m32361J11738N15737J14369L73
4495G176262l3055M42048r5021N37122J55152L1059N14956J01698K68082L28619
$$ plain form
4485 9426922 9991038 10428047 10770430 11643646 11969852 12570919 13008578 13159156 13994822 14871771
4475 14871771 15587658 15673474 15551524 15249106 15645203 15778052 15856433 16084643 16605757 17521177
4465 17521177 18529906 19605796 20721412 22544885 23785652 25574203 27350555 29160529
4457 29160529 30545852 32521551 33558879 34113580 34303390 33796555 32764951 31330349 29582770
4448 29582770 27855519 26943772 26341490 25784928 25115923 24566449 24184492 24317416 24689061
4439 24689061 24730666 24551200 25437597 26112496 27054994 27851652 29043121 30486671 31999131
4430 31999131 33820565 36113659 38145134 39850238 41901429 44322426 46339039 47777108
4422 47777108 48290164 48440428 47860812 47107443 45634555 43867439 42970800 41528733 40390191
$$ packed form
4485I426922N64116M37009L42383Q73216L26206O01067M37659J50578Q35666Q76949
4475A4871771P15887Q5816j21950l02418L96097J32849P8381K28210N21114R15420
4465A7521177J008729J075890J115616J823473J240767J788551J776352J809974
4457B9160529J385323J975699J037328N54701J89810n06835j031604j434602j747579
4448B9582770j727251r11747o02282n56562o69005n49474l81957J32924L71645
4439B4689061M1605j79466Q86397O74899R42498P96658J191469J443550J512460
4430C1999131J821434K293094K031475J705104K051191K420997K016613J438069
4422D7777108N13056J50264n79616p53369j472888j767116q96639j442067j138542
$$ plain form
4413 40390191 38978077 37609651 36407352 35058236 33530977 32205553 30857684 30021092
4405 30021092 28909137 28282500 27471749 27232531 27208522 27318973 27590971 27465449 27778185
4396 27778185 28194665 28938663 29872662 30890229 31942816 33292727 34659224 36236974 37174269
4387 37174269 38198883 39010990 38894940 38302757 37587407 36073323 34189880 32810180 30913780
4378 30913780 29194080 27843043 26147369 25117873 24510132 24097646 23565439 23059464 22891798
4369 22891798 22604325 22509012 22255972 22184955 21881578 21593630 21500490 21190802 21540344 21425947
4359 21425947 20751444 20896671 20921310 20847821 21338573 21334425 21097801 21031699 21031520 20824837 20797899
4348 20797899 20844950 20593886 20385049 20290909 19920795 19430990 19341079 18858470 18911341 18747755
$$ packed form
4413D0390191j412114j368426j202299j349116j527259j325424j347869q36592
4405C0021092j111955o26637q10751k39218k4009J10451K71998j25522L12736
4396B7778185M16480P43998R33999J017567J052587J349911J366497J577750R37295
4387C7174269J024614Q12107j16050n92183p15350j514084j883443j379700j896400
4378C0913780j719700j351037j695674j029496o07741m12486n32207n05975j67666
4369B2891798k87473r5313k53040p1017l03377k87948r3140l09688L49542j14397
4359B1425947o74503J45227K4639p3489M90752m148k36624o6102j79k06683k6938
4348B0797899M7051k51064k08837r4140l70114m89805q9911m82609N2871j63586
$$ plain form
4338 18747755 18224831 18207927 17903536 17782750 17924554 18164743 17893387 17899637 18121620 18304565
4328 18304565 18457857 18384029 17977606 18287202 18595517 18824291 18847277 19187251 19632336 19905380
4318 19905380 20170535 19945559 20505100 21019977 20914637 20701133 21083293 21385147 21850256
4309 21850256 21968217 21489014 21101146 20302016 20013393 19755797 19409418 19431735 19583747 19448170
4299 19448170 19641673 19633642 19693269 20298146 20623306 20598300 20768390 21071121 20924485 21116575
4289 21116575 21048571 20845377 20968927 21277756 21524025 21343756 21072392 20889399 21217575 21543787
4279 21543787 21440413 21726165 22105899 22354014 22759012 23303447 23975798 24846305 25286900
4270 25286900 25629798 26284124 26929305 27636374 28654192 29505878 29672813 30282267 31412469
$$ packed form
4338A8747755n22924j6904l04391j20786J41804K40189k71356O250K21983J82945
4328A8304565J53292p3828m06423L09596L08315K28774K2986L39974M45085K73044
4318A9905380K65155k24976N59541N14877j05340k13504L82160L01854M65109
4309B1850256J17961m79203l87868p99130k88623k57596l46379K2317J52012j35577
4299A9448170J93503q031N9627O04877L25160k5006J70090L02731j46636J92090
4289B1116575o8004k03194J23550L08829K46269j80269k71364j82993L28176L26212
4279B1543787j03374K85752L79734K48115M04998N44435O72351Q70507M40595
4270B5286900L42898O54326O45181P07069J017818Q51686J66935O09454J130202
$$ plain form
4261 31412469 31367520 31735317 31882200 31709046 31335994 30855685 30982442 30746270 30409549 29960458
4251 29960458 29420885 29361479 29106992 29363033 29280002 29141060 29319091 29476750 30027990 30265947
4241 30265947 30380005 30195281 30998516 31699074 32447254 33084752 33627193 34253128 34953273
4232 34953273 36496214 37405798 38332623 39935254 40958039 41881285 43194181 43785475 44543750
4223 44543750 45454823 46528453 47541555 48632641 49327559 49885649 50259026 50969937 51360481
4214 51360481 50780013 49027488 47524720 46567144 46680590 46902455 46244871 46487296 46676988
4205 46676988 47157663 48154189 49262792 49946988 50931740 52208143 53441483 55004266 56845968
4196 56845968 58580807 60354765 62655340 65141503 67319271 69220815 70180669 71394583
$$ packed form
4261C1412469m4949L67797J46883j73154l73052m80309J26757k36172l36721m49091
4251B9960458n39573n9406k54487K56041q3031j38942J78031J57659N51240K37957
4241C0265947J14058j84724Q03235P00558P48180O37498N42441O25935P00145
4232C4953273J542941R09584R26825J602631J022785R23246J312896N91294P58275
4223D4543750R11073J073630J013102J091086O94918N58090L73377P10911L90544
4214E1360481n80468j752525j502768r57576J13446K21865o57584K42425J89692
4205D6676988M80675R96526J108603O84196R84752J276403J233340J562783J841702
4196E6845968J734839J773958K300575K486163K177768J901544R59854J213914
$$ plain form
4188 71394583 72892800 74376478 76341461 78601445 81320075 84581852 88399940 93087758
4180 93087758 98717152 105112829 112810798 121990157 132730225 145579809 159865176 176154090
4172 176154090 194275080 215167885 238297677 263208064 290026448 318663108 347544810
4165 347544810 374459483 387803770 377232442 340912362 290869660 245086040 210771598
4158 210771598 187454173 171223099 159293654 150487701 144715857 140844440 138204661 135743416
4150 135743416 134613058 135158768 137452169 140675780 145732366 152054666 160163065 170099716
4142 170099716 181738589 194091409 206960360 220773900 231888224 235583184 233440048
4135 233440048 230637015 223352446 209742403 194161338 180359774 167434283 153875261
$$ packed form
4188G1394583J498217J483678J964983K259984K718630L261777L818088M687818
4180I3087758N629394O395677P697969R179359J0740068J2849584J4285367J6288914
4172A76154090J8120990K0892805K3129792K4910387K6818384K8636660K8881702
4165C47544810K6914673J3344287j0571328l6320080n0042702m5783620l4314442
4158B10771598k3317425j6231074j1929445q805953n771844l871417k639779k461245
4150A35743416j130358N45710K293401L223611N056586O322300Q108399R936651
4142A70099716J1638873J2352820J2868951J3813540J1114324L694960k143136
4135B33440048k803033p284569j3610043j5581065j3801564j2925491j3559022
$$ plain form
4128 153875261 140642190 128633494 119086446 111831010 105510331 100633332 96986580 93772055
4120 93772055 91476350 89776478 88076122 86742430 85219582 82813872 80827883 79351130
4112 79351130 78064839 77402535 77521342 77945999 78892539 79968156 81871805 84365334 87279062
4103 87279062 90480514 94657099 99409295 103957213 108441082 112328096 115519666 115133718
4095 115133718 110944067 103973881 96693141 90101937 84646594 80691476 77987391 75477418
4087 75477418 74137371 74001379 73365589 73221350 73335354 72871159 72801057 72860334 73053010 73364380
4077 73364380 73886536 73827158 73671419 72520187 70070084 68130997 67015879 66577918 66580363
4068 66580363 67334300 67831917 69149333 69953541 70577703 69887753 68024500 65145094 62681107
$$ packed form
4128A53875261j3233071j2008696r547048p255436o320679m876999l646752l214525
4120I3772055k295705j699872j700356j333692j522848k405710j985989j476753
4112G9351130j286291o62304J18807M24657R46540J075617J903649K493529K913728
4103H7279062L201452M176585M752196M547918M483869L887014L191570l85948
4095A15133718m189651o970186p280740o591204n455343l955118k704085k509973
4087G5477418j340047j35992o35790j44239J14004m64195p0102N9277J92676L11370
4077G3364380N22156n9378j55739j151232k450103j939087j115118m37961K445
4068F6580363P53937M97617J317416Q04208O24162o89950j863253k879406k463987
$$ plain form
4059 62681107 60424370 58706590 57281654 56706600 56151131 56042491 55681806 55861030 56822925
4050 56822925 57374527 58345301 59515337 60647147 61732540 63297986 64397349 65639527
4042 65639527 66990190 67004726 66065337 65043103 64165219 64255174 63740407 63735238 63650778 64072302
4032 64072302 64584204 65598036 66985700 68116640 70001412 72002628 74082671 76253653
4024 76253653 78740034 81495590 84413938 87021717 89476982 92059467 94998663 97573926
4016 97573926 98835509 98088347 95613056 93943329 92997619 93395550 94378020 95565705 96739270
4007 96739270 97717215 98271625 99346713 99945524 99477475 98740226 98282444 99146952 100498580
3998 100498580 102137011 103731524 105947071 108179521 110079079 111899095 112926501 113435622
$$ packed form
4059F2681107k256737j717780j424936n75054n55469j08640l60685J79224R61895
4050E6822925N51602R70774J170036J131810J085393J565446J099363J242178
4042F5639527J350663J4536r39389j022234q77884Q9955n14767n169q4460M21524
4032F4072302N11902J013832J387664J130940J884772K001216K080043K170982
4024G6253653K486381K755556K918348K607779K455265K582485K939196K575263
4016I7573926J261583p47162k475291j669727r45710L97931R82470J187685J173565
4007I6739270R77945N54410J075088N98811m68049p37249m57782Q64508J351628
3998A00498580J638431J594513K215547K232450J899558J820016J027406N09121
$$ plain form
3990 113435622 113671870 115203503 117796159 121343107 125621463 131166242 137054687 143074177
3982 143074177 149366664 154940616 160033236 165545664 171574209 177429112 182082077 182170490
3974 182170490 177504264 172595609 169890633 169705218 171619279 173842930 176415833 178291147
3966 178291147 177712636 172503410 164175710 155706386 149834053 145981348 144333835 143819301
3958 143819301 143627066 143504832 142964964 142716393 142022739 141480827 140692387 140821270 140910560
3949 140910560 140484616 140272240 140612016 142191167 144664589 147194938 149476535 152042671
3941 152042671 153737665 154101388 152033415 146290619 138388934 130296421 123148493 118128111
3933 118128111 114881783 112861488 111645099 111317637 111328497 110828643 110697175 110487966 110267550
$$ packed form
3990A13435622K36248J531633K592656L546948M278356N544779N888445O019490
3982A43074177O292487N573952N092620N512428O028545N854903M652965Q8413
3974A82170490m666226m908655k704976j85415J914061K223651K572903J875314
3966A78291147n78511n209226q327700q469324n872333l852705j647513n14534
3958A43819301j92235j22234n39868k48571o93654n41912p88440J28883Q9290
3949A40910560m25944k12376L39776J579151K473422K530349K281597K566136
3941A52042671J694994L63723k067973n742796p901685q092513p147928n020382
3933A18128111l246328k020295j216389l27462J0860m99854j31468k09209k20416
$$ plain form
3924 110267550 110849209 111366319 112975431 115280412 117347519 119511452 121977298 124042954
3916 124042954 125233844 125707904 124963148 123556937 120939690 116549608 109456639 101830137
3908 101830137 95299472 89711562 85428093 82344608 79792119 77614457 76313665 75193738
3900 75193738 74179767 73487344 73343982 72989104 73121683 73298525 74298500 75379236 75872874
3891 75872874 76610020 76958980 77184131 77020312 77042953 76408218 75591965 74145148 71693363
3882 71693363 69377221 66890536 64597523 62594620 60951430 59699283 58432431 57658443
3874 57658443 57086608 56646928 55919547 55427211 55348158 55068057 55448829 56340704 57371767
3865 57371767 58043457 58907363 60601679 61802242 62107605 62256384 63453380 64252582 64639982
$$ packed form
3924A10267550N81659N17110J609112K304981K067107K163933K465846K065656
3916A24042954J190890M74060p44756j406211k617247m390082p092969p626502
3908A01830137o530665n587910m283469l083485k552489k177662j300792j119927
3900G5193738j013971o92423j43362l54878J32579J76842R99975J080736M93638
3891G5872874P37146L48960K25151j63819K2641o34735q16253j446817k451785
3882G1693363k316142k486685k293013k002903j643190j252147j266852p73988
3874E7658443n71835m39680p27381m92336p9053k80101L80772Q91875J031063
3865E7371767O71690Q63906J694316J200563L05363J48779J196996P99202L87400
$$ plain form
3856 64639982 65608198 66988643 67773668 68401333 69239253 69802107 69787863 68102439 65885818
3847 65885818 62900485 60635942 58686970 57309729 55799306 54177858 53586045 53248637
3839 53248637 52953002 52955076 53455358 53753713 54207063 55322378 56348467 56953797 57078221
3830 57078221 57652092 58335449 59311891 60335086 61088595 61120908 60602486 59772354 58188282
3821 58188282 57862395 57321248 56530901 55916939 54820507 54000684 53228651 52122904 51521782
3812 51521782 51707484 50802707 50523411 50993868 50871936 51674877 52366582 52776207 53654562
3803 53654562 54805447 56395934 58578768 59638349 60501095 60487491 59919826 58627994 56662377
3794 56662377 55413233 54723997 54478255 54249931 53961472 53758866 53861235 53942850 53856197 53810289
$$ packed form
3856F4639982R68216J380445P85025O27665Q37920N62854j4244j685424k216621
3847F5885818k985333k264543j948972j377241j510423j621448n91813l37408
3839E3248637k95635K074N00282K98355M53350J115315J026089O05330J24424
3830E7078221N73871O83357R76442J023195P53509L2313n18422q30132j584072
3821E8188282l25887n41147p90347o13962j096432q19823p72033j105747o01122
3812E1521782J85702r04777k79296M70457j21932Q02941O91705M09625Q78355
3803E3654562J150885J590487K182834J059581Q62746j3604n67665j291832j965617
3794E6662377j249144o89236k45742k28324k88459k02606J02369Q1615q6653m5908
$$ plain form
3784 53810289 54213787 54649180 54881324 55639694 56442462 57674608 58583509 59430191 60307878
3775 60307878 60744557 60771302 60215804 58831216 57266120 55152016 52549864 50176677 48037436
3766 48037436 46440119 45371209 44163915 43693795 43114034 42187230 41763447 41245514 41362753
3757 41362753 40974025 40533709 39879299 39341791 39237549 39317362 38791618 38464981 37840153 37230354
3747 37230354 36505369 35779126 35280514 34946236 34427330 33768677 33102179 32405939 32224376
3738 32224376 31962097 32234709 32393696 32133668 32397541 32922337 32870275 32708857 32628661 32263103
3728 32263103 32372576 32044731 31682644 31701748 31408998 30897514 30680746 30486836 29744048 28959103
3718 28959103 28290051 27922169 27572203 27550719 27594588 27636414 27428770 26884131 26594857 26797332
$$ packed form
3784E3810289M03498M35393K32144P58370Q02768J232146R08901Q46682Q77687
3775F0307878M36679K6745n55498j384588j565096k114104k602152k373187k139241
3766D8037436j597317j068910j207294m70120n79761r26804m23783n17933J17239
3757D1362753l88728m40316o54410n37508j04242P9813n25744l26637o24828o09799
3747C7230354p24985p26243m98612l34278n18906o58653o66498o96240j81563
3738C2224376k62279K72612J58987k60028K63873N24796n2062j61418q0196l65558
3728C2263103J09473l27845l62087J9104k92750n11484k16768j93910p42788p84945
3718B8959103o69052l67882l49966k1484M3869M1826k07644n44639k89274K02475
$$ plain form
3708 26797332 26705713 25856040 25735612 25911015 25597171 25260810 24701749 24660815 24569466 24266983
3698 24266983 23873903 23409338 23168721 23011406 22889066 22654441 22547853 22489029 22566283 22282112
3688 22282112 21847577 21823144 22062867 21966700 21797627 21825999 21425588 21047770 20596968 20621788
3678 20621788 20278213 20135666 20350823 20080647 19849218 20073866 20044183 19675532 19372795 19081078
3668 19081078 18835756 18814404 18307758 18010079 18251329 18071077 18539398 18639782 18136405 18003291
3658 18003291 17946160 17801907 17707670 17772987 17989599 17801661 17913944 17714354 17933254 17752556
3648 17752556 17633445 17977352 17729795 17709330 17640209 17427958 17337850 16949586 16668873 16380452
3638 16380452 16392203 16195332 15755950 15826964 15902736 16053686 16082839 15859962 16010692 16436853
$$ packed form
3708B6797332r1619q49673j20428J75403l13844l36361n59061m0934r1349l02483
3698B4266983l93080m64565k40617j57315j22340k34625j06588n8824P7254k84171
3688B2282112m34535k4433K39723r6167j69073K8372m00411l77818m50802K4820
3678B0621788l43575j42547K15157k70176k31429K24648k9683l68651l02737k91717
3668A9081078k45322k1352n06646k97679K41250j80252M68321J00384n03377j33114
3658A8003291n7131j44253r4237O5317K16612j87938J12283j99590K18900j80698
3648A7752556j19111L43907k47557k0465o9121k12251r0108l88264k80713k88421
3638A6380452J1751j96871m39382P1014P5772J50950K9153k22877J50730M26161
$$ plain form
3628 16436853 16515224 16556508 16534508 16656435 16886826 16933181 16632337 16812275 16964612 16877602
3618 16877602 16925667 16528561 16704418 15882520 15638272 15861773 15644266 15307568 15136779 15061184
3608 15061184 14596160 14347258 13989788 14024248 14435538 14374006 14582576 14678551 14827076 14634008
3598 14634008 14731023 15441980 15470535 15088632 14862229 15072726 14736948 14889548 15070047 14926130
3588 14926130 14725843 14506984 14653627 14959427 14566091 14479489 14355707 14198190 13962480 14237739
3578 14237739 13897145 13588084 12992922 12675796 12750667 13169329 12995777 12543670 12474255 11952786
3568 11952786 11771509 12061090 12118216 11752706 11723999 11814448 11727249 11963896 12333466 12387717
3558 12387717 12054107 11962632 12206844 12080803 12085062 11757577 11376775 11255816 11021275 11266339
$$ packed form
3628A6436853P8371M1284k2000J21927K30391M6355l00844J79938J52337q7010
3618A6877602M8065l97106J75857q21898k44248K23501k17507l36698j70789p5595
3608A5061184m65024k48902l57470L4460M11290o1532K08570R5975J48525j93068
3598A4634008R7015P10957K8555l81903k26403K10497l35778J52600J80499j43917
3588A4926130k00287k18859J46643L05800l93336q6602j23782j57517k35710K75259
3578A4237739l40594l09061n95162l17126P4871M18662j73552m52107o9415n21469
3568A1952786j81277K89581N7126l65510k8707R0449q7199K36647L69570N4251
3558A2387717l33610r1475K44212j26041M259l27485l80802j20959k34541K45064
$$ plain form
3548 11266339 10693030 10179136 10426233 9867450 9302634 9341860 9148169 9120096 8992675 8854633
3538 8854633 8812772 9182531 9192901 8838890 9122918 9480497 9191655 8802294 8922114 9214977
3528 9214977 9309905 9546999 9321911 9089599 9152116 9051332 8903146 8646625 8371116 8288421
3518 8288421 8553186 8001471 7656961 7693694 8094321 7595495 7831981 7758229 7802074 7454485
3508 7454485 7372840 7880193 8121197 7743263 7936777 7864388 7971206 7666336 7218132 7461935
3498 7461935 7733588 7877655 7715869 7660234 7462670 7425391 7275557 7304018 6779180 6656254
3488 6656254 6664531 6788836 6652969 6844070 6510547 6552237 6755810 6352870 6203179 6530199
3478 6530199 6855072 6956778 6986019 6951319 6450279 6349558 6379037 6201121 6118011 6068295
$$ packed form
3548A1266339n73309n13894K47097n58783n64816L9226j93691k8073j27421j38042
3538H854633m1861L69759J0370l54011K84028L57579k88842l89361J19820K92863
3528I214977R4928K37094k25088k32312O2517j00784j48186k56521k75509q2695
3518H288421K64765n51715l44510L6733M00627m98826K36486p3752M3845l47589
3508G454485q1645N07353K41004l77934J93514p2389J06818l04870m48204K43803
3498G461935K71653J44067j61786n5635j97564l7279j49834K8461n24838j22926
3488F656254Q277J24305j35867J91101l33523M1690K03573m02940j49691L27020
3478F530199L24873J01706K9241l4700n01040j00721K9479j77916q3110m9716
$$ plain form
3468 6068295 6127755 6100047 5980678 5622971 5448916 5843282 6021024 5924649 5473740 5247444
3458 5247444 5477085 5287586 5149209 5195150 5192472 5494510 5085075 4689839 5229357 5029435
3448 5029435 4876606 4571420 4628668 4820385 4862640 4917963 5036838 4885608 4795332 4842451
3438 4842451 4690929 4454192 4563229 4567203 4890697 4875553 4687307 4362980 4489341 4738678
3428 4738678 4535647 3945360 4199395 4221805 3758020 3904945 3847058 3980803 4205161 4298438
3418 4298438 4137921 3849940 3985530 4035535 3912000 3728754 3754151 3951818 4412572 4351023
3408 4351023 4251646 4209992 4097533 4033907 4381166 4287629 3918124 3964672 4385179 4127195
3398 4127195 3655011 4019386 3950418 4324078 4430605 4455878 4277433 4236005 4126422 3973623
$$ packed form
3468F068295N9460k7708j19369l57707j74055L94366J77742r6375m50909k26296
3458E247444K29641j89499j38377M5941k678L02038m09435l95236N39518j99922
3448E029435j52829l05186N7248J91717M2255N5323J18875j51230r0276M7119
3438D842451j51522k36737J09037L974L23494j5144j88246l24327J26361K49337
3428D738678k03031n90287K54035K2410m63785J46925n7887J33745K24358R3277
3418D298438j60517k87981J35590N0005j23535j83246K5397J97667M60754o1549
3408D351023r9377m1654j12459o3626L47259r3537l69505M6548M20507k57984
3398D127195m72184L64375o8968L73660J06527K5273j78445m1428j09583j52799
$$ plain form
3388 3973623 4016758 4048482 3600701 4126815 4285857 4042310 3921734 4029387 4224512 4442992
3378 4442992 3995393 3694216 3675119 4030105 3949372 4138098 4193845 4202870 4171453 4217014 4306417
3367 4306417 3864294 4057303 4096674 3622971 3594482 3655898 4165936 4088417 4286722 4355280
3357 4355280 4491863 4280207 4198852 4281408 4291468 4446382 4106024 4522795 4528886 4242427
3347 4242427 4217440 4289572 4177461 4122555 4281861 4010698 3994676 4404289 4672547 4595114
3337 4595114 4460109 4637431 4659827 4607851 4916586 5331271 4990431 5319918 5470466 5351577
3327 5351577 5520562 5393550 5177800 5020802 4757476 4674437 5359729 5950525 5688429 5858800
3317 5858800 5529210 5562159 5543988 5194470 5555902 5245653 5469776 5815032 4966729 4894545
$$ packed form
3388C973623M3135L1724m47781N26114J59042k43547j20576J07653J95125K18480
3378D442992m47599l01177j9097L54986q0733J88726N5747R025l1417M5561Q9403
3367D306417m42123J93009L9371m73703k8489O1416N10038p7519J98305O8558
3357D355280J36583k11656q1355Q2556J0060J54914l40358M16771O091k86459
3347D242427k4987P2132j12111n4906J59306k71163j6022M09613K68258p7433
3337D595114j35005J77322K2396n1976L08735M14685l40840L29487J50548j18889
3327E351577J68985j27012k15750j56998k63326q3039O85292N90796k62096J70371
3317E858800l29590L2949j8171l49518L61432l10249K24123L45256q48303p2184
$$ plain form
3307 4894545 5279770 5523130 5662559 6033169 6360948 6510347 6657111 6131380 6468206 6874518
3297 6874518 7035382 7021996 6841488 6776748 6626500 6859609 7192502 7261864 6872769 7192278
3287 7192278 7354031 7207928 7272143 7018618 7293523 7222664 7532822 7688858 7726217 7875986
3277 7875986 7935985 8000094 8134717 8198179 8482188 9014918 9109169 9534839 9518983 10205432
3267 10205432 10550656 10961060 11427285 12225152 12529034 13071325 13628151 14374102 15359444
3258 15359444 16503107 17132866 18269820 19339386 20141818 20845145 21486047 22449552 22330239
3249 22330239 20906931 19125606 17523312 16233145 14862031 13556717 11932142 11301437
3241 11301437 10681470 10251378 9638277 9193687 8753143 8445004 8110108 7531180 7408318
$$ packed form
3307D894545L85225K43360J39429L70610L27779J49399J46764n25731L36826M06312
3297F874518J60864j3386j80508o4740j50248K33109L32893O9362l89095L19509
3287G192278J61753j46103O4215k53525K74905p0859L10158J56036L7359J49769
3277G875986N9999O4109J34623O3462K84009N32730R4251M25670j5856O86449
3267A0205432L45224M10404M66225P97867L03882N42291N56826P45951R85342
3258A5359444J143663O29759J136954J069566Q02432P03327O40902R63505j19313
3249B2330239j423308j781325j602294j290167j371114j305314j624575o30705
3241A1301437o19967m30092o13101m44590m40544l08139l34896n78928j22862
$$ plain form
3232 7408318 7735936 7721542 7682095 7587758 7366056 7860751 8158482 8832289 9143193 9799053
3222 9799053 10204461 10749772 11348482 11753723 11490513 10330353 8099594 7304765 6780699
3213 6780699 5906882 5598190 5622751 5397425 5037496 4948110 4733206 4603485 4345745 4204461
3203 4204461 4009475 3956564 4158105 4175834 4071850 3792689 4079510 3636327 4249880 4247962
3193 4247962 3968445 4418238 4772105 5305765 5405181 5544874 5900259 5516696 4973769 4263326
3183 4263326 3607050 3365456 3057296 2955497 2965555 2853849 2596067 2458862 2547546 2554519
3173 2554519 2565907 2413183 1980453 1739452 1974624 1925552 2216386 2447702 2117099 1933148
3163 1933148 2527724 2009134 1935867 2032758 1738762 1408102 1373690 1502405 1400604 1295692
$$ packed form
3232G408318L27618j4394l9447r4337k21702M94695K97731O73807L10904O55860
3222I799053M05408N45311N98710M05241k63210j160160k230759p94829n24066
3213F780699q73817l08692K4561k25326l59929q9386k14904j29721k57740j41284
3203D204461j94986n2911K01541J7729j03984k79161K86821m43183O13553j918
3193D247962k79517M49793L53867N33660R9416J39693L55385l83563n42927p10443
3183D263326o56276k41594l08160j01799J0058j11706k57782j37205Q8684O973
3173B554519J1388j52724m32730k41001K35172m9072K90834K31316l30603j83951
3163A933148N94576n18590p3267R6891k93996l30660l4412J28715j01801j04912
$$ plain form
3153 1295692 1327366 1243580 1274208 1651380 1686775 1267302 1259544 1197147 1267231 1705985 1264455
3142 1264455 1173604 1055664 1234044 1440072 1133929 770895 903373 1162584 1214195 1212846
3132 1212846 1416126 1344935 908153 1131751 1327925 1051351 815663 563322 652959 738277
3122 738277 735116 717733 873131 981473 1156581 849230 636189 719116 678234 517137 790263
3111 790263 1089784 1217094 1321449 1016713 613036 360027 768839 1073482 927545 1235763
3101 1235763 1285009 1051834 720216 351704 807642 656084 487705 852965 518167 328104
3091 328104 430355 769354 713281 852643 714839 687093 492749 642072 318368 585062
3081 585062 426148 465158 128840 253997 381428 614351 749900 838831 646042 1174322
$$ packed form
3153A295692L1674q3786L0628L77172L5395m19473p758o2397P0084M38754m41530
3142A264455r0851j17940J78380K06028l06143l63034J32478K59211N1611j349
3132A212846K03280p1191m36782K23598J96174k76574k35688k52341Q9637Q5318
3122G38277l161j7383J55398J08342J75108l07351k13041Q2927m0882j61097K73126
3111G90263K99521J27310J04355l04736m03677k53009M08812L04643j45937L08218
3101A235763M9246k33175l31618l68512M55938j51558j68379L65260l34798j90063
3091C28104J02251L38999n6073J39362j37804k7746j94344J49323l23704K66694
3081E85062j58914L9010l36318J25157J27431K32923J35549Q8931j92789N28280
$$ plain form
3071 1174322 1028646 672155 1001707 604232 663488 855767 788562 796854 856144 742768
3061 742768 718535 281096 652068 575492 390043 310055 387778 290849 399289 421387 490987
3050 490987 689249 927108 573340 889187 865085 935153 685888 844678 880178 401401
3040 401401 605683 676376 451997 289923 60486 125736 521669 678623 959228 786066
3030 786066 703319 610377 550335 768732 279759 176420 -115102 -2745 206413 120753
3020 120753 163371 -102518 51320 -161017 20170 -231069 -230576 101957 508184 559826 584187
3009 584187 711313 806144 681544 587524 432409 229833 482124 283654 76332 398580
2999 398580 298052 123113 384739 624191 326084 132244 557304 758321 449350 504129
$$ packed form
3071A174322j45676l56491L29552l97475N9256J92279o7205Q292N9290j13376
3061G42768k4233m37439L70972p6576j85449p9988P7723r6929J08440K2098O9600
3050D90987J98262K37859l53768L15847k4102P0068k49265J58790L5500m78777
3040D01401K04282P0693k24379j62074k29437O5250L95933J56954K80605j73162
3030G86066q2747r2942o0042K18397m88973j03339k91522J12357K09158q5660
3020A20753M2618k65889J53838k12337J81187k51239M93L32533M06227N1642K4361
3009E84187J27126R4831j24600r4020j55115k02576K52291j98470k07322L22248
2999C98580j00528j74939K61626K39452k98107j93840M25060K01017l08971N4779
$$ plain form
2989 504129 785650 713238 584563 731658 952992 624338 641565 477371 548134 601021
2979 601021 578482 593172 492535 423253 424511 189312 173311 501080 519303 19971 405708
2968 405708 645393 741090 590251 635696 760398 387795 584540 560299 779411 1106150
2958 1106150 805606 492209 447728 437553 562341 760487 761947 806820 1002512 1090600 867786
2947 867786 1039724 1181055 1011281 907876 985189 762414 1308682 1180591 1147780 1444874
2937 1444874 1369878 1673607 1672310 1149049 822405 1402352 1534368 1162334 1319184 1034082
2927 1034082 1378845 1393645 949292 1210745 877903 984541 1351355 1290978 1464763 1730490
2917 1730490 1961880 1487582 1229213 1453641 1488283 1535587 1666082 1738037 1615405 1520833
$$ packed form
2989E04129K81521p2412j28675J47095K21334l28654J7227j64194P0763N2887
2979F01021k2539J4690j00637o9282J258k35199j6001L27769J8223m99332L85737
2968D05708K39685R5697j50839M5445J24702l72603J96745k4241K19112L26739
2958A106150l00544l13397m4481j0175J24788J98146J460M4873J95692Q8088k22814
2947H67786J71938J41331j69774j03405P7313k22775N46268j28091l2811K97094
2937A444874p4996L03729j297n23261l26644N79947J32016l72034J56850k85102
2927A034082L44763J4800m44353K61453l32842J06638L66814o0377J73785K65727
2917A730490K31390m74298k58369K24428L4642M7304J30495P1955j22632r4572
$$ plain form
2907 1520833 1407150 1076308 929778 1073030 1094504 1101770 870775 1110744 983049 632177
2897 632177 772112 1109607 999639 1030079 833299 658359 743485 1173355 874545 674122
2887 674122 776088 1121081 1202132 1208355 1144609 914872 1158645 1164345 1203579 934192 691570
2876 691570 905051 587583 605956 1004368 1072019 687588 823200 367398 307866 560284
2866 560284 805141 586848 230918 -2609 75017 312816 108217 131011 286528 381037
2856 381037 409066 429874 553792 868023 499985 470697 619931 384169 755646 660099
2846 660099 275672 433841 232688 -208560 139371 513794 399665 133855 315255 112719
2836 112719 151115 422827 295082 102755 289890 301559 418825 795368 500725 85569
$$ packed form
2907A520833j13683l30842j46530J43252K1474P266k30995K39969j27695l50872
2897F32177J39935L37495j09968L0440j96780j74940Q5126M29870k98810k00423
2887F74122J01966L44993Q1051O223o3746k29737K43773N700L9234k69387k42622
2876F91570K13481l17468J8373L98412O7651l84431J35612m55802n9532K52418
2866E60284K44857k18293l55930k33527P7626K37799k04599K2794J55517R4509
2856C81037K8029K0808J23918L14231l68038k9288J49234k35762L71477r5547
2846F60099l84427J58169k01153m41248L47931L74423j14129k65810J81400k02536
2836A12719L8396K71712j27745j92327J87135J1669J17266L76543k94643m15156
$$ plain form
2826 85569 281996 409641 288240 247409 561183 512576 54039 263029 345526 708447
2816 708447 116318 -97390 84929 412004 583314 561372 128648 3581 276896 440911
2806 440911 215301 -82601 178513 668224 190131 246529 -86557 -198373 135415 447967
2796 447967 544430 283503 459310 315757 195778 -174270 -287423 -263015 52629 -447198
2786 -447198 -528462 239519 261774 414039 157058 83942 30184 214245 -17308 89099
2776 89099 19304 101362 292227 433243 34223 42860 411965 241824 330963 132574 -40566
2765 -40566 -63902 45147 -457001 -116228 -155123 -93891 -87275 40145 619694 353533 269793
2754 269793 585129 392486 -19957 -145199 340216 409802 380311 254211 204205 -85737
$$ packed form
2826H5569J96427J27645j21401m0831L13774m8607m58537K08990Q2497L62921
2816G08447n92129k13708J82319L27075J71310k1942m32724j25067K73315J64015
2806D40911k25610k97902K61114M89711m78093N6398l33086j11816L33788L12552
2796D47967R6463k60927J75807j43553j19979l70048j13153K4408L15644m99827
2786d47198q1264P67981K2255J52265k56981p3116n3758J84061k31553J06407
2776H9099o9795Q2058J90865J41016l99020Q637L69105j70141Q9139j98389j73140
2765d0566k3336J09049n02148L40773l8895O1232O616J27420N79549k66161q3740
2754B69793L15336j92643m12443j25242M85415O9586k9491j26100n0006k89942
$$ plain form
2744 -85737 22210 -69795 -422814 -545167 -561068 -369204 73883 209482 423682 180439
2734 180439 -74305 -34790 -197863 95846 -145009 60410 -141136 -339034 -409590 -361277
2724 -361277 -238174 63531 135455 297214 -124517 -144940 -71292 -242193 -120356 20566
2714 20566 -106389 162450 -201347 -412371 -326407 -75942 33120 -73252 -141424 -446001
2704 -446001 -219398 133013 39561 -488079 -384287 47001 -12167 -273026 167516 507668
2694 507668 169780 -221874 37305 -163265 -47047 82776 -85694 -153203 -17182 85739
2684 85739 217563 -484949 -490336 -323623 -180336 -145731 -21005 -311963 129339 361671
2674 361671 -255800 95991 -115593 50384 143224 -289807 156329 348873 -98875 -109209
$$ packed form
2744h5737J07947r2005l53019j22353j5901J91864M43087J35599K14200k43243
2734A80439k54744L9515j63073K93709k40855K05419k01546j97898p0556M8313
2724c61277J23103L01705P1924J61759m21731k0423P3648j70901J21837J40922
2714B0566j26955K68839l63797k11024Q5964K50465J09062j06372o8172l04577
2704d46001K26603L52411r3452n27640J03792M31288n9168k60859M40542L40152
2694E07668l37888l91654K59179k00570J16218J29823j68470o7509J36021J02921
2684H5739J31824p02512n387J66713J43287L4605J24726k90958M41302K32332
2674C61671o17471L51791k11584J65977R2840m33031M46136J92544m47748j0334
$$ plain form
2664 -109209 -148240 -305198 79675 124340 -174271 -345692 -177000 56292 593553 281782
2654 281782 -315545 -242009 73820 570640 -105729 114418 145301 9393 148212 198238
2644 198238 -61926 -207352 -39310 -208239 -270510 -220401 -184048 -486456 -348493 145454
2634 145454 -35898 -243181 -97334 -376185 -179450 -257415 83491 174876 191336 112862
2624 112862 -13677 -2540 240389 557954 298308 245989 191737 351250 64162 -177124
2614 -177124 -346529 -628355 -6891 299705 179486 394957 436584 199335 119070 117767
2604 117767 239218 54229 -138652 -197867 -166732 323069 233582 29981 -142302 -171913
2594 -171913 -108622 223308 317410 141348 5703 -83596 -191528 -316341 -452040 -39622
$$ packed form
2664a09209l9031j56958L84873M4665k98611j71421J68692K33292N37261l11771
2654B81782n97327P3536L15829M96820o76369K20147L0883j35908J38819N0026
2644A98238k60164j45426J68042j68929o2271N0109L6353l02408J37963M93947
2634A45454j81352k07283J45847k78851J96735p7965L40906R1385J6460p8474
2624A12862j26539J1137K42929L17565k59646n2319n4252J59513k87088k41286
2614a77124j69405k81826O21464L06596j20219K15471M1627k37249q0265j303
2604A17767J21451j84989j92881n9215L1135M89801q9487k03601j72283k9611
2594a71913O3291L31930R4102j76062j35645q9299j07932j24813j35699M12418
$$ plain form
2584 -39622 -135410 -364672 -330596 -24774 -64600 78809 224464 268475 109188 267738 145171
2573 145171 258317 -14232 -80269 -66448 -30608 -258224 -347288 244171 15196 -87017
2563 -87017 4640 242635 303232 196267 -87608 -95858 -132202 -123324 -227470 282661 -26907
2552 -26907 -198619 115260 376082 162192 -23448 -157144 234727 517905 -13682 -355615
2542 -355615 -223918 -44223 -63583 14707 -18392 -249378 -167730 165425 241568 222792 204113
2531 204113 -20042 -88456 -293601 -143651 -14082 -700085 -526106 -349996 -380755 -260227
2521 -260227 -83855 25368 -202950 -291899 -313994 -142496 -97024 38494 137168 -29504
2511 -29504 -250860 -240364 -6457 298243 -128158 -348115 -8334 -188528 58740 37295
$$ packed form
2584c9622r5788k29262L4076L05822l9826J43409J45655M4011j59287J58550j22567
2573A45171J13146k72549o6037J3821L5840k27616q9064N91459k28975j02213
2563h7017R1657K37995O0597j06965k83875q250l6344Q878j04146N10131l09568
2552b6907j71712L13879K60822k13890j85640j33696L91871K83178n31587l41933
2542c55615J31697J79695j9360P8290l3099k30986Q1648L33155P6143j8776j8679
2531B04113k24155o8414k05145J49950J29569o86003J73979J76110l0759J20528
2521b60227J76372J09223k28318q8949k2095J71498M5472J35518R8674j66672
2511b9504k21356J0496K33907L04700m26401k19957L39781j80194K47268k1445
$$ plain form
2501 37295 -58677 -16694 67473 -317191 -340313 -530687 -628021 60827 -125753 -316636 -205803
2490 -205803 -336578 -207389 -115404 47846 290027 45120 -536785 -679563 -358038 219540
2480 219540 -68640 -321969 -236332 -246246 278227 119452 -84263 -33932 -64009 2095 27642
2469 27642 150286 423946 175032 341893 279990 285914 282327 65624 101347 -3457 -104316
2458 -104316 47467 43795 -16259 -45705 -205986 363884 -253887 -491753 -424665 -382847 -33963
2447 -33963 -125794 369228 51486 -129554 -235924 -375406 288154 49172 281480 283261
2437 283261 321028 -49853 -249565 -309427 -194626 145914 7134 17854 215107 424348
2427 424348 510949 380589 244563 -213927 -235254 214652 83779 54310 -199441 2685
$$ packed form
2501C7295r5972M1983Q4167l84664k3122j90374r7334O88848j86580j90883J10833
2490b05803j30775J29189R1985J63250K42181k44907n81905j42778L21525N77578
2480B19540k88180k53329Q5637r914N24473j58775k03715N0331l0077O6104K5547
2469B7642J22644K73660k48914J66861o1903N924l587k16703L5723j04804j00859
2458a04316J51783l672o0054k9446j60281N69870o17771k37866O7088M1818L48884
2447c3963r1831M95022l17742j81040j06370j39482O63560k38982K32308J781
2437B83261L7767l70881j99712n9862J14801L40540j38780J0720J97253K09241
2427D24348Q6601j30360j36026m58490k1327M49906j30873k9469k53751K02126
$$ plain form
2417 2685 79236 -103197 20500 67785 -79656 414243 257200 -152253 58636 129448 -66331
2406 -66331 34008 236851 580198 488004 300777 267041 668254 424979 32991 122334
2396 122334 557529 552227 309227 551421 750181 671384 329495 134697 170506 965651
2386 965651 1109062 1430803 1534070 1177568 1040525 1013419 1190272 1138619 970581 1142598
2376 1142598 851546 197404 190677 11377 437854 302445 746647 739394 726628 746875 630493
2365 630493 536694 356051 129067 615054 662930 568752 407307 551262 608243 173019
2355 173019 593849 759583 744585 563532 546506 414080 448714 332565 321250 765889
2345 765889 863518 781399 380272 -37693 -51666 -14966 321088 352083 503957 341551 417989
$$ packed form
2417B685P6551j82433J23697M7285j47441M93899j57043m09453K10889P0812j95779
2406f6331J00339K02843L43347r2194j87227l3736M01213k43275l91988Q9343
2396A22334M35195n302k43000K42194J98760p8797l41889j94798L5809P95145
2386I65651J43411L21741J03267l56502j37043k7106J76853n1653j68038J72017
2376A142598k91052o54142o727j79300M26477j35409M44202p253j2766K0247j16382
2365F30493r3799j80643k26984M85987M7876r4178j61445J43955N6981m35224
2355A73019M20830J65734j4998j81053j7026j32426L4634j16149j1315M44639
2345G65889R7629q2119m01127m17965j3973L6700L36054L0995J51874j62406P6438
$$ plain form
2334 417989 548170 233894 469964 1012854 418613 309762 -37832 173154 290121 675105
2324 675105 860178 640313 130249 551537 625954 679615 16371 228391 779389 683202
2314 683202 689218 427458 535633 601379 634245 414713 539821 597595 512844 503286 126583
2303 126583 93524 443948 607843 692818 468451 466403 464070 888690 589613 545380 515507
2292 515507 660553 466546 373459 433457 564647 387015 800026 692856 524720 729233
2282 729233 263058 422333 1000056 1072935 1117544 1076443 959008 898306 720680 928065
2272 928065 754976 482026 864920 1088705 538351 202110 489934 696424 890873 1003255
2262 1003255 1033324 1225608 1020304 914382 1207515 1035823 639523 736255 973342 1159577
$$ packed form
2334D17989J30181l14276K36070N42890n94241j08851l47594K10986J16967L84984
2324F75105J85073k19865n10064M21288P4417N3661o63244K12020N50998r6187
2314F83202O016k61760J08175O5746L2866k19532J25108N7774q4751r558l76703
2303A26583l3059L50424J63895Q4975k24367k048k333M24620k99077m4233k9873
2292E15507J45046j94007r3087N9998J31190j77632M13011j07170j68136K04513
2282G29233m66175J59275N77723P2879M4609m1101j17435o0702j77626K07385
2272I28065j73089k72950L82894K23785n50354l36241K87824K06490J94449J12382
2262A003255L0069J92284k05304j05922K93133j71692l96300R6732K37087J86235
$$ plain form
2252 1159577 1025895 966130 734976 1014694 1288809 1092048 1257859 1247681 922448 925982
2242 925982 1209869 1495068 1158019 1203710 1453281 1529139 1391191 1510304 1679833 1559393
2232 1559393 1112823 910884 1204370 1443478 1626576 1328792 1517149 1690675 1903676 1894916
2222 1894916 1930957 2135504 2382049 2151616 1943311 2137019 2507156 2215218 2205543 1675274
2212 1675274 1755787 2060258 2069904 2068428 1981151 2619503 2770195 2515353 2164777 2560442 2377033
2201 2377033 2824661 3213455 3087761 3177642 3401878 4019642 4065837 3591505 3810090 3874999
2191 3874999 3731355 3570313 3779995 4250595 4625668 4824805 5054262 5402873 5562786 5773859
2181 5773859 5636645 5226625 4830518 5380748 5861930 5591932 5547829 5797311 5847759 5957634
$$ packed form
2252A159577j33682n9765k31154K79718K74115j96761J65811j0178l25233L534
2242I25982K83887K85199l37049M5691K49571P5858j37948J19113J69529j20440
2232A559393m46570k01939K93486K39108J83098k97784J88357J73526K13001q760
2222A894916L6041K04547K46545k30433k08305J93708L70137k91938r675n30269
2212A675274Q0513L04471R646j476q7277O38352J50692k54842l50576L95665j83409
2201B377033M47628L88794j25694Q9881K24236O17764M6195m74332K18585O4909
2191C874999j43644j61042K09682M70600L75073J99137K29457L48611J59913K11073
2181E773859j37214m10020l96107N50230M81182k69998m4103K49482N0448J09875
$$ plain form
2171 5957634 6053983 5971356 6114741 6089073 6008497 6277374 6444579 6703397 6461373 6758845
2161 6758845 7328297 7747388 7741505 8233166 8377004 8762140 9195483 9250952 9666280 9742480
2151 9742480 10363295 11218505 11659267 12483206 13001337 13509554 14127415 14994969 15332719 16345458
2141 16345458 16990544 18057155 19046897 19880423 21202414 22397165 23785803 26128415 28039164
2132 28039164 30067283 32130149 34846024 38223302 41627172 45959737 49562544 54086371
2124 54086371 60353321 67539091 75223152 85016773 97052254 110542839 124769452 142325202
2116 142325202 161981025 181379995 198164758 221776554 221787796 186616129 142907576
2109 142907576 110555966 90786557 76230515 66296692 58190332 52107461 46757618 43439189
$$ packed form
2171E957634R6349q2627J43385k5668q0576K68877J67205K58818k42024K97472
2161F758845N69452M19091n883M91661J43838L85136M33343N5469M15328P6200
2151I742480O20815Q55210M40762Q23939N18131N08217O17861Q67554L37750J012739
2141A6345458O45086J066611R89742Q33526J321991J194751J388638K342612J910749
2132B8039164K028119K062866K715875L377278L403870M332565L602807M523827
2124E4086371O266950P185770P684061R793621J2035481J3490585J4226613J7555750
2116A42325202J9655823J9398970J6784763K3611796J1242l5171667m3708553
2109A42907576l2351610j9769409j4556042r933823q106360o082871n349843l318429
$$ plain form
2101 43439189 40489874 37765519 35518904 33956045 31436414 28972215 26677758 24790563
2093 24790563 22702598 21376427 19969901 19098077 18355921 17344558 16058209 15081461 14303379
2084 14303379 13752810 13400392 13144648 13031557 12659995 12063675 11480202 11021762 10530475
2075 10530475 10217620 9627781 9324054 9144056 8916756 8649226 8265025 7903143 7937999 7350325
2065 7350325 7121753 6852237 6664185 6786509 6197275 6057012 6015046 6000724 5532195 5685142
2055 5685142 5290840 5376091 5593863 5260084 5423017 5464349 5490794 4930674 4547340 4632626
2045 4632626 4373306 4013705 3824619 3916119 3827874 3904719 3593907 3398524 3267016 2844640
2035 2844640 3087027 3440648 3714367 3578315 3527211 3487156 3239935 3447215 3544500 3181622
$$ packed form
2101D3439189k949315k724355k246615j562859k519631k464199k294457j887195
2093B4790563k087965j326171j406526q71824p42156j011363j286349r76748p78082
2084A4303379n50569l52418k55744j13091l71562n96320n83473m58440m91287
2075A0530475l12855n89839l03727j79998k27300k67530l84201l61882L4856n87674
2065G350325k28572k69516j88052J22324n89234j40263m1966j4322m68529J52947
2055E685142l94302Q5251K17772l33779J62933M1332K6445n60120l83334Q5286
2045D632626k59320l59601j89086R1500q8245P6845l10812j95383j31508m22376
2035B844640K42387L53621K73719j36052n1104m0055k47221K07280R7285l62878
$$ plain form
2025 3181622 2993293 2988705 2891544 3128229 2958491 2826823 2662032 2374150 2527920 2364391
2015 2364391 2521545 2762194 2627217 2270193 2273773 2184223 1979568 1846540 2108699 2160486
2005 2160486 1799655 1815983 1945640 2090527 1965404 1665477 1437388 1373073 1403814 1193972
1995 1193972 984396 856069 796444 1052399 1923664 2056808 2026727 1704004 1404875 1319176
1985 1319176 1369079 1113637 1125997 901581 1128784 1038912 1076952 1140488 963562 1226895
1975 1226895 614295 856421 1330530 1235380 836811 1461172 1531827 1037924 765945 1040078
1965 1040078 640346 775016 624397 392383 629015 1151024 1028447 701077 565492 638697
1955 638697 681896 550501 399364 279666 197333 252958 509108 407463 417331 39496 62426
$$ packed form
2025C181622j88329m588r7161K36685j69738j31668j64791k87882J53770j63529
2015B364391J57154K40649j34977l57024L580q9550k04655j33028K62159N1787
2005B160486l60831J6328J29657J44887j25123k99927k28089o4315L0741k09842
1995A193972k09576j28327n9625K55955Q71265J33144l0081l22723k99129q5699
1985A319176M9903k55442J2360k24416K27203q9872L8040O3536j76926K63333
1975A226895o12600K42126M74109r5150l98569O24361P0655m93903k71979K74133
1965A040078l99732J34670j50619k32014K36632N22009j22577l27370j35585P3205
1955F38697M3199j31395j51137j19698q2333N5625K56150j01645R868l77835K2930
$$ plain form
1944 62426 373358 382837 589710 1063415 868070 384569 413478 387139 69979 104488 252379
1933 252379 343138 456223 569494 526117 659383 427337 138098 24987 122221 596619
1923 596619 493565 544844 476418 238336 142546 167678 456415 686927 817657 105765
1913 105765 234145 544141 874104 391236 297433 413454 673999 730445 421294 413900
1903 413900 196538 255426 125709 264139 665389 392827 366307 581321 471745 323699
1893 323699 236550 302379 417652 712836 437460 -136771 279704 269896 -122844 354832
1883 354832 278498 248985 167266 -38869 596888 817401 486952 553420 576196 430518 357372
1872 357372 560160 412203 431986 258367 238956 349151 673328 239567 -1562 -281389
$$ packed form
1944F2426L10932R479K06873M73705j95345m83501K8909k6339l17160L4509J47891
1933B52379R0759J13085J13271m3377J33266k32046k89239j13111R7234M74398
1923E96619j03054N1279o8426k38082r5790K5132K88737K30512J30730p11892
1913A05765J28380L09996L29963m82868r3803J16021K60545N6446l09151p394
1903D13900k17362N8888j29717J38430M01250k72562k6520K15014j09576j48046
1893C23699q7149O5829J15273K95184k75376n74231M16475r808l92740M77676
1883C54832p6334k9513q1719k06135O35757K20513l30449O6468K2776j45678p3146
1872C57372K02788j47957J9783j73619j9411J10195L24177m33761k41129k79827
$$ plain form
1862 -281389 -328003 -108342 -132783 -3420 198741 820306 973566 626102 403379 950348
1852 950348 793944 410128 430644 486812 726889 428645 470155 1047069 1074874 1466858
1842 1466858 1271157 1078314 744116 833417 904608 684342 450757 82533 439952 586640
1832 586640 298602 443078 796605 1088495 855635 312994 88779 -92742 339306 447923
1822 447923 126108 189984 100027 344501 334390 266648 48232 115613 231905 490570 444299
1811 444299 19863 -328981 -255389 -265076 -7167 434499 115193 373932 575703 668337
1801 668337 713638 360241 93169 201907 231084 285973 122651 502716 179591 -82370
1791 -82370 97993 56970 55415 -31729 -324980 -193788 158220 -273648 -157730 173782 295419
$$ packed form
1862b81389m6614K19661k4441J29363K02161O21565J53260l47464k22723N46969
1852I50348j56404l83816K0516N6168K40077k98244M1510N76914K7805L91984
1842A466858j95701j92843l34198Q9301P1191k20266k33585l68224L57419J46688
1832E86640k88038J44476L53527K91890k32860n42641k24215j81521M32048J08617
1822D47923l21815O3876q9957K44474j0111o7742k18416O7381J16292K58665m6271
1811D44299m24436l48844P3592r687K57909M41666l19306K58739K01771R2634
1801F68337M5301l53397k67072J08738K9177N4889j63322L80065l23125k61961
1791h2370J80363m1023j555q7144k93251J31192L52008m31868J15918L31512J21637
$$ plain form
1780 295419 30451 -378537 -87468 93618 65254 145816 145163 180418 -164943 -282941 -124638
1769 -124638 -116562 121637 -216351 -7491 226639 362490 106618 157201 -98166 -334537
1759 -334537 -162641 365298 209504 45515 248812 513549 475750 410760 -119533 -663828
1749 -663828 -182727 129108 -7830 -304956 -276074 -425713 -349210 -166639 -246653 -292921
1739 -292921 -173351 -307785 -287195 -341879 -125429 -165038 -416790 -454224 228241 409478
1729 409478 356076 460909 -172512 -406004 -191883 247237 590230 136383 113170 26182
1719 26182 32155 46944 190396 29996 184628 157900 146926 508041 160377 -46683 191176
1708 191176 252084 -129573 51923 -1199 58252 -435063 -265695 -65643 112435 17487
$$ packed form
1780B95419k64968m08988K91069J81086k8364Q0562o53L5255l45361j17998J58303
1769a24638Q076K38199l37988K08860K34130J35851k55872N0583k55367k36371
1759c34537J71896N27939j55794j63989K03297K64737l7799o4990n30293n44295
1749f63828M81101L11835j36938k97126K8882j49639P6503J82571q0014m6268
1739b92921J19570j34434K0590n4684K16450l9609k51752l7434O82465J81237
1729D09478n3402J04833o33421k33492K14121M39120L42993m53847k3213q6988
1719B6182N973J4789J43452j60400J54632k6728j0974L61115l47664k07060K37859
1708A91176O0908l81657J81496n3122N9451m93315J69368K00052J78078r4948
$$ plain form
1698 17487 -163372 304888 191269 126392 268038 77005 -89501 -166358 53637 52592 7991
1687 7991 -95603 -380951 -291428 -31982 86988 -76319 -102700 -372384 -422416 -298355 -70061
1676 -70061 -369494 -308377 -354610 -722779 -487910 -85209 -42876 -317353 -277071 -63773 110776
1665 110776 467540 364934 346839 84471 -389398 -184827 -108909 -405301 16381 -91134
1655 -91134 26601 338432 492303 86109 137900 466146 395321 -13048 -188838 -255445
1645 -255445 -125990 -115777 -255821 -163255 -132071 156400 176660 287698 250312 142220 194781
1634 194781 53212 -57022 -370076 -356035 -206011 -116699 64732 -119582 -13965 161405
1624 161405 35553 286651 274778 -79274 -135810 -110578 141800 280063 -235961 -235104 -194097
$$ packed form
1698A7487j80859M68260j13619o4877J41646j91033j66506p6857K19995j045m4601
1687G991j03594k85348Q9523K59446J18970j63307k6381k69684n0032J24061K28294
1676g0061k99433O1117m6233l68169K34869M02701M2333k74477M0282K13298J74549
1665A10776L56764j02606j8095k62368m73869K04571P5918k96392M21682j07515
1655i1134J17735L11831J53871m06194N1791L28246p0825m08369j75790o6607
1645b55445J29455J0213j40044R2566L1184K88471K0260J11038l7386j08092N2561
1634A94781j41569j10234l13054J4041J50024Q9312J81431j84314J05617J75370
1624A61405j25852K51098j1873l54052n6536K5232K52378J38263n16024Q57M1007
$$ plain form
1613 -194097 -294300 -320612 -204912 -356935 -643378 -366207 -26915 -28354 -176014 48597
1603 48597 94820 181852 -227789 -458144 -296813 67175 54057 -172578 -101415 -326311 -281955
1592 -281955 -45817 -469060 -583053 -345610 212778 -78323 -354646 171248 441863 72939
1582 72939 -316491 -111730 306152 233214 224477 65533 89946 -40225 -250249 64793 461944
1571 461944 33569 65446 -105117 52419 -455070 -95854 46860 8633 8217 180648 173045
1560 173045 -80832 129878 110355 41279 162819 -154636 -280119 -386255 -284918 -122096
1550 -122096 -41279 146874 -124567 -52119 -37844 25941 244291 312492 46328 258796 -148055
1539 -148055 -564294 -192392 113441 -212955 -210431 -390270 67999 136240 -159338 -53564
$$ packed form
1613a94097j00203k6312J15700j52023k86443K77171L39292j439j47660K24611
1603D8597M6223Q7032m09641k30355J61331L63988j3118k26635P1163k24896M4356
1592b81955K36138m23243j13993K37443N58388k91101k76323N25894K70615l68924
1582G2939l89430K04761M17882p2938q737j58944K4413j30171k10024L15042L97151
1571D61944m28375L1877j70563J57536n07489L59216J42714l8227m16J72431p603
1560A73045k53877K10710j9523o9076J21540l17455j25483j06136J01337J62822
1550a22096Q0817J88153k71441P2448J4275O3785K18350O8201k66164K12468m06851
1539a48055m16239L71902L05833l26396K524j79839M58269O8241k95578J05774
$$ plain form
1529 -53564 -200649 -478790 -330193 -119419 5027 -32522 -21825 15548 100607 -36493 -401915
1518 -401915 -708962 -171870 15513 -129993 -166137 -158696 -243864 -313931 86103 -10159 -401508
1507 -401508 -53956 122294 -3222 -92396 236384 256243 450936 253023 13148 -56811
1497 -56811 105577 110736 -239105 -228332 -257060 -385873 -357191 -26694 -229554 -145347 46190
1486 46190 141234 98801 -11691 190807 143882 -20790 -159583 1597 -218562 -400706
1476 -400706 -437871 -68935 -367948 46654 221662 -54157 -28285 9457 90297 -72684
1466 -72684 -265215 -248483 -224537 -173269 217429 316967 241860 224054 318145 -170536 -221968
1455 -221968 -31352 -116421 -153081 -449725 -449033 100342 170784 242608 -305994 -464595 163595
$$ packed form
1529e3564j47085k78141J48597K10774J24446l7549J0697L7373Q5059j37100l65422
1518d01915l07047N37092J87383j45506l6144P441q5168p0067M00034r6262l91349
1507d01508L47552J76250j25516q9174L28780J9859J94693j97913k39875o9959
1497e6811J62388N159l49841J0773k8728j28813K8682L30497k02860Q4207J91537
1486D6190R5044m2433j10492K02498m6925j64672j38793J61180k20159j82144
1476d00706l7165L68936k99013M14602J75008k75819K5872L7742Q0840j62981
1466g2684j92531J6732K3946N1268L90698R9538p5107j7806R4091m88681n1432
1455b21968J90616q5069l6660k96644O92N49375P0442P1824n48602j58601O28190
$$ plain form
1444 163595 508833 332481 63684 415372 385237 -384057 -480658 -391512 -254917 -233461
1434 -233461 -314311 -87140 61133 -299008 -349085 -12414 -27558 -196499 -178127 -158352 -183743
1423 -183743 57421 88288 -364156 -175056 81879 21575 -279324 -369502 -530872 -190559
1413 -190559 81704 43046 -5052 -174030 215285 344657 16464 9948 -134892 -563285
1403 -563285 -287174 -206253 -136637 -117536 -3779 -1622 -28793 438614 321324 134430 32582
1392 32582 -239137 -259649 -342538 -53691 401253 367752 271843 9729 -137400 108672 97339
1381 97339 -233909 133727 33014 -406168 -406157 -447918 -718555 -192251 -375678 -518348 -23152
1370 -23152 -128101 314092 240648 166687 85603 -428343 -317885 -421282 -204226 -215681 -269329
$$ packed form
1444A63595L45238j76352k68797L51688l0135p69294r6601Q9146J36595K1456
1434b33461q0850K27171J48273l60141n0077L36671j5144j68941J8372J9775k5391
1423a83743K41164L0867m52444J89100K56935o0304l00899r0178j61370L40313
1413a90559K72263l8658m8098j68978L89315J29372l28193o516j44840m28393
1403e63285K76111Q0921O9616J9101J13757K157k7171M67407j17290j86894j01848
1392C2582k71719k0512q2889K88847M54944l3501r5909k62114j47129K46072j1333
1381I7339l31248L67636j00713m39182J1m1761k70637N26304j83427j42670M95196
1370b3152j04949M42193p3444p3961q1084n13946J10458j03397K17056j1455n3648
$$ plain form
1359 -269329 -139088 -260804 -300001 -271524 -548075 -943158 -246742 -84180 -544807 -620021
1349 -620021 -167785 -31494 148546 79411 -104424 -392870 -401963 -161563 -533125 -610044
1339 -610044 -568482 -456538 -388083 -111224 132467 -101509 -402052 -307748 -132758 252249
1329 252249 28608 -105233 176800 -180406 -49186 -78375 -271495 20343 86726 -43563
1319 -43563 -388941 -410724 150721 237492 -332854 -594559 -558264 -151104 160234 80929 -131144
1308 -131144 -474120 -2486 101766 -209517 -181283 119240 482940 390907 300861 -204000
1298 -204000 -106418 -422073 -123974 -105149 -42664 22180 -281649 -558246 -868756 -499068
$$ packed form
1359b69329J30241j21716l9197K8477k76551l95083O96416J62562m60627p5214
1349f20021M52236J36291J80040o9135j83835k88446r093K40400l71562p6919
1339f10044M1562J11944O8455K76859K43691k33976l00543R4304J74990L85007
1329B52249k23641j33841K82033l57206J31220k9189j93120K91838O6383j30289
1319d3563l45378k1783N61445Q6771n70346k61705L6295M07160L11338p9305k12073
1308a31144l42976M71634J04252l11283K8234L00523L63700r2033r0046n04861
1298b04000R7582l15655K98099J8825O2485O4844l03829k76597l10510L69688
$$ [...]
##END NTUPLES=NMR SPECTRUM
##END=
