##TITLE=1H_EC-3267(1-3)
 CDCl3
 8 sc, 
 9.11.2021
##JCAMPDX= 6.0         $$ Bruker NMR JCAMP-DX V2.0
##DATA TYPE= NMR SPECTRUM
##DATA CLASS= NTUPLES
##ORIGIN= UXNMR, Bruker Analytische Messtechnik GmbH
##OWNER= root
$$ XWIN-NMR		Version 3.5
$$ Tue Nov  9 11:17:16 2021 Russian Standard Time (UT+4h)  she@DPX200
##.OBSERVE FREQUENCY= 200.1313468511
##.OBSERVE NUCLEUS= ^1H
##.ACQUISITION MODE= SIMULTANEOUS
##.ACQUISITION SCHEME= undefined
##.AVERAGES= 8
##.DIGITISER RES= 18
##SPECTROMETER/DATA SYSTEM= spect
##.PULSE SEQUENCE= zg30
##.SOLVENT NAME= D2O
##.SHIFT REFERENCE= (INTERNAL, D2O, 0, 15.7238)
##AUDIT TRAIL= $$ (NUMBER, WHEN, WHO, WHERE, WHAT)
$$ ##TITLE= Audit trail, XWIN-NMR		Version 3.5
$$ ##JCAMPDX= 5.01
$$ ##ORIGIN= Bruker BioSpin GmbH
$$ ##OWNER= she
$$ F:/spectra/data/she/nmr/H-F/1/pdata/1/auditp.txt
$$ ##AUDIT TRAIL=  $$ (NUMBER, WHEN, WHO, WHERE, WHAT)
(   1,<2021-11-09 11:15:27.31 +0400>,<she>,<DPX200>,
      <created by zg, POWCHK disabled, PULCHK disabled
       configuration hash MD5:
       00 E9 B6 7A A2 85 ED C7 34 08 36 98 17 FE 4E 26
       data hash MD5: 16K
       D2 77 3B 78 1F 9E D2 18 A6 E1 6C A5 57 11 A0 BF>)
(   2,<2021-11-09 11:16:04.07 +0400>,<she>,<DPX200>,
      <Start of raw data processing
       efp BC_mod = 2 LB = 0.24 FT_mod = 6 PKNL = 1 PHC0 = -15509.74 PHC1 = 9.800819 SI = 16K 
       data hash MD5: 16K
       3B AD CF FE 44 A1 BD 54 6F 8C DD E2 01 81 58 55>)
(   3,<2021-11-09 11:16:26.06 +0400>,<she>,<DPX200>,
      <pk PHC0 = -1.547466 PHC1 = 2.4 
       data hash MD5: 16K
       9A 64 EC 20 16 4E 2D 9A 0C BE F0 67 38 EF 28 8B>)
(   4,<2021-11-09 11:16:29.21 +0400>,<she>,<DPX200>,
      <abs ABSG = 5 
       data hash MD5: 16K
       6A EC A0 66 D2 91 04 7C 15 90 BD 3F 34 08 34 18>)
$$ ##END=
$$ 
$$ hash MD5
$$ 65 86 FF 78 C6 73 91 40 E4 98 A1 EB C2 54 0A 88
##$RELAX= 
##$RELAX= 
##$RELAX= 
##$RELAX= 
##$RELAX= 
##$RELAX= 
$$ Bruker specific parameters
$$ --------------------------
##$DU= <F:/spectra>
##$EXPNO= 1
##$NAME= <H-F>
##$PROCNO= 1
##$TYPE= <nmr>
##$USER= <she>
##$AMP= (0..31)
100 100 100 100 100 100 100 100 100 100 100 100 100 100 100 100 100 100 
100 100 100 100 100 100 100 100 100 100 100 100 100 100 
##$AQSEQ= 0
##$AQ_mod= 1
##$AUNM= <au_zg>
##$AUTOPOS= <>
##$BF1= 200.13
##$BF2= 200.13
##$BF3= 200.13
##$BF4= 200.13
##$BF5= 200.13
##$BF6= 200.13
##$BF7= 200.13
##$BF8= 200.13
##$BYTORDA= 1
##$CFDGTYP= 0
##$CFRGTYP= 5
##$CHEMSTR= <none>
##$CNST= (0..31)
1 1 145 1 1 1 1 1 1 1 1 1 1 1 1 1 1 1 1 1 1 1 1 1 1 1 1 1 1 1 1 1 
##$CPDPRG= <>
##$CPDPRG1= <>
##$CPDPRG2= <>
##$CPDPRG3= <>
##$CPDPRG4= <mlev>
##$CPDPRG5= <mlev>
##$CPDPRG6= <mlev>
##$CPDPRG7= <mlev>
##$CPDPRG8= <mlev>
##$CPDPRGB= <>
##$CPDPRGT= <>
##$D= (0..31)
0 1.2 0 0 0 0 0 0 0 0.06 0 0.03 0 0 0 0 0.0002 0 0 0 0 0 0 0 0 0 0 0 0 
0 0 0 
##$DATE= 1636442126
##$DBL= (0..7)
120 120 120 120 120 120 120 120 
##$DBP= (0..7)
150 150 150 150 150 150 150 150 
##$DBP07= 0
##$DBPNAM0= <>
##$DBPNAM1= <>
##$DBPNAM2= <>
##$DBPNAM3= <>
##$DBPNAM4= <>
$$ [...]
##$SUBNAM2= <"">
##$SUBNAM3= <"">
##$SUBNAM4= <"">
##$SUBNAM5= <"">
##$SUBNAM6= <"">
##$SUBNAM7= <"">
##$SUBNAM8= <"">
##$SUBNAM9= <"">
##$SW= 18.0517286264689
##$SWIBOX= (0..15)
0 0 2 0 0 0 0 0 0 0 0 0 0 0 0 0 
##$SW_h= 3612.71676300578
##$TD= 16384
##$TD0= 1
##$TE= 0
##$TE2= 300
##$TE3= 300
##$TEG= 300
##$TL= (0..7)
0 120 120 120 120 120 120 120 
##$TP= (0..7)
150 150 150 150 150 150 150 150 
##$TP07= 0
##$TPNAME0= <>
##$TPNAME1= <>
##$TPNAME2= <>
##$TPNAME3= <>
##$TPNAME4= <>
##$TPNAME5= <>
##$TPNAME6= <>
##$TPNAME7= <>
##$TPOAL= (0..7)
0.5 0.5 0.5 0.5 0.5 0.5 0.5 0.5 
##$TPOFFS= (0..7)
0 0 0 0 0 0 0 0 
##$TUNHIN= 0
##$TUNHOUT= 0
##$TUNXOUT= 0
##$USERA1= <user>
##$USERA2= <user>
##$USERA3= <user>
##$USERA4= <user>
##$USERA5= <user>
##$V9= 5
##$VALIST= <valist>
##$VCLIST= <CCCCCCCCCCCCCCC>
##$VD= 0
##$VDLIST= <DDDDDDDDDDDDDDD>
##$VPLIST= <PPPPPPPPPPPPPPP>
##$VTLIST= <TTTTTTTTTTTTTTT>
##$WBST= 1024
##$WBSW= 4
##$XGAIN= (0..3)
0 0 0 0 
##$XL= 0
##$YL= 0
##$YMAX_a= 111792
##$YMIN_a= -177167
##$ZGOPTNS= <>
##$ZL1= 120
##$ZL2= 120
##$ZL3= 120
##$ZL4= 120
##$ABSF1= 15.72375
##$ABSF2= -2.328099
##$ABSG= 5
##$ABSL= 3
##$ALPHA= 0
##$AQORDER= 0
##$ASSFAC= 0
##$ASSFACI= 0
##$ASSFACX= 0
##$ASSWID= 0
##$AUNMP= <proc_1d>
##$AZFE= 0.1
##$AZFW= 0.1
##$BCFW= 0
##$BC_mod= 2
##$BYTORDP= 0
##$COROFFS= 0
##$CY= -3
##$DATMOD= 1
##$DC= 0
##$DFILT= <>
##$DTYPP= 0
##$F1P= 0
##$F2P= 0
##$FCOR= 1
##$FTSIZE= 16384
##$FT_mod= 6
##$GAMMA= 0
##$GB= 0
##$INTBC= 1
##$INTSCL= 0
##$ISEN= 128
##$LB= 0.24
##$LEV0= 0
##$LPBIN= 0
##$MAXI= 10000
##$MC2= 0
##$MEAN= 0
##$ME_mod= 0
##$MI= 1.114404
##$NCOEF= 0
##$NC_proc= -8
##$NLEV= 6
##$NOISF1= 3.799351
##$NOISF2= 2.8
##$NSP= 0
##$NTH_PI= 0
##$NZP= 0
##$OFFSET= 15.72375
##$PC= 1
##$PHC0= -15511.29
##$PHC1= 12.20082
##$PH_mod= 1
##$PKNL= yes
##$PPARMOD= 0
##$PSCAL= 0
##$PSIGN= 0
##$REVERSE= no
##$SF= 200.130006414489
##$SI= 16384
##$SIGF1= 3
##$SIGF2= 2
##$SINO= 5.538805
##$SIOLD= 16384
##$SREGLST= <1H.CDCl3>
##$SSB= 0
##$STSI= 16384
##$STSR= 0
##$SW_p= 3612.71676300578
##$SYMM= 0
##$S_DEV= 0
##$TDeff= 16384
##$TDoff= 0
##$TI= <>
##$TILT= no
##$TM1= 0
##$TM2= 0
##$TOPLEV= 0
##$USERP1= <user>
##$USERP2= <user>
##$USERP3= <user>
##$USERP4= <user>
##$USERP5= <user>
##$WDW= 1
##$XDIM= 16384
##$YMAX_p= 280608214
##$YMIN_p= -4516409
$$ End of Bruker specific parameters
$$ ---------------------------------
##NTUPLES= NMR SPECTRUM
##VAR_NAME=  FREQUENCY,     SPECTRUM/REAL,   SPECTRUM/IMAG
##SYMBOL=    X,             R,               I
##VAR_TYPE=  INDEPENDENT,   DEPENDENT,       DEPENDENT
##VAR_FORM=  AFFN,          ASDF,            ASDF
##VAR_DIM=   16384,         16384,           16384
##UNITS=     HZ,            ARBITRARY UNITS, ARBITRARY UNITS
##FACTOR=    0.220516191357247, 1,           1
##FIRST=     3146.79421126288, 0,            0
##LAST=      -465.922551742897, 0,           0
##MIN=       -465.922551742897, -4516409,    0
##MAX=       3146.79421126288, 280608214,    0
$$ Real data points
##PAGE= N=1
##DATA TABLE= (X++(R..R)), XYDATA
$$ [...]
6936D02439k10210p3060N19641J77881J83450k80838J38817l82095p4100K32555
$$ 402439 192229 119169 638810 816691 1000141 719303 858120 476025 401925 634480
6926F34480p1489m0771m28331k36076K46670j03473j08815M12357k24187q96j3894
$$ 634480 562991 522220 93889 -142187 104483 1010 -107805 304552 80365 79469 65575
6915F5575L71468j9096r3153r4124K32548M1024k75998K77895k0535o0572m35876
$$ 65575 437043 417947 324794 230670 463218 504242 228244 506139 485604 425032 -10844
6904a0844q0917L14122r3498J23470m47745k92069P5434K06353K26876K10673
$$ -10844 -91761 222361 128863 252333 -195412 -487481 -412047 -205694 21182 231855
6894B31855j21829j65274K33777p7765j90368l17665J13939N09545L9578l23205
$$ 231855 110026 -55248 178529 100764 -89604 -407269 -293330 216215 255793 -67412
6884f7412j32353M82163K13243o9101L54682l05605j70497k8264j68312k24623
$$ -67412 -199765 282398 495641 426540 781222 475617 305120 276856 108544 -116079
6874a16079l81751L27702R5978N4409M5056L2225k9035j09978K11191O7646J21194
$$ -116079 -497830 -170128 -74150 -19741 25315 57540 28505 -81473 129718 197364 318558
6863C18558J01581L7112j72671k531J19051o6710k63367N6448j36870p8237J32538
$$ 318558 420139 457251 284580 282049 401100 334390 71023 127471 -9399 -87636 44902
6852D4902k53108K55472r9058M53473m3066l51249L29473M9748k39462J3145P4228
$$ 44902 -208206 47266 -51792 401681 358615 7366 336839 386587 147125 160270 234498
6841B34498M6391m8627J90347L52176l5834k90573j44518k43212K94625L35057
$$ 234498 280889 232262 422609 774785 738951 448378 303860 60648 355273 690330
6831F90330j16373m35092j96461J34768k76651J59020R4781m39800J83855J91997
$$ 690330 573957 138865 -57596 77172 -199479 -40459 54322 -385478 -201623 -9626
6821i626j70411M0415l3802L6599L70650J68033K1964k93150l856j18903J27508
$$ -9626 -180037 -139622 -173424 -136825 233825 401858 423822 130672 126816 7913 135421
6810A35421K12551J68141J84514j93405k72034R8505k10466j84475k12837R3102
$$ 135421 347972 516113 700627 507222 235188 333693 123227 -61248 -274085 -180983
6800a80983J13957r2423K93417r318J48539L9473m32762K7268J09029L8484m9221
$$ -180983 -67026 -159449 133968 124650 273189 312662 -120100 -92832 16197 54681 5460
6789E460M17902k27848P1401Q1825j9264j94931J16032J31188k28631J81283k85584
$$ 5460 423362 195514 266915 348740 329476 134545 250577 381765 153134 334417 48833
6778D8833k32911q4717M07984K42115q642k75210m3012j02710L04348L2964J24094
$$ 48833 -184078 -268795 139189 381304 372662 97452 54440 -48270 256078 289042 413136
6767D13136m7639j88638M90532l35529l57683q195j07977K54391p7627K60519
$$ 413136 365497 176859 667391 331862 -25821 -34016 -141993 112398 34771 295290
6757B95290N5274p1064j34973q6620K63523J94619m96347p9426K4862p335j72136
$$ 295290 350564 279500 144527 57907 321430 516049 19702 -59724 -34862 -42197 -214333
6746b14333O40296J92238R8152l93372n59785r6710L77569K9798k07760q0469
$$ -214333 425963 618201 716353 322981 -236804 -333514 44055 73853 -133907 -214376
6736b14376K09993J64833k59602J53739J58944J50677n6790Q8247n5426o7331
$$ -214376 -4383 160450 -99152 54587 213531 364208 307418 395665 340239 272908
6726B72908K82475o928M5001m6144n52709Q1435J28198M623L25906n343L01027
$$ 272908 555383 548455 593456 547312 -5397 76038 204236 208859 534765 529422 830449
6715H30449J89301l36185k19884o8367L29740k34249j04967L29727k40963k77752
$$ 830449 1019750 683565 463681 395314 725054 490805 385838 715565 474602 196850
6705A96850K81687J3544n4056L43462J75790J07616j50051n09193l9711k19246
$$ 196850 478537 492081 438025 781487 957277 1064893 914842 405649 365938 146692
6695A46692r2958J33667L36228r6307j09731K4810k8134o5915K80285L4347j09579
$$ 146692 53734 187401 523629 427322 317591 342401 314267 248352 528637 562984 453405
6684D53405L42094l75672L24141j11772j34538K81950l65380m1114L15600k3270
$$ 453405 795499 419827 743968 632196 497658 779608 414228 373114 688714 665444
6674F65444m3722L53592j10547L3350l8269P10300l05587p30549J34771M4616
$$ 665444 621722 975314 864767 898117 859848 1570148 1264561 534012 668783 713399
6664G13399J84052n1319l25071N01903k72408J47835M34750n20438N2210L65216
$$ 713399 897451 846132 521061 1022964 750556 898391 1333141 812703 864913 1230129
6654A230129J97045L08356K54290m73113J25800k40492K99649j38552m0020J48713
$$ 1230129 1427174 1735530 1989820 1516707 1642507 1402015 1701664 1563112 1523092 1671805
6644A671805Q8786K28302j55562l8036N18993L63163R7418J56407L70554j17168
$$ 1671805 1760591 1988893 1833331 1795295 2314288 2677451 2774869 2931276 3301830 3184662
6634C184662K77246N27336M55161O35101K11558L62449M94733O55270N04030O18577
$$ 3184662 3461908 3989244 4444405 5079506 5291064 5653513 6148246 6803516 7307546 7926123
6624G926123P92727Q56629Q99051J125017J000553P76132Q04010l052m15353r93537
$$ 7926123 8718850 9575479 10474530 11599547 12600100 13376232 14180242 14177190 13761837 12768300
6614A2768300j488923q84083j277221j311590p76514n18365j021844k91881o41759
$$ 12768300 11279377 10395294 9118073 7806483 7029969 6511604 5489760 5197879 4556120
6605D556120o57733o07638J35975k93823l54568k91308k04058J77581r7972n3815
$$ 4556120 3898387 3290749 3426724 3132901 2778333 2487025 2282967 2460548 2362576 2308761
6595B308761j49666p5547r7949l03157k89657k25205L4406m5637j51094O68490
$$ 2308761 2159095 2083548 1985599 1682442 1392785 1167580 1201986 1156349 1005255 1673745
6585A673745k70549q8223k58631l03702K66738k2641K79505K919l040N6479j70862
$$ 1673745 1403196 1314973 1056342 752640 1019378 996737 1276242 1279161 1276121 1332600 1161738
6574A161738l23091K11014j02049l01067M5037K00505Q6226L58617l06550m37417
$$ 1161738 838647 1049661 947612 646545 691582 892087 978313 1336930 1030380 592963
6564E92963m4108j92986K7889M5432K45087K71690l07388q9431Q3994K26j28681
$$ 592963 548855 355869 383758 429190 674277 945967 638579 549148 633142 633368 504687
6553E04687J67112j43393J13303j2879l14492P4277o0561J43604M63800k45639
$$ 504687 671799 528406 641709 628830 314338 388615 328054 471658 935458 689819
6543F89819L463L70726j14860J01402n24162O2751k65242j84310j31692M39691
$$ 689819 693282 1064008 949148 1050550 526388 589139 323897 139587 7895 447586
6533D47586q5490K92416q8395l68546M5689J50274K50126k55224o2627K14226
$$ 447586 362096 654512 566117 197571 243260 393534 643660 388436 325809 540035
6523E40035m28764k16428K95528L41154J46114L58365j26879r3776j68493k70334
$$ 540035 111271 -105157 190371 531525 677639 1036004 909125 815349 646856 376522
6513C76522k81127Q0980k74353Q1268J37261j61284k08994K04582K95221k23029
$$ 376522 95395 176375 -97978 -16710 120551 -40733 -249727 -45145 250076 27047
6503B7047l25220L10109L18591j35716j57183j68572L77446L85836j62415l43204
$$ 27047 -298173 11936 330527 194811 37628 -130944 246502 632338 469923 126719
6493A26719L37746J84745l82042k8546L86131r9086q3599k71539k66114L01952
$$ 126719 464465 649210 267168 238622 624753 525667 442068 170529 -95585 206367
6483B06367K62203J27417K14287l51688j91344J89798m7566k17022O9348n3122
$$ 206367 468570 595987 810274 458586 267242 457040 409474 192452 261800 208678
6473B08678J76959j1437j30685L18550j6659Q8434P297l10248j47972r5999L3353
$$ 208678 385637 374200 243515 562065 545406 633840 641137 330889 182917 86918 120271
6462A20271K83861K68330n75528k1105L10850P9651L3418q208j74592k06409J73063
$$ 120271 404132 672462 96934 75829 386679 466330 499748 491540 316948 110539 283602
6451B83602j95835j22764J18785L16419J02958k07996K00932j42546L9492l68995
$$ 283602 87767 -34997 83788 400207 503165 295169 496101 353555 393047 24052
6441B4052M36978k81093Q1870K07159j73678k0984n5450J9991K66653J27093k74528
$$ 24052 461030 179937 261807 468966 295288 274304 218854 238845 505498 632591 358063
6430C58063k61110K23690J92055m4910q1169J82071J55311r0757P5722O8208j26040
$$ 358063 96953 320643 512698 467788 386619 568690 724001 633244 708966 777174 651134
6419F51134M51341O1044l61514m00114k24284L22963J85886Q5306j17872P9158
$$ 651134 1102475 1163519 802005 401891 177607 500570 686456 771762 653890 733048
6409G33048j5113J98974j33637K0322K85067l0732j63883J14239k46933j30831
$$ 733048 717935 916909 783272 803594 1088661 1057929 894046 1008285 761352 630521
6399F30521j08303p7026l90913P19246j5377m47336j8660L65265r5620j86580
$$ 630521 522218 445192 54279 773525 758148 310812 292152 657417 561797 375217
6389C75217J87667j27312J83875K04557J99499k50565M9908K03381J327K1681
$$ 375217 562884 435572 619447 824004 1023503 772938 822846 1026227 1027554 1049235
6379A049235K9759j94257K99076J27461j71338k43276j68347M6275M2290l6081
$$ 1049235 1078994 884737 1183813 1311274 1139936 896660 728313 774588 816878 780797
6369G80797J32312j81938J31525J70748j72021J00832j67331k30280n6630L85288
$$ 780797 913109 731171 862696 1033444 861423 962255 794924 564644 508014 893302
6359H93302K17420J69776J26905j12161j43905P3430R1766J55055l83714l53519
$$ 893302 1110722 1280498 1407403 1295242 1151337 1224767 1316533 1471588 1087874 734355
6349G34355J33990l2316K8473M50474m9138J0334P7403o5284L13308J53437j82477
$$ 734355 868345 836029 864502 1314976 1265838 1276172 1353575 1288291 1601599 1755036 1572559
6338A572559k30552j3849K93252L4069K01536N11932o34240l9975J40286J37455
$$ 1572559 1342007 1328158 1621410 1655479 1857015 2368947 1734707 1694732 1835018 1972473
6328A972473J48485l1593L02816L99214J46211l7277l36069j38542N18082l72489
$$ 1972473 2120958 2089365 2392181 2791395 2937606 2900329 2564260 2425718 2943800 2571311
6318B571311j46162j30889j30275k0707p4773o3986q910j99729n86234m0526N96952
$$ 2571311 2425149 2294260 2163985 2143278 2068505 2004519 1995609 1795880 1209646 1169120 1766072
6307A766072J44523j61669k64517m60656L75058k59159k29226L55770O8644n49459
$$ 1766072 1910595 1748926 1484409 1023753 1398811 1139652 910426 1266196 1334840 785381
6297G85381L09343K48716l2869J10370k30856k75498j67262L03456M2497P4456
$$ 785381 1094724 1343440 1310571 1420941 1190085 914587 747325 1050781 1093278 1167734
6287A167734m06859J38074l06M50242N8424J55605J45867m14839M3490o3840K65786
$$ 1167734 760875 898949 898643 1348885 1407309 1562914 1708781 1293942 1337432 1273592 1539378
6276A539378L85803k13322k05489J87261k872j18504k0870r5837j64439L269K27973
$$ 1539378 1925181 1711859 1506370 1693631 1690759 1572255 1551385 1455548 1291109 1294378 1522351
6265A522351k73129K55361M9061q145K47330J14331L5203m42033j80822K97690
$$ 1522351 1249222 1504583 1553644 1545499 1792829 1907160 1942363 1500330 1319508 1617198
6255A617198j25758J88661L52727m23134J17420k55730J36402q3768P0591k66581
$$ 1617198 1491440 1680101 2032828 1609694 1727114 1471384 1607786 1524018 1594609 1328028
6245A328028k90921L82868K05856k51832K70880J27685K4972k00071J70812j98920
$$ 1328028 1037107 1419975 1625831 1373999 1644879 1772564 1797536 1597465 1768277 1569357
6235A569357N25441J04877j64572L20326k96547j94594L06779q747Q7400l9018
$$ 1569357 2094798 2199675 2035103 2355429 2058882 1864288 2171067 2162320 2249720 2210702
6225B210702k55563r440l20276K82380J48203P7891K17716l15090p3710L69322
$$ 2210702 1955139 1945699 1625423 1907803 2056006 2133897 2351613 2036523 1962813 2332135
6215B332135r3742J75513l36503L60246j2027K59247J36038l67669l29008J65170
$$ 2332135 2238393 2413906 2077403 2437649 2425622 2684869 2820907 2453238 2124230 2289400
6205B289400j98444M02501O0505l08156j47322p6625O8473K11159L8220K12260
$$ 2289400 2090956 2493457 2553962 2245806 2098484 2021859 2090332 2301491 2339711 2551971
6195B551971o8140m11584K46173J77228J29546L6585Q3771j79985M84172m40776
$$ 2551971 2483831 2072247 2318420 2495648 2625194 2661779 2745550 2565565 3049737 2608961
6185B608961j70513M26276K23058l21742k13533L45842N01436N4250K9909j7388
$$ 2608961 2438448 2864724 3087782 2766040 2552507 2898349 3399785 3454035 3483944 3466556
6175C466556q2000k08482P9066J5565J35136l1974J01055J85837k63746l099K21421
$$ 3466556 3384556 3176074 3255140 3270705 3405841 3373867 3474922 3660759 3397013 3393914 3615335
6164C615335J08828o1141L50713J95950k54623O0884J31499j66442J59063K45495
$$ 3615335 3724163 3663022 4013735 4209685 3955062 4015946 4147445 3981003 4140066 4385561
6154D385561J17415L36667J43295R4300L55293m3719o7585q3263K13494J88797
$$ 4385561 4502976 4839643 4982938 5077238 5432531 5388812 5321227 5237964 5451458 5640255
6144E640255P6502L14659J09369j40552p2654r0348J26354k35458K15151L07252
$$ 5640255 5716757 6031416 6140785 6000233 5927579 5837231 5963585 5728127 5943278 6250530
6134F250530J12833M77326l7691L62331o621j96110K78802M36009K26049J48609
$$ 6250530 6363363 6840689 6802998 7165329 7158708 6962598 7241400 7677409 7903458 8052067
6124H052067L9287Q2380L16002K64921N45805M2702m7794O95327Q37420K99896
$$ 8052067 8091354 8173734 8489736 8754657 9300462 9343164 9295370 9990697 10828117 11128013
6114A1128013K96267O49297O87882K71550L71450N28537Q33479J210112J112058
$$ 11128013 11424280 12073577 12761459 13033009 13404459 13932996 14766475 15976587 17088645
6105A7088645J366838J646611J541241J631659K080236K257594K463722K671085
$$ 17088645 18455483 20102094 21643335 23274994 25355230 27612824 30076546 32747631
6097C2747631K914015K031787N39583p84862k168746l005158k032250j324503
$$ 32747631 35661646 37693433 38233016 37448154 35279408 32274250 30242000 28917497
6089B8917497p69355m83950L767O8583M43174Q00387N95477J456491J301011J664875
$$ 28917497 28148142 27664192 27667959 27736542 28179716 28980103 29575580 31032071 32333082 33997957
6079C3997957K283308K738521L204859K976474L759426M532322M877823N949843
$$ 33997957 36281265 39019786 42224645 45201119 48960545 53492867 58370690 64320533
6071F4320533O562158P182171N732354L902809L91867k268509m100968m879930
$$ 64320533 70882691 78064862 83797216 87700025 88091892 85823383 81722415 76842485
6063G6842485n881527n666701n111150l828105k842282k614539j308271r15311
$$ 76842485 70960958 65294257 60183107 56355002 53512720 50898181 49589910 48674599
6055D8674599n7530M28513M00434J126210J254610J997409L033929L536867M139615
$$ 48674599 48617069 49045582 49446016 50572226 51826836 53824245 56858174 60395041 64534656
6046F4534656M267147N121835N885401O256683O528503N675452N009284M346732
$$ 64534656 68801803 73923638 79809039 86065722 92594225 98269677 103278961 107625693
6038A07625693K734861J041099j883696m396230n131930m406207m082044m032174
$$ 107625693 110360554 111401653 109517957 105121727 99989797 95583590 91501546 87469372
6030H7469372m700152m814527m812304m285814l422824k415407j549465r30708
$$ 87469372 82769220 77954693 73142389 68856575 65433751 63018344 61468879 60538171
6022F0538171l90048M08014K14485R25479J481767K468315K277807K569900K805678
$$ 60538171 60148123 60556137 60770622 61696101 63177868 65646183 67923990 70493890 73299568
6013G3299568K896724M346231L831250L638459L524673K082074J465984J856472
$$ 73299568 76196292 80542523 84373773 88012232 91536905 93618979 95084963 96941435
6005I6941435K243113J496537j133796m378376p099790q233551p274881n020576
$$ 96941435 99184548 100681085 99547289 95168913 88069123 79835572 72560691 67540115
5997F7540115m497665l295540k707076k287962k031732k147747r22733j224928
$$ 67540115 63042450 59746910 57039834 54751872 52720140 50572393 49649660 48424732
5989D8424732n51456l43013o92570M04565K97548K20768M89470P90291J389325
$$ 48424732 47873276 47530263 46837693 47242258 47539806 47760574 48250044 49040335 50429660
5980E0429660J872851K119634J945212K162019J283624l07520j900852l077439
$$ 50429660 52302511 54422145 56367357 58529376 59813000 59505480 57604628 54527189
5972E4527189l225521k348259k088828j579593r58216j022777k85266p8050J27851
$$ 54527189 51301668 48953409 46864581 45284988 44326772 43303995 43018729 42940679 43068530
5963D3068530R33157J423411J182496J838749K149979K900757K969823K379884
$$ 43068530 44001687 45425098 46607594 48446343 50596322 53497079 56466902 58846786
5955E8846786J265714q44344j406131k761452l286857l102299k837776j838957
$$ 58846786 60112500 59268156 57862025 55100573 51813716 48711417 45873641 44034684
5947D4034684j651603j492318j037755k79810J65436P29553J054285J152950J592209
$$ 44034684 42383081 40890763 39853008 39573198 39738634 40468187 41522472 42675422 44267631
5938D4267631K066378K384918L282130L919359L992794N089168N634561N912917
$$ 44267631 46334009 48718927 52001057 55920416 59913210 65002378 70636939 76549856
5930G6549856N852855M234979J140210j405010l249173m186596n209983o923386
$$ 76549856 82402711 86637690 87777900 86372890 83123717 78937121 73727138 66803752
5922F6803752o089865n444901m751148l446384k732712k141484j379026r76638
$$ 66803752 60713887 55268986 50517838 47071454 44338742 42197258 40818232 39841594
5914C9841594p01647l3090L85886M58630N14740J589073J778291J832229K832854
$$ 39841594 39139947 39106857 39492743 39951373 40466113 42055186 43833477 45665706 48498560
5905D8498560L020378K911598K930359K044585J10238j863349j722097j776401
$$ 48498560 51518938 54430536 57360895 59405480 59515718 57652369 55930272 54153871
5897E4153871k643037l365462l318980l053059k825143k413981k503314k416668
$$ 54153871 51510834 48145372 44826392 41773333 38948190 36534209 34030895 31614227
5889C1614227j829892r90305j353805j179018o33037n49676q64868m35020k60945
$$ 31614227 29784335 28794030 27440225 26261207 25628170 25078494 24213626 23778606 23517661
5880B3517661m82556l94990o0573J76015L00081K62716k42376j18133r3k93390
$$ 23517661 23035105 22640115 22579542 22755557 23055638 23318354 23075978 22957845 22957752 22664362
5870B2664362k61800l07272j66688j3736j02507n90376n70614p37238j261951
$$ 22664362 22402562 22095290 21928602 21914866 21812359 21221983 20651369 19914131 18652180
5861A8652180k94699j21318j98257k82989K50290M81971j98456l78980m97584
$$ 18652180 18357481 18236163 18037906 17754917 18005207 18487178 18288722 17909742 17412158
5852A7412158l76069o72203n08892m95372k3510j93950j90780K09190L6127o80100
$$ 17412158 17036089 16363886 15854994 15359622 15336112 15142162 14951382 15160572 15196699 14516599
5842A4516599l79625R2754m35731N7819J46447m43944l39897j8444m52897J27352
$$ 14516599 14136974 14229728 13793997 13851816 13998263 13554319 13214422 13195978 12743081 12870433
5832A2870433K25128J66729K94164K46735P50004o1154o3184K9455J19554J77604
$$ 12870433 13095561 13262290 13556454 13803189 14553193 14492039 14428855 14458310 14577864 14755468
5822A4755468J8707j16612L23289J34078K19746Q49609O71323M86289J20327l77946
$$ 14755468 14774175 14657563 14980852 15114930 15334676 16184285 16855608 17341897 17462224 17084278
5812A7084278j445958j484382j050848r65935m90230l94190q18237j5051R5127
$$ 17084278 15638320 14153938 13103090 12137155 11646925 11252735 10434498 10419447 10514574
5803A0514574n88186j2406k81827L78776L17758K9597J21291P0719o32799K75485
$$ 10514574 9926388 9913982 9632155 10010931 10328689 10358286 10479577 10550296 9917497 10192982
5793A0192982N07400j04252M34880O9557K24913l85582l07999r5132k89057O0990
$$ 10192982 10700382 10596130 11031010 11100567 11325480 10939898 10631899 10536767 10247710 10308700
5783A0308700m466j06648k66020j94415L92896j36248l7705K80704K20460M05927
$$ 10308700 10304234 10197586 9931566 9737151 10130047 9993799 9956094 10236798 10457258 10863185
5773A0863185R36065L87864J16977K62428P90894J68763O37657L88299N39613
$$ 10863185 11799250 12187114 12304091 12566519 13357413 13526176 14163833 14552132 15091745
5764A5091745j5914j1268l2942R2885J09258J34070j53300O8807N94625K83248
$$ 15091745 15075831 15064563 15031621 15124506 15233764 15367834 15214534 15283341 15877966 16161214
5754A6161214l05483J69705J374150L70218M87357J110360J392154J354263J234336
$$ 16161214 15855731 16025436 17399586 17769804 18257161 19367521 20759675 22113938 23348274
5745B3348274J819300K409980J771136K139937K700785K228939K529432L020539
$$ 23348274 25167574 27577554 29348690 31488627 34189412 36418351 38947783 41968322
5737D1968322K761993J472061R48190o19075k154959k865187l141207k320517
$$ 41968322 44730315 46202376 47150566 46531491 44376532 41511345 38370138 36049621
5729C6049621j864711j594653j199524m15451k0721L77525M12159P44021J233812
$$ 36049621 34184910 32590257 31390733 30975282 30954561 31332086 31744245 32488266 33722078
5720C3722078J593249J641224K222204K333838K852068L110627L064538L351376
$$ 33722078 35315327 36956551 39178755 41512593 44364661 47475288 50539826 53891202
5712E3891202M126122M338877M143792L035025L84023k637692n074785o183319
$$ 53891202 58017324 62356201 66499993 69535018 69919041 67281349 62206564 56023245
5704E6023245n913479n232631l762345l433193k532707j611770j552513q60504
$$ 56023245 50109766 44877135 41114790 37681597 35148890 33537120 31984607 31124103
5696C1124103m70462k89876l22824O71114O34637P3100M83756P71360Q14419Q23307
$$ 31124103 30653641 30363765 30040941 30712055 31346692 31419792 31903548 32674908 33489327 34312634
5686C4312634J205047J591014K108031J442884J009079m74441k193680l382880
$$ 34312634 35517681 37108695 39216726 40659610 41668689 41194248 39000568 35617688
5678C5617688l209468k997535l056790k385391j709805j598156j283192j000467
$$ 35617688 32408220 29410685 26353895 23968504 22258699 20660543 19377351 18376884
5670A8376884j066367m68293n01160n97869n13481o35100n59368M3259j94190
$$ 18376884 17310517 16842224 16341064 15743195 15229714 14594614 14035246 14078505 13884315
5661A3884315p5321r0134l40440n38485j44020J64418J05660L40096m2690Q6647
$$ 13884315 13808994 13718860 13378420 12839935 12695915 12860333 12965993 13306089 13263399 13350046
5651A3350046J42437k45157m62096j06894p04665j151733j85750m29396r1377
$$ 13350046 13492483 13247326 12785230 12678336 11973671 10821938 10636188 10206792 10115415
5642A0115415k60608k82096r1080l138M15737j89328l22270j44761j15227n93209
$$ 10115415 9854807 9572711 9481631 9478493 9894230 9704902 9382632 9237871 9122644 8529435
5632H529435Q5262K19692k08588j44967m2889L58771N00898M0141m38829k34244
$$ 8529435 8614697 8834389 8625801 8480834 8437945 8796716 9297614 9337755 8898926 8664682
5622H664682J54577R8044J25798j64155j70762m52905n3290j75736j22859K37249
$$ 8664682 8819259 8917303 9043101 8878946 8708184 8255279 8201989 8026253 7903394 8140643
5612H140643q5109P2771L15821K39428m78854k4024O203P6858k53824M46064R7692
$$ 8140643 8055534 8128305 8444126 8683554 8204700 8180676 8186879 8263737 8009913 8455977 8553669
5601H553669J16180L57462m9671K45276O9532M47839k2621K92686O75776J69811
$$ 8553669 8669849 9027311 8977640 9222916 9292448 9740287 9717666 10010352 10686128 10855939
5591A0855939P68401J90327L35536O40196M83314J06824M41142K52484O36527
$$ 10855939 11624340 11814667 12150203 12790399 13273713 13380537 13821679 14074163 14710690
5582A4710690L17936L65788O62248J32624N74750L67202L84779L93166J01940
$$ 14710690 15028626 15394414 16056662 16189286 16764036 17131238 17516017 17909183 18011123
5573A8011123M01645L73764Q12471O83749O35429P28765Q03567J862696J388943
$$ 18011123 18412768 18786532 19599003 20282752 20918181 21646946 22450513 24313209 25702152
5564B5702152J590573o1441j031935j065258r93430o78699n94671k58104J49579
$$ 25702152 27292725 27231284 26199349 25134091 24140661 23461962 22867291 22609187 22758766
5555B2758766k42743j87097J912n3159K64843o67730n90607n83717r2280n58743
$$ 22758766 22516023 22328926 22330838 22277679 22542522 21874792 21284185 20700468 20608188 20049445
5545B0049445n78725j09122k05146r18108n51005L9129m32395k74895R952Q8581
$$ 20049445 19470720 19361598 19156452 18238344 17687339 17726468 17294073 17019178 17029130 17117711
5535A7117711l89910O987O07208k29125k96722m65066m06091n21350m27569M31043
$$ 17117711 16727801 16734788 17341996 17112871 16816149 16351083 15944992 15423642 14996073 15427116
5525A5427116l14696k00996m63784n22968J44401m15999o19302k11852j055079
$$ 15427116 15112420 14911424 14447640 13924672 14069073 13653074 13033772 12821920 11766841
5516A1766841k83427k14306n37979l34522o8006m56632m31400n48858j72504n31002
$$ 11766841 11483414 11269108 10731129 10396607 10328601 9871969 9440569 8891711 8719207 8188205
5506H188205k13070k40952j01170K44586j48870O6283n27042r5698j7180k08735
$$ 8188205 7975135 7734183 7633013 7877599 7728729 7795012 7267970 7172272 7155092 6946357
5496F946357j92925j56055R3332r3105l2280j23861r0690n3986k61506M4641Q8299
$$ 6946357 6753432 6597377 6690709 6597604 6565324 6441463 6350773 6296787 6035281 6079922 6168221
5485F168221o120k86390Q77l59447m45365j24981L28611k55295l2200P7247J4834
$$ 6168221 6162101 5875711 5876588 5517141 5071776 4946795 5275406 5020111 4987911 5065158 5079992
5474E079992j46447J56914l76873J28413j46518m3350k3627k41520J80844j18823
$$ 5079992 4933545 5090459 4713586 4841999 4695481 4652131 4628504 4386984 4567828 4449005
5464D449005l8096j12639R6334J14621J64781q9251k21014J25294Q1607p2879
$$ 4449005 4410909 4298270 4394604 4509225 4674006 4584755 4363741 4489035 4570642 4497763
5454D497763n8307o8015k8275j50325J54792k48926n8669j29492Q2157k04235
$$ 4497763 4439456 4371441 4343166 4192841 4347633 4098707 4040038 3910546 3992703 3788468
5444C788468N8760j57770R758n12631J24047J03832Q0163M13710m25852j40505
$$ 3788468 3847228 3689458 3699216 3186585 3310632 3414464 3494627 3908337 3482485 3341980
5434C341980j73224j1866L3998p6184J56296J95636r0091j81258j00196l0975
$$ 3341980 3168756 3156890 3190888 3114704 3271000 3466636 3376545 3195287 3095091 3064116
5424C064116N1598K8035J66174k55010L26772l96130j05633M99890J04828J63412
$$ 3064116 3115714 3143749 3309923 3054913 3381685 2985555 2879922 3379812 3484640 3648052
5414C648052J77674j39321l29983J7979j44991N505R6835L86842m82443L02685
$$ 3648052 3825726 3686405 3356422 3374401 3229410 3234915 3331750 3718592 3236149 3538834
5404C538834R5944J77245q4782k78772l1502k94586N98323L5265k09799J23256
$$ 3538834 3634778 3812023 3727241 3448469 3416967 3122381 3720704 3755969 3546170 3669426
5394C669426j8434J57447j09415m45760J97530L24018m8680K22451m55144J4484
$$ 3669426 3650992 3808439 3699024 3253264 3450794 3774812 3726132 3948583 3493439 3507923
5384C507923M39231L83286M31619J11589o7618K8739K51067N52679L41003Q9684
$$ 3507923 3947154 4330440 4762059 4873648 4806030 4834769 5085836 5638515 5979518 6069202
5374F069202J1083J85923J25056P7030J09130M07844K89238n73456l94746m33868
$$ 6069202 6080285 6266208 6391264 6468294 6577424 6985268 7274506 6701050 6306304 5872436
5364E872436M92881N53507O7693M4122J07036K72086k82040n00211l9945L95490
$$ 5872436 6365317 6918824 6986517 7030639 7137675 7409761 7127721 6627510 6587565 6983055
5354F983055J17020K32173K9361j60543Q31556L59754J21420K06088L51339N75284
$$ 6983055 7100075 7332248 7361609 7201066 8032622 8392376 8513796 8719884 9071223 9646507
5344I646507J89836N7887K28130L73947M4275K02430m85320K6485p5345k16413
$$ 9646507 9836343 9894230 10122360 10496307 10540582 10743012 10257692 10284177 10208832 9992419
5334I992419J93141K94706R3574k48381J144j93266j31676k47452l46511m70880
$$ 9992419 10185560 10480266 10573840 10325459 10326603 10133337 10001661 9754209 9407698 8936818
5324H936818l41870k27713J49859r148k2740J30210k39547K10462M4742K36508
$$ 8936818 8594948 8367235 8517094 8507946 8485206 8615416 8375869 8586331 8631073 8867581
5314H867581M93697L93842k14149j37906M7547j97835j08198N98937P75262N89602
$$ 8867581 9361278 9755120 9540971 9403065 9450612 9252777 9144579 9743516 10518778 11108380
5304A1108380K75370O3429j27452n1700K33187p11941n30426n91612n71315l41377
$$ 11108380 11383750 11447179 11319727 11268027 11501214 10789273 10258847 9667235 9095920 8754543
5294H754543l94652j24279J09711k05703j663j16180j32405n9532r1938j64961
$$ 8754543 8359891 8235612 8345323 8139620 8137957 8021777 7889372 7829840 7737902 7572941
5284G572941r1855N0601M73940M03593M02835m35258K79717L67065J58806L24143
$$ 7572941 7481086 7531687 8005627 8409220 8812055 8376797 8656514 9023579 9182385 9506528
5274I506528j97319J43126N139l83355l3534K74615j16213j80593o9977O60973
$$ 9506528 9309209 9452335 9457474 9074119 9040585 9315200 9198987 9018394 8948417 9609390
5264I609390M11882k35801m03082k28496m53157j96736L34135K3288M31459n2528
$$ 9609390 10021272 9785471 9382389 9153893 8700736 8504000 8838135 8861423 9292882 9240354
5254I240354m98100o8J72003L1436j30374k1528m43905J22096M7622k26890L12657
$$ 9240354 8742254 8742186 8914189 8945625 8815251 8793723 8349818 8471914 8519536 8292646 8605303
5243H605303l52983k98298o87328m156P45987j4868O2641J55900J75871k50186
$$ 8605303 8252320 7954022 7266694 7262538 8008525 7993657 8056298 8212198 8388069 8137883
5233H137883l75810l73010O8637n05505k28592K8876J39439j24322n55274m81358
$$ 8137883 7762073 7389063 7457700 6952195 6723603 6752479 6891918 6767596 6212322 5730964
5223E730964J28748l65496J35395j62592m8178k67347o1523M1308n55770j25517
$$ 5730964 5859712 5494216 5629611 5467019 5418841 5151494 5089971 5131279 4575509 4449992
5213D449992J50098j2265n9217k33539j331m6859l55003L38984J02358J94015
$$ 4449992 4600090 4587825 4528608 4295069 4293738 4246879 3891876 4230860 4333218 4527233
5203D527233j63966Q4351o67098k32484J94944Q36j61120L20619J04990m17949
$$ 4527233 4363267 4447618 3780520 3548036 3742980 3743816 3582696 3903315 4008305 3590356
5193C590356M3636r7052k57723R1061N4832J95660j88639p750m43129K30465N12019
$$ 3590356 3633992 3536940 3279217 3370278 3425110 3620770 3432131 3424381 2981252 3211717 3723736
5182C723736k60883j80105L38689K39134K65397K947J00657O8564m71346j43428
$$ 3723736 3462853 3282748 3621437 3860571 4125968 4128915 4229572 4298136 3826790 3683362
5172C683362K76284l82927m72913J23203K41225j93850J69760l8398j4670J9559
$$ 3683362 3959646 3576719 3103806 3227009 3468234 3274384 3444144 3405746 3391076 3410635
5162C410635l91549J57398j69964L70525k17670Q581L3404j22046j78279R2800
$$ 3410635 3019086 3176484 3006520 3377045 3159375 3167956 3201360 3079314 2901035 2993835
5152B993835O18474l70337k09781k866K15446l13440K11598N88216n9678o2324
$$ 2993835 3612309 3241972 3032191 3029325 3244771 2931331 3142929 3731145 3671467 3609143
5142C609143J96745j37430p0978M98898o06528n19721j14666m3717m7746n6759
$$ 3609143 3805888 3668458 3597480 4096378 3489850 2970129 2855463 2811746 2764000 2707241
5132B707241m0499K99544q2765j014J14335J75736k68183r3234J00943K57590
$$ 2707241 2666742 2966286 2883521 2882507 2996842 3172578 2904395 2811161 2912104 3169694
5122C169694R505K92663l16974k94026K60230J78450Q12L90364j31413L23447
$$ 3169694 3179199 3471862 3154888 2860862 3121092 3299542 3300354 3690718 3559305 3882752
5112C882752L8080j91282M34709M22520q1500n94591n37696j02541j67993j93380
$$ 3882752 3920832 3729550 4164259 4586779 4505279 3910688 3372992 3270451 3102458 2909078
5102B909078R0208l48598J20211k2626o3868J76927K70107R9643J72929n9538
$$ 2909078 2999286 2650688 2770899 2748273 2684405 2861332 3131439 3231082 3404011 3344473
5092C344473j5129m86276J91129K88647k69540j16559K0681O3917J72361o5258
$$ 3344473 3329344 2843068 3034197 3322844 3053304 2936745 2957426 3021343 3193704 3128446
5082C128446k63374J14736J91391m4549L42928J07257j65567J05454p0008j07330
$$ 3128446 2865072 2979808 3171199 3126650 3469578 3576835 3411268 3516722 3446714 3339384
5072C339384k8316j19943J676m3038J11806j98839K51682l20010N5328n7112N1361
$$ 3339384 3311068 3191125 3192801 3149763 3261569 3062730 3314412 2994402 3049730 2992618 3043979
5061C043979J08246p5368L47091k80982M6543r6212l15070K92994r3685m865n54739
$$ 3043979 3152225 3076857 3423948 3142966 3189509 3093297 2778227 3071221 2977536 2972671 2417932
5050B417932J54398L4307L88293j97721k80940K40259k81613J6392m90031K03855
$$ 2417932 2572330 2606637 2994930 2797209 2516269 2756528 2474915 2491307 2001276 2205131
5040B205131M00056K25519k31608Q6207J16863K50422P1578K05141J78864M00357
$$ 2205131 2605187 2830706 2599098 2685305 2802168 3052590 3124168 3329309 3508173 3908530
5030C908530l59667l11590K8799K6396j01448R0355j11277J95658J1504k80670
$$ 3908530 3548863 3237273 3266072 3292468 3191020 3281375 3170098 3365756 3377260 3096590
5020C096590k33256M69385J69364j57790j08903O6590L70820m96655j50327r9267
$$ 3096590 2863334 3332719 3502083 3344293 3235390 3301980 3672800 3176145 3025818 2926551
5010B926551K47265K33626M22232o8858m16561j67933L21003L05496k31026k23207
$$ 2926551 3173816 3407442 3829674 3760816 3344255 3176322 3497325 3802821 3571795 3348588
5000C348588J67393J02295o2767q2194N6355J33516k77890K60078j3063N12270
$$ 3348588 3515981 3618276 3555509 3473315 3529670 3663186 3385296 3645374 3632311 4144581
4990D144581l6138l01020K03925l50373j27688M1742N2268K68M06978j84997J9456
$$ 4144581 4108443 3807423 4011348 3660975 3533287 3575029 3627297 3627565 4034543 3849546 3869002
4979C869002P5946l06142J91959Q3739J59744j3498j46182q3155K83434K10277
$$ 3869002 3944948 3638806 3830765 3914504 4074248 4060750 3914568 3831413 4114847 4325124
4969D325124j01916K30222M59110R8411j94216m44502j33883M7840N23814N5231
$$ 4325124 4223208 4453430 4912540 5010951 4816735 4372233 4238350 4286190 4810004 4865235
4959D865235n7666K65463L367K9048J39101m67471L7478N65682K78055L48251
$$ 4865235 4807569 5073032 5076399 5105447 5244548 4777077 4814555 5380237 5658292 6006543
4949F006543M2073N42355l66413M57923K51216j76185J95465L2057J21663N23365
$$ 6006543 6048616 6590971 6224558 6682481 6933697 6757512 6952977 6985034 7106697 7630062
4939G630062l9434K62716K70859j78294N5817P0770J88232K51949k3068L20005
$$ 7630062 7590628 7853344 8124203 7945909 8001726 8072496 8260728 8512677 8489609 8809614
4929H809614K86344j79697K16705J57898N39572L60040l317J311J67163L75325
$$ 8809614 9095958 8916261 9132966 9290864 9830436 10190476 10187159 10188470 10355633 10730958
4919A0730958J12612j11116L15051K08109N57370M2742j67424j11242J75103O04375
$$ 10730958 10843570 10732454 11047505 11255614 11812984 11855726 11688302 11577060 11752163 12356538
4909A2356538N33730L04796K67228r36m50862L42778M48229L91109L15168N55643
$$ 12356538 12890268 13195064 13462292 13461356 13010494 13353272 13801501 14192610 14507778 15063421
4899A5063421K41254O20907N24712J095096P90671O31489J323687R60080J081501
$$ 15063421 15304675 15925582 16450294 17545390 18336061 18967550 20291237 21251317 22332818
4890B2332818J068037J074918J344996J874267J207988J845524K078397K049402
$$ 22332818 23400855 24475773 25820769 27695036 28903024 30748548 32826945 34876347
4882C4876347K870289K537967L036382M061077M777598N906073O895087P300517
$$ 34876347 37746636 40284603 43320985 47382062 52159660 58065733 64960820 72261337
4874G2261337P336442Q983960J0499165J1213050J3150795J5875212J9226198
$$ 72261337 79597779 88581739 99080904 110293954 123444749 139319961 158546159
4867A58546159K2497998K7351397K1405747m378316k9267393l3439835k5760142
$$ 158546159 181044157 208395554 229801301 225422985 196155592 162715757 136955615
4860A36955615j8743302j3575505r445904q894368p709817n590689m578074k828694
$$ 136955615 118212313 104636808 95190904 86296536 78586719 72996030 68417956 65589262
4852F5589262k111936j357659o51803p65051r04421k87309j236221j905528k458517
$$ 65589262 63477326 62119667 61467864 60702813 59798392 59511083 58274862 56369334 53910817
4843E3910817j672108m35687N6078n76003l77032l46329j16539l950P52304J832846
$$ 53910817 52238709 51803022 51859100 51283097 50906065 50559736 50443197 50439247 51191551 53024397
4833E3024397J930617J907170L047868K649422L593955M133787K566229j212430
$$ 53024397 54955014 56862184 59910052 62559474 66153429 70287216 72853445 71641015
4825G1641015m761460m554585k734347j879748m75672L43146L03468N60644m20298
$$ 71641015 66879555 62324970 59590623 57710875 57235203 57578349 57881817 58442461 58022163
4816E8022163J85950j1204P78173J354389J788643K156032L017338L779425M966492
$$ 58022163 58208113 58196909 58975082 60329471 62118114 64274146 67291484 71070909 76037401
4807G6037401O167918P285131P452283R236407J0612186J1098783J2546413J5656607
$$ 76037401 82205319 89490450 96942733 106179140 116791326 127890109 140436522 156093129
4799A56093129J9278712K2216095K4983875K6037640J5984573j0556492k9750770
$$ 156093129 175371841 197587936 222571811 248609451 264594024 254037532 224286762
4792B24286762k8285736j8854759j1595081o647704k801578J192815M838358Q440174
$$ 224286762 196001026 177146267 165551186 158903482 156101904 157294719 162133077 170573251
4784A70573251J2902056J3902391Q520373q95915j1137947j8670197j9978581
$$ 170573251 183475307 197377698 205898071 205002156 193864209 175194012 155215431
4777A55215431j6066160j0493215o642383l316178n52242J505922L301838M871816
$$ 155215431 139149271 128656056 122013673 118697495 118145253 119651175 122953013 127824829
4769A27824829O183498N849667N941539O490510Q826315J1423360J5078037J9719084
$$ 127824829 134008327 139857994 145799533 152290043 161116358 172539718 187617755 207336839
4761B07336839J5549230o115260k6946854k9171053k1790618j4299477j0970489
$$ 207336839 222886069 216770809 189823955 160652902 138862284 124562807 113592318
4754A13592318q146545n959454m220233j867951o66495O89796K177636L532371
$$ 113592318 105445773 99486319 95266086 93398135 92731640 93421436 95599072 99131443
4746I9131443M347190L562592L9771n281508q976664q945088p048920n257458
$$ 99131443 103478633 107041225 107080996 101799488 92822824 83877736 76828816 71571358
4738G1571358m122880l054834k512500j629372q62162l50184L19747M04755J697163
$$ 71571358 67448478 64393644 61881144 60251772 59389610 59039426 59359173 59763928 61461091
4729F1461091K122000K896451L945950M496693M507932O038047P527787Q623851
$$ 61461091 63583091 66479542 70425492 74922185 79430117 85468164 92995951 101619802
4721A01619802J0311017J2563841J4864694J0322179J649892l456753r213200
$$ 101619802 111930819 124494660 139359354 149681533 151331425 147874672 138661472
4714A38661472j6237043j8959343j5762790j1487365q885447p050629n253626
$$ 138661472 122424429 103465086 87702296 76214931 67329484 60278855 55025229
4707E5025229m426592l283241k546612k309635j741881j450799j260198r50816
$$ 55025229 50598637 47315396 44768784 42459149 40717268 39266469 38006271 37055455
4699C7055455k31126j58169j66088j573980k096042k636134j892164j316620j094297
$$ 37055455 36824329 36666160 36500072 34926092 32830050 30193916 28301752 26985132 25890835
4690B5890835j168123q47506q99457j096617j040101l21857R1353p55770r51066
$$ 25890835 24722712 23875206 22975749 21879132 20839031 20517174 20608527 19852757 18901691
4681A8901691j101644m76026L6512o87688m12478k62771j51147k05470q21341
$$ 18901691 17800047 17324021 17360533 16672845 16260367 15997596 15846449 15640979 14819638
4672A4819638j11857n49613m82610m5362k34229o3872m02744o41416k44658K0719
$$ 14819638 14707781 14158168 13675558 13630196 13395967 13332095 12929351 12287935 12043277 12063996
4662A2063996l85010l11906o2112l80780J01807l92445k49960p6898k60015k21672
$$ 12063996 11678986 11367080 11304968 10924188 11025995 10633550 10383590 10306692 10046677 9825005
4652I825005o2513k60988K95040j47442o7489k78881l44738J40197j72803J15665
$$ 9825005 9762492 9501504 9796544 9649102 9581613 9302732 8957994 9098191 8925388 9041053
4642I041053k45367k69685N7245n75646J20957L22403l20019j28220l7439k52452
$$ 9041053 8795686 8526001 8583246 8007600 8128557 8450960 8130941 8002721 7965282 7712830
4632G712830n00243O9325j22840l55758k50760J14141N02055J10700r78012k01407
$$ 7712830 7212587 7281912 7159072 6803314 6552554 6666695 7168750 7279450 6301438 6100031
4622F100031q1686l26195K21838J94118k33004o7901l03335j86943J51744K35825
$$ 6100031 6018345 5692150 5913988 6108106 5875102 5807201 5503866 5316923 5468667 5704492
4612E704492q492j31379j84523p8306n84571R407K68753j45615j16181J17393
$$ 5704492 5696000 5564621 5380098 5301792 4717221 4726628 4995381 4849766 4733585 4850978
4602D850978J12173j46668j15879j2101l8871K6292l07104J73591M39750j98147
$$ 4850978 4963151 4816483 4700604 4688503 4649632 4675924 4368820 4542411 4982161 4784014
4592D784014N5767k84330j40966J43883J68093r2129j67030j62899J90374k53673
$$ 4784014 4839781 4555451 4414485 4558368 4726461 4634332 4467302 4304403 4494777 4241104
4582D241104o30734M83522K00187l8046J77659k63389k18156K39634k40294R2750
$$ 4241104 3610370 4093892 4294079 4256033 4433692 4170303 3952147 4191781 3951487 4044237
4572D044237J06233J35489J24537Q2334k9214k54076K89140p827k63005M9196
$$ 4044237 4150470 4285959 4410496 4492830 4463616 4209540 4498680 4490853 4227848 4277044
4562D277044r5397l29784J0821K91677M68200K11096k80422j53278J72962k77805
$$ 4277044 4181647 3851863 3862684 4154361 4622561 4833657 4553235 4399957 4572919 4295114
4552D295114j61904N4400L14859N26025M4025k51158n36437k32109J62213J88974
$$ 4295114 4133210 4187610 4502469 5028494 5072519 4821361 4284924 4052815 4215028 4404002
4542D404002j60809l19177K35038j14392n40469L10180L19066l10780R9872j04505
$$ 4404002 4243193 3924016 4159054 4044662 3504193 3814373 4133439 3822659 3922531 3818026
4532C818026K44562j10243K04609J16626l09667K74779J5873M61240R3403j78186
$$ 3818026 4062588 3952345 4156954 4273580 3963913 4238692 4254565 4715805 4809208 4631022
4522D631022J08548j05122m41230J38500K48602P052L03802J69967r6700o2793
$$ 4631022 4739570 4634448 4193218 4331718 4580320 4587372 4891174 5061141 4964441 4901648
4512D901648L65145l5470j4282m2373K11636j14644K12169j73845j84587M74970
$$ 4901648 5266793 5231323 5217041 5174668 5386304 5271660 5483829 5309984 5125397 5600367
4502E600367P02921k26989R6436j8325k1902l43845J48739Q85453J39986Q7219
$$ 5600367 6303288 6076299 6172735 6154410 6132508 5788663 5937402 6822855 6962841 7050060
4492G050060M99109K04387j47739K93144Q48997L61773K9997K64809J286523N92774
$$ 7050060 7549169 7753556 7605817 7898961 8747958 9109731 9139728 9404537 10691060 11283834
4482A1283834n7032L11296j5970j94169J9039M26307P10288K39184K36277N84257
$$ 11283834 11226802 11538098 11522128 11327959 11346998 11773305 12483593 12722777 12959054 13543311
4472A3543311N61955Q08265P56473J215991J000360J040376J605199J512637R64232
$$ 13543311 14105266 14913531 15670004 16885995 17886355 18926731 20531930 22044567 23008799
4463B3008799J524059P97566R82546J988049K004915J645039J028661k29502o69274
$$ 23008799 24532858 25330424 26312970 28301019 30305934 31950973 32979634 32750132 32080858
4454C2080858j148970j469504j230286r30828j507854j260659p50284m35614m18050
$$ 32080858 30931888 29462384 28232098 27301270 25793416 24532757 23782473 23346859 22928809
4445B2928809j9010m16055N84253m9591K95916R06457O03681M92406O53174J158205
$$ 22928809 22909799 22493744 23077997 23028406 23324322 24230779 24834460 25326866 25980040 27138245
4435B7138245J585824J817944J822954K214674L020005K889026K593696K516328
$$ 27138245 28724069 30542013 32364967 34579641 37599646 40488672 43082368 45598696
4427D5598696K214645J775383P34338M2988k11747m22227j839372j788126j856834
$$ 45598696 47813341 49588724 50323062 50366050 50154303 49732076 47892704 46104578 44247744
4418D4247744j441474j192014o37588r30823j262643j499884j523513k076894
$$ 44247744 42806270 41614256 40976668 40045845 38783202 37283318 35759805 33682911
4410C3682911k418408j634343j212563j190398o46137r89477o10687K45481k06335
$$ 33682911 31264503 29630160 28417597 27227199 26581062 25591585 24980898 25226379 25020044
4401B5020044L27295L08076J39047O41421O90742O48920J084656J277751J647051
$$ 25020044 25347339 25655415 25794462 26435883 27126625 27775545 28860201 30137952 31785003
4392C1785003J596024K233253J608064J088649J508062m03815j095782j683654
$$ 31785003 33381027 35614280 37222344 38310993 39819055 39415240 38319458 36635804
4384C6635804k552951k293322k469249k226888j637211j594250j549215j278754
$$ 36635804 34082853 31789531 29320282 27093394 25456183 23861933 22312718 21033964
4376B1033964r35903k89886p54788j484522r81464l98910n16664m45145o54195
$$ 21033964 20098061 19808175 19053387 17568865 16587401 16188491 15671827 15226682 14572487
4367A4572487l29784m82203L32421k48088k62192K49791k35335K02254K65743
$$ 14572487 14242703 13760500 14092921 13844833 13582641 13832432 13597097 13799351 14065094
4358A4065094k73053M34358N6832k30404l58054k47915K20041K81625k05012m53989
$$ 14065094 13792041 14226399 14283231 14052827 13694773 13446858 13666899 13948524 13743512 13289523
4348A3289523j8431j94576p07662m11695l8765k51364J33187n14272k78531m34063
$$ 13289523 13271092 13076516 12368854 11957159 11918394 11667030 11800217 11285945 11007414 10573351
4338A0573351j01036Q824J52428r5909l22957o43667L05558L80484j8471l19958
$$ 10573351 10472315 10481139 10633567 10537658 10214701 9571034 9876592 10257076 10238605 9918647
4328I918647J56744N6522J40197K32890J60109J38397j86264N21510L48635j81579
$$ 9918647 10075391 10131913 10272110 10505000 10665109 10803506 10617242 11138752 11487387 11305808
4318A1305808k9009L52245l8287j84660j17645J36481L36172m29328q4650l22124
$$ 11305808 11276799 11629044 11590757 11406097 11288452 11424933 11761105 11331777 11247127 10925003
4308A0925003o00361K75k24464l55552k40775k00781m11779J16029K20878N9481
$$ 10925003 10324642 10324917 10100453 9744901 9504126 9303345 8891566 9007595 9228473 9287954
4298I287954J1430o5541N2425j04779R7924j91618l82856K13978N10450k02723
$$ 9287954 9299384 9233843 9286268 9181489 9279413 9087795 8704939 8918917 9429367 9226644
4288I226644P0609L55202Q3691m8548K72361J0801j57759j02586K2898J86094
$$ 9226644 9297253 9652455 9736146 9687598 9959959 9970760 9813001 9710415 9733313 9919407
4278I919407P42261R9291j43433L91995j36645L72580j3639J49414p3765j37209
$$ 9919407 10661668 10760959 10617526 11009521 10872876 11245456 11231817 11381231 11307466 11170257
4268A1170257o9892k91827J96540m42680L91756M33638J60130L48078J22868K18189
$$ 11170257 11100365 10808538 11005078 10562398 10954154 11387792 11547922 11896000 12018868 12237057
4258A2237057J93212K49477J17844M03152J29055K40760N53199L15601L10728
$$ 12237057 12430269 12679746 12797590 13200742 13329797 13570557 14123756 14439357 14750085
4249A4750085K88264J85462j46952M77517R09241K72867N75998M74224L36139
$$ 14750085 15038349 15223811 15076859 15554376 16463617 16736484 17312482 17786706 18122845
4240A8122845O36769K09575k24908j23614N12421M66439J41049j78774K64476
$$ 18122845 18759614 18969189 18744281 18620667 19133088 19599527 19740576 19561802 19826278
4231A9826278L86919J78449O35231M06167J018290M21173N43719N60056O10548
$$ 19826278 20213197 20391646 21026877 21433044 22451334 22872507 23416226 23976282 24586830
4222B4586830M36928M58495J054669J197007R47996J093055J267329J289914N02697
$$ 24586830 25023758 25482253 26536922 27733929 28681925 29774980 31042309 32332223 32834920
4213C2834920j54149m01165P8638P0703j13612N17442P75509P74997J013903J772171
$$ 32834920 32680771 32279606 32358244 32428947 32315335 32832777 33608286 34383283 35397186 37169357
4203C7169357J920410J779275K207654K304294K397681K448258K273460K401037
$$ 37169357 39089767 40869042 43076696 45380990 47778671 50226929 52500389 54901426
4195E4901426J979539J802021K318426K449554L191039L975376M293810N584480
$$ 54901426 56880965 58682986 61001412 63450966 66642005 70617381 74911191 80495671
4187H0495671O202843O746833Q574786R879153J1272355J2603946J4543229J7433223
$$ 80495671 86698514 93445347 102020133 111899286 123171641 135775587 150318816 167752039
4179A67752039K0510463K3544025K4817144J9658631Q498696k977296p237039
$$ 167752039 188262502 211806527 236623671 256282302 264780998 261803702 254566663
4172B54566663p822274r686786j5421138k2082524k3567481k0299208j5673151
$$ 254566663 246744389 237057603 221636465 199553941 175986460 155687252 140014101
4165A40014101j1929594q418625o544504m484483k787409j491432m73991N73752
$$ 140014101 128084507 119665882 113121378 108636895 105849486 104358054 103884063 104457815
4157A04457815K442742L583874M675246N873192O791140Q139329J0013524J1345429
$$ 104457815 106900557 110484431 115159677 121032869 127824009 135963338 145976862 157322291
4149A57322291J3241674J5974881J8682301K1578387K3786509K1878662Q143509
$$ 157322291 170563965 186538846 205221147 226799534 250586043 272464705 280608214
4142B80608214j3578161k7664700k7701342k2747834j7658365j4971916j3492507
$$ 280608214 267030053 239365353 211664011 188916177 171257812 156285896 142793389
4135A42793389j2565371j1266142r833227q475873p067936n705897m982680l617231
$$ 142793389 130228018 118961876 109128649 100652776 93584840 87878943 82896263 79279032
4127G9279032l034664k503267j548150j593903o75844p57974l18478O92372J000148
$$ 79279032 76244368 73741101 72192951 70599048 69923204 69165230 68846752 69539124 70539272
4118G0539272J263861R57161L39943j10774j712526j855498j798687j395330o2306
$$ 70539272 71803133 72760294 73100237 72989463 71276937 69421439 67622752 66227422 66165116
4109F6165116J89004N80668R69958K372336K450295L033421L233197M353441N373557
$$ 66165116 66354120 66934788 67904746 70277082 72727377 75760798 78993995 83347436 88720993
4100H8720993M249377O08428m802749p864475p758794o084169m911539l590817
$$ 88720993 92970370 93578798 88776049 80911574 73152780 67068611 62157072 58566255
4092E8566255k455396l283719k229097j544263j640609j554447j599133q05615
$$ 58566255 56110859 52827140 50598043 49053780 47413171 45858724 44259591 43453976
4084D3453976j622277j115696j196888j037020j094747r13865r13513q55139k50653
$$ 43453976 41831699 40716003 39519115 38482095 37387348 36473483 35559970 34704831 34454178
4075C4454178m27037j82177m65085N3348M62696K6024M05647O20332Q32146O63031
$$ 34454178 34027141 33844964 33379879 33433227 33895923 33921947 34327594 34947926 35780072 36443103
4065C6443103Q43793J202172P85321Q85665k44904n74718n76746k34645N68935
$$ 36443103 37286896 38489068 39274389 40160054 39915150 39340432 38763686 38529041 39097976
4056C9097976M43438M01299M65473M12985J282292J669567J602384J913124K021463
$$ 39097976 39541414 39942713 40408186 40821171 42103463 43773030 45375414 47288538 49310001
4047D9310001K941142L177260L458678L941867M525137N192379N264641N912904
$$ 49310001 52251143 55428403 58887081 62828948 67354085 72546464 77811105 83724009
4039H3724009O226735N302710N76109n539476p689570o159209l971756k387156
$$ 83724009 89950744 95253454 95829563 90290087 82600517 76441308 72469552 70082396
4031G0082396j769615n46399K96955J494427K326497K106985O85321k113595l038559
$$ 70082396 68312781 67766382 68063337 69557764 71884261 73991246 74676567 72562972 69524413
4022F9524413k938066j213783m32188k76250N70556J552923J322263P55254l15108
$$ 69524413 66586347 65372564 64940376 64664126 65234682 66787605 68109868 68865122 68550014
4013F8550014j357114j640404k405377k113910j434001j472144j241441o86818
$$ 68550014 67192900 65552496 63147119 61033209 59599208 58127064 56885623 56198805
4005E6198805j54929K35326R73862R20535J726544J276641J663742K817337K899237
$$ 56198805 56043876 56279202 57253064 58173599 59900143 61176784 62840526 65657863 68557100
3996F8557100L079745K931196K593448K533064K320910L092184L559464K541691
$$ 68557100 71636845 74568041 77161489 79694553 82015463 85107647 88667111 91208802
3988I1208802J720304Q97201p68762k427718k674985k642716l732910l529309
$$ 91208802 92929106 93826307 93057545 90629827 87954842 85312126 81579216 78049907
3980G8049907l451063l179466j952210j356845r87871p0113J61622L06564O56416
$$ 78049907 74598844 71419378 69467168 68110323 67122452 67052339 67213961 67520525 68176941
3971F8176941J577006K026868K772384L169297M022234N036860N218495N829726
$$ 68176941 69753947 71780815 74553199 77722496 81744730 86781590 92000085 97829811
3963I7829811O136797O724195O427462L604748o43601m074128o134014n660462
$$ 97829811 103966608 110690803 117118265 120723013 120079412 116005284 109871270 104210808
3955A04210808m892914n659303n841233n486503m688195l780833l461761k937587
$$ 104210808 99317894 93658591 87817358 82330855 77642660 73861827 70400066 67462479
3947F7462479k654361j929426j492340j408623q67680k2833j9933N31097J137098
$$ 67462479 64808118 62878692 61386352 59977729 59110049 59087216 59067283 59598380 60735478
3938F0735478J918071J993692K478313K075975K035039J836082Q01540O57185
$$ 60735478 62653549 64647241 67125554 69201529 71236568 73072650 73874190 74531375
3930G4531375J03390K94957L78032p72464j522586j939674j633324j662107j948986
$$ 74531375 74634765 74929722 75307754 74535290 73012704 71073030 69439706 67777599 65828613
3921F5828613j555814j744125j900199r92770j200040p42207j091818k306051
$$ 65828613 64272799 62528674 60628475 59635705 58435665 57693458 56601640 54295589
3913E4295589k977677k294937j449410o93867n57407k17028O56892O73071m45656
$$ 54295589 51317912 49022975 47573565 46879698 46322291 46105263 46762155 47435226 46989570
3904D6989570Q0400J61753M55096O56526q1016J35898l41462j35812r619l71666
$$ 46989570 47069970 47231723 47686819 48343345 48262329 48398227 48056765 47920953 47911334 47539668
3894D7539668n68330m68267j017936j670165j530135j123739j813161j471241
$$ 47539668 46971338 46503071 45485135 43814970 42284835 41161096 39347935 37876694
3886C7876694q97543j616296r20610r56434m90010k43351j85358j9629n43847
$$ 37876694 36979151 35362855 34442245 33485811 32995801 32752450 32567092 32547463 32003616
3877C2003616K4562k6567p3549m39260p2018p7836M92090N14857N01590J82050
$$ 32003616 32028178 32001611 31928062 31488802 31416784 31338948 31831038 32345895 32847485 33029535
3867C3029535K32031L00660k60329J10792o6820l70729r61402l67637o22182l91309
$$ 33029535 33261566 33562226 33301897 33412689 33345869 32975140 32013738 31646101 31023919 30632610
3857C0632610n09744l28360M86136m45266n4439m11141j91582n06713l21141k49820
$$ 30632610 30122866 29794506 30280642 29835376 29780937 29369796 29178214 28671501 28350360 28100540
3847B8100540k22478p56485p45928k50049O4935l3926j49337k51637L05373J63539
$$ 28100540 27878062 27121577 26375649 26125600 26190535 26156609 26007272 25755635 26061008 26224547
3837B6224547J35475q8797n69252k97679n783k65982j75460p5286R1921K31611
$$ 26224547 26360022 26271225 25701973 25404294 25398511 25132529 24957069 24881783 24973704 25205315
3827B5205315P6793k79888k15722K15460k95117L72289l3417j5013M870j43596
$$ 25205315 25282108 25002220 24786498 25001958 24706841 25079130 25045713 25030700 25035570 24891974
3817B4891974p28695p77300n92806l24435l92531q6098M9300k10808q40658J10227
$$ 24891974 24163279 23385979 22793173 22468738 22076207 21990109 22039409 21828601 20987943 21098170
3807B1098170M61233k57274k96567j54032N4727K66107M2740q5197J26502J58846
$$ 21098170 21559403 21302129 21005562 20851530 20906257 21172364 21215104 21129907 21256409 21415255
3797B1415255N7125J77572P7173J92531j64989j08248J18008J82396J76909r6196
$$ 21415255 21472380 21649952 21727125 21919656 21754667 21646419 21764427 21946823 22123732 22027536
3787B2027536P579j04370k00319o64699j80910K34534j54021k18039K37925O2295
$$ 22027536 22035115 21930745 21730426 21065727 20884817 21119351 20965330 20747291 20985216 21047511
3777B1047511k00975l31361M002n7289k05409j8921L40019J25193O08996L65219
$$ 21047511 20846536 20515175 20519177 20461888 20256479 20237558 20577577 20702770 21311766 21676985
3767B1676985K16594M10479L82924N01544O62182P35967N70961R51331J041784
$$ 21676985 21893579 22304058 22686982 23188526 23850708 24586675 25157636 26108967 27150751
3758B7150751J234642J068948R32602J391522J018587J123134P00048J345477
$$ 27150751 28385393 29454341 30386943 31778465 32797052 33920186 34620234 35965711
3750C5965711J614887J701147J983933K034368K297160K852182K464609K260651
$$ 35965711 37580598 39281745 41265678 43300046 45597206 48449388 50913997 53174648
3742E3174648K504293K088949K820701J633515J552864M97587M07751j261824
$$ 53174648 55678941 57767890 60588591 62222106 63774970 64272557 64680308 63418484
3734F3418484k138348k458501l107808l533899l493199k845657l516931k902315
$$ 63418484 61280136 58821635 55713827 52179928 48686729 45841072 42324141 39421826
3726C9421826k337595k785791k454744j970837j493829r25200j449923r96174
$$ 39421826 37084231 34298440 31843696 29872859 28379030 27453830 26003907 25007733
3718B5007733r85047j132164j449979n36390q23548j182645o38067m20225j017687
$$ 25007733 24022686 22890522 21440543 20904153 20080605 18897960 18259893 17839668 16821981
3709A6821981o51493J42672n49647o41642r87023r8583j65671n36115q1704k43579
$$ 16821981 16170488 16313160 15763513 15121871 14134848 14036265 13870594 13334479 13252775 13009196
3699A3009196K39660l25881l26086l16256j88591k20268j4123k4278k90620o21264
$$ 13009196 13248856 12922975 12596889 12280633 12092042 11871774 11857651 11833373 11542753 10921489
3689A0921489j43004J02358j76122J11451l32430n19773J06745n68613m48341
$$ 10921489 10778485 10880843 10704721 10816172 10483742 9963969 10070714 9502101 9053760
3680I053760J04634j67345j79234R5119j87402J19192J80369l04625k72003k33635
$$ 9053760 9158394 8991049 8811815 8906934 8719532 8838724 9019093 8714468 8442465 8208830
3670H208830N78411J5529J08555k38744K487L15024k01197l63045l55144P5738
$$ 8208830 8787241 8802770 8911325 8672581 8675068 8990092 8788895 8425850 8070706 8146444
3660H146444l96207j47611K81920o63026m50024L30203j60463m31414J34372j04671
$$ 8146444 7750237 7602626 7884546 7221520 6771496 7101699 6941236 6509822 6644194 6539523
3650F539523k44740J15173J21473l34085n6526k65342k32629J93442k33127l29580
$$ 6539523 6294783 6409956 6531429 6197344 6140818 5875476 5642847 5836289 5603162 5273582
3640E273582P6768l3638K84988j44772j67761j1881J4572K72435j22565k03248
$$ 5273582 5350350 5316712 5601700 5456928 5289167 5277286 5291858 5564293 5441728 5238480
3630E238480J26042P4333l02520J60308n5209m30768J91327l04559m3360J99210
$$ 5238480 5364522 5438855 5136335 5296643 5241434 4810666 5001993 4697434 4654074 4853284
3620D853284o1464J142k69611j26066J8875j84255P5095p2591J310k20026P0232
$$ 4853284 4791820 4792962 4523351 4397285 4416160 4231905 4307000 4234409 4235719 4015693 4085925
3609D085925K35402K91961K9488k37237L561J20478Q9807p5748j56670r39673
$$ 4085925 4321327 4613288 4642776 4405539 4409100 4529578 4619385 4543637 4386967 3447294
3599C447294P22357J50971k87146J27959m37701j81022j06550j43856n9933Q2393
$$ 3447294 4169651 4320622 4033476 4161435 3723734 3542712 3436162 3292306 3232373 3314766
3589C314766K82661K70465J4351o5789l03678j41491O991j71718j89698J33205
$$ 3314766 3597427 3867892 3882243 3816454 3512776 3371285 3378276 3206558 3016860 3150065
3579C150065j66282k0623j25394q6502j80407r0941J67073p0546N43513k04988
$$ 3150065 2983783 2963160 2837766 2751264 2570857 2479916 2646989 2576443 3119956 2914968
3569B914968J84375L7669K203N65154r7181k9684R6115J82469J75604P5611L16862
$$ 2914968 3099343 3137012 3139215 3704369 3607188 3577504 3673619 3856088 4031692 4107303 4424165
3558D424165K15328k21116m80580j7960m40064L18750J56466l85329K74553L61155
$$ 4424165 4639493 4418377 3937797 3919837 3479773 3798523 3954989 3569660 3844213 4205368
3548D205368K20134l61254j57601L5730K74569k12710l39499L99934N4811J01495
$$ 4205368 4425502 4064248 3906647 3942377 4216946 4004236 3664737 4064671 4119482 4220977
3538D220977N33050o4024L58298M25647K12082k0212J84745K37397j22683K35131
$$ 4220977 4754027 4690003 5048301 5473948 5686030 5665818 5850563 6087960 5965277 6200408
3528F200408l92826o19570j5838O8034K36790J70988l38923j45089j39122k39627
$$ 6200408 5807582 5188012 5172174 5240208 5476998 5647986 5309063 5163974 5024852 4785225
3518D785225l38578J20857J28458J43040L04561j58606K08220J2875L50223j2503
$$ 4785225 4446647 4567504 4695962 4839002 5143563 4984957 5193177 5206052 5556275 5543772
3508E543772m43894O4555M91576K66952J58012q0189K08690N90166k35855j44705
$$ 5543772 5099878 5164433 5656009 5922961 6080973 6000784 6209474 6799640 6563785 6419080
3498F419080k02909o9079j09895k30449j3629j09048n30718j95289P7508M00952
$$ 6419080 6216171 6147092 6037197 5806748 5793119 5684071 5153353 4958064 5035572 5436524
3488E436524n7645R5047m22783j42864L80899K69053J5669l8127k22465l65468
$$ 5436524 5378879 5473926 5051143 4908279 5289178 5558231 5573900 5535773 5313308 4947840
3478D947840R5727q1162r4278L23028j49333j57705J39100k44385k02867K78857
$$ 4947840 5043567 4962405 4868127 5191155 5041822 4884117 5023217 4778832 4575965 4854822
3468D854822K13l02008K94237l1641l25914n4179L98912p1193m812j68039Q7886
$$ 4854822 4855035 4553027 4847264 4815623 4489709 4435530 4834442 4763249 4758437 4590398 4678284
3457D678284k24220j04832o8515j20596j74235m8481k81869K71480l6957L48182
$$ 4678284 4454064 4349232 4280717 4160121 3985886 3937405 3655536 3927016 3890059 4238241
3447D238241j40579k49826L03079j37795J80662M40772j28955l89482J55925L6698
$$ 4238241 4097662 3847836 4150915 4013120 4193782 4634554 4505599 4116117 4272042 4308740
3437D308740J06405j97468j7286k10028M306k2664j23208P3167K07082R6639p778
$$ 4308740 4415145 4217677 4200391 3990363 3994669 3972005 3848797 3921964 4129046 4225685 4217907
3426D217907k79922k26250j73115p629K26825P7354r4519k1243j19082J26164
$$ 4217907 3937985 3711735 3538620 3530991 3757816 3835170 3740651 3719408 3600326 3726490
3416C726490L08774L9689l08876j57798O29961l54153l39973L98742j70782J9345
$$ 3726490 4035264 4074953 3766077 3608279 4238240 3884087 3544114 3942856 3772074 3791419
3406C791419r4188J34058j35397K00874j13303n1031k50373l17988L59010J96327
$$ 3791419 3697231 3831289 3695892 3896766 3783463 3732432 3482059 3164071 3523081 3719408
3396C719408K7054k48662K08703K7830J40018k03289j51489Q4529k3403J38048
$$ 3719408 3746462 3497800 3706503 3734333 3874351 3671062 3519573 3604102 3580699 3718747
3386C718747p5634j90257J66685J01377j69927l31304M43690P5277L5673j07277
$$ 3718747 3643113 3452856 3619541 3720918 3550991 3219687 3663377 3738654 3774327 3667050
3376C667050M4438L06273j40100j0568j48247l45982j58944j87585K4404J70548
$$ 3667050 3711488 4017761 3877661 3867093 3718846 3372864 3213920 3026335 3050739 3221287
3366C221287q6170q4851M89334p6819l0793P5844j66808J5545k76216M0100r9990
$$ 3221287 3135117 3050266 3539600 3462781 3431988 3507832 3341024 3356569 3080353 3120453 3020463
3355C020463N8894N14083k78984J37634r914J321k02693k49797K06837k13129
$$ 3020463 3079357 3593440 3314456 3452090 3442176 3443497 3240804 2991007 3197844 2984715
3345B984715R1451J0972J6932k14120j99718K37016l7790J2272L8711p09205M99403
$$ 2984715 3076166 3087138 3104070 2889950 2690232 2927248 2889458 2901730 2940441 2231236 2730639
3334B730639j63966m0388J33453L46939q9012k24508Q3099l91620j85304O54017
$$ 2730639 2566673 2526285 2659738 3006677 2917665 2693157 2776256 2384636 2199332 2853349
3324B853349l36402p7017K67085K2952k7504L5340o880o1910p9793j53396k41733
$$ 2853349 2516947 2439930 2707015 2729967 2702463 2737803 2730923 2669013 2589220 2435824 2194091
3313B194091n1216K78190R4777o8311j44277K0785K28435k13617j77829K81613
$$ 2194091 2142875 2421065 2515842 2447531 2303254 2324039 2552474 2338857 2161028 2442641
3303B442641Q3175J48591o7636J04919q1502j19219J96857J38168q9418j36831
$$ 2442641 2525816 2674407 2606771 2711690 2630188 2510969 2707826 2845994 2756576 2619745
3293B619745o7274K8434N4599J9107k12806L86151o2511j44152k2932O856j0542
$$ 2619745 2552471 2580905 2635504 2654611 2441805 2827956 2765445 2621293 2598361 2605217 2594675
3282B594675K68749L32370n85433q02090M03225K90646k2739o1404k40981P02584
$$ 2594675 2863424 3195794 2610361 1808271 2211496 2502142 2479403 2417999 2177018 2879602
3272B879602J39071M9800L66704j25017N5583m50396L42692L69079j21757j31021
$$ 2879602 3018673 3068473 3435177 3310160 3365743 2915347 3258039 3627118 3505361 3374340
3262C374340M60625M42038L36119P7332l8115k74755P3401J72344l86646K52371
$$ 3374340 3834965 4277003 4613122 4690454 4652339 4377584 4450985 4623329 4236683 4489054
3252D489054L70333K51093k74297m99952M1893j86609n57456L50067l09352m72644
$$ 4489054 4859387 5110480 4836183 4336231 4378124 4191515 3634059 3984126 3674774 3202130
3242C202130j27547k93008J62058k05454l38064n0386L4767O5115O9440j67248
$$ 3202130 3074583 2781575 2943633 2738179 2400115 2349729 2384496 2449611 2519051 2351803
3232B351803O3088K34093N3486k49962k8674Q8003j66879K63991n21560l43379
$$ 2351803 2414891 2648984 2702470 2452508 2423834 2511837 2344958 2608949 2087389 1744010
3222A744010J92189l45743J55927M9268r4806k86632k82954R5533K64084J23640
$$ 1744010 1936199 1590456 1746383 1795651 1700845 1414213 1131259 1226792 1490876 1614516
3212A614516l98196N3902K22865l10653K35769q8567m68523m4324k6661K47248
$$ 1614516 1216320 1270222 1493087 1182434 1418203 1329636 861113 816789 790128 1037376
3202A037376L61869n0099L20639J3887n68343k46337j2178J88674P5133J32532
$$ 1037376 1399245 1349146 1669785 1683672 1115329 868992 856814 1045488 1120621 1253153
3192A253153j20243N3262n43128j24816L59105K62204k03089k95750P3366P4596
$$ 1253153 1132910 1186172 643044 518228 877333 1139537 936448 640698 714064 788660
3182G88660J83948j8327l84889J02487J86945j56109k57348L93056J6202j13992
$$ 788660 972608 954281 569392 671879 858824 702715 445367 838423 854625 740633
3172G40633L24361J62477j70878k41907k43632J13266K2892o0977j37715K23599
$$ 740633 1064994 1227471 1056593 814686 571054 684320 707212 646235 508520 732119
3162G32119j19798r4354K828n2093O143J59735p2168K038k79691l53467K64384
$$ 732119 612321 517967 520795 468702 474845 634580 562412 564450 284759 -68708 195676
3151A95676K43221J22287J93626l86131j39777J33649J43570N2252J56622L66312
$$ 195676 438897 561184 754810 368679 228902 362551 506121 558373 714995 1081307
3141A081307k52045M42385j08745n82125k06572K14976J89481j27191k53319M19878
$$ 1081307 829262 1271647 1162902 580777 374205 589181 778662 651471 398152 818030
3131H18030l94335j24255p4946K28230R1130p4763l8189P65295o14505r4213j71556
$$ 818030 423695 299440 224494 452724 543854 469091 430902 1196197 581692 487479 315923
3120C15923k6478K6405K4603L31564j65938M9059j83743L02188J13165k06572
$$ 315923 289445 315850 340453 672017 506079 555138 371395 673583 786748 580176
3110E80176m07133M08304j33707l41050K40413M1121J88154p41260r9387M76880
$$ 580176 173043 581347 447640 106590 347003 388124 576278 -164982 -264369 212511
3100B12511K16321k18762r0932K23071p1283l41623P5167p1293K22059L30718
$$ 212511 428832 210070 119138 342209 270926 -70697 4470 -66823 155236 485954
3090D85954m50990K57254J85080k74715k8721M86661K75855n30013n94805N18490
$$ 485954 34964 292218 477298 202583 173862 660523 936378 406365 -188440 330050
3080C30050N910j31796J91336N23055k59241l58463j89856K03867k18681J5691
$$ 330050 335960 204164 395500 918555 659314 300851 110995 314862 96181 111872
3070A11872J59766k983l65012J38780K10244p1621K53159m1205k35092j35954
$$ 111872 271638 268655 -96357 42423 252667 181046 434205 393000 157908 21954
3060B1954l4553J24238K43748p7314j64397k1111N7880P463j91816K97727P5725
$$ 21954 -12599 111639 355387 278073 113676 92565 150445 157908 -33908 263819 339544
3049C39544l55793Q8273J76705q6793n5253L08825J92273j54131j39554l37402
$$ 339544 -16249 72024 248729 161936 106683 415508 607781 453650 314096 -23306
3039b3306k97028K26784M88262n1268r5266j40523M01091R3941j14222n020k40719
$$ -23306 -320334 -93550 394712 343444 248178 107655 508746 602687 488465 483445 242726
3028B42726R7037J68773m91756o49734N20319N1466J0412M67693Q1108m81131
$$ 242726 339763 508536 16780 -632954 -112635 -61169 -50757 416936 498044 16913
3018A6913j45782J84981O7667k19180l83588M27714M626P9778r0010k20968J4607
$$ 16913 -128869 56112 123779 -95401 -478989 -51275 -46649 33129 -56881 -277849 -263242
3007b63242j38621K35075J57986k85482l83194L24008J69935K86888L9246j65013
$$ -263242 -401863 -166788 -8802 -294284 -677478 -353470 -183535 103353 142599 -22414
2997b2414J77566M06725m14286j33114O4303k0226K74727J16136L6885n90217
$$ -22414 155152 561877 147591 14477 78780 58554 333281 449417 486302 -103915
2987a03915R600O5784J76324O2538l56849K01603J65188o6195m1082K44162L0652
$$ -103915 -94315 -28531 147793 210331 -146518 55085 220273 154078 112996 357158 387810
2976C87810k81944J07210k99030r3428K77969k22565J07638J52203q0213L01145
$$ 387810 105866 213076 -85954 -179382 98587 -123978 -16340 135863 55650 356795
2966C56795M9831l82814M15852k84159Q4271J31527j47083K0898P4892M3872P7889
$$ 356795 406626 23812 439664 155505 239776 371303 224220 245118 320010 363882 441771
2955D41771M2762l16548m62473K68457O59281J90576n3866R2316j05375k39907
$$ 441771 484533 167985 -294488 -26031 633250 823826 769960 862276 756901 516994
2945E16994J27353l43095l59233J88189k5587J2877J12877L16235J17529p719
$$ 516994 644347 301252 -57981 130208 104621 117498 230375 546610 664139 656420
2935F56420l53610K9891M22379l27755k30964L89488p0956k55453j39862O1644
$$ 656420 302810 332701 755080 427325 196361 585849 514893 259440 119578 181222
2925A81222K4481j48096q6736J96316L12272l27971J73202M23386k44638L94617
$$ 181222 205703 57607 -29129 167187 479459 151488 324690 748076 503438 898055
2915H98055j15024j26857j2631l50016J21405O2427O8231o6751o129o1319k6739
$$ 898055 783031 656174 643543 293527 414932 477359 545590 478839 472710 411391 384652
2904C84652J22195P3440k58579M59149k05911l8442j12650J65614j71671p24450
$$ 384652 506847 580287 321708 780857 574946 536504 423854 589468 417797 -306653
2894c06653j4755K76445K23993j51969K14088J12290K40465J13096j77648j184
$$ -306653 -321408 -44963 179030 27061 241149 353439 593904 707000 529352 528168
2884E28168j60142K23078K05532R70j14557K3633l82644p6327k3270R42k47744
$$ 528168 368026 591104 796636 797606 683049 706682 324038 247711 224441 225383 -22361
2873b2361m39154p4775M08326L97201P6624l8437R680l32101L22553K07513J83814
$$ -22361 -461515 -536290 -127964 269237 345861 307424 317104 -14997 307556 515069 698883
2862F98883M4157k33308o0332k35418J26854l79847p0257K4570K11376M61634
$$ 698883 743040 509732 449400 213982 340836 -39011 -109268 -84698 126678 588312
2852E88312k54992l34432l17625J11683P12607J12294k15202k34698J11836K05914
$$ 588312 333320 -1112 -318737 -207054 505553 617847 402645 167947 279783 485697
2842D85697P553O9552l92935m1390j41505m41988J09694L77360O36262k83816
$$ 485697 493250 562802 169867 128477 -13028 -455016 -345322 32038 668300 384484
2832C84484j41635K05479j99093l1755J75549l13820l84242M02671K20592k31700
$$ 384484 242849 448328 249235 217480 393029 79209 -305033 97638 318230 86530
2822H6530p5230j98968j53636J44916k22105J90067M83663J76488j32767k06609
$$ 86530 11300 -187668 -341304 -196388 -418493 -228426 255237 431725 298958 92349
2812I2349j98698o5051M39601K14372q5442q4594m08062J72484P20616j97570
$$ 92349 -106349 -171400 268201 482573 397131 312537 -95525 76959 797575 600005
2802F00005p48364l20635K62276K0635L28589j00216l86773l36619J64634J23654
$$ 600005 -148359 -468994 -206718 -186083 142506 42290 -344483 -681102 -516468 -392814
2792c92814R3492j10740J34479R6305M460N9019p8688o7784L18942J98307J95893
$$ -392814 -299322 -410062 -275583 -179278 -174818 -115799 -194487 -262271 56671 254978 450871
2781D50871l36212j76556K81590l54830k30503J95083O2301O2754j0421Q8607
$$ 450871 114659 -61897 219693 -135137 -365640 -170557 -108256 -45502 -55923 32684
2771C2684K48599k7187N5322k31053o07809k6970N81492K8622n37609k75284N62013
$$ 32684 281283 254096 309418 78365 -529444 -556414 25078 53700 -483909 -759193 -197180
2760a97180M58775L22745k95227k95601j83504M3686N08514J78069J56488J89029
$$ -197180 261595 584340 289113 -6488 -189992 -146306 362208 540277 696765 885794
2750H85794l03184m78546P8706o9751k29519J77111k0028k90342J83096M3227
$$ 885794 582610 104064 182770 113019 -116500 60611 40583 -249759 -66663 -23436
2740b3436L90986M1295k05444P8948k10883m15668J36079Q6133o85297L56350
$$ -23436 367550 408845 203401 282349 71466 -344202 -208123 -121990 -807287 -450937
2730d50937K33183K49571m10809M21735r598J690J32795J8848m5158o3755m1356
$$ -450937 -217754 31817 -378992 42743 33145 34835 167630 186478 141320 77565 36209
2719C6209J08744k56229j41558K46434j48610k82892O8922L03698k32508m79057
$$ 36209 144953 -111276 -252834 -6400 -155010 -437902 -368980 -65282 -297790 -776847
2709g76847m0965O38768p3992K50793j14192n87573J21974J44508j60394L25602
$$ -776847 -817812 -179044 -253036 -2243 -116435 -704008 -582034 -437526 -597920 -272318
2699b72318K54096j368j4768l77819M30809Q1016m18461K93004O9082j26163Q4030
$$ -272318 -18222 -19590 -34358 -412177 18632 99648 -318813 -25809 43273 -82890 1140
2688A140M7288j10845K8334j86082n4901O8198M41379q5080m16894R5701J24595
$$ 1140 48428 -62417 -34083 -220165 -275066 -206868 234511 149431 -267463 -171762 -47167
2677d7167l05745P3000q1548K16736q5405K08807j6026l85361J10614K82561K80360
$$ -47167 -352912 -279912 -361460 -144724 -230129 -21322 -37348 -422709 -312095 -29534 250826
2666B50826l40818k58147k9562M44734o1976J1975o10288p9612P69951l47312
$$ 250826 -89992 -348139 -377701 67033 5057 17032 -593256 -672868 97083 -250229
2656b50229o6614j35211n9261K46065J18203o3970O2316N2818k67900J67546J4233
$$ -250229 -316843 -452054 -511315 -265250 -147047 -211017 -148701 -95883 -363783 -196237 -182004
2645a82004j87361L02613n3034l92215R7033K35850L00112k23690j21987l34829
$$ -182004 -369365 -66752 -119786 -512001 -414968 -179118 120994 -102696 -224683 -559512
2635e59512R6287J89913j79207L57594j16778P41610O7919m15603k98959J0229
$$ -559512 -463225 -273312 -452519 -94925 -211703 529907 597826 182223 -116736 -106507
2625a06507J43210j30145M79804k18520k04373J37982k9857m0k85334L4636j15848
$$ -106507 36703 -93442 386362 167842 -36531 101451 71594 71554 -213780 -179144 -294992
2614b94992J57539j07642L80469k49147m4776j3564J66745J52483n15287J76279
$$ -294992 -137453 -245095 135374 -113773 -158549 -172113 -5368 147115 -368172 -191893
2604a91893j03316l7862R4715L01978J06947m60593k4855N15615m9285j94964
$$ -191893 -295209 -333071 -238356 63622 170569 -290024 -314879 200736 151451 -43513
2594d3513J23194k72986o7991N1972j60624K94298p9290L03666j48382L8436J4593
$$ -43513 79681 -193305 -261296 -209324 -369948 -75650 -154940 148726 344 38780 53373
2583E3373J71905k82505j39869J36424j81368j4161J2226L60656l27353J86312
$$ 53373 225278 -57227 -197096 -60672 -242040 -256201 -243975 116681 -210672 -24360
2573b4360M15857l22780L89086q0731k21281K05481k52535J44024j26715n2889
$$ -24360 391497 68717 457803 377072 155791 361272 108737 252761 126046 73157
2563G3157K51600l23206J3790J89484j23358k7210M7280k96850L27865o60895
$$ 73157 324757 1551 15341 204825 81467 54257 101537 -195313 132552 -528343
2553e28343j1628n850M14840N86939m58360l8018j32770J26367J25759n0000Q3929
$$ -528343 -539971 -545821 -130981 455958 -2402 -40420 -173190 -46823 78936 28936 112865
2542A12865k855l43948k69024M30144Q2433Q6403k16753M7504L6875L98054N0497
$$ 112865 110010 -233938 -502962 -72818 9615 96018 -120735 -73231 -36356 361698 412195
2531D12195l05282R0387n04513j65515L93948j65091M20231J71764m25389J35700
$$ 412195 106913 197300 -307213 -472728 -78780 -243871 176360 348124 -77265 58435
2521E8435k67896p5067L33141l4998P1684N5512l52493J22746k75208K73636K7997
$$ 58435 -209461 -284528 48613 13615 85299 140811 -211682 -88936 -364144 -90508 -62511
2510f2511j14714l40045k13664K58336K27397r5599K28914j80355J25110L08972
$$ -62511 -177225 -517270 -730934 -472598 -245201 -340800 -111886 -292241 -167131 141841
2500A41841j69123l45590K34717l6772K27052j2534j75857R3463k24309p1475
$$ 141841 -27282 -372872 -138155 -174927 52125 39591 -136266 -42803 -267112 -338587
2490c38587q8848O4613M93734K87261o34769r6488j14696j52791K32906N4285
$$ -338587 -427435 -362822 130912 418173 -216596 -313084 -427780 -580571 -347665 -293380
2480b93380K77071k30211K02155k55150J84790L06692k63938l05041J59154J54000
$$ -293380 -16309 -246520 -44365 -299515 -114725 191967 -71971 -377012 -217858 -63858
2470f3858J66820Q9121j63411q2341k66018R1284j05662J81623P855l08491k31608
$$ -63858 102962 192083 28672 -53669 -319687 -228403 -334065 -152442 -144587 -453078 -684686
2459f84686J72057M0975J63717K71450j97235j29079j73641L25433N5033j62299
$$ -684686 -512629 -471654 -307937 -36487 -233722 -362801 -536442 -211009 -155976 -318275
2449c18275N58495J00150o44674n752K77981j4490m43046K13993Q7545l42122
$$ -318275 240220 340370 -304304 -310056 -32075 -46565 -489611 -275618 -188073 -530195
2439e30195L36332K14358k34038J26951K52967L5292l50104l61406K32176k91821
$$ -530195 -193863 20495 -213543 -86592 166375 201667 -148437 -509843 -277667 -569488
2429e69488L45184J19493k87123J03170N41384K53190m31406O9033j55568j90818
$$ -569488 -224304 -104811 -391934 -288764 252620 505810 74404 143437 -12131 -202949
2419b02949J13595M3824J0666K41458o5690l5139j14859k64568j61888L0788K87230
$$ -202949 -89354 -45530 -34864 206594 140904 105765 -9094 -273662 -435550 -404762 -117532
2408a17532k33460J96167N33308J70641m81166j3812L3724K03341j34132K48841
$$ -117532 -350992 -154825 378483 549124 67958 54146 87870 291211 157079 405920
2398D05920k85983K09013j39606j43992L27056M2312r3079J04558K1130J26424
$$ 405920 119937 328950 189344 45352 372408 414720 321641 426199 447329 573753
2388E73753K10433K13402l35042k11063R0620L31708K23355r1700k13170M24757
$$ 573753 784186 997588 662546 451483 542103 873811 1097166 1005466 792296 1217053
2378A217053o6254k42869m44757l86019L17131q9644J54485k05611j57997P6968
$$ 1217053 1150799 907930 463173 77154 394285 304641 459126 253515 95518 172486
2368A72486J03896p8159J97770j44890K3402O3226J96714j0223j63452J01968
$$ 172486 276382 198223 395993 251103 274505 337731 534445 524222 360770 462738
2358D62738L38995k97998n5624L21332O1212l02733m50060J68144J62587m51894
$$ 462738 801733 503735 448111 769443 830655 527922 77862 246006 408593 -43301
2348d3301J92700Q0722L70256J136j44953k10776k40626l9566R6594K89867l29862
$$ -43301 149399 230121 600377 601513 456560 245784 5158 -34408 62186 352053 22191
2337B2191O3735q8825J87322P15982k23388j74551k9355k62411K23612j02286
$$ 22191 85926 -2899 184423 900405 677017 502466 473111 210700 434312 332026
2327C32026p2378K90203j70690K23508n0782k75888m15364q8434J48016O86341
$$ 332026 259648 549851 379161 602669 551887 275999 -139365 -227799 -79783 606558
2317F06558K3605j38880k64685k80291k5498K44722K60648J7742Q8628l3372J43387
$$ 606558 630163 491283 226598 -53693 -79191 165531 426179 443921 532549 499177 642564
2306F42564J76787l00148m43042K10267l40503J12729k40941p8294J97381K45782
$$ 642564 819351 519203 76161 286428 -54075 58654 -182287 -260581 -63200 182582
2296A82582J54020k4617K11031j68678o5987M20567l53248K18450J00004l08199
$$ 182582 336602 311985 523016 354338 288351 708918 355670 574120 674124 365925
2286C65925J87445p4897j41232L95613M650M8788L15067j43725k85257q215Q5157
$$ 365925 553370 478473 337241 732854 737504 786292 1101359 957634 672377 664162 749319
2275G49319L7893J12913m6285J89640p8081O7391k49615q6032N5940q9730P8792
$$ 749319 787212 900125 853840 1043480 965399 1032790 783175 697143 753083 663353 742145
2264G42145o1733K11464k9600l40011K2824k56418R9477L50944K02147N28158
$$ 742145 680412 891876 862276 522265 545089 288671 388148 739092 941239 1469397
2254A469397m46455j56747L48802l92370L67628j87116k13781O66982j28884k7694
$$ 1469397 1022942 866195 1214997 822627 1190255 1003139 789358 1456340 1327456 1299762
2244A299762k8278k4207L1702L5975k89515k14819p5339j15781M17899L37627
$$ 1299762 1271484 1247277 1278979 1314954 1025439 810620 735281 619500 1037399 1375026
2234A375026J21007N1647J9098k70821m72372j20079M20871L16945J54551M4934
$$ 1375026 1496033 1547680 1566778 1295957 823585 703506 1124377 1441322 1595873 1640807
2224A640807j3034o7674L29027J69459j56401j33799M7414J54967l1109J24983
$$ 1640807 1627773 1560099 1889126 2058585 1902184 1768385 1815799 1970766 1939657 2064640
2214B064640K0362j54015Q983j47984k12329M900J2932M90426L69992m84461j71847
$$ 2064640 2085002 1930987 1939970 1791986 1579657 1584557 1597489 2087915 2457907 1973446 1801599
2203A801599L85248l23441K9125J03510M68927J50582J92488M09127L80403M46686
$$ 1801599 2186847 1863406 1892531 1996041 2464968 2615550 2808038 3217165 3597568 4044254
2193D044254j51759m1885m048L12303m4136j86280J5078J79397Q9110l70721K72161
$$ 4044254 3892495 3850610 3846562 4158865 4114729 3928449 3943527 4122924 4212034 3841313 4113474
2182D113474j13979j52963N48225K48847p0523J28752n367j84640j63323p2821
$$ 4113474 3999495 3846532 4394757 4643604 4573081 4701833 4696466 4511826 4348503 4275682
2172D275682N36445L71601M41307o63710J52939K66990M064M85006P50708l6032
$$ 4275682 4812127 5183728 5625035 4961325 5114264 5381254 5385318 5870324 6621032 6585000
2162F585000N6993M1231R1333M70674n09453K87763K34703N6599k25128L64466
$$ 6585000 6641993 6683224 6774557 7245231 6735778 7023541 7258244 7314843 7089715 7454181
2152G454181M40734L16921l0251L26671P30024O81778O82301M50997O1688M10065
$$ 7454181 7894915 8211836 8181585 8508256 9238280 9920058 10602359 11053356 11115044 11525109
2142A1525109J361326J186273M60396J209093J452318J341521K072571J485017
$$ 11525109 12886435 14072708 14533104 15742197 17194515 18536036 20608607 22093624
2134B2093624J657532K137786K235652K462121K878879L388232L332332L064033
$$ 22093624 23751156 25888942 28124594 30586715 33465594 36853826 40186158 43250191
2126D3250191M304105M693106N916073O554994P741438R585918J0713291J1438151
$$ 43250191 47554296 52247402 58163475 64718469 72459907 82045825 92759116 104197267
2118A04197267J4144868J7343856J9991425K5053787L2784915K2163697j4503382
$$ 104197267 118342135 135685991 155677416 180731203 213516118 235679815 221176433
2111B21176433m1953933l8362645k5999741j8618801j3683417j1816184r581055
$$ 221176433 179222500 140859855 114860114 96241313 82557896 70741712 61160657
2104F1160657p587923n197872m177862l012301k672291j952333k011059k652821
$$ 61160657 53572734 48374862 44197000 41184699 38512408 36560075 34549016 31896195
2096C1896195k972556k930224k097029j167502j740945p48876j211833q25442
$$ 31896195 28923639 25993415 23896386 22728884 20987939 20239063 19027230 18201788
2088A8201788p87057o36934o16187o16547l85820m90415n48664r5654m32629o73994
$$ 18201788 17414731 16777797 16161610 15545063 15159243 14668828 14120164 14024510 13591881 12917887
2078A2917887k83484n79056q84591k66080o737q47049M5863m51956l92313n17354
$$ 12917887 12634403 12055347 11170756 10904676 10897939 10050890 10096753 9644797 9252484 8735130
2068H735130k76667j94527o9793l58412n53859n04613l12054j88441J60291k57848
$$ 8735130 8458463 8263936 8194143 7835731 7281872 6777259 6465205 6276764 6437055 6179207
2058F179207K0312K05684n37197j24419J33024k92310N4812k91119l02425Q5411
$$ 6179207 6199519 6405203 5868006 5743587 5876611 5584301 5639113 5347994 5045569 5130980
2048E130980J36714L3500k76586K28443k69235p3913q5223l28741j3600n0471
$$ 5130980 5267694 5301194 5024608 5253051 4983816 4909903 4824680 4495939 4482339 4431868
2038D431868k55491k68172K52348l90431j98001K64241m11751j99383j02029j32589
$$ 4431868 4176377 3908205 4160553 3770122 3572121 3836362 3424611 3225228 3123199 2990610
2028B990610m0106M21701J29318J22595N6580m23320k7123J29986j73762L385
$$ 2990610 2950504 3372205 3501523 3624118 3680698 3257378 3230255 3360241 3186479 3189864
2018C189864L4435j28978n63717K57118J78239j10844n1747k08865N1119k61700
$$ 3189864 3224299 3095321 2531604 2788722 2966961 2856117 2804370 2595505 2646624 2384924
2008B384924k25722n1504K45840l03947l41158J89180k6100l35914K13443J15526
$$ 2384924 2159202 2107698 2353538 2049591 1708433 1897613 1871513 1535599 1749042 1864568
1998A864568J31764J34226j78833m62379J16795l88205L0899R4845M07677J40938
$$ 1864568 1996332 2130558 1951725 1489346 1606141 1217936 1248835 1343680 1751357 1892295
1988A892295j99233j78254n31103n4505j2038k63012K30816k26201J88507J32994
$$ 1892295 1693062 1514808 983705 929200 917162 654150 884966 658765 847272 980266
1978I80266K18639j71200j17455K43312k66583O2597j04264L5470j1010k18273
$$ 980266 1198905 1027705 910250 1153562 886979 949576 845312 880782 869772 651499
1968F51499O00057r1160j79344J52705l24879K13495l96038J58025J22290j73729
$$ 651499 1251556 1160396 981052 1133757 808878 1022373 626335 784360 906650 732921
1958G32921L6748o1089j18720J16193L5276k37524l72595L15034L1296k03996
$$ 732921 769669 708580 589860 706053 741329 503805 131210 446244 477540 273544
1948B73544K70175L76753m01729k07338j50883K6093M02430J47411N21j68472
$$ 273544 543719 920472 518743 311405 160522 186615 589045 736456 736977 568505
1938E68505k80923J79118j39723k24927m4772J30298M1111J11494N80544J04308
$$ 568505 287582 466700 326977 102050 57278 187576 228687 340181 920725 1025033
1928A025033J5734m02586M0243o5048j11719K2504L8287j4925J72963J68250l39091
$$ 1025033 1040767 638181 678424 613376 501657 524161 562448 547523 720486 888736 549645
1917E49645J96107k18069r7562L11014k36638j44059K92653l2615j4608l70884
$$ 549645 745752 527683 430121 741135 504497 360438 653091 620476 605868 234984
1907B34984k26227N04202P5447j20841R6763l2672J87231k4384j15478o0770K03087
$$ 234984 8757 512959 588406 467565 564328 531656 718887 694503 579025 518255 721342
1896G21342p0537R198k85653P4383J62805q947K5838J7257J05151j43564k74941
$$ 721342 650805 660003 374350 448733 611538 602591 628429 645686 750837 607273 332332
1885C32332K4165J38677k11937K2978J33569O8699L18235m22447R406j89844P7167
$$ 332332 356497 495174 283237 306215 439784 508483 826718 404271 413677 223833 301000
1874C01000n4096J94685J07677l41575K25922j38911j8526l3461J41544j06387
$$ 301000 246904 441589 549266 207691 433613 294702 276176 242715 384259 277872
1864B77872l887J03713j23092k56677L05747O04131m9686n70493J65057K69561
$$ 277872 273985 377698 254606 -2071 303676 907807 858121 287628 452685 722246
1854G22246J32376k48229J08771L79001P8869m02732M3703K15284J62439j98027
$$ 722246 854622 606393 715164 1094165 1173034 770302 814005 1029289 1191728 993701
1844I93701L98221p5554m91307k20644L43264R1321j7877m47801k55686o0207
$$ 993701 1391922 1316368 825061 604417 947681 1039002 1021125 573324 317638 257431
1834B57431K34820P04638m22626q945l4844j04549k36913k31255Q2135R214k61512
$$ 257431 492251 1196889 774263 765318 730474 625925 389012 157757 239892 249106 -12406
1823a2406J78962K88716J20896q0021j10288m676J91762k70135j31643M4403k72682
$$ -12406 166556 455272 576168 496147 385859 381183 572945 302810 171167 215570 -57112
1812e7112K65112K19004J29523k5843J58731l60542k38476k36072j99250R184
$$ -57112 208000 427004 556527 530684 689415 328873 90397 -145675 -344925 -335741
1802c35741Q128O7482J73860M6495Q7649L88550P6345O6084k79235L12404n5628
$$ -335741 -327613 -260131 -86271 -39776 47873 436423 512768 578852 299617 612021 556393
1791E56393k79066j60818j07503J30858Q0901l40138m54032P28564J38104k97154
$$ 556393 277327 116509 9006 139864 220765 -119373 -573405 155159 293263 -3891
1781c891J93863J59001J76863j11912m0473k54865O026J97412L0139l18424L9403
$$ -3891 189972 348973 525836 413924 373451 118586 124612 322024 352163 33739 73142
1770G3142l0657p8690K55667J5620j87881n7150j9751j11639K49096l86014K5486
$$ 73142 42485 -36205 219462 235082 47201 -9949 -29700 -141339 107757 -278257 -252771
1759b52771K10856O1581K26842m90806k5987K38841l85208J30810J03544K60217
$$ -252771 -41915 19666 246508 -244298 -270285 -31444 -416652 -285842 -182298 77919
1749G7919j36506j48616L0550J98038P723K66660k22799m32527L59079J99756
$$ 77919 -58587 -207203 -176653 21385 29108 295768 72969 -359558 -479 199277
1739A99277j95134R4535O13472l11316l47171J51748K77863j7542k69085M9734
$$ 199277 4143 98678 712150 400834 53663 205411 483274 465732 196647 246381
1729B46381j61050M5941j32036J49207Q4185l58027q9562j50429j48655L75611
$$ 246381 85331 131272 -764 148443 232628 -125399 -214961 -365390 -514045 -138434
1719a38434l0774j94992K05863l98231N05923J77233J43153j68301j20623m8869
$$ -138434 -169208 -364200 -158337 -556568 -50645 126588 269741 101440 -19183 -68052
1709f8052J22350K28572n8617l1786M780O6425j06052l29916J24807k4992l30563
$$ -68052 54298 282870 224253 192467 197247 263672 157620 -172296 -47489 -72481 -403044
1698d03044L4513o7688K81256j32597k33755J07199N15385p0703k46090J48140
$$ -403044 -368531 -436219 -154963 -287560 -521315 -414116 101269 30566 -215524 -67384
1688f7384j57488K92612m35782m3520J91412M0109L57861K19179k25812M5567
$$ -67384 -224872 67740 -368042 -411562 -220150 -180041 177820 396999 171187 216754
1678B16754J03942j4738k45990n25987j08646j15109M68313r6462R4925L24801
$$ 216754 320696 305958 59968 -466019 -574665 -689774 -221461 -317923 -222998 101803
1668A01803l35375O0110J2221R685M1685M05563j21813m71177K11270L83688k68768
$$ 101803 -233572 -173462 -161241 -151556 -109871 295692 173879 -297298 -86028 297660 28892
1657B8892J95881K81826m46179l73108O0246P8432K22005l3387o1942R9615k38810
$$ 28892 224773 506599 60420 -312688 -252442 -174010 47995 14608 -47334 52281 -186529
1646a86529n6605J81666J98092o9953n1152k7410J34368n7448k49160O1051R2518
$$ -186529 -243134 -61468 136624 66671 15519 -11891 122477 65029 -184131 -123080 -30562
1635c0562n68648N28010K55454k37445K51022n70630K4270N00362N6870j44545
$$ -30562 -599210 -71200 184254 -53191 197831 -372799 -348529 151833 208703 64158
1625F4158J8797Q3680m3225P3774j34708q6346K2737K06592j89061J44070L30595
$$ 64158 82955 166635 123410 197184 62476 -23870 -1133 205459 16398 160468 491063
1614D91063k18949k20669m8180J5079R0670j83848j36546J13801J51979L8354
$$ 491063 272114 51445 3265 18344 109014 -74834 -211380 -97579 54400 92754
1604I2754k22433Q7733J87773q0315Q8208j86104P6300q007J1147P7364j64550
$$ 92754 -129679 -41946 145827 65512 153720 -32384 43916 35909 47056 124420 -40130
1593d0130J28646k73333K12343J60710k00939j29038P7213n3991r6782J5028M9180
$$ -40130 88516 -184817 27526 188236 -12703 -141741 -64528 -118519 -215301 -200273 -151093
1582a51093L1163K03507j6114k13934J03467R8202Q8663K4560k40453P4406j25012
$$ -151093 -119930 83577 67463 -146471 -43004 55198 143861 168421 -72032 2374 -122638
1571a22638l80960J40047N5507J25651J32935L59789l5647k84445k83216P0324
$$ -122638 -503598 -363551 -308044 -182393 -49458 310331 274684 -9761 -292977 -222653
1561b22653O3206K04849k19455j91667N99840J75190j83021l7405m72831K34601
$$ -222653 -159447 45402 -174053 -365720 234120 409310 226289 188884 -283947 -49346
1551d9346K40577m07207o9895K31279r1320M9957L7786P0728j87510k71448j82437
$$ -49346 191231 -215976 -285871 -54592 -145912 -95955 -58169 12559 -174951 -446399 -628836
1540f28836r8416N43510K38283k11749q952j63935K84801j6517j16216J22155
$$ -628836 -727252 -183742 54541 -157208 -166160 -330095 -45294 -61811 -178027 -55872
1530e5872L4587j56147K68150j97490j96013J86934k33007J89866k58711K71153
$$ -55872 -21285 -177432 90718 -106772 -302785 -115851 -348858 -158992 -417703 -146550
1520a46550Q7333l12137j23819M12450o6735l26319L30840J75083j34337O3674
$$ -146550 -59217 -371354 -495173 -82723 -149458 -475777 -144937 30146 -104191 -40517
1510d0517j4395j44777M54843k46217j89958L60846l98268K24233K8348m106k49661
$$ -40517 -54912 -199689 255154 8937 -181021 179825 -218443 5790 34138 30032 -219629
1499b19629P700K11030Q1858k80426j31965R3255N36461k65555l7777L84809j55804
$$ -219629 -211929 -899 80959 -199467 -331432 -238177 298284 32729 -5048 379761 223957
1488B23957J289j99928P1903l85660l98319N08605K73385k57161k27929J01458
$$ 223957 225246 25318 97221 -288439 -686758 -178153 95232 -161929 -389858 -288400
1478b88400R6068L29413k50152J4891M60770l31865J78439o8711q8350o8549o6923
$$ -288400 -192332 137081 -113071 -98180 362590 30725 209164 140453 52103 -16446 -83369
1467h3369m8151k38765M93380M3977K21258p4538j46522k15778n79130M01076
$$ -83369 -131520 -370285 123095 167072 388330 313792 167270 -48508 -627638 -226562
1457b26562o6607n0032K21050p8052K40830k26559n00274L19679M73688J31591
$$ -226562 -293169 -343201 -122151 -200203 40627 -185932 -686206 -366527 107161 238752
1447B38752m33424L71743m40647O3922L62129J07648j48776m55128M725K90469
$$ 238752 -194672 177071 -263576 -199654 162475 270123 121347 -333781 -329056 -38587
1437c8587P9903M4921J53675n01225R9364K27171K96407l04846L1952J0058n04018
$$ -38587 41316 86237 239912 -261313 -161949 65222 361629 56783 88735 98793 -405225
1426d05225M87854L1223l36140K17364n7181j03879M01495K32219n13771J15080
$$ -405225 82629 113852 -222288 -4924 -62105 -165984 235511 467730 -46041 69039
1416F9039j52294K92234K4853q5967j37729l44249k66399l15640R09073K21215
$$ 69039 -83255 208979 233832 147865 10136 -334113 -600512 -916152 -7079 214136
1406B14136m16041K69668r6326k79348k18698J95371L85651l94384l12081J75376
$$ 214136 -201905 67763 -28563 -307911 -526609 -331238 54413 -339971 -652052 -476676
1396d76676j07808j7785N85975L8437R525j9435l20325J98766N6853Q3419k77302
$$ -476676 -584484 -602269 -16294 22143 31668 12233 -308092 -109326 -52473 30946 -246356
1385b46356n4737O0635j6600M3847K3814J71127K56351k10897n34873K47995L14147
$$ -246356 -301093 -240458 -257058 -213211 -189397 -18270 238081 27184 -507689 -259694 54453
1374E4453J63523m5321j84434J33573M05710m66911m62606K41027R9209k15015
$$ 54453 217976 172655 -11779 121794 527504 60593 -402013 -160986 -61777 -276792
1364b76792R735R1274L11351l34859K05347j86436j52256M14646P4076j06277
$$ -276792 -267057 -175783 135568 -199291 6056 -180380 -332636 82010 156086 49809
1354D9809l65337M64564j14609l97561K31904J22304j64227l88196J84110K28154
$$ 49809 -315528 149036 34427 -363134 -131230 -8926 -173153 -561349 -377239 -149085
1344a49085P1136j361k3203j60919R0648k35209M51429J16145m35604q1756r5243
$$ -149085 -77949 -79310 -102513 -263432 -172784 -407993 43436 159581 -276023 -357779 -453022
1333d53022J88711M72072K64102k25565l52211P5619O2175r700l32489K72813
$$ -453022 -264311 207761 471863 246298 -105913 -30294 31881 22181 -310308 -37495
1323c7495K35935l4401L58076l14134k15856J80253J07916p1765j33714j72962
$$ -37495 198440 164039 522115 207981 -7875 172378 280294 208529 74815 -98147
1313i8147p2352J99535K98544L3203k86315o9605n37417j47636L82802Q4390j5245
$$ -98147 -170499 29036 327580 360783 74468 4863 -532554 -680190 -297388 -212998 -228243
1302b28243l29069M45235K3156k27070J14434N25335n1893L7803k08877o2294
$$ -228243 -557312 -112077 -88921 -315991 -201557 323778 271885 309688 100811 38517
1292C8517k3759j70012J71840R5683m8909j43104M6600J72060N7706r8001r6506
$$ 38517 14758 -155254 16586 112269 63360 -79744 -33144 138916 196622 98621 2115
1281B115K50805k55356j05034M90701l70103j54537j09119K68885K45134l0185
$$ 2115 252920 -2436 -107470 383231 13128 -141409 -250528 18357 263491 233306
1271B33306o18558k29056P20796j18798K3811L5403m69282L43791N3567j04076
$$ 233306 -385252 -614308 106488 -12310 11501 46904 -422378 -78587 -25020 -129096
1261a29096j32807k27139L26138M4227P15738k80216o46955J63754N43864k08101
$$ -129096 -261903 -489042 -162904 -118677 597061 316845 -330110 -166356 377508 169407
1251A69407o05916J58648K70839l43125j28988L70668k8367o8272J73098r8032
$$ 169407 -436509 -277861 -7022 -350147 -479135 -108467 -136834 -205106 -32008 -130040
1241a30040m10660L14540J50861J6740k71983M3489l3730l1324L22133l79959
$$ -130040 -540700 -226160 -75299 -58559 -330542 -287053 -320783 -352107 -29974 -409933
1231d09933J7600Q648j9299Q8863K12076J79070j78305O9662K72101j38652j02758
$$ -409933 -392333 -383685 -402984 -314121 -102045 77025 -101280 -31618 240483 101831 -927
1220i27k62269J18803Q0097K78088k42608m12629j44229K99642j3927K19319J4436
$$ -927 -263196 -144393 -64296 213792 -28816 -441445 -585674 -286032 -299959 -80640 -66204
$$ [...]
##END NTUPLES=NMR SPECTRUM
##END=
