##TITLE=1H_EC-3267(1-2)
 CDCl3
 8 sc, 
 9.11.2021
##JCAMPDX= 6.0         $$ Bruker NMR JCAMP-DX V2.0
##DATA TYPE= NMR SPECTRUM
##DATA CLASS= NTUPLES
##ORIGIN= UXNMR, Bruker Analytische Messtechnik GmbH
##OWNER= root
$$ XWIN-NMR		Version 3.5
$$ Tue Nov  9 11:10:50 2021 Russian Standard Time (UT+4h)  she@DPX200
##.OBSERVE FREQUENCY= 200.1313468511
##.OBSERVE NUCLEUS= ^1H
##.ACQUISITION MODE= SIMULTANEOUS
##.ACQUISITION SCHEME= undefined
##.AVERAGES= 8
##.DIGITISER RES= 18
##SPECTROMETER/DATA SYSTEM= spect
##.PULSE SEQUENCE= zg30
##.SOLVENT NAME= D2O
##.SHIFT REFERENCE= (INTERNAL, D2O, 0, 15.7238)
##AUDIT TRAIL= $$ (NUMBER, WHEN, WHO, WHERE, WHAT)
$$ ##TITLE= Audit trail, XWIN-NMR		Version 3.5
$$ ##JCAMPDX= 5.01
$$ ##ORIGIN= Bruker BioSpin GmbH
$$ ##OWNER= she
$$ F:/spectra/data/she/nmr/H-F/1/pdata/1/auditp.txt
$$ ##AUDIT TRAIL=  $$ (NUMBER, WHEN, WHO, WHERE, WHAT)
(   1,<2021-11-09 11:09:31.62 +0400>,<she>,<DPX200>,
      <created by zg, POWCHK disabled, PULCHK disabled
       configuration hash MD5:
       00 E9 B6 7A A2 85 ED C7 34 08 36 98 17 FE 4E 26
       data hash MD5: 16K
       FE 2D F5 32 32 F7 DD 3E 85 A1 41 A3 2B 20 85 CD>)
(   2,<2021-11-09 11:09:33.92 +0400>,<she>,<DPX200>,
      <Start of raw data processing
       efp BC_mod = 2 LB = 0.24 FT_mod = 6 PKNL = 1 PHC0 = -15511.54 PHC1 = 11.40082 SI = 16K 
       data hash MD5: 16K
       74 55 F7 33 6F AB 49 92 92 81 B5 FF 37 D0 89 44>)
(   3,<2021-11-09 11:09:51.09 +0400>,<she>,<DPX200>,
      <pk PHC0 = 1.803148 PHC1 = -1.6 
       data hash MD5: 16K
       4A E6 34 13 56 EF 5B 7A 94 AC 5E A6 58 1B 92 1E>)
(   4,<2021-11-09 11:09:54.56 +0400>,<she>,<DPX200>,
      <abs ABSG = 5 
       data hash MD5: 16K
       40 CD E9 9A 62 D6 7B 27 1D 2F 04 59 57 59 36 EE>)
$$ ##END=
$$ 
$$ hash MD5
$$ 26 62 26 9C EE C7 AB BC AB 33 48 E7 0C 55 21 58
##$RELAX= 
##$RELAX= 
##$RELAX= 
##$RELAX= 
##$RELAX= 
##$RELAX= 
$$ Bruker specific parameters
$$ --------------------------
##$DU= <F:/spectra>
##$EXPNO= 1
##$NAME= <H-F>
##$PROCNO= 1
##$TYPE= <nmr>
##$USER= <she>
##$AMP= (0..31)
100 100 100 100 100 100 100 100 100 100 100 100 100 100 100 100 100 100 
100 100 100 100 100 100 100 100 100 100 100 100 100 100 
##$AQSEQ= 0
##$AQ_mod= 1
##$AUNM= <au_zg>
##$AUTOPOS= <>
##$BF1= 200.13
##$BF2= 200.13
##$BF3= 200.13
##$BF4= 200.13
##$BF5= 200.13
##$BF6= 200.13
##$BF7= 200.13
##$BF8= 200.13
##$BYTORDA= 1
##$CFDGTYP= 0
##$CFRGTYP= 5
##$CHEMSTR= <none>
##$CNST= (0..31)
1 1 145 1 1 1 1 1 1 1 1 1 1 1 1 1 1 1 1 1 1 1 1 1 1 1 1 1 1 1 1 1 
##$CPDPRG= <>
##$CPDPRG1= <>
##$CPDPRG2= <>
##$CPDPRG3= <>
##$CPDPRG4= <mlev>
##$CPDPRG5= <mlev>
##$CPDPRG6= <mlev>
##$CPDPRG7= <mlev>
##$CPDPRG8= <mlev>
##$CPDPRGB= <>
##$CPDPRGT= <>
##$D= (0..31)
0 1.2 0 0 0 0 0 0 0 0.06 0 0.03 0 0 0 0 0.0002 0 0 0 0 0 0 0 0 0 0 0 0 
0 0 0 
##$DATE= 1636441770
##$DBL= (0..7)
120 120 120 120 120 120 120 120 
##$DBP= (0..7)
150 150 150 150 150 150 150 150 
##$DBP07= 0
##$DBPNAM0= <>
##$DBPNAM1= <>
##$DBPNAM2= <>
##$DBPNAM3= <>
##$DBPNAM4= <>
$$ [...]
##$SUBNAM2= <"">
##$SUBNAM3= <"">
##$SUBNAM4= <"">
##$SUBNAM5= <"">
##$SUBNAM6= <"">
##$SUBNAM7= <"">
##$SUBNAM8= <"">
##$SUBNAM9= <"">
##$SW= 18.0517286264689
##$SWIBOX= (0..15)
0 0 2 0 0 0 0 0 0 0 0 0 0 0 0 0 
##$SW_h= 3612.71676300578
##$TD= 16384
##$TD0= 1
##$TE= 0
##$TE2= 300
##$TE3= 300
##$TEG= 300
##$TL= (0..7)
0 120 120 120 120 120 120 120 
##$TP= (0..7)
150 150 150 150 150 150 150 150 
##$TP07= 0
##$TPNAME0= <>
##$TPNAME1= <>
##$TPNAME2= <>
##$TPNAME3= <>
##$TPNAME4= <>
##$TPNAME5= <>
##$TPNAME6= <>
##$TPNAME7= <>
##$TPOAL= (0..7)
0.5 0.5 0.5 0.5 0.5 0.5 0.5 0.5 
##$TPOFFS= (0..7)
0 0 0 0 0 0 0 0 
##$TUNHIN= 0
##$TUNHOUT= 0
##$TUNXOUT= 0
##$USERA1= <user>
##$USERA2= <user>
##$USERA3= <user>
##$USERA4= <user>
##$USERA5= <user>
##$V9= 5
##$VALIST= <valist>
##$VCLIST= <CCCCCCCCCCCCCCC>
##$VD= 0
##$VDLIST= <DDDDDDDDDDDDDDD>
##$VPLIST= <PPPPPPPPPPPPPPP>
##$VTLIST= <TTTTTTTTTTTTTTT>
##$WBST= 1024
##$WBSW= 4
##$XGAIN= (0..3)
0 0 0 0 
##$XL= 0
##$YL= 0
##$YMAX_a= 192466
##$YMIN_a= -275825
##$ZGOPTNS= <>
##$ZL1= 120
##$ZL2= 120
##$ZL3= 120
##$ZL4= 120
##$ABSF1= 15.72926
##$ABSF2= -2.322589
##$ABSG= 5
##$ABSL= 3
##$ALPHA= 0
##$AQORDER= 0
##$ASSFAC= 0
##$ASSFACI= 0
##$ASSFACX= 0
##$ASSWID= 0
##$AUNMP= <proc_1d>
##$AZFE= 0.1
##$AZFW= 0.1
##$BCFW= 0
##$BC_mod= 2
##$BYTORDP= 0
##$COROFFS= 0
##$CY= -3
##$DATMOD= 1
##$DC= 0
##$DFILT= <>
##$DTYPP= 0
##$F1P= 0
##$F2P= 0
##$FCOR= 1
##$FTSIZE= 16384
##$FT_mod= 6
##$GAMMA= 0
##$GB= 0
##$INTBC= 1
##$INTSCL= 0
##$ISEN= 128
##$LB= 0.24
##$LEV0= 0
##$LPBIN= 0
##$MAXI= 10000
##$MC2= 0
##$MEAN= 0
##$ME_mod= 0
##$MI= 1.114404
##$NCOEF= 0
##$NC_proc= -6
##$NLEV= 6
##$NOISF1= 3.799351
##$NOISF2= 2.8
##$NSP= 0
##$NTH_PI= 0
##$NZP= 0
##$OFFSET= 15.72375
##$PC= 1
##$PHC0= -15509.74
##$PHC1= 9.800819
##$PH_mod= 1
##$PKNL= yes
##$PPARMOD= 0
##$PSCAL= 0
##$PSIGN= 0
##$REVERSE= no
##$SF= 200.130006414768
##$SI= 16384
##$SIGF1= 3
##$SIGF2= 2
##$SINO= 5.538805
##$SIOLD= 16384
##$SREGLST= <1H.CDCl3>
##$SSB= 0
##$STSI= 16384
##$STSR= 0
##$SW_p= 3612.71676300578
##$SYMM= 0
##$S_DEV= 0
##$TDeff= 16384
##$TDoff= 0
##$TI= <>
##$TILT= no
##$TM1= 0
##$TM2= 0
##$TOPLEV= 0
##$USERP1= <user>
##$USERP2= <user>
##$USERP3= <user>
##$USERP4= <user>
##$USERP5= <user>
##$WDW= 1
##$XDIM= 16384
##$YMAX_p= 296968442
##$YMIN_p= -674194
$$ End of Bruker specific parameters
$$ ---------------------------------
##NTUPLES= NMR SPECTRUM
##VAR_NAME=  FREQUENCY,     SPECTRUM/REAL,   SPECTRUM/IMAG
##SYMBOL=    X,             R,               I
##VAR_TYPE=  INDEPENDENT,   DEPENDENT,       DEPENDENT
##VAR_FORM=  AFFN,          ASDF,            ASDF
##VAR_DIM=   16384,         16384,           16384
##UNITS=     HZ,            ARBITRARY UNITS, ARBITRARY UNITS
##FACTOR=    0.220516191357247, 1,           1
##FIRST=     3146.79421126727, 0,            0
##LAST=      -465.92255173851, 0,            0
##MIN=       -465.92255173851, -674194,      0
##MAX=       3146.79421126727, 296968442,    0
$$ Real data points
##PAGE= N=1
##DATA TABLE= (X++(R..R)), XYDATA
$$ [...]
9539 236482 227258 -9791 -71710 76109 38178 65708 135766 101292 35523 135016 147368
9528 147368 158498 104597 141365 175291 128993 219653 196905 183828 184016 187447 228762 236244
9516 236244 262454 198392 141755 214997 149698 172114 269895 322480 256456 92907 174418
9505 174418 147763 163578 202896 102075 93929 117512 159996 194915 236473 118103 129574
9494 129574 139971 190792 242261 242017 237075 150846 108630 128932 101019 209793 194422 186262
9482 186262 120598 136974 185995 199791 290702 283766 303766 338588 315913 260710 316928 381321
9470 381321 302855 181142 261065 234843 230124 315524 245816 238578 180212 317304 216042
9459 216042 213628 348965 374838 267355 223338 310037 362629 375730 327163 371505 336833
9448 336833 435147 347494 333707 369230 362801 414282 451711 523236 594817 500654 520418 542564
9436 542564 561211 534135 577673 566954 595803 593248 503283 464715 482839 485803 431332 432334
9424 432334 498743 461954 471771 413507 400886 430059 444105 456871 394867 363373 346521 355270
9412 355270 396075 496054 566252 538747 625195 623685 529548 546571 601476 625372 554234 599729
9400 599729 676587 742124 701274 703168 633480 607762 583907 586304 596105 582860 647385 564729
9388 564729 595309 598239 690403 763972 674726 607946 538574 531888 533241 596796 607921 555779
9376 555779 598950 575994 575144 584146 568656 661265 689503 655588 575945 543499 663797 676594
9364 676594 604557 680579 613556 578099 617824 702130 618115 636892 608297 669591 725366 791960
9352 791960 765752 742911 736660 809213 832204 836052 814146 837398 924665 952485 1008831 1061458
9340 1061458 1072002 1055003 1063509 1148353 1161660 1121046 1191520 1228784 1343292 1298576 1231021
9329 1231021 1253960 1244990 1284478 1301889 1165057 1206139 1321343 1439288 1442198 1527935 1666367
9318 1666367 1645345 1689553 1865078 1935770 2013598 2094862 2141540 2236790 2303988 2229881 2312585
9307 2312585 2357289 2271677 2256979 2250785 2200149 2147570 2077590 2129653 2155857 2338549 2312657
9296 2312657 2213213 2265011 2334845 2375317 2351189 2382534 2432188 2517094 2540645 2610912 2611310 2625909
9284 2625909 2714465 2836011 2969855 2968769 2981480 3041459 3093264 3142172 3037429 2922013 3040389
9273 3040389 3114719 3015163 2946964 2954014 2822935 2738323 2754885 2605621 2553234 2398225 2300748
9262 2300748 2227423 2120634 2060903 2149641 2186556 2173202 2181785 2190674 2301075 2318716 2442335
9251 2442335 2510104 2620454 2617401 2592439 2529688 2608357 2622240 2598709 2597765 2600985 2610435 2489795
9239 2489795 2332830 2221040 2195225 2215798 2201896 2149988 2192431 2145976 2086624 2121266 2188864
9228 2188864 2195881 2128958 2095164 2008251 2008755 1939628 1826592 1785197 1706334 1790037 1831001 1866294
9216 1866294 1761917 1805561 1887539 1889642 1831642 1874753 1938584 1948505 1930211 1859915 1779807 1932676
9204 1932676 1966058 2051409 2017697 2102106 2189629 2230281 2209105 2194946 2229394 2233075 2281462 2226765
9192 2226765 2275455 2393565 2395721 2292967 2352482 2371587 2341600 2262303 2308630 2365235 2390799
9181 2390799 2358848 2298805 2309616 2312459 2201484 2120296 2284291 2247245 2265727 2385566 2489810
9170 2489810 2449450 2521054 2540979 2535988 2482504 2454408 2474837 2661777 2676620 2641013 2744924
9159 2744924 2780558 2815666 2881156 2963451 2885892 2875322 2913325 2950022 2943703 3066148 2988094
9148 2988094 3076228 3124023 3131106 3111781 3241970 3363536 3350689 3416766 3463618 3457811 3499338
9137 3499338 3633806 3702039 3795804 3904021 3925395 4021345 3947536 4013735 3986065 4117687 4200315
9126 4200315 4316146 4432646 4535031 4708940 4894995 4958610 5065114 5144501 5276147 5535933
9116 5535933 5642520 5735733 5892317 6159208 6427914 6560666 6770185 7035302 7284645 7547106
9106 7547106 7809928 8001158 8358906 8758269 8994148 9131369 9343593 9632398 10084748 10443107
9096 10443107 10785456 11187918 11446685 11721540 12012166 12495215 12917527 13425214 14183077
9087 14183077 15057773 15732181 16590915 17706297 19005800 20363050 21934062 23609454 25631925
9078 25631925 27990697 30729837 33690829 36735041 39701593 42785434 46355630 50165601
9070 50165601 53114221 54271216 54199561 54681343 56096555 58437176 60311746 59441300 56096725
9061 56096725 51206156 45937031 41770534 39043434 37244656 36157879 35487603 34858550
9053 34858550 33845897 32572596 31535304 31376595 31703882 32353412 33373919 34535039 36164821
9044 36164821 38203697 40659917 43484578 46590115 50294087 54062734 57396850 60728305
9036 60728305 63883840 66363202 68213673 70019619 72898875 76383894 78126792 77237331
9028 77237331 75197469 72933876 70052000 65613371 58626272 50400006 43208359 37935806
9020 37935806 34046325 31119036 29094653 27574076 26406816 25477504 24483944 23431200
9012 23431200 22179602 21034500 20095985 19318648 18617502 18162704 17822552 17468550 17041208
9003 17041208 16676553 16181572 15654559 15120555 14582564 14054477 13367280 12784784 12219621
8994 12219621 11613667 11117030 10746318 10460157 10107623 9968285 9729765 9351086 9110671
8985 9110671 8873208 8738971 8617547 8513518 8389562 8244533 8126584 7982256 7796494 7761499
8975 7761499 7589177 7477970 7381479 7247339 7117065 7093644 7061377 6900534 6837376 6869377
8965 6869377 6685408 6607124 6497341 6514238 6638092 6700613 6745915 6712973 6753502 6822770 6882698
8954 6882698 6961982 6949396 6992979 7189622 7217831 7202715 7326803 7228879 7228952 7279718 7338605 7401295
8942 7401295 7412100 7370275 7337020 7145833 7217233 7174562 7145444 7296824 7385729 7438560 7415651
8931 7415651 7413787 7341198 7316374 7474278 7646534 7724415 7693703 7715579 7796623 7792038 7852755
8920 7852755 7868100 7890305 7990988 8218845 8322763 8538215 8731099 9033570 9118651 9200983
8910 9200983 9228185 9366173 9441788 9424898 9492115 9690987 10055554 10206413 10560454 10860470
8900 10860470 11167070 11730417 12079725 12490841 12821654 13224424 13670404 13950914 14155365
8891 14155365 14478945 14859837 15220409 15507577 15907911 16393119 17049136 17887684 18912809
8882 18912809 20104598 21427029 23054585 24821631 26809986 28864362 30775412 32576545
8874 32576545 34621194 37203727 39952980 42205943 43607351 44422674 45114519 44637388 42562300
8865 42562300 39481211 36750303 35136775 34380204 34332068 34509895 34602959 34236356 33373453
8856 33373453 32331001 31519935 31164182 31070486 31529109 32450413 33679744 35092867 36958905
8847 36958905 39080691 41486271 43902905 46324499 49111022 52657295 56692323 61124982
8839 61124982 65678353 70359460 74206691 76742074 78111419 77536877 74542571 69408005
8831 69408005 63888385 59378244 56473187 54631765 52602661 49261301 45141374 41499676
8823 41499676 38778751 36516329 34645275 33030292 31803249 30721719 30015763 29444349
8815 29444349 29126542 29073649 29333340 29872479 30778309 32035920 33376006 35029724 37055052
8806 37055052 39156204 40611232 41378500 42155733 43421427 45239143 46948028 48244841
8798 48244841 48462269 46769441 43689956 39459867 34944104 30869657 27776385 25563769
8790 25563769 24028205 22825719 21869270 21000757 19915668 18712436 17566143 16745047 15926188
8781 15926188 15197166 14603342 13991902 13579234 13067850 12666648 12222926 11891482 11633248
8772 11633248 11301527 11088746 10924955 10732556 10539918 10541370 10412604 10291656 10285421 10171876
8762 10171876 10226192 10326542 10300742 10505568 10563815 10639807 10633145 10777110 10993673 11001334 11075060
8751 11075060 11147031 11161373 11325673 11418219 11486522 11635236 11742912 11911596 12030047 12111179
8741 12111179 12251792 12519072 12752899 13039326 13408566 13740912 14240915 14897089 15614003
8732 15614003 16418443 17373434 18456681 19820612 21273634 22959500 25110621 27498521
8724 27498521 30244538 33379407 36999109 40797064 43960406 46845651 49968983 53650348
8716 53650348 58026317 62961191 66600616 69265771 72239849 76862941 78595757 71633824
8708 71633824 59808285 48737999 41138054 35940700 32309153 29678591 27923582 26702833
8700 26702833 25838314 25439692 25073968 24918490 25110237 25607988 26412785 27307507 28542204
8691 28542204 29671917 30361094 30851053 31611095 32792135 34428702 36508487 38646806 40028164
8682 40028164 40097992 39021990 36645059 33184172 29503037 26469400 24221924 22722381
8674 22722381 21744001 21104295 20535126 19627002 18486555 17264981 16260788 15560526 15055671
8665 15055671 14682305 14206927 13954020 13830103 13725466 13788473 13832757 14089148 14469958 15087220
8655 15087220 15661760 16201433 16391702 16307689 16313167 16502737 16805947 16855628 16073262 14919558
8645 14919558 14046610 13373690 12902692 12284441 11373654 10341086 9549344 8856852 8282665
8636 8282665 7914372 7526737 7214522 7016158 6737664 6354988 6076879 5870775 5600419 5446902
8626 5446902 5382653 5107845 4910243 4674602 4519263 4461188 4343657 4333401 4136241 3996187
8616 3996187 3910905 3853115 3888621 3746473 3715534 3603218 3498071 3439441 3420843 3381166 3251153
8605 3251153 3065283 2945227 2905468 2785615 2813847 2781881 2706894 2590536 2615999 2418995
8595 2418995 2425445 2399125 2260379 2206407 2092660 2039841 2031761 1969404 1943959 1840730 1842526
8584 1842526 1789580 1772636 1786650 1628575 1596227 1530067 1610292 1597683 1438318 1499372 1486039
8573 1486039 1480136 1396854 1357190 1292227 1205143 1243318 1273523 1295149 1232174 1150107 1085569 1099747
8561 1099747 1129948 1123926 1126916 1094940 909373 887745 1020243 1065356 985075 946730 958156
8550 958156 932756 898059 905774 903809 760483 743014 767752 918218 890261 797481 710033 731056
8538 731056 830515 792273 699985 679686 760391 752640 618171 582134 709744 700792 672282 727955
8526 727955 737782 775685 801006 737482 714092 650073 591051 602791 611353 565165 584286 590019
8514 590019 534734 572895 671048 712450 616895 690503 732496 692814 777416 773959 754947 682270
8502 682270 720195 840095 827046 810341 694218 668788 681613 622866 648447 632651 585876
8491 585876 699505 694581 555813 629085 585767 598992 629859 604544 543469 617420 666012
8480 666012 630600 647441 604465 473690 471036 489584 459892 510139 574079 526318 563089 660907
8468 660907 718663 695012 650237 612839 570031 440490 527271 508418 479949 433147 390804
8457 390804 403156 446635 376320 431798 473824 392694 429276 447451 361686 261770 374912
8446 374912 434289 321872 445274 425750 442958 382980 433027 444316 360210 447891 451415
8435 451415 406676 360635 375018 278004 312250 173019 257210 269174 317610 291895 329365
8424 329365 348427 269616 250561 242588 267782 229119 216865 217304 124167 108844 100216 95473 46286
8411 46286 35273 122220 120577 171615 239235 228800 212106 157291 135593 182198 197531 177966
8399 177966 161128 221398 192530 197824 201422 205840 196267 124280 111871 45344 20939 68749
8387 68749 63617 2256 5608 60118 137643 113715 125464 152496 193546 222340 124168 182151
8375 182151 116225 127788 221733 219755 124458 -11298 54002 21218 60046 86082 115074 102578
8363 102578 111925 143790 139824 150296 142242 170603 144892 144296 221288 162560 145643 140543 152186
8350 152186 188478 205008 232900 273268 320400 344662 166849 176883 192346 185883 83728
8339 83728 32409 155668 185484 157561 115599 160675 179839 182997 175106 124437 186569 189317
8327 189317 213060 177160 135619 154353 186839 148950 69470 212447 252192 272746 362894
8316 362894 331216 151493 190496 198638 129509 132125 207802 104197 45168 29210 73732 4032
8304 4032 -1131 92242 116994 78687 36090 74139 158052 192487 184342 197636 106491 130036
8292 130036 61658 -22771 66180 64113 166677 89728 72095 187360 102424 78635 77793 86170
8280 86170 77651 75562 19775 -2542 122102 149079 181849 108094 -39716 29769 39959 45048
8268 45048 78335 71504 56860 33604 62913 -1332 68630 -7343 -83516 -136730 -92808 -28916
8256 -28916 54697 65096 117161 80042 35577 64425 54096 88480 -3395 -47910 -5794 56618
8244 56618 90827 131693 129125 186446 148977 111543 90999 179690 248648 202223 205924 268122
8232 268122 190983 219255 142577 102823 26392 80646 52588 2042 57330 748 117441
8221 117441 90054 32160 11273 -21179 -21059 12854 18305 -44615 -102768 -72957 9699 -45209
8209 -45209 -43619 61218 56402 139644 -16926 -2055 62725 59336 -6105 108514 95397 79210
8197 79210 14901 -7675 -70054 -6722 -60839 -674194 -447712 -113944 -92593 -102212 -50576
8186 -50576 -70084 -57770 7735 108750 106524 14250 -38346 -58972 68835 173911 -6665
8175 -6665 12562 2546 -48692 -29688 42532 62692 32043 -19812 -32548 -115024 -147312 -128806
8163 -128806 -66191 -15681 -30525 -33921 -143253 -117493 -86692 -67585 928 23940 -2682 -3271
8151 -3271 -26946 -152802 -135219 -15117 15391 -50859 -87607 -75641 -156846 -135029 -89316 -11402
8139 -11402 48711 18647 -59142 54964 -64732 -7348 103519 -23326 -24602 9143 29392
8128 29392 13382 -86287 -102147 -159067 -99084 -69068 -32862 -53079 -22380 52384 50038 -19927
8116 -19927 -39332 -61695 -29948 -64592 -142111 -57041 -32789 57782 -16915 38969 -81322 -69085
8104 -69085 7514 -91593 -108993 -44974 -42404 68333 -30343 -72382 -62674 -135532 -83080 -108539
8092 -108539 -94526 -70727 -115876 -59927 -140954 -88082 -70951 65047 -8519 -68671 45222
8081 45222 -19473 9888 47123 104740 30127 -78920 -83158 -29772 -4451 19792 -39724 -48731
8069 -48731 -37367 35278 48277 92526 4592 -75974 -102052 -128666 -84803 75027 52625 44831
8057 44831 70410 -8629 -32492 -9651 34161 -40926 -108347 -86863 -78786 -140691 -70536 7890
8045 7890 -85337 -93505 -72348 -40675 -47888 -104829 -118499 12243 47133 -15771 -119592 -75715
8033 -75715 11979 -762 -126734 -66824 -40004 -88308 -73951 -14502 58604 28 -42562 -29339
8021 -29339 -135634 -134530 28501 7795 -56443 -14353 49995 38079 -42086 -119702 -198609 -177351
8009 -177351 -99171 9075 -37864 -29107 -1500 -11699 -55085 13438 -82716 -70756 7478 -20060
7997 -20060 -2540 -169936 -73156 -32332 -81614 -26451 -40051 -174442 -175109 -129998 -149468 -171698
7985 -171698 -55469 -105436 -175204 -147707 -17946 -80374 -21576 -31432 -121504 -150661 -92609
7974 -92609 -49495 34678 -85405 30242 -20448 -67107 -137253 -86403 -24950 -45793 -52955 -110961
7962 -110961 -42702 -35138 -76250 -65622 -37158 -67706 -47521 -54959 -6926 -39935 -42318 -100796
7950 -100796 -67263 -61821 52067 112596 13877 -96090 101075 1458 -1659 -68884 -46418
7939 -46418 37534 57306 32425 -20625 -107314 -98496 -19079 -32357 -49359 -87541 1895 -73256
7927 -73256 -131763 -89560 29676 13226 -15105 4871 -42785 -20174 15423 -73227 -138247 -10801
7915 -10801 -1649 -7607 -26040 -74310 -58216 -56706 -115642 -113055 -33411 -11721 9067 37464 75922
7902 75922 -16933 -129603 -152518 -116359 -58083 -45482 -80641 -23616 -5312 -94698 -11953 29207
7890 29207 -8564 -55093 -55897 -89060 -165142 -120429 -120819 -74505 -55784 -21872 -72248 -106238 -114893
7877 -114893 -65503 -125386 -75214 -74776 -107093 -32206 -24105 -34364 -96416 -21475 5903 -107298
7865 -107298 -42732 -122791 -179245 -95574 -50638 -83688 -91558 -52765 -111941 -18385 6417 -15922
7853 -15922 -41208 -52548 -32353 -16602 -112322 -129234 -169311 -203743 -213672 -180977 -93258 51580
7841 51580 -65982 -159862 -21953 -27410 -93155 -102907 -43085 90104 4671 -96675 -47849
7830 -47849 -19352 13894 -26948 -67371 -80991 -47481 -139347 -107588 -23420 -67937 -41475 -89048
7818 -89048 -178574 -51958 -97854 -109627 -86191 -100789 -169605 -192746 -210468 -282857 -361956 40354
7806 40354 17749 -106389 19792 13058 43237 -44967 -102931 -56918 -24771 -101567 -107826 -64017
7794 -64017 45216 90505 42366 11696 22691 18039 -9492 -134507 -85089 -41052 34018 -62132
7782 -62132 -72666 -10857 6243 -74474 -59555 -63077 -16014 -50616 18696 -38179 -13968 -74665
7770 -74665 -143048 -136002 -30712 -19952 -8539 34228 -47037 13059 50049 19070 -72926 -63728
7758 -63728 36655 62257 -2632 77529 8848 -8194 -43356 27223 32237 99151 194700 121799
7746 121799 96479 -68348 -121381 50387 9013 -68171 -98400 -148114 -129558 -100869 -53474
7735 -53474 -11048 -70935 -90056 -78985 -108275 -199852 -112244 -130522 -87685 -55896 -3558 -98313
7723 -98313 -151282 -132142 -134097 -79183 -49944 -75598 -50148 -22630 -76372 -111091 -63315 -39938
7711 -39938 -112492 -31867 -42226 -113698 -53395 -9870 12421 -8229 -11501 -28725 -3496 15776
7699 15776 63960 19306 989 68033 35756 101711 54942 -29969 -103225 -114424 -146911 -152235
7687 -152235 -85501 -2433 -59892 2336 -4839 41928 -41220 -9066 25498 14569 -37770 -111509
7675 -111509 -82481 9528 31111 -3554 -13709 18394 86641 28262 -27915 42287 61625 -12864
7663 -12864 26964 11412 -56684 13607 45767 -9868 -61600 -30697 34403 18274 -35188 -22572
7651 -22572 22005 49326 19596 -74180 -37824 6369 51054 105791 -2465 -71710 -73291 -144803
7639 -144803 -54989 -98868 -129522 -170089 -120138 -41520 -39523 -111144 -134290 -73779 -12966 -40526
7627 -40526 7811 -52439 -90386 11570 34358 -75733 42484 -17626 -113310 -51938 -9115
7616 -9115 26825 -74562 24816 25335 10098 -13796 -32531 35916 -53121 -75638 -60143 -36325
7604 -36325 34132 51304 -47587 -147757 -73228 -19498 -87557 -111762 -73261 -78792 -2719 34417
7592 34417 -20366 -38896 45067 27416 45587 130031 65357 64934 40362 11062 70289 14298
7580 14298 -27535 28951 2696 -28359 -10599 29786 53272 258 329 30100 79024 44886
7568 44886 109167 38502 -28115 -103504 -122582 22632 -132628 -38113 41252 70637 91804
7557 91804 72863 28092 -52793 -44940 22780 44467 16868 32049 73635 85384 43315 95019
7545 95019 40054 -23824 -50783 -12038 30163 85110 7428 42769 51449 94925 151122 140070
7533 140070 117977 187433 102555 62827 15109 47655 155489 257976 294584 366421 435880
7522 435880 433488 457993 396074 466736 490943 484160 462635 396043 370368 315497 326449 344744
7510 344744 268987 92529 146815 194762 43213 90683 62072 119975 50892 2967 50346
7499 50346 73411 -38050 82177 69711 7472 46388 33467 102103 147869 113104 161897
7488 161897 90439 16606 -10557 -37971 51779 60294 34234 30146 50368 81202 71161 -15721
7476 -15721 67208 83410 133083 129038 157494 113749 104760 100613 50736 103684 166770 176139 100643
7463 100643 -40908 96993 147629 91257 76274 70351 99863 126366 134890 88207 48425 -6867
7451 -6867 143847 180598 86520 78086 -12166 54920 73415 54503 81852 14861 27084 72828
7439 72828 97209 46684 158921 132444 103352 92615 124526 45453 39998 -17817 112117 136576
7427 136576 145919 161475 90269 62809 150951 208137 132332 160948 141030 172474 126737 141962
7415 141962 133433 -22863 15585 166556 114344 116650 80 -13565 81233 102031 127602
7404 127602 179390 205102 175037 77879 61429 183513 183841 133477 108633 162895 226213 142694
7392 142694 91858 99537 104592 142027 111741 114303 149132 238039 220486 133014 -15136 45402
7380 45402 148681 80513 81553 140350 90417 86279 82166 98861 105898 33588 142255 173591
7368 173591 172379 117097 95687 107008 193097 196592 105484 131517 135857 150743 123529 144089
7356 144089 157317 128834 103923 101114 193574 197514 159588 231134 240305 242016 230275 253090
7344 253090 242266 146023 165422 212576 363992 289640 313752 285078 242266 280867 273367 336536
7332 336536 261398 172468 200960 260150 313356 301590 328984 273425 271196 294891 335986 296640
7320 296640 276875 358316 353136 317615 318152 341024 340347 307155 298502 349431 340273 298402 288564
7307 288564 250640 340130 318883 259711 258140 377816 435097 346118 272482 365216 419147 262401
7295 262401 199497 261239 300855 394898 496711 492013 496558 473946 481515 460535 402449 512557
7283 512557 484243 343593 359877 410630 545794 544759 383600 361770 456712 456871 423141 407274
7271 407274 506337 538420 547210 403685 474370 518669 502153 507620 435636 515068 506490 508717
7259 508717 629717 566166 617620 683676 703992 726517 641933 524903 508872 566303 555557
7248 555557 514995 618142 593464 680549 668505 572193 658524 681143 678694 709483 833953
7237 833953 842737 788167 810383 791552 812697 791240 784944 807947 836101 845155 945342 1020367
7225 1020367 994142 1054525 930662 1011392 1081160 1089419 1107084 1173783 1203401 1259474 1360073
7214 1360073 1377286 1393764 1452769 1548417 1550708 1675289 1736240 1609368 1583888 1657122 1729996
7203 1729996 1733122 1632263 1818709 2017372 2071521 2032515 1971251 2155169 2092374 2074506 2120014
7192 2120014 2094650 2172570 2210641 2222269 2314529 2349744 2366719 2397847 2387862 2480372 2509956 2503332
7180 2503332 2605276 2627043 2652458 2637909 2755161 2947904 2930949 2898042 3014106 3095337 3213995
7169 3213995 3291125 3323061 3463113 3579902 3679473 3761154 3963835 4130414 4246088 4351920
7159 4351920 4608917 4768293 4998021 5176065 5413464 5710839 5919189 6161877 6515848 6796246
7149 6796246 7043807 7527540 7996753 8363293 8772808 9317230 9869139 10628318 11409462 12373685
7139 12373685 13502036 14756551 16403092 18303966 20434950 23060507 25965022 29239708
7131 29239708 33053589 37381916 42375771 48137374 54532703 61717241 69548703 77402903
7123 77402903 83592243 85817424 82772563 74687920 63626010 52432149 43108599 36249701
7115 36249701 31374185 27804542 25138138 23059334 21349798 19750497 18261357 16652358
7107 16652358 15178897 13963658 12818283 12031070 11357401 10681803 10138045 9711415 9361587
7098 9361587 8913817 8548112 8119310 7608257 7127915 6743617 6446421 5989877 5632355 5367282
7088 5367282 5117404 4887698 4699921 4512432 4356001 4238046 4029215 3950721 3790126 3657830
7078 3657830 3570616 3285785 3208924 3087508 3031383 2934927 2791435 2670624 2678070 2730679 2604300
7067 2604300 2552275 2423556 2242425 2255770 2193090 2011837 2045971 1986038 1983696 1972632 1973174
7056 1973174 1871591 1785689 1874609 1875165 1787963 1757021 1619094 1550321 1551435 1547485 1532367 1579243
7044 1579243 1583273 1488436 1511775 1501118 1390993 1399138 1405069 1393883 1432523 1380479 1370054 1290070
7032 1290070 1332041 1374850 1308148 1162631 1260241 1302138 1242982 1181340 1053104 1117870 1194064
7021 1194064 1214617 1197336 1151602 1082547 1120260 1062284 968066 996650 995657 966477 906050 1037086
7009 1037086 1013417 929911 926387 818952 887370 1053049 1119710 1055766 1013682 1022510 1067828
6998 1067828 1140030 1111915 1140170 1149031 1302453 1305925 1201457 1207817 1184342 1130686 1186837 1255071
6986 1255071 1058570 926275 955240 975581 862938 871272 756270 758463 780248 712387 644592
6975 644592 636647 632048 568265 546972 513788 531965 438112 330777 409718 393359 408919 407961
6963 407961 394106 328819 318100 381236 367227 368306 390181 367204 222711 331878 393983
6952 393983 254683 242523 319567 390538 350170 282653 315155 321757 285461 198675 281229 370800
6940 370800 348023 380135 345919 217719 300797 365865 264814 210916 212116 183508 116482
6929 116482 228319 336614 295405 272095 351202 313090 169539 220186 237633 290994 234465
6918 234465 131871 134565 104758 181864 187774 129308 210827 203605 209406 224313 246037 311426
6906 311426 256655 290466 338986 181021 125445 272031 222877 190009 195873 250910 255606 217040
6894 217040 201226 123815 108741 134671 151393 160048 96982 186791 213163 146155 43257 160477
6882 160477 92974 113485 131963 154886 155721 278775 263159 75753 48356 -110295 -25927
6871 -25927 -22524 27592 69323 76875 105206 196150 105083 111831 134307 111420 143336 113153
6859 113153 121017 152709 160182 124300 47417 -14222 -49361 66717 27527 -9962 118238 46866
6847 46866 41053 39130 -77265 -33689 -8765 16814 45450 119809 180511 124545 -53123 -74844
6835 -74844 -35908 72355 85359 92084 133756 218307 115143 -9838 -5755 63725 109635 -38732
6823 -38732 1171 150404 78037 -61506 40927 109676 76360 12234 186970 182673 145763
6812 145763 84470 15641 143929 95051 61202 -48593 1690 -17732 38003 25355 -71318
6801 -71318 35545 94475 128607 101282 164448 194349 173690 184240 199244 182354 191983 180426
6789 180426 87564 195197 188546 166091 187310 147052 189236 122675 27094 79270 182913
6778 182913 138010 -24909 87356 149880 54292 60645 96475 98293 24340 32706 -26345 63001
6766 63001 42267 51053 83080 -33535 -38210 92041 -6679 -2456 44058 33624 39925 74638
6754 74638 68953 16654 70221 45752 39670 68074 63496 47923 -18991 22530 56824 140785
6742 140785 -21938 -24500 -39728 -1436 112381 38800 118077 133559 82586 230992 190996
6731 190996 189958 216322 281828 347956 340177 381450 433205 404169 428838 537469 583698 456543
6719 456543 434305 394743 273802 216233 140573 182713 333226 248156 247242 206492 163978 304571
6707 304571 158028 190749 191160 107921 47434 63395 58475 207298 230155 172920 121032 96431
6695 96431 6519 45393 57754 51638 122385 206912 87072 129767 127392 124331 133203 81393
6683 81393 56672 13431 -7760 90963 118356 183424 126922 158358 63960 59674 78527 -21886
6671 -21886 -22598 -15584 58071 52731 50595 68309 136655 98329 118853 192803 109248 75664 56356
6658 56356 18945 13980 108305 152407 59852 81071 73340 94256 -12817 30812 207189 123760
6646 123760 52531 106884 34314 -16823 76688 27712 31459 58633 -52646 148452 78944
6635 78944 55992 50153 119610 120029 156401 112442 110493 194225 73659 86490 91727 -26328
6623 -26328 -29847 82417 135092 85993 73875 135190 119662 48983 -13546 65461 183074 157228
6611 157228 162844 116311 35636 -1085 55025 63045 31510 48877 71213 153695 41108 36198
6599 36198 83718 26703 67285 25466 -77115 25740 100010 16339 54044 100072 43593
6588 43593 107128 12680 -29079 50783 58247 13685 5377 -42708 -40003 37138 91362 107072
6576 107072 160046 75032 119182 137183 216444 130550 15678 57524 21027 127049 39595
6565 39595 78339 75334 45027 -22583 43929 94377 95787 45169 95449 80712 -48227 89465
6553 89465 -18194 24008 129450 47289 74699 116426 154636 250359 142728 198914 250516
6542 250516 177949 53535 59731 102286 71535 108832 51591 86958 58003 57366 9706 80295
6530 80295 147097 157935 214208 154901 174255 177869 157417 134089 176111 193109 138253 197471
6518 197471 177936 147621 169355 112701 159300 95886 79449 130093 66777 125752 94291 97707
6506 97707 113044 43906 126492 135400 30998 105260 168630 112198 42587 -9466 38494 96574
6494 96574 87569 69282 102189 90221 184962 214341 154839 131309 157225 221861 253272 140925
6482 140925 107569 171344 112725 161789 176452 73684 173715 298038 151550 165066 156985
6471 156985 229883 193983 64518 5847 122558 137915 130899 159387 211242 127814 22694
6460 22694 171536 258512 120469 63859 104034 153281 171429 153623 177684 252834 160431
6449 160431 220272 283546 286739 255125 239185 254810 318639 270284 226895 193365 277026 395087
6437 395087 349297 287537 269278 280250 307458 375370 360007 396468 414062 494417 555278 372799
6425 372799 287320 393883 395026 376649 295683 419985 408277 445715 434740 335087 354798
6414 354798 421021 391659 553731 583168 593242 513305 521100 508717 524835 583349 636659 684648
6402 684648 653438 603539 634078 625648 562561 584093 589719 560096 581386 458654 459853 461686
6390 461686 451292 396135 409554 410516 442859 579501 505591 426571 406357 423491 522199 488605
6378 488605 522925 550796 569981 497451 417898 486445 471973 429907 382341 452995 516347 541851
6366 541851 549602 514805 565000 552366 489355 440983 400673 423985 485132 631431 505483
6355 505483 602880 553004 454606 545441 548742 491799 431463 506114 394604 383035 447741 430530
6343 430530 469795 468236 517587 422377 403105 486855 562163 462995 450509 472524 476564 492136
6331 492136 519335 473286 465026 460972 471871 536775 573646 636461 520283 436141 517651 500611
6319 500611 649363 598931 498181 625997 536115 550610 590889 669167 641369 635697 664114
6308 664114 695158 606022 630219 706631 580301 588762 637965 728340 727624 766846 842349 819743
6296 819743 720779 771515 780025 817877 840764 901229 813332 843113 962337 1073430 1029936
6285 1029936 1051689 976645 944875 1011581 984582 966840 1010226 954935 904785 978280 968988 946590
6273 946590 922515 994310 936443 926790 984214 931889 1033447 1054512 995915 1105213 1138759
6262 1138759 1220508 1237698 1251030 1304756 1275571 1349693 1266009 1278281 1401711 1318601 1237726
6251 1237726 1205982 1182707 1161960 1189625 1197107 1200515 1287592 1252688 1182233 1119376 1090453 1269698
6239 1269698 1239147 1244572 1311908 1315365 1333242 1308353 1315297 1353059 1379529 1488513 1506379 1552073
6227 1552073 1469900 1510463 1471410 1479304 1469035 1434401 1468925 1443323 1476463 1501867 1505690 1457457
6215 1457457 1459129 1465656 1418528 1448811 1476604 1548306 1517886 1541841 1580085 1582798 1687989 1708244
6203 1708244 1676538 1705676 1738645 1754222 1698962 1690780 1666437 1727316 1637994 1679442 1822540
6192 1822540 1852902 1907388 1995117 2039419 2116558 2048662 2140588 2196549 2128665 2131164 2076935 2180546
6180 2180546 2218993 2361951 2361240 2433693 2508600 2509086 2585486 2483873 2541754 2656132 2571248 2670323
6168 2670323 2772478 2792661 2901245 2927249 3055400 3082861 3113637 3272803 3318996 3454704
6158 3454704 3426471 3460050 3445947 3613515 3663919 3672302 3790303 3736458 3998811 4127109 4123506
6147 4123506 4176005 4305978 4407317 4446800 4487359 4491555 4668479 4808556 4892665 4921988 4977667
6136 4977667 5022624 5040335 5226622 5319812 5484292 5662795 5842412 5933449 6058970 6229078
6126 6229078 6356540 6503695 6628817 6739938 7000969 7173799 7391047 7646401 7811091 8096494
6116 8096494 8302283 8528453 8782744 9187386 9588350 9940360 10217617 10772290 11291436 11876167
6106 11876167 12476568 13285896 14086887 14991211 16120281 17519644 19024092 20614208 22534938
6097 22534938 24623186 27056178 29789525 32715903 35997526 39623781 43372503 46913309
6089 46913309 49945591 51056976 49386730 45469242 40962817 36963783 33853246 31666387
6081 31666387 30256606 29415436 29036602 29036150 29529179 30451152 31823372 33689751 35851446
6072 35851446 38442907 41526028 45095420 49177203 53972806 59303798 65394600 71965553
6064 71965553 78899541 85816499 91493781 93724958 90816278 82929789 72529528 62415728
6056 62415728 54090614 47908606 43241713 39747389 37230995 35345690 34144112 33314436
6048 33314436 32889103 32856877 33233122 34121366 35213440 36643777 38424541 40589530 43114285
6039 43114285 45992314 49247229 52515263 55734431 58621470 60069698 59136280 55184181
6031 55184181 49747551 44335433 39590398 36050411 33115044 30618272 28445619 26543044
6023 26543044 24905234 23555928 22411677 21539581 20822599 20162344 19675292 19410378 19256797
6014 19256797 19092885 18912165 18983053 19082241 19135957 19150849 19029849 18803936 18702103 18723967
6004 18723967 18939986 19071693 19046338 19158440 19345174 19404006 19307726 19024330 18563218 18086395
5994 18086395 17586812 16941329 16452238 15939228 15527900 15284160 15171608 15110285 15058002 15000674
5984 15000674 15032738 15173430 15269903 15376175 15523028 15559749 15545827 15733020 15956983 16227954
5974 16227954 16518979 16954928 17370315 17870582 18353073 18604295 18922674 19292058 19870618
5965 19870618 20753214 21785443 23090100 24549911 25974880 27692669 29675529 31884952
5957 31884952 34478464 37438525 40600772 44071967 47643668 50770436 52697174 52454132
5949 52454132 49687035 45555594 41359223 37841919 35324815 33603195 32507613 31875998
5941 31875998 31739842 32053851 32787474 33965969 35466472 37335518 39652913 42459900 45711696
5932 45711696 49542537 54105342 59077622 64737356 71004320 77543851 83939800 89281150
5924 89281150 91691708 89570489 82666602 73239701 63751319 55582831 49133708 44237901
5916 44237901 40591139 37915009 35957497 34656479 33786098 33379562 33232478 33351390 33700258
5907 33700258 34468413 35545828 36875365 38639160 40891887 43573064 46438510 49520814
5899 49520814 52501498 54815215 55531455 53558124 49092678 43736569 38565742 34090087
5891 34090087 30311289 27224277 24733727 22740966 21004728 19532425 18479489 17571183
5883 17571183 16613461 15755792 15056691 14349984 13714377 13115038 12631711 12257527 11981984
5874 11981984 11659084 11399238 11131996 11086960 11080618 10979337 10819882 10605370 10559164 10233607
5864 10233607 9919591 9616686 9272768 8926900 8609757 8290505 8010059 7850352 7617883
5855 7617883 7555563 7332209 7120691 7006503 6809639 6536421 6291737 6201271 5987988 5887792
5845 5887792 5757260 5697639 5531395 5496946 5474683 5425266 5353788 5320180 5303675 5243591 5153798
5834 5153798 4971890 4887117 4783616 4677272 4634649 4662806 4577776 4539434 4593923 4729272 4680316
5823 4680316 4742601 4790756 4685239 4688563 4788575 4891718 5023692 5322689 5422748 5605128
5813 5605128 5905674 6212578 6636815 7156548 7582075 8016126 8114713 7661518 6825352 5935101
5803 5935101 5257383 4792374 4424297 4084804 3904046 3726501 3621729 3632235 3644034 3582680
5793 3582680 3482363 3412450 3462190 3420696 3317621 3364282 3265893 3328276 3332054 3395104 3498648
5782 3498648 3454564 3238580 3039424 2938370 2771334 2603451 2544180 2484994 2454720 2494882
5772 2494882 2518384 2501843 2495911 2490464 2520532 2515773 2591724 2786176 2817170 2793643 2759821 2721047
5760 2721047 2636529 2690825 2618795 2660509 2686007 2573176 2593722 2581430 2626624 2727056 2760680
5749 2760680 2856953 2977566 2965485 3066804 3316762 3462630 3573852 3756367 3876200 3940321
5739 3940321 4186187 4419038 4693284 4889161 5055320 5268640 5222332 5208620 5041506 4746068
5729 4746068 4463463 4138808 4025297 3870362 3841756 3789783 3841462 3908191 3965270 4066716
5719 4066716 4284763 4549409 4730197 4878253 5016685 5093466 5036657 5106281 5269403 5522884
5709 5522884 5728523 5982617 6171285 6127921 5865169 5497251 5035003 4578025 4307682 3932858
5699 3932858 3692776 3551009 3339388 3368752 3277924 3266833 3331647 3372691 3429290 3471148 3480629
5688 3480629 3506177 3534225 3514332 3537573 3652588 3683936 3729375 3747545 3736419 3761636 3532643
5677 3532643 3257406 2954988 2687431 2523511 2395740 2120652 1878132 1883660 1912042 1875834
5667 1875834 1879396 1815802 1686289 1587589 1633717 1653980 1762557 1751944 1751834 1736593 1807591 1851059
5655 1851059 1877246 1890698 1925851 1981912 1998805 2004009 1833291 1627896 1525199 1541670 1511614
5644 1511614 1524567 1424749 1322636 1307330 1303557 1229227 1221407 1320814 1351712 1314608 1349082 1383711
5632 1383711 1392325 1257103 1177874 1281312 1365852 1449835 1451535 1481944 1488658 1353809 1253976
5621 1253976 1288644 1234322 1133231 1235260 1234512 1245962 1259664 1262000 1142759 1079122 1167087
5610 1167087 1131212 1050990 985115 1052260 1117807 1025227 956274 976288 1042278 1007389 1009449 1068047
5598 1068047 1093042 1162613 1142879 1091658 1253858 1287685 1345647 1408411 1476102 1579462 1507051
5587 1507051 1482224 1418042 1436144 1380841 1449011 1522158 1541099 1490049 1498763 1594551 1662585 1727532
5575 1727532 1796193 1884514 1944271 2002909 2155168 2355515 2444820 2749006 3120012 3413944
5565 3413944 3680211 4173815 4729389 5198297 5701085 6264951 6999543 7824694 8593440 9478541
5555 9478541 9819709 9100377 7590162 6180433 5111085 4389000 3852004 3462317 3016258
5546 3016258 2769544 2719307 2638552 2537190 2476202 2473752 2478122 2341101 2370941 2487102 2519446
5535 2519446 2594074 2593946 2768098 2921219 3157694 3235915 3388442 3509511 3502093 3305472 3016419
5524 3016419 2720069 2409984 2229071 2099047 1897295 1747877 1638988 1558655 1591775 1531911
5514 1531911 1500960 1414751 1302814 1363228 1218235 1268924 1303661 1402255 1431007 1384679 1391497
5503 1391497 1378778 1295793 1311231 1267494 1281371 1200494 1148268 1039014 989961 1010971 962430
5492 962430 917813 918275 959983 950324 920798 951312 844801 735204 711648 798738 881515 818230
5480 818230 813810 778050 815141 700542 791736 782068 719256 744107 647865 538843 553072 686389
5468 686389 718559 682519 700550 675432 594783 538691 580979 538451 581526 632846 572399 568655
5456 568655 623065 614231 601816 570466 638820 600144 633042 601087 573784 530431 545382 544740
5444 544740 642757 584839 560187 550654 476085 460452 504555 540027 506294 610286 655141 551345
5432 551345 443598 431446 519050 535127 583390 579495 536965 602090 561212 578727 658149 777206
5420 777206 729942 673426 647736 695328 740160 707119 792997 746360 675006 605388 656722 684522
5408 684522 621045 719291 653685 623711 607917 591759 714887 706309 661848 733738 684072 703588
5396 703588 760771 892614 921834 805496 741390 846995 844327 872430 983717 957329 946768
5385 946768 923561 901723 1036686 1102608 1132555 1090396 1078741 1133576 1164616 1201394 1276128
5374 1276128 1385454 1475233 1507224 1601391 1510911 1727888 1896420 1969577 2030491 2072460 2128350
5363 2128350 1995995 1793145 1700071 1607658 1521759 1428160 1354152 1435596 1455015 1428638 1462857
5352 1462857 1520958 1585865 1778486 1866417 1976844 2046560 2173804 2280858 2400359 2701471
5342 2701471 2919850 2958433 3229257 3429059 3519723 3501368 3401888 3191732 2868902 2731580
5332 2731580 2650738 2450169 2555931 2549951 2633873 2656409 2758751 2839821 2959166 2990193 2880206
5321 2880206 2843963 2652818 2542295 2503816 2552328 2542804 2586124 2640996 2743723 2790996 2718685
5310 2718685 2780608 2833982 2706071 2612134 2539975 2588863 2667549 2716964 2674547 2827103 2953937
5299 2953937 3088585 3413802 3513350 3546880 3428997 3240998 2955023 2730777 2428791 2221540
5289 2221540 2092827 1976262 1874177 1773617 1765643 1730285 1685888 1664155 1747491 1727658 1709228
5278 1709228 1718363 1721095 1791794 1841000 1920715 2078859 2204434 2267968 2293398 2258391 2154571
5267 2154571 2073467 1935894 1885169 1719538 1678810 1532946 1468632 1457768 1453332 1425406 1461889
5256 1461889 1413640 1352239 1334705 1325097 1438506 1516435 1509791 1503060 1551970 1666609 1742440 1794819
5244 1794819 1881496 1972400 2045043 2154862 2389128 2439552 2288800 2101341 1819312 1509203
5234 1509203 1443234 1374550 1238970 1054193 1028791 1026757 1008544 1008876 1024198 1014248 954249 935327
5222 935327 922438 866124 907205 808765 794225 793102 809887 741024 609239 651114 696303 699428
5210 699428 684272 700482 760967 734287 656888 674402 659792 634214 616481 513399 566317
5199 566317 617735 632274 630776 586727 571994 531581 613950 558947 504415 525350 564669 605230
5187 605230 526727 412258 421425 482318 381417 386771 461902 490216 576599 517127 404598
5176 404598 448217 465837 484442 585596 533622 502215 538675 571116 666747 735543 594403
5165 594403 620757 607484 467131 485095 571134 479277 462237 466561 478939 529719 482095 515761
5153 515761 410769 454113 407710 378674 482739 360584 330764 384310 522697 489771 550131
5142 550131 623410 622132 575494 577689 533625 538915 516570 448358 420079 424956 544928 429120
5130 429120 333940 393343 445658 431561 506495 630163 601084 451922 511467 461308 504327
5119 504327 536366 488142 511090 503362 564778 561026 500511 531161 598970 517631 459492 538865
5107 538865 502270 537455 608705 570782 617514 671384 606345 754458 754813 706226 704126 635252
5095 635252 678405 675114 601826 606926 656510 744984 720252 585407 644033 757185 821515 839151
5083 839151 859922 900935 903493 847811 890293 919053 907730 884278 1076642 1154765 1214526 1277752
5071 1277752 1369321 1452300 1550825 1780130 1844310 2030962 2264273 2175363 2038902 1864923
5061 1864923 1730300 1716998 1468216 1408938 1383661 1600758 1626290 1595719 1588037 1404088 1245709
5050 1245709 1250536 1226164 1067200 983128 958602 940577 898739 901086 960479 962770 984362 904365
5038 904365 896248 901525 812173 821082 863791 949631 893335 904503 807560 854981 879808 852345
5026 852345 864838 925361 933484 960234 862810 750559 877931 914476 806980 806635 875629 921408
5014 921408 877364 820015 831693 835911 836131 906450 902988 770518 808319 925086 885043 908358
5002 908358 899275 944819 920093 945034 984545 951025 1000965 1012677 896408 923473 947223 921037
4990 921037 905618 857754 975070 1054733 1070951 1036688 944778 954579 1010857 1093165 1091909 1046944
4978 1046944 972101 1043591 1136521 1199379 1213852 1106671 1178884 1122902 1065729 1219957 1184575
4967 1184575 1158817 1238341 1185574 1155173 1183229 1142803 1130779 1304226 1315318 1317981 1394656
4956 1394656 1312722 1277419 1332262 1350646 1404216 1387098 1398383 1416262 1405192 1480137 1559303
4945 1559303 1546829 1484024 1436863 1508648 1514920 1659443 1714613 1737253 1751720 1736628 1696804
4934 1696804 1632411 1663985 1790069 1745488 1690990 1762035 1853574 1919626 1924493 1870266 1872646 1945533
4922 1945533 2072378 2194252 2155408 2286288 2330205 2314977 2370538 2256858 2248758 2260306 2339147
4911 2339147 2272723 2284269 2368350 2510184 2503736 2522931 2547600 2661104 2737095 2695112 2713736
4900 2713736 2744951 2747206 2747154 2861587 2878402 2936906 3017075 3142170 3212605 3298522 3373259 3464716
4888 3464716 3528908 3546392 3481630 3658954 3697198 3819603 3981661 4001659 4156822 4203765 4292593
4877 4292593 4478250 4716208 4783928 4990496 5292624 5638535 6108828 6362145 6878340 7459323
4867 7459323 8086009 8767960 9508311 10318121 11252700 12390557 13694714 15046811 16563181
4858 16563181 18259108 20008941 20969504 19787371 17398763 14982115 13286793 12185843
4850 12185843 11368130 10805611 10523981 10315724 10209168 10236687 10372443 10658833 10960918 11429252
4840 11429252 11707268 12163817 12487299 12764600 13189883 13740823 14475156 15378133 16354514
4831 16354514 17427138 18340890 19046556 18703758 17402731 15997503 15138134 14657632 14478941
4822 14478941 14495628 14711961 15108252 15567421 15975434 16444003 16374978 15772537 14922859 14325102
4812 14325102 13918900 13644664 13462356 13451799 13419400 13337994 13403894 13579771 13896594 14336641
4802 14336641 14851122 15339251 15937756 16642214 17613005 18649966 19903563 21224361 22869661
4793 22869661 24668586 26532878 28610759 30968000 33419308 34896471 35393893 35378045 33910841
4784 33910841 31626324 29462066 28176494 27537821 27214233 27355704 27884749 28421565 29293330
4775 29293330 30306711 31541211 32841574 34730509 36856715 39314560 42130115 45427983
4767 45427983 49230261 54217873 60479289 68175178 77011536 86875941 97543302 109962517
4759 109962517 123881320 139063979 156670112 178411812 202037489 227664219 255565317
4752 255565317 285054068 294065879 262832705 210724019 163807593 131498338 108752163
4745 108752163 92419106 80020448 71002222 64078399 58651244 53822286 49938026 46652018
4737 46652018 43970793 41577644 39554806 37433310 35171700 32723471 30385827 28334218
4729 28334218 26606917 25090758 23626870 22345678 21162598 20100722 19110327 18383340
4721 18383340 17619759 16940820 16341688 15694622 15033504 14473991 13981857 13550601 13037502
4712 13037502 12635919 12278460 12045471 11588976 11132456 10804591 10413441 10094765 9770591
4703 9770591 9461198 9237395 8920347 8645951 8432560 8318517 8030407 7850704 7678550 7478702
4693 7478702 7076141 6866853 6817301 6650503 6553224 6452888 6414661 6276466 6196457 6106240
4683 6106240 6009561 5949146 5863511 5724800 5621525 5552655 5355406 5183701 5097088 4967610
4673 4967610 4937974 4863152 4878907 4734670 4585115 4540742 4513476 4409834 4329905 4308986 4398804
4662 4398804 4271516 4171314 4137430 3966422 3950312 3890898 3706021 3571479 3446095 3385575
4652 3385575 3341010 3293808 3272766 3214749 3144514 3110287 3050777 2950098 2905491 2901059 2937897
4641 2937897 2889644 2833432 2828459 2840544 2708357 2666531 2593602 2540787 2586694 2600048 2666738
4630 2666738 2590179 2419991 2337927 2290566 2197273 2053389 2047379 1986552 1951266 1873932 1922530
4619 1922530 2027432 1885838 1814801 1763194 1635008 1670888 1669553 1716769 1703465 1702220 1644105
4608 1644105 1610665 1558755 1476641 1470913 1442959 1435206 1385083 1397045 1371350 1366572 1301796 1231392
4596 1231392 1120220 1063484 1112019 1279022 1213710 1177435 1130718 1098597 1191060 1256350 1316589
4585 1316589 1271685 1198276 1265237 1324228 1278385 1336659 1356293 1426034 1270310 1263487 1227905
4574 1227905 1268249 1191264 1177770 1114977 1129239 1175297 1196740 1232828 1090287 1084201 1159036
4563 1159036 1156538 1130365 1082336 1117256 1153501 1077413 1116116 1091501 1132633 1143586 1173063 1121386
4551 1121386 1076004 1117807 1037125 1056805 1144206 1162401 1159699 1179438 1225725 1130853 1226412 1204091
4539 1204091 1119012 1114781 1135038 1240891 1199729 1111174 1123873 1256794 1283421 1185673 1201897
4528 1201897 1061133 1020997 1096412 1115759 1078930 1138562 1224789 1165893 1190505 1191581 1196543 1172016
4516 1172016 1124965 1135406 1160678 1168261 1261275 1175503 1144703 1270485 1286814 1267409 1215507
4505 1215507 1220249 1301259 1346875 1380618 1456220 1427863 1384214 1494223 1583199 1473998 1495114
4494 1495114 1581937 1541078 1474609 1573771 1578648 1656098 1628268 1616685 1607212 1600994 1763285 1770347
4482 1770347 1831771 1867465 1845396 1980326 2123264 2141023 2166378 2198884 2190216 2368788 2586045
4471 2586045 2694766 2869565 2978481 3012980 3252484 3522973 3743981 4042688 4261017 4451065
4461 4451065 4602899 4701864 4805205 4823700 4926470 5047173 5111564 5214696 5215468 5289027 5232845
4450 5232845 5166785 4957544 4668423 4575407 4467374 4250987 4095251 4058935 4090856 4161947
4440 4161947 4315614 4378628 4562201 4894432 5019420 5261960 5507245 5379039 5206358 5246323
4430 5246323 5309922 5595543 5825132 6010561 6221580 6338849 6498352 6557455 6501185 6416436
4420 6416436 6276774 5984092 5666304 5551176 5437340 5269313 5138697 5017927 4927107 4803312
4410 4803312 4657276 4343897 4132454 4022117 3980492 3945646 3927153 3804650 3748148 3822776
4400 3822776 3944522 3899704 3950146 4022691 4017021 4071539 4016189 4171356 4211820 4340219 4411762
4389 4411762 4423427 4441019 4442423 4349188 4366315 4308427 4151639 4065079 3892928 3788479 3785877
4378 3785877 3740534 3647943 3499116 3448672 3394880 3334369 3332965 3217877 3135563 3189136 3200012
4367 3200012 3107701 3110803 3108079 3106320 3045914 3169289 3173791 3122554 3155065 3242392 3200099 3220570
4355 3220570 3251869 3134960 3182761 3097181 3094849 3076376 3055597 3006906 3015959 2927932 2884985 2927758
4343 2927758 2983866 3085505 3092282 3035940 3042517 3129385 3166843 3238489 3165754 3190026 3154606 3229609
4331 3229609 3217709 3247013 3278934 3348836 3474042 3560789 3622317 3583683 3586217 3730931 3801924
4320 3801924 3744752 3698299 3681158 3732352 3713228 3613779 3598507 3587449 3606047 3570344 3554317
4309 3554317 3658134 3747252 3673517 3725230 3787297 3701943 3734330 3794556 3776719 3913640 3953379
4298 3953379 3878196 3961341 4088004 4098294 4100947 4230835 4261608 4400537 4425350 4510017 4522733
4287 4522733 4539410 4601147 4769493 4869258 4852403 4966187 5139096 5258999 5431772 5562901
4277 5562901 5727310 5839367 5978700 6175270 6267344 6403449 6500422 6566192 6797374 7024952
4267 7024952 7074334 7139659 7329690 7484214 7596476 7642302 7849120 8040359 8159074 8288566
4257 8288566 8478665 8616418 8801638 9034167 9280077 9465562 9575341 9800982 9949442 10093301
4247 10093301 10303051 10461161 10564729 10789666 11120521 11311437 11529669 11844487 12102415
4238 12102415 12271285 12404887 12438273 12396275 12407560 12363877 12420943 12560057 12717808 12933498
4228 12933498 13153596 13363892 13644605 13952864 14187981 14440483 14874566 15209402 15615990
4219 15615990 16070901 16561192 17058723 17656290 18127153 18689738 19441454 20228349 20852288
4210 20852288 21589921 22497215 23557451 24466737 25436595 26478135 27601713 28920887 30288239
4201 30288239 31773964 33385901 35239903 37208987 39447938 42007942 44762175 47983507
4193 47983507 51591513 55539969 59846633 64813876 70223796 75855803 82129733 89224471
4185 89224471 97391997 107057194 118593859 131905687 147128756 164632087 184618161
4178 184618161 207040751 231676617 257953751 283276591 296968442 290279840 262795515
4171 262795515 225301880 190772694 164378165 145473537 132051579 122865016 116575223
4164 116575223 112345949 108981128 105376647 100389682 94004145 86781811 80022810 74340584
4156 74340584 69549523 65879168 63180187 61116573 59643323 58968368 58972890 59396260 60423601
4147 60423601 62062199 64227272 66846384 69754630 72933829 75740239 77498750 78847205
4139 78847205 80677133 83134340 85477740 86650968 86036316 83242337 77925343 71046254
4131 71046254 63740506 57371582 52129237 48027477 44892647 42382354 40396048 38912118
4123 38912118 37894988 37197433 36994755 36888694 37098619 37665570 38588034 39915092 41381095
4114 41381095 43161142 45282884 47487357 49833632 52136802 53841091 54336448 53072590
4106 53072590 50007646 45570893 40919828 36816211 33504390 30985195 29195145 27723788
4098 27723788 26496682 25534749 24671967 23901474 23386055 22982549 22799798 22856673 23039069
4089 23039069 23287532 23633947 24209781 24820292 25229195 25277087 25002984 24524700 23893754 22880786
4079 22880786 21525502 19975171 18299471 16933996 15798139 14899786 14067290 13502622 12830969
4070 12830969 12282952 11907629 11473088 11151048 10916693 10617639 10233141 9975321 9775365
4061 9775365 9609268 9546718 9416599 9236676 9116867 9014526 8920573 8754953 8672355 8446424
4051 8446424 8336135 8189217 8242572 8242378 8291811 8192869 8161461 8132143 8057935 8074137 8063440
4040 8063440 8048857 8120932 8167532 8161625 8287883 8385353 8472895 8668022 8735229 8758368 8785122
4029 8785122 8943282 9111648 9382787 9698550 10005174 10388212 10895879 11408094 11765600 11771126
4019 11771126 11241640 10621700 10115379 9743599 9433249 9266075 9202462 9104566 9026900 9031327
4009 9031327 8949614 8749193 8618635 8662381 8677480 8686881 8795568 8941823 9005970 9203763 9319648
3998 9319648 9384239 9456421 9594351 9838276 10117021 10578749 11036411 11305227 11335933 11063602
3988 11063602 10770159 10518119 10316151 10243902 10213097 10150538 10011010 9792707 9575020 9517031
3978 9517031 9409213 9402892 9375216 9285260 9388039 9541880 9589156 9731811 9733203 9754102 9886577
3967 9886577 10009654 10328331 10741660 11205973 11664993 12191502 12681146 13205134 13916986 14449274
3957 14449274 14927872 15471468 15612740 15168080 14397155 13718085 13272732 13052719 12947866
3948 12947866 12974746 13068978 13208762 13049756 12498705 11805839 11127137 10576648 10144677 9909002
3938 9909002 9620491 9504766 9502843 9454049 9501790 9497232 9352846 9270152 9320240 9311023 9352601
3927 9352601 9446035 9476498 9471500 9459874 9317994 9135649 9130315 9164265 9117039 9156787 9131059
3916 9131059 9159082 9108167 9162593 9270228 9406002 9349821 9082116 8659338 8372451 7983020
3906 7983020 7708353 7591785 7582999 7636257 7633815 7754717 7831371 7945677 7965273 7910701 7797822
3895 7797822 7571130 7309539 7380066 7256995 7074021 7050872 7038155 7007761 6914999 6946227 6916761
3884 6916761 6816656 6751274 6658353 6370893 6217757 5990825 5813650 5740699 5784078 5728072
3874 5728072 5753036 5877139 5923755 5989811 5946172 5983891 5828864 5702761 5429087 5389457 5308012
3863 5308012 5214645 5162754 5099052 5096064 5112431 5092857 5068034 4984723 4987110 5026141 4967247 4958739
3851 4958739 4889279 4911251 5026300 5014406 4932359 4960854 5084599 5073529 5062977 5044593 5025838
3840 5025838 5081307 5046549 5059030 5153698 5313179 5335419 5452768 5533753 5664363 5832724 5976709
3829 5976709 6254418 6426381 6636350 6967131 7290383 7481297 7897354 8364641 8797577 9330118
3819 9330118 9848018 10488225 11201264 11783176 12481612 13265494 14011301 14765600 15584090 16417738
3809 16417738 17202967 17929261 18284277 18347444 18169988 17596745 16731433 15624110 14446699
3800 14446699 13267855 12192317 11269685 10410905 9679549 8992593 8457186 7967164 7634909
3791 7634909 7274153 6930422 6637535 6205335 5801935 5467689 5279063 5029114 4786469 4682364
3781 4682364 4410685 4193113 4098163 3881120 3659918 3635511 3486279 3384572 3316954 3204781
3771 3204781 3057189 2988310 2999722 2842763 2757526 2721502 2628685 2568990 2640125 2598076 2630281
3760 2630281 2472573 2321054 2209305 2223230 2231866 2215487 2259011 2175828 2178361 2186945 2118848
3749 2118848 2115438 2117000 1903696 1949234 1907261 1878122 1846193 1762595 1706023 1680216 1652634 1676433
3737 1676433 1672660 1638596 1601353 1549202 1637183 1537859 1489123 1437110 1375356 1403988 1481161 1529718
3725 1529718 1535346 1359459 1357021 1469998 1459428 1328363 1289294 1215729 1230588 1327512 1319596
3714 1319596 1363372 1272299 1276182 1287838 1100186 970876 1036626 1055962 1003034 951308 1037259
3703 1037259 1007439 899183 890204 866192 915307 1003456 984936 888972 894960 922986 919650 945705
3691 945705 992985 1059305 1013421 1022803 1054289 1020744 1060347 1102297 1019521 1005104 999818 1045236
3679 1045236 934756 901342 869375 895340 868012 770760 804060 768294 826905 798203 653818
3668 653818 673631 756240 744070 870466 904097 859790 796555 748114 919346 946845 793745
3657 793745 761755 805215 770467 698749 702081 692811 679591 582637 690496 758961 772723 668532
3645 668532 582396 626382 559527 601946 520846 527930 574903 577005 569191 593484 603561 608977
3633 608977 634082 558080 518692 463974 477611 500997 558347 580179 610342 598536 590428 458967
3621 458967 461599 514117 473128 448528 407995 404808 389002 502163 501312 383983 433185 468485
3609 468485 480621 521642 626641 509925 459900 599322 557112 663259 638578 634255 488909
3598 488909 523526 426956 466682 382860 426942 525918 492599 353220 285191 318912 390699
3587 390699 439715 290440 385104 378723 454237 444536 406402 389084 374933 307449 353095 401374
3575 401374 421000 322463 339296 396578 402411 351207 376530 309502 302397 477332 518752 556093
3563 556093 543451 538720 634409 633237 610750 642577 657346 712333 675556 603409 644098 542658
3551 542658 549840 599664 519204 493570 522081 551475 638710 555625 498465 460962 569407 622568
3539 622568 579818 638828 671709 637158 684132 790963 793050 836443 922405 914018 939561 958205
3527 958205 988318 898195 841543 906866 835878 816481 767199 721080 707992 722820 755556 799587
3515 799587 812549 774647 781158 793640 758244 833508 786062 766856 862676 891216 839413 927550
3503 927550 946679 970358 1042910 1039030 1040212 1043775 1031819 1034618 990091 910906 881998 862209
3491 862209 910097 982061 887623 992681 996779 954560 894358 882333 954982 984421 892196 821228
3479 821228 877824 887701 1001511 1026045 972394 1035053 1018377 938872 997404 951450 895430 954094
3467 954094 1002079 1030826 1038244 1099467 1105400 1015581 1025509 910477 991541 980228 886726 922857
3455 922857 995372 1018042 1023001 1002035 939588 969554 948647 1020443 1017365 1091055 1095544 1002893
3443 1002893 1121705 1186043 1206196 1208645 1263062 1307449 1280835 1397587 1408422 1475382 1461196
3432 1461196 1589124 1706227 1925852 2068445 2193396 2406375 2629930 2834357 2747722 2570015
3422 2570015 2222747 1902222 1790555 1692826 1716184 1702864 1530338 1490656 1542949 1546840 1445802
3411 1445802 1440747 1536937 1492206 1476172 1514045 1565021 1651609 1768102 1986315 2088765 2229270
3400 2229270 2420009 2509771 2732592 3056168 3365084 3722633 4079968 4480082 4728825 4354005
3390 4354005 3680471 3106824 2712010 2535599 2228018 2001171 1835592 1788349 1642985 1567367
3380 1567367 1520940 1538992 1497013 1522088 1463089 1450144 1527595 1475289 1437930 1391931 1322435
3369 1322435 1474928 1571539 1680224 1812103 1870416 1908656 2071631 2279265 2493668 2612281
3359 2612281 2424336 2209106 1954729 1641418 1423745 1198283 1111575 1198417 1210656 1146243
3349 1146243 1019542 1042010 1006886 1075456 1018751 908324 895297 790467 799435 845290 843963
3338 843963 767242 704320 674798 769344 770013 763716 826149 746529 780149 823285 780963 730621
3326 730621 811287 761495 646702 644708 678214 609032 671853 718926 746720 611695 623445
3315 623445 643901 652151 746673 674543 558739 532720 653297 692487 605834 696627 668358
3304 668358 619151 684733 608831 579985 608844 705409 726792 679085 753227 846962 815208 739943
3292 739943 811100 766101 663358 673414 801092 722899 701765 685744 588752 547902 553833
3281 553833 603601 584554 652573 684464 765959 674153 560257 557599 662768 672453 740530 819423
3269 819423 925659 997546 952548 962714 950063 1010620 1169649 1290282 1202470 1191507 1266218
3258 1266218 1296366 1306783 1276466 1372001 1372049 1402100 1411247 1382992 1368413 1323563 1242707 1274258
3246 1274258 1250646 1218846 1091741 941401 873093 776395 695731 781072 770123 718171 708434
3235 708434 682421 721667 730959 682089 658911 616983 527754 539362 409570 377260 441852 424817
3223 424817 444584 442965 462281 548403 653961 513593 420211 427990 394625 368239 375738 317335
3211 317335 366402 415098 326446 387443 324182 383025 415286 428598 363563 407657 386749 457808
3199 457808 465708 452676 402880 375057 286771 242321 240943 255540 246048 325728 337733 273990
3187 273990 329892 262266 278863 252084 313912 224634 252064 217878 286913 335440 288954 294422
3175 294422 261471 284221 161040 143934 51767 96168 199466 179033 115626 86643 45657
3164 45657 69885 81044 164808 215451 130758 161490 113119 91634 212563 162243 122548 107611
3152 107611 154520 226988 188008 216745 294883 319710 158246 138186 191446 142442 103200
3141 103200 165836 152493 97927 64240 59757 48611 83159 184907 204076 109927 116407 96871
3129 96871 55227 36703 105197 153671 274848 262610 181763 75632 37763 -2082 21314
3118 21314 82549 36654 79445 110045 44263 20546 -15385 -5372 31192 96929 79354 152118
3106 152118 134762 122611 23968 52343 37278 -27184 37110 76451 91728 -24446 76117
3095 76117 96655 138689 164428 165559 85112 129165 96836 20375 122300 79322 66491 124863
3083 124863 34287 64055 92097 42091 -12517 -31574 24160 124814 60859 54303 67753 117899
3071 117899 143855 26716 -67216 -64591 71932 59672 57807 44656 2790 15097 12765 158140
3059 158140 59169 -14763 -8714 -6556 -29657 -30167 655 -42532 -30327 -17758 -86408 -59658
3047 -59658 -19083 12290 -75154 -79484 6247 86077 123081 48667 112860 94636 -14698 87512
3035 87512 197999 166143 190404 106502 73037 57285 48024 81783 121438 65274 12449 -11026
3023 -11026 36074 60494 -70953 -3920 -36674 -73585 6383 -1517 -53295 -129326 -24981 3218
3011 3218 -19279 -10064 -20989 -53338 63007 156970 111253 54188 94976 35445 76133 87910
2999 87910 82803 102781 -51218 -90255 -78934 -1025 -235 -62470 26237 -22293 48590 84718
2987 84718 40972 27605 91447 101669 14709 42999 84447 54262 -5632 535 1186 -12870
2975 -12870 -71183 -52996 61932 16289 -31341 45738 -19862 30727 49942 2724 23287 39148
2963 39148 41008 80879 19007 121297 100663 -8072 -46817 102957 146837 220957 170011
2952 170011 134028 213749 155931 147875 145460 110334 146109 177374 141001 111378 65736 72824
2940 72824 131905 113831 144405 169903 170663 159982 93694 48296 22389 75046 44093 13489
2928 13489 60600 120298 108731 48214 37309 98887 39295 75467 185731 197121 173336 116067
2916 116067 182034 236318 93318 62961 126773 144775 154550 147769 166085 214413 30284 73155
2904 73155 207502 256113 171362 136828 133380 247544 223014 243328 303438 240586 199795 276854
2892 276854 216587 163193 242521 233350 174034 148755 91948 32917 57735 66266 56509 56647 109129
2879 109129 134630 238535 121901 38237 79443 118857 105240 109471 120274 151395 210343
2868 210343 124739 176444 148377 121288 193949 194993 134063 105414 153460 38230 2557 38678
2856 38678 111804 82446 34912 -33587 -63005 -94030 -136270 -64325 -8184 11551 102169 117838
2844 117838 85982 104322 64240 73065 131178 97970 58697 -81467 -87425 -11992 46679 56425
2832 56425 57026 -10135 -3600 -17889 61619 110161 2262 29456 77904 14098 -77294 -5793
2820 -5793 -42811 -20938 -38766 -4290 52290 81629 20886 -11757 64778 99221 78951 80529
2808 80529 46546 38059 42144 -91433 -62739 -19938 -4154 -14329 91034 110908 76155 13561
2796 13561 -57167 -65847 -42591 39763 14841 55605 12832 -17822 -21744 -24225 -114541 -103787
2784 -103787 -18071 -7189 -62219 -61137 46425 75128 77841 107744 89725 -10086 -33125 -50854
2772 -50854 10409 -6144 -70850 -83073 -128914 -171784 -127913 -59927 -5582 -50497 -21847 -10399
2760 -10399 -71688 11992 10010 -11775 -29773 32961 48036 -62541 -55530 20460 -47221 -62328
2748 -62328 -14443 -33439 55557 -37147 -108130 8817 -78370 -91049 -161516 -142037 -87113 -192048
2736 -192048 -225595 -117460 -63646 -78500 -9905 20988 2614 73059 54223 23569 11606
2725 11606 10802 74686 -11781 51320 -13055 23654 -44033 -28382 -50355 -61729 -28316 -7412
2713 -7412 -534 43654 -29322 -91782 1775 -55420 -21129 -23559 22772 -72076 -68088 -5006 -88026
2700 -88026 -123769 -79547 43020 63343 -69442 1787 76999 51753 65090 91877 67931
2689 67931 -5323 -53180 -61984 -39898 -34916 33641 100471 498 -66814 -101665 -98888 -38958
2677 -38958 -11403 -78843 -17464 -10636 59552 47862 11842 -27349 -31947 -20384 -82917 -70804
2665 -70804 -21285 46901 53180 29406 -6529 -45756 -104961 -149989 -111943 -116477 -111529 -50231
2653 -50231 -97082 -145188 -72573 -52510 -67178 -71817 -23582 646 -72579 -99826 -59278 -84098
2641 -84098 -97062 -96643 -37615 -40775 -105982 -161744 -134871 -102140 -101267 -62252 42827 -17034 -148354
2628 -148354 -137293 -185736 -77234 -74322 -85806 13694 -45847 -105868 -41852 -6356 -67325 -69334
2616 -69334 -5666 -102372 -51751 -87655 -29758 48667 53414 6477 -114273 -53229 -36660 -101460
2604 -101460 -96277 -42276 32198 1363 52935 16660 20117 -34775 -69800 -6766 78939 4908
2592 4908 -46746 33264 1429 468 20703 -35631 -58311 -44342 -182671 -188229 -81321 -39975
2580 -39975 -53326 -104670 -21589 19854 4048 3830 -29527 24461 130979 88068 -81160 -68174
2568 -68174 -67863 -120647 -60426 43297 5494 -1402 96560 101812 34753 -12897 43748 697
2556 697 51510 -33032 -18568 12972 29892 -3341 -104612 -35626 -46143 -57593 57430 31484
2544 31484 -44476 -84847 -88554 -23929 -55698 -91869 -108164 -118293 -49862 -43754 -134843 -80775
2532 -80775 -143222 -85899 1074 49509 18387 22542 -25944 -52642 -189980 -151474 -57697 -50004
2520 -50004 -5562 71234 1859 -18339 -50891 -12811 -44309 -18293 -789 -19789 -13076 -12408
2508 -12408 -110079 -43578 -3014 -62569 21336 53354 26184 -64514 -63502 -124648 -82908 -33452
2496 -33452 -106449 -124420 -100144 -64932 -10276 -14702 10796 -1815 -26318 67016 67512 40195
2484 40195 -26598 -97353 -122432 -53403 2806 -25042 6860 -28995 40252 35909 22518 39142
2472 39142 61231 46040 95251 46346 25474 52013 85624 18312 55550 22039 -19331 -56465
2460 -56465 -87247 -15293 8600 60555 2393 -11869 14028 -110334 -72522 -62228 -8462 -33757
2448 -33757 -57561 7842 65525 151611 93984 2266 -2463 -69522 -164727 -29840 58934 57665
2436 57665 10995 -43954 -5161 -3280 -57018 -14033 -27809 -44936 -48198 8119 -6904 -107655
2424 -107655 14089 -34660 -94417 -100250 -42403 74483 38619 10424 -76491 5874 -4470
2413 -4470 -35451 -56849 -76060 16221 119176 50376 1914 121271 72088 69744 48993 30821
2401 30821 62581 90264 24060 78816 -12649 -16743 79880 38447 -30461 -19774 -20296 1524
2389 1524 99812 145203 110721 64784 117881 151883 140719 218211 189039 146538 120409 160906
2377 160906 100391 134888 174035 59981 -15914 33741 30608 65340 196244 142755 169004
2366 169004 80893 45543 68908 138049 90192 65804 74865 157633 42822 60085 174415
2355 174415 108411 89544 98091 19430 124835 149968 127202 96551 86777 22829 100522 86134
2343 86134 112684 157767 114423 -6088 4577 -83016 104144 182831 145958 62659 25836
2332 25836 80887 1240 -27077 -96219 15023 854 68315 88680 77247 151208 191566 87842
2320 87842 85001 94324 69598 40201 81862 106871 160884 146055 138589 48282 20026 112912
2308 112912 87249 85198 153473 126275 162583 198239 275300 324617 151117 106056 129865 139732
2296 139732 67424 57694 79007 88520 127607 132578 134665 91724 56833 181903 263043 215296
2284 215296 220892 98988 166779 258838 295029 189852 219027 171135 159859 269278 284236
2273 284236 236373 202584 152995 220628 267656 194743 223552 274839 180033 153428 76927 210011
2261 210011 173261 180219 240079 166842 258071 305648 461577 402602 299529 316448 276853
2250 276853 164115 121770 201529 235763 282076 191243 171173 248834 209655 234154 254265
2239 254265 356121 397332 395972 391503 419986 390989 405077 349369 305252 294336 275936 337382
2227 337382 378057 407770 454170 473004 506775 493458 405428 365771 388616 521079 585677
2216 585677 480068 487102 537198 546472 516685 517208 590167 504318 587083 688844 682859 669305
2204 669305 638009 678895 711700 811103 816062 856287 897755 851412 822747 847727 892938 966721
2192 966721 1012567 990500 1015519 1010670 1123728 1126640 1083004 1129862 1184557 1055508 1002543 1216596
2180 1216596 1349064 1399146 1313115 1259914 1191024 1205727 1226629 1206170 1199041 1302291 1392343
2169 1392343 1351200 1475585 1442795 1430887 1536506 1685309 1633596 1524191 1669261 1632476
2159 1632476 1679938 1747248 1801972 1893328 1921287 1944764 2095590 2156375 2310469 2455062 2487219
2148 2487219 2507180 2717508 2805947 2870833 3112352 3277363 3371277 3501618 3615926 3889888
2138 3889888 4170876 4450499 4719482 4945674 5258524 5749326 6221133 6773363 7432059 8058615
2128 8058615 8806554 9764331 10642962 11629293 12879960 14313609 16008428 18213935 20817271
2119 20817271 23615464 26594834 30477571 34794598 39254066 44193325 50324498 53681565
2111 53681565 48723922 38718313 29551424 23640924 19579021 16483365 14248996 12607342
2103 12607342 11370296 10395415 9594336 9008909 8435383 8086129 7723243 7155555 6472155
2094 6472155 5856628 5461406 5037913 4626826 4432766 4197618 3926550 3678333 3485175 3322464
2084 3322464 3223681 3104087 2869624 2752235 2783498 2638004 2457495 2314628 2330094 2270211
2074 2270211 2227280 2073163 1976994 1937007 1805190 1829784 1750383 1642086 1637313 1570212 1568600
2063 1568600 1496055 1485511 1398369 1459282 1364016 1280175 1229218 1130002 1158178 1084110 976793
2052 976793 976832 1055298 950516 952111 953401 959598 944941 846449 903790 946215 862191 898285 787656
2039 787656 735481 847596 845703 816584 810733 854135 780835 748565 690846 679576 758696 691289
2027 691289 641227 651739 676739 659722 582693 584013 482894 395210 506690 530036 522395 516678
2015 516678 444311 404659 402699 348403 337671 400801 409175 462405 481623 408709 406322 533481
2003 533481 542653 404773 418392 379579 360253 382193 340138 266879 322360 260811 324817 425981
1991 425981 424226 317068 364672 337146 301802 280046 244010 273812 296901 349343 268559 225411
1979 225411 190664 142030 195664 186859 222521 203757 201263 180355 205069 204689 143082 76886
1967 76886 73751 136605 225578 106264 116013 68314 15087 39416 39162 82031 105816 92134
1955 92134 78440 201998 220901 110478 125614 25372 52600 108979 63748 58535 101788
1944 101788 172493 128564 213203 227978 180857 69981 30443 46008 -40660 1322 54435
1933 54435 78327 172562 167808 68393 20102 102763 61956 83867 64501 -2560 85825 171488
1921 171488 210087 178274 53369 98347 60601 11066 31939 91199 174346 142440 38588
1910 38588 131296 135023 124728 27305 1165 34807 88080 97866 53651 74356 104579 136822
1898 136822 49404 86965 74797 -7987 -87446 -105692 -9892 110105 168300 64648 24275
1887 24275 121843 88368 -28700 9516 15075 1364 -15745 6466 26255 32419 110354 94030
1875 94030 115538 39754 -73754 81191 95220 82602 99037 53184 -48959 17861 12225
1864 12225 52454 144358 136907 49260 42989 65862 -39743 32571 57556 84161 59070 78716
1852 78716 122429 139287 187162 289993 233723 169252 134938 84090 152278 141433 165003 235740
1840 235740 225929 163445 143544 146799 89905 120106 240728 164079 93346 138071 111280 138133
1828 138133 108871 73374 101813 76464 -11426 -31453 -45615 83384 21523 -20309 -18789 -9336
1816 -9336 10962 -60525 -38468 27089 7212 11260 124880 103453 112961 98833 45778 -49392
1804 -49392 -15540 -123983 -32853 39773 51662 8724 -13924 -11023 47226 41422 -19581 3452
1792 3452 -48483 -16094 43229 30374 -29433 89020 152605 -22641 -13380 -24569 -133481 -85646
1780 -85646 -31184 38926 -10078 38318 58281 49022 36010 8335 21821 14190 -85212 -76581
1768 -76581 -105934 -38203 22869 61821 46118 -3777 14745 -36788 -31913 -41292 -14296 27866
1756 27866 94892 91467 -32565 -68755 -40648 64078 138306 40608 -1171 -38211 -52537 -43350
1744 -43350 -59085 126596 28295 -119321 -84199 119783 41324 -45442 -108032 -49862 -89569
1733 -89569 -34752 -56267 -87350 3046 -5338 26658 -5355 95208 59373 95 28341 -39691
1721 -39691 -110517 57 -51338 -65608 -26878 -67792 -102293 -11953 -28184 -26798 -9302 -75690
1709 -75690 -57610 8840 -1422 -56363 -14652 -36151 -111048 -169792 -180220 -83622 -77298 -128631
1697 -128631 -84920 -29441 17563 44641 72057 56201 118260 88104 -90019 -147139 -120214
1686 -120214 -58142 -19546 13633 4356 -111189 -51263 -33548 -110519 -149549 -167242 -126185 -113559
1674 -113559 115021 54644 -83182 -72310 -5170 79725 118584 87916 -41487 -38627 84971
1663 84971 53169 -25591 65161 -16621 -88262 -25588 -95390 -26181 -31873 -49779 -71110 -29710
1651 -29710 -75597 -72228 15208 15426 -115010 -97025 -7989 17484 -96169 -78370 26299 -29724
1639 -29724 14551 47611 -93513 -126296 -174981 -55652 -27593 -47941 36752 -78495 -70341
1628 -70341 -16295 103731 95819 47806 89980 81093 99294 97516 26612 82734 92301 -487
1616 -487 -37405 -23790 -52044 -50246 -13883 7753 60353 15540 -65993 -164856 -247176 -158702
1604 -158702 -52812 8360 -142031 -88458 -40275 -4489 -40665 -38001 -20939 27432 86685
1593 86685 88150 101150 44954 43070 37065 -12926 -49412 40091 16881 -44266 -121990 51281
1581 51281 125336 50434 7995 2210 -49308 -75202 6527 26363 39490 27932 -31112 -54594
1569 -54594 -48381 -72460 -90612 -135744 -67546 40554 32113 17962 -34984 -69207 -80336 -30770
1557 -30770 -68721 -232447 -121038 -78416 -5537 107851 31333 -62611 -40146 -41268 -26486
1546 -26486 15907 -91501 -134897 -68275 1465 52422 41166 -73044 3411 55408 -84597
1535 -84597 -50425 -149953 -141494 -8020 60390 36110 70899 -34257 -55909 -147003 -110185 -57125
1523 -57125 -113333 -62737 -56431 -96206 -40478 -8968 59181 26926 2021 8660 3154 67912
1511 67912 65619 53757 116961 -6911 -119664 -70161 16777 47963 37201 78062 -8373 -66325
1499 -66325 -30002 -63201 -76762 -82308 -152577 -82355 -33617 52039 19766 -40274 -136391 -78968
1487 -78968 -52327 -42923 -165720 -138438 -22927 -34614 -66361 45278 28033 -50638 -62720
1476 -62720 -50209 -11212 30543 63776 34053 47345 18919 4940 7566 -25980 69723 41364
1464 41364 85831 99827 -22753 -66452 -109879 -96303 -91868 -37281 -48577 -99557 -57145 -41315
1452 -41315 -141371 39658 12381 -19727 2231 -152277 -74310 -82431 -66913 -55393 5491
1441 5491 68886 8547 80199 111037 32982 -126689 -80538 7944 5762 -32718 -1142 81194
1429 81194 15470 36691 -721 47512 -30302 18066 -10980 -19577 31959 -55966 -73780 -66971
1417 -66971 -97004 -74632 -47302 23490 97091 20710 -15001 41208 52397 8346 -26371 42502
1405 42502 -27477 -53122 47154 27603 24607 14027 -25409 -38152 73867 165919 123177 148810
1393 148810 100462 64082 85744 -76338 -81723 21621 -65193 -170102 -93682 -32451 26952
1382 26952 2542 89645 -29680 12864 -49458 -86082 27505 11138 -14770 -4675 -75055
1371 -75055 -97078 -74367 -54900 -97303 -8656 103568 57174 20305 45872 28921 -30040 -10564
1359 -10564 -37983 19384 47838 73711 15389 67857 1176 -57744 -38046 -29679 125750 37059
1347 37059 -85817 -96136 -137165 -115622 -153717 -20484 23335 6428 13902 51317 67219 157216
1335 157216 116714 91145 -13172 -50837 51666 -5607 -83971 -137097 -26726 31218 -106183
1324 -106183 -140577 -73495 -83782 -71170 -30388 -98922 -131726 -10653 5668 -83771 -77802 9974
1312 9974 -35181 4150 -47457 -4352 8306 33051 18656 26806 3744 -15820 -18543 50095
1300 50095 3375 -51355 -94288 -70739 -57093 24613 129123 82938 -26243 -20142 51378 -68492
1288 -68492 -123944 -78879 -24237 -141197 -125919 -147449 -76198 -36070 -56615 -60168 -13536 12529
1276 12529 -12279 45458 3745 -99922 -87051 -61231 92188 115443 25105 -24642 -89230
1265 -89230 -55770 20476 -66083 -22230 97432 -23992 -11497 -30619 -23107 -31918 -23510 22
1253 22 -30174 -77885 -179718 -48814 -13742 -50677 -59471 -76232 -34145 -26163 -29244 -63823 -3562
1240 -3562 -36289 -27999 -355 60079 -42835 -46320 -8750 -45442 -14167 -41614 -33379 -121674
1228 -121674 -67716 32068 95425 103901 29177 -16235 -86014 -87235 -25342 -65152 -23837 68347
1216 68347 82991 16107 -114635 -87951 -9504 -54212 84273 106510 38538 88822 81238 40669
1204 40669 -27683 -97854 -79757 11831 54655 32665 40566 72597 101680 92441 47972 31768
1192 31768 4207 9824 19056 -19126 -42043 9524 41338 -101942 -175811 -137933 -1800 -58603
1180 -58603 -102581 -48059 10416 2975 -35863 28542 -85688 -20559 37149 11049 -14899 -39469
1168 -39469 -3572 -58142 17769 28933 68059 101067 46301 -27394 -8440 -27996 -93787 -40339
1156 -40339 -3577 463 -37770 -37897 -6570 1651 113248 101972 26085 9254 -10410 30247
1144 30247 19523 46913 -11122 -1824 137071 64093 -13178 -37224 -68081 -17839 33656 -14634
1132 -14634 1725 -48544 -122363 -137574 -80771 -41397 -29305 54502 141305 128740 57138 3109
1120 3109 4635 -40703 -80843 -15984 -84910 -96884 -134276 -27204 2103 -36663 -33152 -10242
1108 -10242 105194 -11030 -75580 -59081 -113300 -186652 -142273 -103540 -145120 -77031 25813
1097 25813 46139 -24371 11074 -54965 42564 2642 -20069 -45946 -41827 -47139 -41625 -25377
1085 -25377 -13503 -37730 45474 20144 -22984 1373 27758 48167 -59589 -118499 -148266 -132256
1073 -132256 -107565 -65056 -33149 12958 -11505 -73505 -82054 -51396 85762 1527 -149240
1062 -149240 -114866 3941 22316 22693 60087 3357 -14272 -50547 46120 1283 -11198 16873
1050 16873 13018 30028 -81366 -4046 23137 31035 36352 -65462 -90119 -91199 -38199 -29083
1038 -29083 33370 61827 70385 4888 2936 -22670 -16171 -57143 -46136 -59013 -102033 -68917
1026 -68917 1952 35585 32623 40817 20 -34186 -102932 -87419 -25258 180944 182376 139602
1014 139602 99158 96077 24433 25852 80341 78196 11233 -79468 -92740 -100480 79722 69078
1002 69078 23484 -24715 13304 -53066 1134 6052 23210 -30390 -204213 -113638 16791 -29422
990 -29422 148514 141513 43349 107009 101699 39280 116260 20704 5470 -54893 40126 -7291
978 -7291 -52283 -69916 -62436 -43657 -85246 -53607 -10720 -26028 -76488 -55558 -93070 -53099
966 -53099 -65622 51344 31024 -66798 -152510 -58661 -84918 -63772 -96166 -42556 -80492 -130321
954 -130321 -70880 -63731 -49381 20935 36483 67109 -13010 25517 -47775 -68075 -46381 13513
942 13513 -34463 25754 -232 4835 102323 6116 19523 37315 -36703 -86184 18249 53505
930 53505 18874 77110 30476 -21893 1073 35002 -26191 -26405 -39031 -56276 -34269 24111
918 24111 23212 -53647 48696 -79816 -19544 67903 -1438 -91360 -26700 35632 62407 89566
906 89566 19062 84203 69136 16311 -13275 -33458 70318 124817 118216 114922 -8531 -54860
894 -54860 -95588 -118958 -99234 34237 78500 -3419 -8927 -34598 12177 35307 33104 -3403
882 -3403 59417 -41996 -56102 9074 43091 -27885 64879 -56686 -34372 52750 12551 -15805
870 -15805 -43846 -21263 -41774 8841 63851 90994 32982 -61580 -39354 -43659 -75777 -19760
858 -19760 -41188 -85530 -53311 -18571 -43122 -12599 32613 -24573 64084 60133 53573 101427
846 101427 83310 94436 27831 95380 54508 -83768 -86459 -64186 -88577 -66180 -90400 -77178
834 -77178 -121075 48213 22926 70933 -9562 -44092 -40432 -17834 88302 79005 14659 -95200
822 -95200 -84966 -181078 -129687 -63652 12999 -2420 -37056 2933 -67147 -35992 31184 -21784
810 -21784 60910 172833 26457 32957 10189 13390 23478 35501 -24383 -15543 3360 -41629
798 -41629 47857 47191 -32555 -75568 22358 -6193 -102839 -117481 -46238 -3189 9492 6975 81555
785 81555 6338 -111608 -9687 118593 157941 121088 -58499 -53764 34793 -4445 1295 79749
773 79749 50209 -63759 -33782 -59757 -22201 74616 22048 -11292 -33271 14224 31256 11923
761 11923 71744 61810 57886 92743 96993 97468 100438 127476 112356 53887 64766 14089 -17381
748 -17381 -23356 25339 -7787 -55663 -44536 -129467 -63729 -71927 -123765 -75553 3314 -1007 5576
735 5576 -22418 -102549 -9631 88091 135685 49971 97789 17235 -55530 -8810 41781 120568
723 120568 -20215 -66005 1642 -4906 -8352 59760 23947 6363 -80557 -75962 17824 37140
711 37140 74385 60955 37282 52291 -9104 -75061 -33552 -10291 788 51503 116221 180560
699 180560 3228 -19522 86244 11077 12354 61477 -19446 -86923 -3850 14381 -13639 19876
687 19876 71581 109385 88314 22596 -48793 31053 9759 40463 61027 14329 10246 31125
675 31125 -89444 -112269 -4397 111651 97560 -5546 -144353 -68430 -85756 -74970 -16266
664 -16266 -2258 -11113 -72956 -41062 -46465 5836 -42384 -92297 -73235 -4044 46137 -16732
652 -16732 -27002 49168 97637 77792 63032 155463 -8542 304 178 -46530 -32201 -42441
640 -42441 37257 65719 -11224 -73613 -178056 -51339 -22937 -116578 -34605 -29173 12176 20359
628 20359 54843 10539 24985 77098 -1173 45196 -12680 -31145 -11855 4737 -35313 -13378
616 -13378 14954 -8456 -24887 13446 4660 -46266 -117994 -61622 -82396 -17434 41353 148538
604 148538 18473 30798 21623 8828 -23969 -50579 33778 100901 76926 -45630 -48324 -37494
592 -37494 -97042 -38703 -52918 7693 100672 111661 169087 69397 25240 32150 16553 -8277
580 -8277 33852 20838 44192 105345 3621 -107290 10770 54479 72974 38522 -15310 -63149
568 -63149 965 -79169 -91154 -56339 96819 153725 89423 23128 -79125 -152375 -145284 -49852
556 -49852 42593 -54556 -85084 5259 -47988 -98525 -64161 -61078 -19961 34342 -23416 -70443
544 -70443 -73633 -58296 3215 15902 28341 33044 -13116 -44334 -34903 -3023 68560 -55735
532 -55735 -22646 -6221 -8126 38477 94897 119512 131326 -6250 -63007 -17414 35961 -1902
520 -1902 -71456 -7187 50120 37209 36772 93794 4381 -58029 -89698 -49915 -15197 47486 111026
507 111026 24102 51402 81063 171231 164558 -60593 -102896 -53242 -8206 45979 44829 52659
495 52659 -35248 -77786 -133272 -28354 51327 87349 77459 -40913 15901 2416 -7190 28580
483 28580 77184 187956 164046 -7852 -48034 -42824 9721 81899 55286 23117 3434 -46167
471 -46167 -23753 19026 118154 75675 -15159 50607 56545 4744 8635 -10488 52207 -13736
459 -13736 1027 -13605 14895 187206 196846 114751 85347 2745 14231 -33074 -39900 61076
447 61076 115174 107213 81106 154496 74627 138447 97151 45825 113762 -19796 68869 68710
435 68710 73395 165850 110705 59532 42941 -27732 -50080 -44099 -51751 64887 106478 13633
423 13633 37842 27346 -22560 -51126 -90626 -155600 -78456 38891 35476 -97114 3663 40004
411 40004 58140 116112 12384 -41991 -32932 18351 -49331 -14229 -27971 -10122 74086 29011
399 29011 32943 61125 7691 -15686 63540 -9764 115189 66977 -4623 49789 110931 52774
387 52774 5778 37993 34911 43272 34675 15195 62973 94926 61670 58710 55241 85100 73535
374 73535 110001 138271 85442 11387 -9276 -20514 84970 -256 64649 99300 124948 248889
362 248889 288201 192919 201886 89137 47416 61175 73595 67559 61893 150031 92168 -52236
350 -52236 -47393 11678 -31635 6521 105641 68886 143973 108104 19924 65481 -77940 -91956
338 -91956 2976 58226 3071 -56573 -34006 -19093 108048 162968 177380 97072 103218 158981
326 158981 84865 51490 71086 4917 -100878 -8757 -35771 -84534 -31097 -20028 -15414 -1008
314 -1008 -17927 -78827 25908 -23774 -29703 11049 902 41899 11519 -34911 -22522 14065
302 14065 -15855 -58968 -78291 70883 12454 -41259 9474 -49186 25922 121435 180708 68993
290 68993 46697 90433 108622 69844 71515 83428 59099 120653 26681 22073 120422 54302
278 54302 -12432 16877 -650 55382 151379 126775 82090 -27100 45335 56812 -12100 -101161
266 -101161 -98843 34288 18023 37586 -53219 -33411 20796 105102 106894 63713 27981 -32379
254 -32379 17531 38521 -14369 49264 62506 67130 112189 103817 13828 41640 8954 -32930
242 -32930 76039 73611 36643 81312 98640 137537 146909 40767 -64532 -83504 -3091 57076
230 57076 143101 161502 121470 150019 61640 -1655 -8664 -35650 -41268 59682 114465 175793
218 175793 123629 -9782 1549 8208 -59412 8029 97786 37101 80033 62990 25979 -17627
206 -17627 70654 128018 -37720 3400 92457 4449 17040 19315 26953 104298 142463 130457
194 130457 45011 3953 50597 101670 111797 99161 42853 63646 85140 53083 94190 86188
182 86188 101762 66513 72944 176420 144153 91451 74187 10457 -6739 -7599 60649 120610
170 120610 7200 2157 65917 78560 54442 97320 16558 -33007 -24174 20985 33306 89401
158 89401 71263 36709 -19212 -81699 -8842 -35487 71475 101406 121552 93794 57323 89397
146 89397 19784 20367 102488 11740 -57210 11686 100915 75626 -38706 -7645 -1981 -6398 -33018
133 -33018 -804 85699 75877 98430 106383 3399 24053 92550 40263 86235 76013 115543
121 115543 70264 93150 30149 -89838 40633 67234 51113 34748 12049 4711 19838 17990
109 17990 80545 55490 1060 32924 55473 18092 13622 35406 95614 85865 18298 142275
97 142275 104631 35284 73810 118126 47011 24059 100836 55713 41895 134915 108568 110627
85 110627 54253 -535 -2380 9079 16050 30367 64457 73823 37127 8066 -69679 -86556 -82378
72 -82378 -53933 16441 49933 69463 71616 11360 -38497 25256 90445 31993 56568 76396
60 76396 20639 7715 28844 -8238 17349 45182 112348 122491 55455 94303 47498 17277
48 17277 80276 71425 94895 99173 86343 56858 48737 108378 28278 101451 91879 91983 79199
35 79199 113096 120488 110840 39510 65588 40615 63602 42868 -51619 -26272 -30487 -676 16756
22 16756 41135 75585 102351 117631 83346 -1048 -4288 26678 30462 74249 83099 102542 97033
9 97033 107620 105330 42749 -28829 16981 83134 51238 22164 3105
0 3105
$$ Imaginary data points
##PAGE= N=2
##DATA TABLE= (X++(I..I)), XYDATA
16383 -647721 -619449 -553807 -575536 -605494 -660267 -652671 -654664 -583318 -495507 -475782 -398361 -419768
16371 -419768 -331758 -422644 -464143 -482249 -464445 -371099 -357597 -328207 -348666 -380043 -376615 -330971
16359 -330971 -316475 -271632 -215273 -214983 -255591 -323566 -326683 -285076 -206038 -220066 -188051 -117428
16347 -117428 -114133 -133635 -213064 -194783 -106301 -103208 -106834 2068 -11008 14911 19041 75630
16335 75630 81192 58172 117075 138961 57752 62829 94243 92704 153946 165581 237327 219457
16323 219457 165048 240783 250243 232960 238268 185301 169855 225535 268358 269335 283805 303320
16311 303320 356202 363225 373831 385425 383110 387020 381185 413012 370642 415137 463804 511182
16299 511182 502254 567385 526972 550578 536177 523025 516494 499467 590275 708806 730526 599899
16287 599899 596814 531688 627625 636575 728706 726684 701010 702217 682000 706298 771287 710316
16275 710316 716454 763010 734781 669856 771444 849014 829728 761221 728447 809637 816094 757124
16263 757124 792643 878310 868970 909993 891076 915196 940150 935395 996719 1110485 1025470 1053556
16251 1053556 1053194 975449 984522 989573 1008991 978801 1005605 1023679 984655 1036427 1064024 1007791
16239 1007791 1038845 975598 1026482 1039125 1021023 1069353 1123882 1045982 1029636 1063684 1200896
16228 1200896 1243241 1171680 1142730 1187033 1107834 1111599 1209374 1223969 1236822 1254204 1209232
16217 1209232 1145285 1184386 1159871 1277833 1268465 1221533 1163649 1264330 1301583 1325752 1306889
16206 1306889 1385952 1382220 1275162 1240053 1265089 1309972 1224711 1320676 1392741 1397943 1395038 1270454
16194 1270454 1258021 1277267 1264806 1307647 1378546 1361944 1320576 1286368 1392965 1474774 1474950
16183 1474950 1404671 1361363 1385087 1374639 1317231 1365968 1271127 1256209 1374659 1425005 1376067
16172 1376067 1439639 1438738 1485350 1502647 1386979 1398011 1463349 1394447 1369083 1383149 1398161
16161 1398161 1447181 1473480 1391523 1294224 1436745 1601584 1559243 1580888 1559843 1655610 1624480
16150 1624480 1477345 1513117 1518292 1508631 1475290 1514655 1554266 1578938 1553512 1636777 1551625
16139 1551625 1537514 1528480 1471619 1391718 1431124 1473736 1583295 1475011 1456900 1537758 1534516
16128 1534516 1597037 1620290 1533751 1564270 1488272 1519243 1582714 1533226 1554374 1623085 1593198
16117 1593198 1577394 1556885 1482862 1572981 1597854 1547847 1536167 1503932 1467243 1630160 1696765
16106 1696765 1668379 1611668 1670990 1643207 1571749 1629085 1579104 1578109 1620083 1632160 1652943 1728801
16094 1728801 1778473 1699965 1645084 1589921 1516830 1564259 1616543 1582713 1536994 1565652 1520487
16083 1520487 1575397 1691294 1578711 1648839 1664147 1588104 1635873 1587068 1592498 1541949 1601906
16072 1601906 1559809 1440057 1473532 1594515 1578897 1511934 1674387 1751331 1661219 1649873 1695316
16061 1695316 1630645 1568283 1487578 1531338 1635947 1592253 1643176 1664650 1589799 1715712 1717905
16050 1717905 1724136 1768658 1627068 1572729 1493803 1543173 1526759 1504563 1592962 1675644 1735080
16039 1735080 1745329 1691749 1644493 1634206 1693183 1764576 1715239 1660748 1681139 1662012 1558869
16028 1558869 1639180 1602815 1518380 1563150 1598683 1708945 1684795 1547147 1688284 1692504 1687749
16017 1687749 1678864 1657133 1649288 1683956 1615449 1611501 1652995 1752390 1769291 1675921 1714388 1679910
16005 1679910 1611490 1694032 1727834 1648032 1618935 1636728 1723527 1716208 1594896 1548495 1551892
15994 1551892 1621368 1661098 1625400 1512278 1460663 1558152 1618648 1576091 1722372 1683458 1653601
15983 1653601 1622173 1719401 1741121 1650076 1750221 1682806 1706580 1753408 1708398 1629095 1633315
15972 1633315 1711783 1752921 1606234 1635341 1635620 1595155 1602572 1644615 1586574 1589937 1657926 1804502
15960 1804502 1685075 1598837 1721726 1646948 1560020 1677647 1721114 1711165 1702413 1657976 1605865
15949 1605865 1676317 1636495 1681551 1680818 1718423 1724162 1689274 1717634 1632402 1766665 1806236 1755691
15937 1755691 1646341 1641073 1565364 1617235 1697358 1629180 1677060 1769378 1595787 1549112 1668739
15926 1668739 1552827 1475639 1527920 1577794 1678107 1748789 1607654 1643150 1752086 1669485
15916 1669485 1684913 1662155 1580478 1618308 1660960 1722371 1682659 1631653 1719674 1699741 1557187
15905 1557187 1716179 1631270 1581943 1722869 1640964 1609636 1657013 1680944 1637915 1605942 1762479
15894 1762479 1740101 1685701 1701088 1720520 1739145 1690362 1635258 1574555 1694055 1687848 1753384
15883 1753384 1753078 1704075 1708790 1698904 1684647 1722998 1631535 1687970 1724052 1756615 1694881 1742948
15871 1742948 1745984 1802811 1790804 1794252 1827163 1810864 1759336 1661846 1571625 1610345 1736833
15860 1736833 1760616 1744940 1694138 1723365 1622792 1672245 1633492 1685295 1742230 1750549 1743223
15849 1743223 1719546 1566676 1599580 1762028 1701249 1597239 1596859 1664811 1643648 1673622 1631752
15838 1631752 1554914 1553856 1613484 1533779 1630005 1652334 1675869 1690898 1686870 1683076 1638111 1608482
15826 1608482 1600952 1624451 1621712 1677254 1745407 1751838 1719593 1665400 1653848 1736973 1726316 1755020
15814 1755020 1728767 1789805 1775222 1823911 1754596 1729283 1709038 1693798 1669701 1658094 1583512
15803 1583512 1667220 1700117 1668246 1713555 1638206 1608758 1656730 1659070 1647829 1718209 1826941
15792 1826941 1737803 1699729 1740508 1731108 1676123 1740184 1705305 1660916 1791701 1770426 1730532
15781 1730532 1737861 1787617 1881969 1778907 1723274 1675371 1635477 1688667 1604568 1621360 1617295
15770 1617295 1696757 1667174 1593523 1669777 1770239 1741785 1690309 1702893 1754629 1751619 1768992
15759 1768992 1713570 1657615 1763869 1744886 1673542 1637377 1656257 1737590 1847462 1748809 1707729
15748 1707729 1730480 1703635 1634832 1636776 1677042 1677668 1718958 1724557 1729797 1774718 1867048 1770972
15736 1770972 1700561 1597696 1639776 1719784 1726669 1712860 1571575 1593235 1621788 1594095 1678934
15725 1678934 1706823 1890221 1804233 1734449 1728882 1690349 1612400 1701376 1727259 1651572 1658243
15714 1658243 1773223 1729351 1726377 1682608 1667139 1720344 1766492 1787598 1670944 1585899 1643202
15703 1643202 1723047 1675920 1659304 1649105 1621917 1597417 1648304 1629757 1743162 1853988 1817792
15692 1817792 1726526 1771435 1843566 1780809 1674251 1632832 1673895 1718006 1743370 1801865 1746642
15681 1746642 1810546 1817301 1748682 1685788 1689144 1706111 1750092 1799245 1728420 1708344 1654713 1626552
15669 1626552 1618883 1641824 1616505 1687947 1618742 1596644 1736689 1717463 1732415 1716161 1679666
15658 1679666 1616840 1695338 1719563 1732802 1697902 1709217 1750078 1742598 1736247 1731135 1726767 1748544
15646 1748544 1783780 1793985 1750410 1845584 1770561 1720201 1678611 1680873 1755025 1648589 1656961
15635 1656961 1615516 1621009 1678144 1735376 1689345 1740189 1726692 1763784 1834831 1820003 1877305
15624 1877305 1794261 1824975 1755133 1694652 1707292 1830628 1789609 1771631 1774531 1767217 1759346 1809852
15612 1809852 1746321 1630180 1717121 1747590 1684307 1720499 1839040 1823519 1857170 1711582 1632977
15601 1632977 1603355 1632851 1703022 1721094 1686588 1611128 1646353 1741745 1769715 1765699 1630247
15590 1630247 1598005 1705996 1811082 1775187 1797716 1764276 1800776 1729690 1645959 1724506 1707682
15579 1707682 1714942 1715772 1731538 1834153 1824604 1696613 1780756 1762462 1719814 1750554 1829516 1821943
15567 1821943 1725231 1668653 1631756 1779933 1776623 1770071 1757977 1701517 1717137 1726975 1752191 1719663
15555 1719663 1685676 1707465 1684577 1688152 1688049 1736992 1802609 1726251 1685188 1651516 1739790 1781282
15543 1781282 1803389 1842254 1854543 1826298 1777849 1742839 1802758 1767326 1649323 1727437 1832331
15532 1832331 1820224 1752800 1729823 1671523 1698584 1682992 1699985 1758797 1699363 1705168 1754166
15521 1754166 1739431 1755141 1786085 1681609 1705735 1737310 1832043 1819018 1730259 1782433 1837794
15510 1837794 1738386 1638324 1693195 1713897 1809667 1818843 1813989 1905503 1906240 1811992 1802705 1813287
15498 1813287 1811650 1831702 1832788 1856621 1816253 1807060 1727411 1685027 1784343 1735690 1726122 1745383
15486 1745383 1647512 1675880 1711961 1683374 1685130 1749331 1810543 1822957 1777434 1777000 1809554 1720368
15474 1720368 1706940 1765336 1778907 1754159 1792600 1773088 1765281 1807240 1782416 1741120 1711576
15463 1711576 1680992 1624949 1693226 1846994 1798831 1813957 1877396 1847650 1880258 1845126 1784449
15452 1784449 1778658 1696718 1763310 1825521 1854646 1817155 1785097 1798083 1828319 1784230 1801182
15441 1801182 1812445 1811247 1829012 1769289 1856586 1792354 1790805 1832711 1903981 1799455 1664432
15430 1664432 1719023 1704507 1718448 1776806 1815755 1746122 1769383 1735755 1829760 1832866 1632891
15419 1632891 1699145 1855789 1876540 1727691 1764227 1784789 1741060 1699346 1584397 1628604 1642909
15408 1642909 1655271 1725248 1819465 1772077 1678464 1700423 1782807 1814876 1793323 1943319 1878892
15397 1878892 1741851 1786727 1840170 1867218 1729173 1709779 1762750 1752976 1723837 1726714 1866589
15386 1866589 1939948 1884592 1719990 1705500 1760224 1660327 1667961 1605767 1576630 1694973 1605758
15375 1605758 1703514 1762723 1694439 1739245 1799521 1800902 1785267 1818633 1805310 1800979 1752260 1725209
15363 1725209 1777752 1686041 1734603 1772086 1710836 1769010 1860991 1769422 1806000 1755010 1712858
15352 1712858 1816978 1827277 1826915 1746784 1749260 1783371 1818290 1824024 1769925 1712756 1734772 1820472
15340 1820472 1906008 1806993 1850523 1838104 1730792 1744839 1690934 1683792 1713096 1811796 1806542
15329 1806542 1795815 1742603 1718300 1742927 1695377 1776367 1790094 1759502 1776592 1799403 1865143
15318 1865143 1862977 1803047 1764171 1759543 1761876 1803728 1802546 1761815 1722286 1764131 1829603 1810614
15306 1810614 1786629 1868223 1824874 1757273 1728482 1772947 1904621 1878054 1848066 1867335 1843106
15295 1843106 1808073 1920851 1816026 1833727 1924200 1916297 1905867 1831870 1840001 1820415 1852111
15284 1852111 1932397 1825988 1916860 1828816 1780639 1901405 1821566 1812750 1763340 1718315 1792701
15273 1792701 1756336 1745449 1743374 1771706 1824415 1875452 1865828 1824460 1891263 1851388 1766689 1733980
15261 1733980 1772325 1720422 1715587 1644571 1651915 1687121 1744444 1848381 1875712 1836533 1848554
15250 1848554 1842157 1959559 1826983 1877485 1909844 1882452 1865818 1796998 1859060 1740976 1822251
15239 1822251 1927318 1797957 1781956 1827028 1802924 1898699 1873691 1844760 1840804 1817191 1771383
15228 1771383 1829100 1796055 1758855 1820063 1839346 1767236 1739959 1708354 1762854 1772906 1644909
15217 1644909 1709594 1834798 1822456 1838158 1798779 1790483 1748839 1791356 1816717 1898813 1862369
15206 1862369 1784440 1746501 1791481 1843916 1892212 1857382 1806556 1787725 1799391 1879977 1850432
15195 1850432 1743476 1700918 1695127 1734955 1840172 1902234 1890661 1875222 1865644 1851803 1793978
15184 1793978 1894276 1947511 1895123 1875876 1869009 1891291 1895679 1873342 1964812 1960600 1870727 1878227
15172 1878227 1872273 1814772 1821060 1821172 1814279 1869923 1908711 1980297 1974772 1899156 1870876 1941108
15160 1941108 1881263 1838877 1770229 1845434 1857634 1881494 1744459 1799831 1872944 1870807 1643398
15149 1643398 1590123 1696432 1696896 1729294 1912156 1950064 1928862 1923197 2002773 1932505 1924422 1900510
15137 1900510 1914293 1911943 1812466 1836277 1811054 1801187 1778389 1654021 1628541 1709701 1742691
15126 1742691 1762044 1942859 1996387 1969705 1840098 1762471 1797198 1744435 1666388 1678728 1733673
15115 1733673 1760760 1779192 1768299 1829075 1844465 1870070 1867647 1789800 1724664 1868411 1898634
15104 1898634 1826160 1782364 1844291 1761742 1886061 1906299 1879506 1905496 1887976 1909316 1902147
15093 1902147 1916494 1901676 1874065 1905699 1831201 1865352 1844892 1722643 1806260 1865489 1921188
15082 1921188 1887221 1850984 1803626 1716878 1795870 1853279 1804160 1782137 1902433 1927695 1912586
15071 1912586 1895835 1935212 1868009 1848889 1850183 1872112 1923946 1912052 1943192 2004507 1833847
15060 1833847 1824466 1835536 1869795 1869009 1995083 1986590 1968206 1870773 1768604 1819181 1790040 1765540
15048 1765540 1785364 1890541 1976538 1882451 1784944 1855071 1829122 1745093 1718065 1776857 1852582
15037 1852582 1862312 1794406 1744505 1763952 1821656 1759682 1820138 1757179 1836067 1810663 1838453
15026 1838453 1818628 1915451 1965574 1947654 1936668 1815583 1793511 1820092 1989563 1981326 1839178
15015 1839178 1789340 1850943 1857503 1814786 1854321 1925348 1820665 1798569 1875299 1946084 1892099
15004 1892099 1870817 1843713 1933887 1983761 1850185 1864326 1897576 1952516 1950256 1975374 1905503
14993 1905503 1889832 1884330 1837073 1797202 1790449 1759446 1764122 1882277 1866853 1782852 1854216 1937081
14981 1937081 2002194 1860560 1829279 1999464 1978453 1957163 1832327 1739341 1788997 1883599 1837732
14970 1837732 1836990 1869093 1823772 1853945 1823131 1744599 1847224 1941884 1937851 2033726 1906065
14959 1906065 1833477 1818498 1838536 1845390 1881835 1896230 1893710 1875804 1823861 1740788 1802340 1792876
14947 1792876 1782738 1836663 1821923 1826924 1806439 1849894 1795096 1821558 1875553 1857912 1812500
14936 1812500 1844219 1942785 2035380 1954228 1896473 1921165 1899312 1910976 1986933 1983270 1946287
14925 1946287 1895533 1892329 1839598 1851736 1786230 1782388 1880091 1814272 1913523 2021765 2033078
14914 2033078 1950871 1978689 1859462 1795961 1896027 1891684 1931602 1953956 1993383 2006215 1910712
14903 1910712 1897339 1941032 1918290 1912571 1923582 1807887 1664804 1732521 1844119 1842992 1863348
14892 1863348 1813566 1842601 1899638 1860809 1791406 1880561 1852001 1770894 1819868 1873360 1887834
$$ [...]
##END NTUPLES=NMR SPECTRUM
##END=
