##TITLE=1H_EC-3267(1-1)
 CDCl3
 8 sc, 
 9.11.2021
##JCAMPDX= 6.0         $$ Bruker NMR JCAMP-DX V2.0
##DATA TYPE= NMR SPECTRUM
##DATA CLASS= NTUPLES
##ORIGIN= UXNMR, Bruker Analytische Messtechnik GmbH
##OWNER= root
$$ XWIN-NMR		Version 3.5
$$ Tue Nov  9 11:05:45 2021 Russian Standard Time (UT+4h)  she@DPX200
##.OBSERVE FREQUENCY= 200.1313468511
##.OBSERVE NUCLEUS= ^1H
##.ACQUISITION MODE= SIMULTANEOUS
##.ACQUISITION SCHEME= undefined
##.AVERAGES= 8
##.DIGITISER RES= 18
##SPECTROMETER/DATA SYSTEM= spect
##.PULSE SEQUENCE= zg30
##.SOLVENT NAME= D2O
##.SHIFT REFERENCE= (INTERNAL, D2O, 0, 15.7293)
##AUDIT TRAIL= $$ (NUMBER, WHEN, WHO, WHERE, WHAT)
$$ ##TITLE= Audit trail, XWIN-NMR		Version 3.5
$$ ##JCAMPDX= 5.01
$$ ##ORIGIN= Bruker BioSpin GmbH
$$ ##OWNER= she
$$ F:/spectra/data/she/nmr/H-F/1/pdata/1/auditp.txt
$$ ##AUDIT TRAIL=  $$ (NUMBER, WHEN, WHO, WHERE, WHAT)
(   1,<2021-11-09 11:04:33.64 +0400>,<she>,<DPX200>,
      <created by zg, POWCHK disabled, PULCHK disabled
       configuration hash MD5:
       00 E9 B6 7A A2 85 ED C7 34 08 36 98 17 FE 4E 26
       data hash MD5: 16K
       8B 2F 9D DE 59 EB 1E 81 C7 3B AA AA 7B E1 CF F4>)
(   2,<2021-11-09 11:04:36.45 +0400>,<she>,<DPX200>,
      <Start of raw data processing
       efp BC_mod = 2 LB = 0.24 FT_mod = 6 PKNL = 1 PHC0 = -15511.34 PHC1 = 10.80082 SI = 16K 
       data hash MD5: 16K
       61 FE 55 19 D2 5C C2 2F 3E 87 74 EB 1D D7 27 BF>)
(   3,<2021-11-09 11:04:56.87 +0400>,<she>,<DPX200>,
      <pk PHC0 = -0.1962308 PHC1 = 0.5999999 
       data hash MD5: 16K
       66 8F BC 74 EB 27 70 3D 6D C1 14 A2 35 13 FD D7>)
(   4,<2021-11-09 11:05:00.20 +0400>,<she>,<DPX200>,
      <abs ABSG = 5 
       data hash MD5: 16K
       61 16 12 31 E3 88 BD 5F 45 6D AE 14 6F 00 94 38>)
$$ ##END=
$$ 
$$ hash MD5
$$ 73 A0 81 3C 12 DC 47 4E 28 C2 B1 6C 9E 93 74 A8
##$RELAX= 
##$RELAX= 
##$RELAX= 
##$RELAX= 
##$RELAX= 
##$RELAX= 
$$ Bruker specific parameters
$$ --------------------------
##$DU= <F:/spectra>
##$EXPNO= 1
##$NAME= <H-F>
##$PROCNO= 1
##$TYPE= <nmr>
##$USER= <she>
##$AMP= (0..31)
100 100 100 100 100 100 100 100 100 100 100 100 100 100 100 100 100 100 
100 100 100 100 100 100 100 100 100 100 100 100 100 100 
##$AQSEQ= 0
##$AQ_mod= 1
##$AUNM= <au_zg>
##$AUTOPOS= <>
##$BF1= 200.13
##$BF2= 200.13
##$BF3= 200.13
##$BF4= 200.13
##$BF5= 200.13
##$BF6= 200.13
##$BF7= 200.13
##$BF8= 200.13
##$BYTORDA= 1
##$CFDGTYP= 0
##$CFRGTYP= 5
##$CHEMSTR= <none>
##$CNST= (0..31)
1 1 145 1 1 1 1 1 1 1 1 1 1 1 1 1 1 1 1 1 1 1 1 1 1 1 1 1 1 1 1 1 
##$CPDPRG= <>
##$CPDPRG1= <>
##$CPDPRG2= <>
##$CPDPRG3= <>
##$CPDPRG4= <mlev>
##$CPDPRG5= <mlev>
##$CPDPRG6= <mlev>
##$CPDPRG7= <mlev>
##$CPDPRG8= <mlev>
##$CPDPRGB= <>
##$CPDPRGT= <>
##$D= (0..31)
0 1.2 0 0 0 0 0 0 0 0.06 0 0.03 0 0 0 0 0.0002 0 0 0 0 0 0 0 0 0 0 0 0 
0 0 0 
##$DATE= 1636441473
##$DBL= (0..7)
120 120 120 120 120 120 120 120 
##$DBP= (0..7)
150 150 150 150 150 150 150 150 
##$DBP07= 0
##$DBPNAM0= <>
##$DBPNAM1= <>
##$DBPNAM2= <>
##$DBPNAM3= <>
##$DBPNAM4= <>
$$ [...]
##$SUBNAM2= <"">
##$SUBNAM3= <"">
##$SUBNAM4= <"">
##$SUBNAM5= <"">
##$SUBNAM6= <"">
##$SUBNAM7= <"">
##$SUBNAM8= <"">
##$SUBNAM9= <"">
##$SW= 18.0517286264689
##$SWIBOX= (0..15)
0 0 2 0 0 0 0 0 0 0 0 0 0 0 0 0 
##$SW_h= 3612.71676300578
##$TD= 16384
##$TD0= 1
##$TE= 0
##$TE2= 300
##$TE3= 300
##$TEG= 300
##$TL= (0..7)
0 120 120 120 120 120 120 120 
##$TP= (0..7)
150 150 150 150 150 150 150 150 
##$TP07= 0
##$TPNAME0= <>
##$TPNAME1= <>
##$TPNAME2= <>
##$TPNAME3= <>
##$TPNAME4= <>
##$TPNAME5= <>
##$TPNAME6= <>
##$TPNAME7= <>
##$TPOAL= (0..7)
0.5 0.5 0.5 0.5 0.5 0.5 0.5 0.5 
##$TPOFFS= (0..7)
0 0 0 0 0 0 0 0 
##$TUNHIN= 0
##$TUNHOUT= 0
##$TUNXOUT= 0
##$USERA1= <user>
##$USERA2= <user>
##$USERA3= <user>
##$USERA4= <user>
##$USERA5= <user>
##$V9= 5
##$VALIST= <valist>
##$VCLIST= <CCCCCCCCCCCCCCC>
##$VD= 0
##$VDLIST= <DDDDDDDDDDDDDDD>
##$VPLIST= <PPPPPPPPPPPPPPP>
##$VTLIST= <TTTTTTTTTTTTTTT>
##$WBST= 1024
##$WBSW= 4
##$XGAIN= (0..3)
0 0 0 0 
##$XL= 0
##$YL= 0
##$YMAX_a= 164838
##$YMIN_a= -273225
##$ZGOPTNS= <>
##$ZL1= 120
##$ZL2= 120
##$ZL3= 120
##$ZL4= 120
##$ABSF1= 15.76782
##$ABSF2= -2.284031
##$ABSG= 5
##$ABSL= 3
##$ALPHA= 0
##$AQORDER= 0
##$ASSFAC= 0
##$ASSFACI= 0
##$ASSFACX= 0
##$ASSWID= 0
##$AUNMP= <proc_1d>
##$AZFE= 0.1
##$AZFW= 0.1
##$BCFW= 0
##$BC_mod= 2
##$BYTORDP= 0
##$COROFFS= 0
##$CY= -3
##$DATMOD= 1
##$DC= 0
##$DFILT= <>
##$DTYPP= 0
##$F1P= 0
##$F2P= 0
##$FCOR= 1
##$FTSIZE= 16384
##$FT_mod= 6
##$GAMMA= 0
##$GB= 0
##$INTBC= 1
##$INTSCL= 0
##$ISEN= 128
##$LB= 0.24
##$LEV0= 0
##$LPBIN= 0
##$MAXI= 10000
##$MC2= 0
##$MEAN= 0
##$ME_mod= 0
##$MI= 1.114404
##$NCOEF= 0
##$NC_proc= -6
##$NLEV= 6
##$NOISF1= 3.799351
##$NOISF2= 2.8
##$NSP= 0
##$NTH_PI= 0
##$NZP= 0
##$OFFSET= 15.72926
##$PC= 1
##$PHC0= -15511.54
##$PHC1= 11.40082
##$PH_mod= 1
##$PKNL= yes
##$PPARMOD= 0
##$PSCAL= 0
##$PSIGN= 0
##$REVERSE= no
##$SF= 200.130005312282
##$SI= 16384
##$SIGF1= 3
##$SIGF2= 2
##$SINO= 5.538805
##$SIOLD= 16384
##$SREGLST= <1H.CDCl3>
##$SSB= 0
##$STSI= 16384
##$STSR= 0
##$SW_p= 3612.71676300578
##$SYMM= 0
##$S_DEV= 0
##$TDeff= 16384
##$TDoff= 0
##$TI= <>
##$TILT= no
##$TM1= 0
##$TM2= 0
##$TOPLEV= 0
##$USERP1= <user>
##$USERP2= <user>
##$USERP3= <user>
##$USERP4= <user>
##$USERP5= <user>
##$WDW= 1
##$XDIM= 16384
##$YMAX_p= 315032118
##$YMIN_p= -297497
$$ End of Bruker specific parameters
$$ ---------------------------------
##NTUPLES= NMR SPECTRUM
##VAR_NAME=  FREQUENCY,     SPECTRUM/REAL,   SPECTRUM/IMAG
##SYMBOL=    X,             R,               I
##VAR_TYPE=  INDEPENDENT,   DEPENDENT,       DEPENDENT
##VAR_FORM=  AFFN,          ASDF,            ASDF
##VAR_DIM=   16384,         16384,           16384
##UNITS=     HZ,            ARBITRARY UNITS, ARBITRARY UNITS
##FACTOR=    0.220516191357247, 1,           1
##FIRST=     3147.89697634429, 0,            0
##LAST=      -464.819786661487, 0,           0
##MIN=       -464.819786661487, -297497,     0
##MAX=       3147.89697634429, 315032118,    0
$$ Real data points
##PAGE= N=1
##DATA TABLE= (X++(R..R)), XYDATA
$$ [...]
7238A420365n6318L3426R3686o4107q0397l7761J5319K7897o8929o7467P3869
7227A289583M2560M6187j84847j43108j17403J26385O6957n9104O0945J9577j71299
7216I76433N2884M8943M4999j2753j16362n742n576K3590p5901j0432k7538J46250
7204A038795M7444p7396M3335M6607k0559k4654K6739P2269Q0378M0029q2890
7193A190097P8072L940K4518O2398J3057N5113J46063M1658n478p2379M4103J40659
7181A721821J74212N6011J0390L5426J71685P1252J60019Q173j3965J2222j728
7170B405518R6145J35865J01530j10510J12486R9354R9884J15621m5159k8644
7160B982090J49890P3557k7068J50200J63564O2009P3412J51983K18291J96695
$$ plain form
7238 1420365 1364047 1397473 1491159 1427052 1346655 1308894 1324213 1352110 1283181 1215714 1289583
7227 1289583 1332143 1378330 1193483 1050375 932972 1059357 1126314 1067210 1128155 1147732 976433
7216 976433 1029317 1078260 1123259 1110506 994144 988402 982826 1006416 930515 920083 892545 1038795
7204 1038795 1086239 1008843 1052178 1098785 1078226 1053572 1080311 1152580 1232958 1272987 1190097
7193 1190097 1268169 1272109 1296627 1359025 1372082 1427195 1573258 1614916 1609438 1537059 1581162 1721821
7181 1721821 1896033 1952044 1962434 1997860 2169545 2240797 2400816 2408989 2395024 2407246 2405518
7170 2405518 2501663 2637528 2739058 2628548 2741034 2840388 2940272 3055893 3010734 2982090
7160 2982090 3131980 3205537 3178469 3328669 3492233 3554242 3627654 3779637 3997928 4194623
7150D194623J47572K07696K24007J23857K21487K61963L38975L49915M71022L15714
7140F856831M20789N83936L16202M73870O93769P29738P36652J036512J099548
7131A2947847J483281J759711J795735K222003K638091L204964L717970M615753
7123C4385355N452078O155260P213830Q291952R378170R611853P448969K196753
7115I0134220m080600r421881j2314509j1586240r486070p134271n176675l748496
7107B7185478k930726k477965k124519j922888j628933j497313j347510j071325
7099A2184299q91671q08002p77894p62570o96289m93609m57877l61473l27046
7090F607868k82314k72279j21431j38685l10277k19354l04333j64372k13992k65109
$$ plain form
7150 4194623 4342195 4549891 4773898 4897755 5119242 5381205 5720180 6070095 6541117 6856831
7140 6856831 7277620 7861556 8177758 8651628 9345397 10075135 10811787 11848299 12947847
7131 12947847 14431128 16190839 17986574 20208577 22846668 26051632 29769602 34385355
7123 34385355 39837433 45992693 53206523 61498475 70876645 80488498 87937467 90134220
7115 90134220 86053620 76631739 64317230 52730990 43244920 36110649 30933974 27185478
7107 27185478 24254752 21776787 19652268 17729380 16100447 14603134 13255624 12184299
7099 12184299 11292628 10484626 9706732 8944162 8247873 7754264 7296387 6934914 6607868
7090 6607868 6325554 6053275 5931844 5793159 5482882 5263528 4959195 4794823 4580831 4315722
7080D315722j90388j23013j92386j12178j95960j84605j09461q4115j64991k32481
7070B726144n8215n8182j8882j72844l9240r5834j06091j15682o2219j2604p3694
7059A912657j39485q6106N1109j12822o9008m0040K0568m3705m6594O5004n1995
7048A459583r1356J9278n0115m2231P2105m8402J053j35778K0877q766L234J1788
7036A211270p3195p2976l7721j1346o5930k9745r1639k8655j3780j4009j4157
7025G58117k7589j2527Q1863n1207q0989M7951r0450j07301K9906n640K1881R653
7013E73668L6423p0615n7049Q9560M1067q6685P2198l3058q0068n3538L7185O2902
7001E31990o1024J4529L4698m3438r1895j4049j0056Q8720O810m4026j4916L0678
$$ plain form
7080 4315722 4125334 4002321 3809935 3697757 3501797 3317192 3207731 3123616 2958625 2726144
7070 2726144 2667929 2609747 2590865 2418021 2378781 2282947 2176856 2061174 1998955 1986351 1912657
7059 1912657 1773172 1687066 1738175 1625353 1556345 1516305 1536873 1493168 1446574 1511578 1459583
7048 1459583 1368227 1387505 1337390 1295159 1367264 1318862 1319915 1184137 1205014 1196248 1199482 1211270
7036 1211270 1138075 1065099 1027378 1016032 950102 920357 828718 800063 786283 772274 758117
7025 758117 730528 718001 799864 748657 667668 715619 625169 517868 547774 542134 564015 573668
7013 573668 610091 539476 482427 571987 613054 526369 598567 565509 485441 431903 469088 531990
7001 531990 470966 485495 520193 476755 384860 370811 360755 449475 456285 412259 397343 428021
6989D28021L9860J4965j6022r5732o3217L7613j1413k1246l8240Q4979M7973l6193
6977C71348j6906O7279K5688j119o8171j5413m2264q5987p1286n8003O2601j19612
6965D8155J39603O2420K8398o7066k51p8351K6247Q8717Q4266K0112J0511j15629
6953B47132o1059l3810J27376n822q5628k7622k7738l0177J42004N8158r7430
6942B05384o3576K1649J3850m7699M7973j4475J0246n7071M6017K0169N9099m5591
6930A95975j7418o3269j5127P5567j23658R8877L1632j20251N5235n9537J960
6919E9986k7393M0863N9635J05160k6497q4785q921N7164k1419k8334q3506k1415
6907B0538O0275M3957j6454O503j9298L3509j02330J04200J11825J7796j57965
$$ plain form
6989 428021 467881 482846 466824 371092 307875 345488 334075 312829 274589 359568 407541 371348
6977 371348 354442 421721 447409 446290 378119 362706 320442 234455 163169 105166 167767 48155
6965 48155 187758 250178 278576 211510 211259 132908 159155 247872 332138 352250 362761 247132
6953 247132 186073 152263 279639 273817 188189 160567 132829 102652 244656 302814 205384
6942 205384 141808 163457 177307 129608 177581 163106 173352 116281 162298 182467 241566 195975
6930 195975 178557 115288 100161 175728 52070 150947 182579 62328 117563 58026 59986
6919 59986 32593 73456 133091 238251 211754 126969 118048 175212 153793 125459 41953 20538
6907 20538 80813 124770 108316 114819 95521 129030 26700 130900 242725 260521 102556
6896A02556o3658J29196j6939j48650q0959J40185K3497n1477J01528N5624l1632
6885A59271l6650l9470J75397J377j40282n0265n1707R8433O4511M0012l2222
6874A88405j609m4120J2130j0387l0403J9691N1613o402K3211l6524l4777k7841
6862A02987p6208j4750L130J760J60095l9816o2427m4432j681N7337l8090P3188
6850A21093l1241R460q1746J2429K0098K6191K592Q57k500M0713j1345o623q6737
6837A3241J01586R0747L5666m5648M3166q4632r5482N3769n2684J6559o9602O2377
6825F9063R2879n3050q1943l337J9485n7525M9033N3558p3494R652O9209r8756
6813e226M8261n1148P7647N5884m6579N0898m1763K6009q1078K2312Q834m8642
$$ plain form
6896 102556 38898 168094 151155 2505 -78454 61731 85228 33751 135279 190903 159271
6885 159271 122621 83151 258548 259925 119643 69378 17671 116104 180615 220627 188405
6874 188405 186796 142676 154806 144419 114016 133707 185320 178918 202129 165605 130828 102987
6862 102987 26779 12029 15159 16919 177014 137198 74771 30339 28658 85995 47905 121093
6850 121093 89852 99312 17566 29995 50093 76284 78876 79733 77233 117946 106601 99978 13241
6837 13241 114827 205574 241240 195592 238758 154126 58644 112413 59729 76288 6686 69063
6825 69063 161942 108892 26949 23612 43097 -14428 34605 88163 14669 24321 93530 -5226
6813 -5226 43035 -8113 69534 125418 78839 129737 87974 113983 32905 55217 64051 15409
6801A5409k0506n803p4113J20913R0979k5994N7269l6982P5310r2438o849n9840
6789C7355J08223M0086O841p7389m8507l2683o737m3721k8311J9617J15740M6851
6777A37365O7061m0433j14778n3588m4844J36908M4549q03p7239k7614J06464
6766A33048J04079j08598m2859n2646n307j7709o91k6532J5452K0104Q6008q3855
6754B0494m5999J17755O0226p4276n731J9387O203m4229P8097K9537q5934k1337
6742E4193L846N1759k780k9342l8352L2395j15967J20983J10182j0426L295M5962
6730B25748j35234J8046N2963N5850n5419j01645J75514l5384L3698K6706J34631
6719C95474M9169p598j1182J26812L5288n6766n3620j05023j66656j0456k0900
$$ plain form
6801 15409 -5097 -10900 -85013 35900 126879 100885 158154 121172 196482 104044 97195 37355
6789 37355 145578 185664 192505 115116 66609 33926 27189 -16532 -44843 -25226 90514 137365
6777 137365 204426 163993 49215 -4373 -49217 87691 132240 131437 54198 26584 133048
6766 133048 237127 128529 85670 33024 27717 10008 9317 -17215 -1763 18341 104349 20494
6754 20494 -25505 92250 152476 78200 72469 91856 98059 53830 131927 161464 75530 54193
6742 54193 58039 109798 107018 77676 39324 71719 -44248 76735 186917 176491 179786 225748
6730 225748 90514 108560 161523 217373 161954 60309 235823 200439 234137 260843 395474
6719 395474 444643 437045 425863 552675 587963 531197 477577 372554 205898 195442 174542
6708A74542n1870k0867P1767L3513j60589l6634Q387m9936R3242m3146J09220
6697A27629M3416j03589j0861Q3801R5078J859n1882J3579n8922j0537l787q861
6685A16923n1697l6932K8707n1866K505K1214J3166j1137J0587j9211O0526m8534
6673C4251m0775j9191j8823L5726N1546N7315j14107j9429M2717j0649O0211M4
6661E8836J2527N9761M7801J34688o1927j36028R661N7423q145q8125R433J932
6649I7837K5788k4776P5323m1762m0123O8177J1134p0669O8016R176K4374J9411
6637B21906j80896J1832J49300L8567j17501j27329J5449N2166M6327M3793q7184
6626F6430m101Q2234j17941Q1881K012K2544k5133l2970P4009M2013l9541L5402
$$ plain form
6708 174542 122672 101805 173572 207085 46496 9862 18249 -31687 61555 18409 127629
6697 127629 171045 67456 56595 140396 235474 237333 185451 199030 140108 129571 125784 116923
6685 116923 65226 28294 57001 5135 7640 28854 42020 30883 41470 22259 82785 34251
6673 34251 -6524 -25715 -44538 -8812 42734 100049 -14058 -33487 9230 -1419 58792 58836
6661 58836 71363 131124 178925 313613 251686 115658 125319 182742 174597 86472 95905 97837
6649 97837 123625 98849 174172 132410 92287 160464 171598 100929 168945 178121 202495 221906
6637 221906 41010 52842 202142 240709 123208 -4121 11328 63494 109821 153614 66430
6626 66430 62329 144563 26622 108503 110515 133059 107926 74956 148965 190978 151437 186839
6614A86839o0842k179N5835j245o6542O8207q6413P5824M875r4615k7367k4278
6602B8099k346J00988K3590q6820K9005M7760l1722l9252k2908p329P4960O3789
6590A77814M5791j50567J2700Q1016k0377j5092O4192o1841L0780P680k9506j07360
6578C5230n7169N5970R4072n8838o6261p2776Q950Q8725P7112l084L0084l4634
6566I7381j0893K7501p6974j01072Q4714O6145k6057Q0256J4150J727j9174q4074
6554E3630J50416q329j9041l530o7477m7923J04049O8812j25882m2623Q5455o2844
6542H4713K4642k4513j6195R6610J5890K2644J6251O5520M3992r9895r8065q2842
6530D8752q4573j8997Q3848K0030N6869q338K1764k9657m0465P6673l9976L9106
$$ plain form
6614 186839 125997 123818 179653 178408 111866 180073 93660 169484 174359 79744 52377 28099
6602 28099 25753 126741 150331 63511 92516 140276 108554 69302 46394 39065 114025 177814
6590 177814 223605 73038 85738 166754 146377 131285 195477 133636 164416 172096 142590 35230
6578 35230 -21939 34031 128103 69265 3004 -69772 -60822 27903 105015 101931 132015 97381
6566 97381 86488 113989 37015 -64057 20657 86802 60745 141001 155151 156878 137704 53630
6554 53630 204046 195717 176676 173146 105669 57746 161795 230607 104725 62102 147557 84713
6542 84713 109355 84842 68647 165257 181147 203791 220042 285562 329554 229659 131594 48752
6530 48752 -35821 -54818 29030 49060 105929 97591 119355 89698 49233 125906 85930 125036
6518A25036P6142k9095j61607K2767k7898Q5283j4862j2981k9269j5211m0012
6507b1707Q1269P1456K1603m8857K2106M3601j8304o9421L4192L1717K6501j3416
6495A60740k0213L7656M9445L6501o5062M15P6236p6198k0694J0113o1525J0247
6483A37661n9871j0680K5203M8693o3756l4697K0276K9770K8229o2876j8182N9449
6471I9219j0286k9966P549P5329J44339j9709j8116M4860j2931m3784n1797L8865
6459B23572k124M4495r4362o6144j5738K1916N9938l1826M7072L6549n8367K3624
6447A88605M2040j16601l6808M3128P7226j9079n8082R3959O0184n7983j04304
6436A12285O7425n8585q186Q0448J2655K478K4855M6621M7414r275m4618P3890
$$ plain form
6518 125036 201178 172083 10476 33243 5345 90628 75766 62785 33516 18305 -21707
6507 -21707 59562 131018 152621 103764 125870 169471 151167 81746 115938 147655 174156 160740
6495 160740 140527 178183 227628 264129 199067 199482 275718 199520 178826 188939 127414 137661
6483 137661 77790 67110 92313 141006 77250 42553 62829 92599 120828 57952 39770 99219
6471 99219 88933 58967 66516 141845 286184 266475 248359 293219 280288 236504 184707 223572
6459 223572 221448 265943 171581 105437 89699 111615 171553 139727 186799 223348 164981 188605
6447 188605 230645 114044 77236 120364 197590 178511 120429 214388 274572 216589 112285
6436 112285 179710 121125 112939 193387 206042 208520 233375 279996 327410 318135 273517 347407
6424C47407J4497l940J0454r14l292M7053j2754n2841j9921J29680L4543k2215
6412D67757j8230j05335M9142K9965j47595j2263L1012J05359j609j01991J44528
6401D40740n4481j5344j2949J13084P0368Q3495j6464Q5137K3355l2523J23772
6390H08190p4583o7308k5107o2357k8219l035q9340o5091q0844M1024k4012N8853
6378C88171K514J3389R8548j23585O719J04403j2436O642r3969O640L7071J52507
6366E86614J42015q7761l9240L6614k5507j1966L1526p9410O723m7982k0042L792
6354D95376L6209k4193r3986j28370j08821Q4951R4830q3684M1159O970L1956
6343C52397P2971j36982K409M7203M7660j00408R3353K2457n9521k477m3867Q7981
$$ plain form
6424 347407 361904 357964 368418 367504 364212 411265 398511 345670 325749 455429 489972 467757
6412 467757 449527 344192 393334 423299 275704 263441 294453 399812 398203 296212 440740
6401 440740 386259 370915 357966 471050 541418 624913 608449 693586 716941 684418 808190
6390 808190 733607 666299 641192 578835 550616 547581 458241 393150 312306 353330 329318 388171
6378 388171 390685 404074 502622 379037 385756 490159 477723 484365 390396 397036 434107 586614
6366 586614 728629 640868 601628 638242 612735 600769 632295 552885 559608 511626 491584 495376
6354 495376 531585 507392 413406 285036 176215 261166 355996 272312 313471 320441 352397
6343 352397 425368 288386 290795 337998 385658 285250 378603 401060 341539 339062 295195 383176
6331C83176q7399M4877N2390K6863J9508j0851o3405m2577J30716M6039L6317
6320E35654k9873o7059o9620K1255q6483Q2991O0700R597p6734Q098N350j2249
6308C81627P1203J00761n1933m6561r793r4617m1030K2485j3592K7322J09238
6297D55110O3321N1696j21236j8413k1892N9258l8218K1330L5698O866k0373r4155
6285C78992L8835J57226K3830M8482j24238r415N7120j436O1935n6008k6107J01055
6273F50271O207l5701m964o6317O8896o0038n6048j6049P2286p389L0485L2276
6261F13915j8706K4686J5951P0646m8175O9596Q5985p6173L8369o957M5354J0838
6249H25329O9259o4255L5285J09225J2211j09751j33455J9349N0310P8917N1263
$$ plain form
6331 383176 295777 340654 393044 419907 439415 428564 365159 322582 453298 499337 535654
6320 535654 505781 438722 369102 390357 303874 386865 447565 457162 380428 388526 393876 381627
6308 381627 452830 553591 501658 455097 445304 350687 309657 332142 318550 345872 455110
6297 455110 518431 570127 448891 430478 408586 467844 429626 450956 486654 493520 473147 378992
6285 378992 417827 575053 598883 647365 523127 513712 570832 569396 631331 575323 549216 650271
6273 650271 656478 620777 615813 549496 618392 558354 502306 486257 558543 551154 581639 613915
6261 613915 595209 619895 635846 706492 658317 727913 813898 737725 776094 769137 814491 825329
6249 825329 894588 830333 865618 974843 987054 877303 743848 763197 813507 892424 943687
6238I43687L1986j64372l5548L0032J4661l854L9916m4782P4412n1685k9258O1083
6226H66278J790K1201l5635j5327o958R1681O682n4863j7573K0278P5950L7646
6214I91150r1806M3283K2444p7515j6169M1396n6179M369R4933o454j2569J8011
6202I54894L6471j6659L1538M2888j6292n4933J60707n4069L783n5009q157P5563
6190A100725J32732m5615l7340k0072l8187M1157O9888O9837N3365L1822m5861
6179A312451K1777L3948j7932M5071M4602M0787L8514Q931J4247j0426J32773
6168A664743K226L232m2994k8148k9809Q5076M4119J29831k7927q82K7542Q8342
6156A915351Q9885l5153r8845L7051P1146R1861R5610O200q1807J7993K20647
$$ plain form
6238 943687 975673 811301 775753 805785 820446 816592 856508 811726 886138 834453 805195 866278
6226 866278 868068 889269 853634 838307 831349 923030 929712 874849 857276 877554 953504 991150
6214 991150 899344 942627 965071 887556 871387 912783 856604 860973 955906 949452 936883 954894
6202 954894 991365 974706 1006244 1049132 1032840 977907 1138614 1084545 1088328 1033319 1025162 1100725
6190 1100725 1233457 1187842 1150502 1130430 1092243 1133400 1203288 1273125 1326490 1358312 1312451
6179 1312451 1334228 1368176 1350244 1395315 1439917 1480704 1519218 1528149 1542396 1531970 1664743
6168 1664743 1666969 1670201 1627207 1599059 1569250 1654326 1698445 1828276 1800349 1799467 1827009 1915351
6156 1915351 2005236 1970083 1871238 1908289 1979435 2071296 2166906 2173106 2091299 2109292 2329939
6145B329939J41308J7217J2712Q4156K4310P0455J40238R0924K5833N5295K578
6134B994965k8783J10525J63379N2561R3768J28962K5751R5338J14390M0712J03419
6123C894987l7194J12584O7164M8490K85475J89705K27668J58457J56573K45467
6113E349376Q5710Q9643L16191K40639K05090J05722K35020M40652K27197J89967
6103G485207L19941M49396L83072L70547L10390J95621M73433N29198N61924Q18383
6093A1897112R36811R22877R98198J301132J496219J788325K331303K565359K868832
6084B7106168L381835L929446M432528M711862M304098K576606k57099l085459
6076D7099985m492165m470545l821782k838824k069673j430119q48076m52390
$$ plain form
6145 2329939 2471247 2488464 2501176 2585332 2609642 2680097 2820335 2911259 2937092 2992387 2994965
6134 2994965 2966182 3076707 3240086 3292647 3386415 3515377 3541128 3636466 3750856 3791568 3894987
6123 3894987 3857793 3970377 4037541 4086031 4371506 4561211 4788879 4947336 5103909 5349376
6113 5349376 5435086 5524729 5840920 6081559 6286649 6392371 6627391 7068043 7295240 7485207
6103 7485207 7805148 8254544 8637616 9008163 9318553 9514174 9987607 10516805 11078729 11897112
6093 11897112 12833923 13756800 14754998 16056130 17552349 19340674 21671977 24237336 27106168
6084 27106168 30488003 34417449 38849977 43561839 47865937 50442543 50185444 47099985
6076 47099985 42607820 38137275 34315493 31476669 29406996 27976877 27128801 26676411
6068B6676411j64082K42116Q10623J021396J637253J965494K358215K945366L649840
6059D1142632M652177N482175O477896P627698Q794855R573536Q913886N972177
6051I8637032Q14120n160321r558024j1404493j0738921q639845o431976m845043
6043D2672529l561145k601372j949486j452953q69129m94797j01967K62734N40891
6034C2445305J011029J606672K039932K701051L232582L601056M209741M655935
6026E5503303M893158M090298J617902j624849l790793m215766l252042j734354
6018E1486857m30372q69650l068828n319407n314431m232725l142609k297296
6010B6811539j683604j371645j064927q68059p16764l96510l85666k44844n2223
$$ plain form
6068 26676411 26512329 26754445 27565068 28586464 30223717 32189211 34547426 37492792 41142632
6059 41142632 45794809 51276984 57754880 65382578 74177433 83750969 92664855 98637032
6051 98637032 99451152 94290831 84732807 73328314 62589393 53949548 47517572 42672529
6043 42672529 39111384 36510012 34560526 33107573 32238444 31743647 31641680 31904414 32445305
6034 32445305 33456334 35063006 37102938 39803989 43036571 46637627 50847368 55503303
6026 55503303 60396461 64486759 66104661 64479812 60689019 56473253 53221211 51486857
6018 51486857 51056485 50186835 47118007 41798600 36484169 32251444 29108835 26811539
6010 26811539 25127935 23756290 22691363 21823304 21106540 20710030 20324364 20079520 20027297
6001B0027297n295j55207L057J93157K09813L18167N80119O75859R01223J129344
5991B3877534J178181J289164J358819J581732K121355K579202J964447m30069
5983C5520365l522456m236268l355128k495014j610150j009164p05488m59264
5975A8127433m75057k50261q6083q1061l4194k137j78961j52579J2591N5967K57705
5964A7193363L48777K24566K14844L11052M73203N00096O63823J039454J270156
5955B2239334J580601J762707J811069J286745N27797M69935J153198J759234
5947C2590620K568924L131122L777375M173915M296242L424297J362821j338230
5939E3987086l755192m862822m576791l787723k976717k142596j498343r35915
$$ plain form
6001 20027297 20022002 19866795 19869852 20063009 20272822 20590989 21171108 21846967 22748190 23877534
5991 23877534 25055715 26344879 27703698 29285430 31406785 33985987 35950434 35520365
5983 35520365 31997909 27761641 24406513 21911499 20301349 19292185 18586697 18127433
5975 18127433 17652376 17402115 17316032 17234971 17200777 17198640 17019679 16867100 16879691 16935658 17193363
5964 17193363 17542140 17766706 17981550 18292602 18765805 19265901 19929724 20969178 22239334
5955 22239334 23819935 25582642 27393711 28680456 29208253 29678188 30831386 32590620
5947 32590620 35159544 38290666 42068041 46241956 50538198 53962495 55325316 53987086
5939 53987086 50231894 45369072 40792281 37004558 34027841 31885245 30386902 29450987
5931B9450987n04016o6425L38890P33987J012957J376974K053814K443336L170812
5922D0011316L970932M776343N611087O572788P555256Q321592Q258064O304522
5914I1381900K211868l329059q283465j0374277j0028864q370357o528156n059633
5906D1619957l775674k947044k231429j765593j194615p30539m36743j51761K95916
5897B8682475P51122J161320J569949K093584K407313L023491L522542M022366
5889D7234162L968263K840178N70268k573197m928316n990608n525207m716026
5881C0879517l687660k969394k374894j880854j630874j366789j239156j007488
5873A4722408q92644q30308o03949n62458m34700l90389m67301k82835k75153
$$ plain form
5931 29450987 28946971 28880546 29219436 29953423 30966380 32343354 34397168 36840504 40011316
5922 40011316 43982248 48758591 54369678 60942466 68497722 76819314 85077378 91381900
5914 91381900 93593768 90264709 81981244 71606967 61578103 53207746 46679590 41619957
5906 41619957 37844283 34897239 32665810 30900217 29705602 28975063 28538320 28386559 28682475
5897 28682475 29433597 30594917 32164866 34258450 36665763 39689254 43211796 47234162
5889 47234162 51202425 54042603 54612871 52039674 47111358 41120750 35595543 30879517
5881 30879517 27191857 24222463 21847569 19966715 18335841 16969052 15729896 14722408
5873 14722408 13829764 12999456 12395507 11833049 11398349 11007960 10540659 10257824 9982671
5864I982671k18203j54762l8525j60094j46202j96563j67763k59593l43137l73046
5854G924783l43589m26660k97595k36648j41808j64172j29162j33669k58173k32076
5844E561231l30674j37491k47061j31296m9586j32945j77612r1534q0838J32574
5834D314768q0056k26776r1848k4761n9365p3709j63643l0647p4850l08986l5930
5823C144197j26808n7183O3076J03862j22760o6632j23306J00124j2933k5336
5813B876301n7218j16122n992j91752j47695P0530j0819o3511N5456n3290k0385
5802B335503J9133n7508j40214j3817p8065p8482n0100K7816j12368n1430l8312
5791A762156k9779l7662p9702j00825Q2326J59657J8634j01679j5154P6671j06039
$$ plain form
5864 9982671 9764468 9609706 9571181 9411087 9264885 9068322 8900559 8640966 8297829 7924783
5854 7924783 7581194 7154534 6856939 6620291 6478483 6314311 6185149 6051480 5793307 5561231
5844 5561231 5230557 5093066 4846005 4714709 4665123 4532178 4354566 4263032 4182194 4314768
5834 4314768 4234712 4007936 3916088 3891327 3831962 3758253 3594610 3563963 3489113 3180127 3144197
5823 3144197 3017389 2960206 3023282 3127144 3004384 2937752 2814446 2914570 2901637 2876301
5813 2876301 2819083 2702961 2696969 2505217 2357522 2428052 2417233 2353722 2409178 2355888 2335503
5802 2335503 2354636 2297128 2156914 2143097 2065032 1986550 1936450 1964266 1851898 1800468 1762156
5791 1762156 1732377 1694715 1615013 1514188 1596514 1756171 1774805 1673126 1657972 1734643 1628604
5780A628604l2500m2813j4120O2737j62879j2918K5249j21090J2804K1304k0062
5769A344316N2768P1148L362M6349k4322M6796Q9353k0329L7304J36293R1444
5758A874482L0238R7593k7244J28637J58822p86p1504k9766l4972j20500R1156
5747B096156m7234j56825l1472Q6783m5962J13758J63668J64158Q6218J74537
5737B603785K19396J61475J30513J11202K50418J51369J35420J10842K54756K35087
5727D364263J18064j66795j48669j66431k18623l17536k51188j4739m6164j01967
5717C050215j03721J9788Q7250K08011N7510N0359J57908K42435O6924J96150
5707D032829J35456J24418K43831J98496R9428J33019J55957j25816k55308l26489
$$ plain form
5780 1628604 1596104 1553291 1539171 1601908 1439029 1426111 1451360 1330270 1343074 1364378 1344316
5769 1344316 1397084 1468232 1471594 1517943 1493621 1540417 1629770 1609441 1646745 1783038 1874482
5758 1874482 1904720 2002313 1975069 2103706 2262528 2261742 2190238 2160472 2125500 2005000 2096156
5747 2096156 2048922 1892097 1860625 1947408 1901446 2015204 2178872 2343030 2429248 2603785
5737 2603785 2823181 2984656 3115169 3226371 3476789 3628158 3763578 3874420 4129176 4364263
5727 4364263 4482327 4315532 4166863 4000432 3781809 3464273 3213085 3198346 3152182 3050215
5717 3050215 2946494 2966282 3053532 3261543 3319053 3369412 3527320 3769755 3836679 4032829
5707 4032829 4168285 4292703 4536534 4735030 4834458 4967477 5123434 4997618 4742310 4415821
5697D415821l20040l53551m13199l07227j60253p8387n4138j08367m8625R6281
5687B668315m9395p5460j0517m2108P8625J04869O8042q2311K03793J55257Q4515
5676C103625m700N1100N0571k04592k80096k71383k09780k12411k57083j03860
5666A661391n3819j19998r8517k5002o5631p3992J0770M2176K1663q9639M8429
5655A257831k5964m5412K1903Q1005J09162N4552P1565m4519j35272O0345K318
5644A407514j84556j118p3734j89852Q6784n3322n0722Q1709r1702k654o8832
5633H59515q4181M8364q709L8915L2571j85202k5893l896L8457m4138J30356K5139
5621H21298k1362K3120m0337p033M1471m255k07705O9847P2513o0565r4169J16663
$$ plain form
5697 4415821 4095781 3742230 3329031 3021804 2861551 2783164 2729026 2620659 2572034 2668315
5687 2668315 2618920 2543460 2532943 2490835 2569460 2674329 2742371 2660060 2863853 3019110 3103625
5676 3103625 3098925 3150025 3200596 2996004 2715908 2444525 2234745 2022334 1765251 1661391
5666 1661391 1607572 1487574 1389057 1364055 1298424 1224432 1235202 1277378 1299041 1209402 1257831
5655 1257831 1231867 1186455 1208358 1289363 1398525 1453077 1524642 1480123 1344851 1405196 1407514
5644 1407514 1222958 1221840 1148106 958254 1045038 991716 940994 1022703 931001 928347 859515
5633 859515 775334 823698 814989 853904 886475 701273 675380 671484 709941 665803 796159 821298
5621 821298 799936 823056 782719 775686 817157 812902 605197 675044 747557 686992 592823 709486
5609G09486l0744P8497L4417m0166L3438q7832M280Q747j0260j23784j02778L5917
5597E09218j8836p176K2430k1830j1596j4136o0408M5015J8182J0117Q4239L1916
5585E87135M0064k4994J6104J3280K3633K5729N1264M3911p44j04391L2255R9573
5573H02819j30684m7470j8012n5583L1151P6406K1839j11095r8836N5306J2837
5562E38678o00P4790j2467L5529K5753o0366r953P5919L4947J17607N1755k837
5550H68755J27697l3431J00559J08897R2353L2159k7874k07722j74019p3474K9567
5539H43467j30732r2326O0158Q7419j75602p3107J3549L1439O316k3656O3127
5528F10052m2359r9146q3111N9467P9767J16598j0617p4332N8060O8916p6392
$$ plain form
5609 709486 678742 757239 791656 751490 784928 697096 701376 710123 699863 576079 473301 509218
5597 509218 490382 483206 505636 483806 472210 458074 397666 442681 460863 470980 555219 587135
5585 587135 627199 602205 618309 631589 655222 680951 732215 776126 775382 670991 703246 802819
5573 802819 672135 624665 606653 551070 582221 658627 680466 569371 470535 525841 538678
5562 538678 538078 612868 600401 635930 661683 601317 591364 667283 702230 819837 871592 868755
5550 868755 996452 963021 1063580 1172477 1264830 1296989 1269115 1061393 887374 813900 843467
5539 843467 712735 620409 680567 767986 592384 519277 532826 564265 570581 546925 610052
5528 610052 567693 468547 385436 444903 524670 641268 630651 556319 614379 683295 606903
5517F06903n0726m9540J5820K8088k350N5351j7461k588J9826j299M1877k0175
5505F23726j4403l6099l9506k5120J8837l4350L4987M7001J2528q0735J12804
5494F19670p3242j587j4294O399J82529j343k0515R7127k5867l4002M6661M7560
5482H29096K7144J21428o4313l1922R3137M2231J05760K81044J44457J48647J27090
5471A823799J53504K97853n6192j01688k95230j70501p1035k00633r3700k8082
5461A258095o3466J0537K6750Q446k3619l2438L2350K3368K7257P6632J60946
5450A504858K16378P4421K05358J92754K25484L38815K81946L58575L66302R2000
5440C856891k26293l29002l57139l83234k62458k42449j57569k14337r5995m0371
$$ plain form
5517 606903 556177 506637 522457 550545 548195 603546 586085 583497 603323 602024 643901 623726
5505 623726 609323 573224 533718 508598 527435 493085 528072 575073 587601 506866 619670
5494 619670 546428 544841 530547 536946 719475 718132 697617 794744 768877 734875 781536 829096
5482 829096 856240 977668 913355 881433 974570 1016801 1122561 1403605 1548062 1696709 1823799
5471 1823799 1977303 2275156 2218964 2117276 1822046 1651545 1580510 1379877 1286177 1258095
5461 1258095 1194629 1205166 1231916 1240362 1216743 1184305 1216655 1240023 1267280 1343912 1504858
5450 1504858 1721236 1795657 2001015 2193769 2419253 2758068 3040014 3398589 3764891 3856891
5440 3856891 3630598 3301596 2944457 2561223 2298765 2056316 1898747 1684410 1588415 1548044
5430A548044j37641l7450j0182N136l0071Q7273k1528J9087K4272l7843R2239
5419A501336R6579J20805J37864K33623K18090J13772J63567K7174j78076k17257
5409B217477k03239k25302j81157k13168o407q7878j85469m3411r9854L7835l0194
5398I79233l4278l7677L5536J5897j6777M3792n9295K5315Q5030J4861q5727m2910
5386I23000L2828Q0576K044l3878J45096R6503p7622n6569J5534k8719O0106n2734
5374A106165o1678K7683Q8444l1131q9669J50155J22472l1566q4454l6594J46086
5363A305913N8290J80786Q8092M0863L0694K8772L0533p6427o1056q1927l284
5352A541249J6511N2610p0992n7347j32679k3485q857n7228l171R0305P4500N9346
$$ plain form
5430 1548044 1410403 1372953 1362771 1367907 1337836 1425109 1403581 1422668 1446940 1409097 1501336
5419 1501336 1597915 1718720 1856584 2090207 2308297 2422069 2585636 2612810 2434734 2217477
5409 2217477 2014238 1788936 1607779 1394611 1388204 1300326 1114857 1071446 971592 1009427 979233
5398 979233 944955 907278 942814 958711 941934 985726 926431 951746 1036776 1051637 965910 923000
5386 923000 955828 1036404 1038448 1004570 1149666 1246169 1168547 1111978 1127512 1098793 1158899 1106165
5374 1106165 1044487 1072170 1160614 1129483 1039814 1189969 1312441 1280875 1196421 1159827 1305913
5363 1305913 1364203 1544989 1633081 1673944 1704638 1733410 1763943 1687516 1626460 1544533 1541249
5352 1541249 1557760 1610370 1539378 1482031 1349352 1325867 1317010 1259782 1256611 1346916 1421416 1480762
5340A480762N3224N6189N5290J76863K86840J80827J22610K02640J81993Q1184
5330B878422j33118j32861j43011j45058j77664j27719K915j0626J36632n9405
5320B088507l6465J20983J78122J56789j5376q7805o9980j50515j64805m7871
5310A971584L7103l5636m4927M0419J28939K09016N1667o2108j964j04487R0117
5299B279723r4412j23708J44696O6008J55665J66828J71013R9082J54688J27919
5289C147502P4253p8118k92055l07464k51893j99458k31740k91077j01755k235
5279A465960q4028k6651K7791m7490K1236m1684j1111p1145L6243N6845J08385
5268A434351Q4678R9453J83924N5911J23924J10806l3338j29171O637j72270k25963
$$ plain form
5340 1480762 1533986 1590175 1645465 1822328 2109168 2289995 2412605 2615245 2797238 2878422
5330 2878422 2745304 2612443 2469432 2324374 2146710 2018991 2021906 2011280 2147912 2088507
5320 2088507 2052042 2173025 2351147 2507936 2492560 2404755 2334775 2184260 2019455 1971584
5310 1971584 2008687 1973051 1928124 1968543 2097482 2306498 2358165 2296057 2294093 2189606 2279723
5299 2279723 2185311 2061603 2206299 2272307 2427972 2594800 2765813 2864895 3019583 3147502
5289 3147502 3221755 3143637 2851582 2544118 2292225 2092767 1861027 1569950 1468195 1465960
5279 1465960 1381932 1355281 1383072 1335582 1356818 1315134 1304023 1232878 1269121 1325966 1434351
5268 1434351 1519029 1618482 1802406 1858317 1982241 2093047 2059709 1930538 1937175 1764905 1538942
5257A538942j13186q8195l216L4k11300r9478k7115r5778p69K5319j23740q3780
5245G17738J37094Q5333o3648m0264k8883j493j6900J8096O0464m8127N2071o244
5233H65237o7639k5624o4276O6602O4011o8514n9702Q3487N3782j22026m3522
5222F81816n0863j1289J10802J24290K8882j40288m3361l9537r484j19j229r2090
5210E57530J2525O1655L1237P0182j5580l5783m8633j973p1974j16665R0071L1802
5198E64394l3307J5586R519l9776J9451r464J274j4419K7345N5689K986j3761
5186E85517q4899P1945m8103K437m945o2984P2821j0618N4057m5503M9408j1024
5174E68109l6167j01K6701J4731m6925m5620J27024J9527m9006m3824o0979j7150
$$ plain form
5257 1538942 1425756 1337561 1334345 1334379 1123079 1023601 996486 900708 899939 925258 801518 717738
5245 717738 854832 940165 876517 836253 807370 805877 788977 807073 867537 819410 871481 865237
5233 865237 797598 771974 707698 774300 838311 769797 710095 793582 847364 725338 681816
5222 681816 630953 619664 730466 854756 883638 743350 699989 660452 650968 650849 649620 557530
5210 557530 570055 631710 662947 733129 717549 681766 633133 631160 559186 442521 532592 564394
5198 564394 531087 546673 556192 516416 535867 526403 527677 513258 540603 596292 599278 585517
5186 585517 500618 572563 524460 526897 521952 458968 531789 521171 575228 529725 579133 568109
5174 568109 531942 531841 558542 573273 526348 480728 607752 627279 578273 534449 473470 456320
5162D56320J86204M7758o0209m9582O443j6723j1058R8452j17771J9740M0254
5151E99828J7052n8024r3985l6925J04383O108Q5303k9400k4779o0213J7428m931
5139E21845J88132K9718J75832j23379N4503J31651J23912p8373K1042j31990
5129I12893m1774m7607j08334k6991j4289J25170o0249J0077r4268J47344j46059
5118F55913K2239N2528k4669N824J7338m9310P8510n4580j00358j211K3307P3552
5106F99083O7355j9211n2453l4364K277K8258N6087k8817m919J0484j8227J10740
5094H16293k0486L8996J17551L2242J35104r819K781K6365l5442j27984k6569
5083I49032j1474p2353K4299j37874P1134n4231J3473N0089p680Q6796l2290q4586
$$ plain form
5162 456320 642524 690282 630073 580491 586934 570211 559153 657605 539834 559574 599828
5151 599828 616880 558856 464871 427946 532329 538437 623740 594340 569561 509348 526776 521845
5139 521845 709977 739695 915527 792148 846651 978302 1102214 1023841 1044883 912893
5129 912893 871119 823512 715178 688187 673898 799068 738819 748896 654628 801972 655913
5118 655913 678152 730680 706011 711835 729173 679863 758373 703793 603435 602224 625531 699083
5106 699083 766438 747227 694774 660410 662687 690945 747032 718215 713296 723780 705553 816293
5094 816293 795807 834803 952354 984596 1119700 1109881 1112662 1139027 1103585 975601 949032
5083 949032 937558 865205 889504 751630 822764 768533 782006 832095 824415 911211 878921 794335
5071G94335m6634R0223J02137R9130K3039K9652N6546J52364J18378J12102R8642
5060A629914K22893K30764J63537J85926R7341k421j66126j96251o9086k15398
5050A881093j34736m4551N0633L8009k4328j66140j62942j62948o6254m594r7834
5039A105408j05782n9281j746n63p7363J3965R801m939k9220j61368l5747L9248
5027F92413P155J15958p792n1905L2257M4889Q985L5751o2425j54918N2621j1377
5015G01612K1200N7465j27645o0315L8578O8410j4919J06327M9758o2357j7230
5004G60884M3502J1798l2887n8729Q7373J893o4258P4376p7078K7899m994j47487
4992F22292J35966Q8104l5169L6300M7871k6089q7801o9320L1953j5398N0805
$$ plain form
5071 794335 747701 837924 940061 1039191 1062230 1091882 1148428 1300792 1419170 1531272 1629914
5060 1629914 1852807 2083571 2247108 2433034 2530375 2527954 2361828 2165577 2096491 1881093
5050 1881093 1746357 1701806 1752439 1790448 1766120 1599980 1437038 1274090 1207836 1203242 1105408
5039 1105408 999626 940345 938599 938036 860673 874638 884439 879500 850280 688912 653165 692413
5027 692413 699568 815526 807734 755829 788086 832975 841960 877711 815286 660368 712989 701612
5015 701612 722812 780277 652632 592317 630895 699305 684386 790713 840471 778114 760884
5004 760884 804386 816184 783297 724568 811941 813834 749576 823952 746874 774773 769779 622292
4992 622292 758258 846362 811193 847493 895364 869275 781474 712154 744107 728709 779514
4981G79514Q8727l0663O194p9541Q2475Q13M8040k9576j3093l5224J90538r138
4969I99066o9127J1369L1477j6684P0666Q2717M561o0847p4710O764k8595M0527
4957I97184m5302p4326J07094O933k2788L141L7929P6705p649O3358J0206K4626
4945A177111J14492j04249j5452N4406n6105M2827J08o1127K1139k5407M359J07363
4933A259465Q6025n4050M3761J05515J92710j39939n7617J19333M5073N5101r0808
4922A564569K6341L2851O5792J2683N1908J3320K305J20189n0603J4665N5642
4911A909662Q6428k2057j37130n0092J04815K2963M5893J42459K7546m7406O8703
4900B151784J45502P861l4384J02686L4590K1213L7158J06652N9734R899J04951
$$ plain form
4981 779514 868241 837578 843772 764231 846706 847519 895559 865983 852890 817666 1008204 999066
4969 999066 929939 941308 972785 956101 1026767 1109484 1114045 1053198 978488 985252 956657 997184
4957 997184 951882 877556 984650 991583 968795 971936 1009865 1086570 1078921 1142279 1152485 1177111
4945 1177111 1291603 1187354 1171902 1226308 1170203 1213030 1213138 1152011 1173150 1147743 1152102 1259465
4933 1259465 1345490 1291440 1335201 1440716 1633426 1493487 1435870 1555203 1600276 1655377 1564569
4922 1564569 1590910 1623761 1689553 1702236 1754144 1767464 1769769 1889958 1839355 1854020 1909662
4911 1909662 1996090 1974033 1836903 1786811 1891626 1914589 1960482 2102941 2130487 2083081 2151784
4900 2151784 2297286 2305147 2270763 2373449 2408039 2429252 2466410 2573062 2632796 2642695 2747646
4889B747646k8670J84389R0977L5172J86047J95062P8343N3346J1443J12374Q3686
4878C749815N1817J23116J45902J33477Q5556P7016K04449L16785P6797J37127
4868E101857K88038J88109J50870K21913K57997K65694M30260M95422N06747M83057
4858H389964O52025O95837R43424R90899J142366J159404J126027J337855J701034
4849A8138835K015612J486057K11281j537789j848416j382438r03427m95095n66884
4840A5117736l16212k18694k5436M04576N70835P37032J087407J162653J518193
4831B0038090J913612J967510K022996K740657L607133M410625N365160O524467
4823D8590250P926800R599111J1808708J3763092J0888098j78215j4874939j7908254
$$ plain form
4889 2747646 2718976 2903365 2994342 3029514 3215561 3410623 3488966 3542312 3553755 3666129 3749815
4878 3749815 3801632 3924748 4070650 4204127 4289683 4366699 4571148 4887933 4964730 5101857
4868 5101857 5389895 5578004 5728874 5950787 6208784 6474478 6904738 7400160 7906907 8389964
4858 8389964 9041989 9737826 10681250 11672149 12814515 13973919 15099946 16437801 18138835
4849 18138835 20154447 21640504 21851785 20313996 18465580 17083142 16179715 15684620 15117736
4840 15117736 14801524 14582830 14557394 14961970 15532805 16269837 17357244 18519897 20038090
4831 20038090 21951702 23919212 25942208 28682865 32289998 36700623 42065783 48590250
4823 48590250 56517050 66116161 77924869 91687961 102576059 102397844 87522905 69614651
4815F9614651j4060974r681028o315373m504390l235068k151544j463980j113241
4807B7089053q17427j410253j623180j345719r80776r61952o78540o19050o74795
4798A7977361m21132k99122k63968J253J0892K3140P0851L38432L24634L87601
4788A8149942N05276O99849P75710J162613J412680J650519J916416K097768J591743
4779B9962516Q95112M52955j10999j450993k194851j940028j063487n46169K08178
4770B4212234L68555N35569O61396Q57221Q71429J101521J138121J343410J605086
4761C2694542K224456K675778L138888L728608M751250N613024O362424O986356
4753F8175326Q259969J0214399J3111954J5417991J8495511K2171220K7332301
$$ plain form
4815 69614651 55553677 45872649 39557276 35052886 31817818 29666274 28202294 27089053
4807 27089053 26271626 24861373 23238193 21892474 20911698 19949746 19271206 18652156 17977361
4798 17977361 17556229 17257107 16993139 16994392 17005284 17028424 17099275 17437707 17762341 18149942
4788 18149942 18655218 19355067 20130777 21293390 22706070 24356589 26273005 28370773 29962516
4779 29962516 30857628 31310583 31199584 29748591 27553740 25613712 24550225 24004056 24212234
4770 24212234 24580789 25116358 25777754 26634975 27506404 28607925 29746046 31089456 32694542
4761 32694542 34918998 37594776 40733664 44462272 49213522 54826546 61188970 68175326
4753 68175326 76435295 86649694 99761648 115179639 133675150 155846370 183178671
4746A83178671L2535265L9940500L9697967J9679715k4393461n3345714m9184477
4739A88108466l7626109k6024912j9296354j4986455j2232991r578479p984693
4732F0378473o471546n511049m450569l627696k758245k682157k475813k286155
4724C0115243k012761j991284j645696j543252j290303j041227q50804q01643
4716A8938273p41142o37915m21658o25960o75340q23883o01206n14648m54150
4707A3442371l65184l58241l95353n99066o63639l49070l63318n50384m05404
4698I392712l39089m14030l12427k85151l03732j86768j96255j35046j25842k68056
4688F826316k64783k84239o2861j97747j34215j16816j70505j6078J6428l8920
$$ plain form
4746 183178671 215713936 255654436 295352403 315032118 290638657 237292943 188108466
4739 188108466 150482357 124457445 105161091 90174636 77941645 68363166 60378473
4732 60378473 53906927 48395878 43945309 40317613 37559368 34877211 32401398 30115243
4724 30115243 28102482 26111198 24465502 22922250 21631947 20590720 19739916 18938273
4716 18938273 18197131 17559216 17137558 16511598 15836258 15012375 14411169 13896521 13442371
4707 13442371 13077187 12718946 12323593 11724527 11060888 10711818 10348500 9798116 9392712
4698 9392712 9053623 8639593 8327166 8042015 7738283 7551515 7355260 7220214 7094372 6826316
4688 6826316 6561533 6277294 6214433 6016686 5882471 5765655 5595150 5579072 5595500 5556580
4678E556580j24590o695o8850o4664j16284r2380m441l0303l5849r8158J6397
4667D930763J22478L8892J06959O0330m0271k9527m517n1013k24383l45384k78888
4656D285439k85983j58166j48571k83301k07597j59268l1310j01493j89773k5336
4646B694641r3626j94639K4261j18491k5435M2104j9875M1693r0976k1875J7922
4635B255704j12667k7216j4296m2193j4554j80k8488k6853n3104j57635m0710
4624A737808k5494K6149J1191L2942q3931p453j413r4070J630j4478M8428L4234
4612A665543q3414m8712r0247o5290R612K3583k4486P168j21567J1057o2584j03549
4600A117114k1254J12591m0807j12514l8241J6500p4696l4930r829k7331L7169
$$ plain form
4678 5556580 5431990 5425295 5356445 5291781 5175497 5083117 5078676 5048373 5012524 4914366 4930763
4667 4930763 5053241 5092133 5199092 5259422 5219151 5189624 5185107 5134094 4909711 4564327 4285439
4656 4285439 3999456 3841290 3692719 3409418 3201821 3042553 3011243 2909750 2719977 2694641
4646 2694641 2601015 2406376 2430637 2312146 2286711 2328815 2308940 2350633 2259657 2237782 2255704
4635 2255704 2143037 2115821 2101525 2059332 2044778 2044598 2016110 1989257 1936153 1778518 1737808
4624 1737808 1712314 1738463 1749654 1782596 1698665 1691212 1689799 1595729 1597359 1582881 1631309 1665543
4612 1665543 1582129 1533417 1443170 1377880 1387492 1411075 1386589 1393757 1272190 1283247 1220663 1117114
4600 1117114 1095860 1208451 1167644 1055130 1016889 1033389 958693 923763 913934 886603 923772
4589I23772L9788j4352K8633l1511J28734Q4924p406n1255n5286j4625n1598Q8918
4577A068736o3980j27325l2878o207k8941l2491k5943L2565J12069P20p5944o5408
4565G54973J24190j00000j66767J46157J3572j07905l7474O454J3253k8995j2828
4554F04630K7095P5414M0648Q4827Q3276m6149j1230o1494M933j17525J0472l9520
4542F55377Q231N0095o468M0472p212q5156J13195Q4676J9288Q3245q6759l5820
4530H33164l9570M2868k6527P1754m5438m2817O6941J0745j6599L975l9732l9810
4518G78954Q2224p5834K6493p481O6238Q8305M7419O2849P5789K17795J72767
4507A535518j6305J51675J1504N7426P3620j43768j09849j68274j37203j36795
$$ plain form
4589 923772 963560 949208 977841 946330 1075064 1159988 1152582 1101327 1046041 1031416 979818 1068736
4577 1068736 1004756 877431 844553 838346 809405 776914 750971 783536 895605 896325 820381 754973
4565 754973 879163 779163 612396 758553 772125 664220 626746 633200 646453 617458 604630
4554 604630 631725 707139 747787 832614 915890 869741 858511 797017 801950 684425 694897 655377
4542 655377 663608 713703 707235 747707 740495 655339 768534 853210 872498 955743 868984 833164
4530 833164 793594 836462 809935 881689 836251 793434 860375 871120 854521 858496 818764 778954
4518 778954 861178 785344 811837 804356 870594 958899 1006318 1069167 1144956 1362751 1535518
4507 1535518 1519213 1670888 1682392 1739818 1813438 1669670 1559821 1391547 1254344 1117549
4497A117549J1235Q1556p4823k0074R1944j6734P386O8921q8372p9559m7726o8144
4485I83159K7572j4889P2127J4210M0673J30029J08463l9274J09355O4748J2884
4474A509057R7123J3403K5572R3612N2136j8222P6482K31828M433N4658J15057
4463B255139P9531R7125J16555K15044J71007K66583K43211K89169K08016K93252
4453D234632R7044j3395J9097n6771J03750N2857J11189J36548J07824L9303o4447
4442D767631r0227k67588k45672j47494j70274q7618n71O1052K02074N7338J49610
4431D228261J66512L0464O3140J39472J57038J56579l6546o8060m3002J53496
4421D947354J19408J60206K34575K16803J88441L9993n2158j47647l15962k54913
$$ plain form
4497 1117549 1128784 1210340 1135517 1115443 1207387 1190653 1198039 1266960 1178588 1099029 1051303 983159
4485 983159 1010731 995842 1067969 1082179 1122852 1252881 1361344 1322070 1431425 1496173 1509057
4474 1509057 1606180 1619583 1645155 1738767 1790903 1772681 1849163 2080991 2085424 2140082 2255139
4463 2255139 2334670 2431795 2548350 2763394 2934401 3200984 3444195 3733364 3941380 4234632
4453 4234632 4331676 4318281 4337378 4280607 4384357 4437214 4548403 4684951 4792775 4832078 4767631
4442 4767631 4677404 4409816 4164144 4016650 3846376 3758758 3758187 3819239 4021313 4078651 4228261
4431 4228261 4394773 4425237 4488377 4627849 4784887 4941466 4904920 4836860 4793858 4947354
4421 4947354 5066762 5226968 5461543 5678346 5866787 5906780 5854622 5706975 5391013 5136100
4411E136100l07976k52448k23700j18337j08402q4399q8328k06978j81402k12915
4401C351215k01563j27421j57294j34329K0547j40746N7824R6404j02160P0337
4391B732814L224J2767J14387K9752J83494N3215N6729L7162J19996l3619K0090
4380C330011Q9089q3185q8414K4587j70065r7259j50377j69072k2665j4974k8137
4369B619539j28444L3973j66713k5657p1041q1160j15765k6676L259N6700J44668
4358B242683L6915K2074K4313N9802l860p5503r222J9263M3102q6619r0690O8162
4346B250420k9582k203j05934l9575q0467M5826k8889K5875k5299k0344m7298
4335A942530r9334P8996n4757N4617o0993m1475O7102N1894Q045N3538J2724K8964
$$ plain form
4411 5136100 4828124 4575676 4351976 4233639 4125237 4040838 3952510 3745532 3564130 3351215
4401 3351215 3149652 3022231 2864937 2730608 2751155 2610409 2668233 2764637 2662477 2732814
4391 2732814 2736038 2748805 2863192 2892944 3076438 3129653 3186382 3223544 3343540 3309921 3330011
4380 3330011 3419100 3335915 3247501 3272088 3102023 3004764 2854387 2685315 2662650 2647676 2619539
4369 2619539 2491095 2525068 2358355 2332698 2261657 2180497 2064732 2038056 2041315 2098015 2242683
4358 2242683 2279598 2301672 2325985 2385787 2381927 2306424 2297202 2316465 2359567 2272948 2182258 2250420
4346 2250420 2220838 2218635 2112701 2073126 1992659 2038485 2009596 2035471 2010172 1989828 1942530
4335 1942530 1843196 1922192 1867435 1922052 1861059 1819584 1886686 1938580 1946625 2000163 2012887 2041851
4323B041851J08890L1071P256K6233J33743k2036n2035K7856O2676j60624p1324
4312B133557L1775M8319k4711l5450O7153k4887j8484J26820l5646j42581j75
4301B125690l4663N2900K1107l272J21241J3853q6430J29351J04241J2005J02882
4290B558905L1582M1201Q2955J81443k028J910Q8832R2034N4193Q8694J8327l865
4278C234183R0218J03046p713L9990J2117N3396K02215R6935J49536J39416J18521
4267D231860Q3537K8118J64614M9308N8030Q739Q3739J2323O4190J44273J4009
4256D942740P7601P2581K41151J93377P8408Q492J152R5259N9928J89946J30320
4245F090955N4446M5006J05563K47614J80615J62744K62381L54405K62626K12499
$$ plain form
4323 2041851 2150741 2181812 2189068 2215301 2349044 2327008 2274973 2302829 2365505 2204881 2133557
4312 2133557 2165332 2213651 2188940 2153490 2220643 2195756 2177272 2304092 2268446 2125865 2125690
4301 2125690 2091027 2143927 2165034 2161762 2283003 2296856 2210426 2339777 2444018 2456023 2558905
4290 2558905 2590487 2631688 2714643 2896086 2894058 2895968 2984800 3076834 3131027 3219721 3238048 3234183
4278 3234183 3324401 3427447 3419734 3459724 3471841 3525237 3727452 3824387 3973923 4113339 4231860
4267 4231860 4315397 4343515 4508129 4557437 4615467 4624206 4707945 4720268 4784458 4928731 4942740
4256 4942740 5020341 5092922 5334073 5527450 5605858 5614350 5615502 5710761 5770689 5960635 6090955
4245 6090955 6145401 6190407 6295970 6543584 6724199 6886943 7149324 7503729 7766355 7978854
4235G978854L27708M32383K78866K04312m2655J31984J85894J80512J36877R4534
4225I909269J78678K37270R1147J85333J60275K28852K41649K25664L22990J90337
4215A1971464K64521K79128L13271L81063K62715L29788K87878N39184N29844
4206A5158856N80505M47394N09924N39100O83038O18806O11864O25929P32624
4197B0508040R85528J157849J311885J363000J515903J686094J718071J697286
4189C1943656K046553K138213K539078K913757L347854L890922M540215N292475
4181E8652723O023216O572630P186011P643903Q879614J0879192J3235175J6207707
4173A35280171J9304794K3345853K7735974L2814029L4813772K8233261P439742
$$ plain form
4235 7978854 8306562 8738945 9017811 9222123 9179468 9311452 9497346 9677858 9814735 9909269
4225 9909269 10087947 10325217 10416364 10601697 10761972 10990824 11232473 11458137 11781127 11971464
4215 11971464 12235985 12515113 12828384 13209447 13472162 13801950 14089828 14629012 15158856
4206 15158856 15739361 16186755 16696679 17235779 17918817 18537623 19149487 19775416 20508040
4197 20508040 21493568 22651417 23963302 25326302 26842205 28528299 30246370 31943656
4189 31943656 33990209 36128422 38667500 41581257 44929111 48820033 53360248 58652723
4181 58652723 64675939 71248569 78434580 86078483 94958097 105837289 119072464 135280171
4173 135280171 154584965 177930818 205666792 238480821 273294593 301527854 308967596
4166C08967596j8481539l7530617m2399710l5330587k6693260j9128925j3636370
4159A15766588r725445p055211m670065k967904j228880K9531O61986j76343k209594
4150H8424663m758736o131736o336384n421031m219984l167549k073315j064941
4142E5250987m53983J79536O62754J113018J479744J341465M51775m72872m58130
4133E9094294K25803R28560J602936K310823K947378L677853M000936L296973
4125G8085556J680831r75039l691496o138216p208136o778589n644709m448830
4117D4881372l558500k642185j968192j622569j231028q27183m43623k03588J18533
4108C2503037M79280O64163R84717J393558J820374K158735K632452L170332L297100
$$ plain form
4166 308967596 290486057 252955440 210555730 175225143 148531883 129402958 115766588
4159 115766588 106041143 98985932 94315867 91347963 90119083 90148614 90810600 90634257 88424663
4150 88424663 83665927 77534191 71197807 65776776 61556792 58389243 56315928 55250987
4142 55250987 54797004 54976540 55639294 56752312 58232056 59573521 60025296 59552424 59094294
4133 59094294 59320097 60248657 61851593 64162416 67109794 70787647 74788583 78085556
4125 78085556 79766387 78791348 75099852 68961636 61753500 54974911 49330202 44881372
4117 44881372 41322872 38680687 36712495 35089926 33858898 33031715 32588092 32384504 32503037
4108 32503037 32982317 33646480 34631197 36024755 37845129 40003864 42636316 45806648 49103748
4099D9103748K861358J729827k42451k431145m119851m575156m376701l735564
4091C4214065k881555k109886j688729j199870r21038n60765k68270k09596k0795
4082B4353561J44168j74352q07564j067324r27818o86190n01876r3528J2038J62961
4072B0414076J32444L201l84253j096467j352713j560109j359966j043903q82280
4063A2870030p86435o70347n08498l87570n57107m61399m17042l95071k81681
4054H404880k50207j71104k63265k04623j23417j74998j86980m6879j02323r9716
4044F781368j12546j22452J10789q1455r1983L4934N2902K0405M969j6217Q2771
4033F663485l7654m5720M2819P6583J76080J73832Q9987K6458p1814l4599L7500
$$ plain form
4099 49103748 51965106 53694933 53452482 51021337 46901486 42326330 37949629 34214065
4091 34214065 31332510 29222624 27533895 26334025 25412987 24852222 24583952 24374356 24353561
4082 24353561 24497729 24323377 23515813 22448489 21520671 20834481 20332605 20239077 20251115 20414076
4072 20414076 20546520 20549721 20165468 19069001 17716288 16156179 14796213 13752310 12870030
4063 12870030 12083595 11413248 10904750 10517180 9960073 9498674 9081632 8686561 8404880
4054 8404880 8154673 7983569 7720304 7515681 7392264 7217266 7030286 6983407 6881084 6781368
4044 6781368 6668822 6546370 6657159 6575704 6483721 6518655 6571557 6591962 6596931 6580714 6663485
4033 6663485 6625831 6580111 6622930 6699513 6875593 7049425 7139412 7165870 7094056 7059457 7096957
4022G096957J26558L11156K67627L32860K55527L45633M28947L95951l1898k94216
4012I235102n07898n77055k94163q9722o4848j68823r7545r5490n1603O5196j64648
4001G188503k13806j37767o3865j2507j46465J5640L0508j0196J36199K20576
3991G006820M5206R3084J71829K61549M49912L63798K72019n8085k29641k56271
3981H120220j07478p8811J3813K2987m2325N1851j83657j48462k07019j27476
3971G313643q6957o7873L723p3671m122J00987R466J4173M1735O841p7371J82328
3959G362902J93897L10555M03016M14669N78229N87114N05112O44469Q12479P46899
3949A2559341M69093k30271p56363q25979r75634q22452n07249m24666l12993
$$ plain form
4022 7096957 7223515 7534671 7802298 8135158 8390685 8736318 9165265 9561216 9529318 9235102
4012 9235102 8727204 8150149 7855986 7766264 7701416 7532593 7435048 7339558 7287955 7353151 7188503
4001 7188503 6974697 6836930 6773065 6760558 6614093 6629733 6660241 6650045 6786244 7006820
3991 7006820 7052026 7145110 7316939 7578488 8028400 8392198 8664217 8606132 8376491 8120220
3981 8120220 8012742 7933931 7947744 7970731 7928406 7980257 7796600 7648138 7441119 7313643
3971 7313643 7226686 7158813 7162536 7088865 7084743 7185730 7195196 7209369 7251104 7257945 7180574 7362902
3959 7362902 7556799 7867354 8270370 8685039 9263268 9850382 10355494 10999963 11812442 12559341
3949 12559341 13028434 12798163 12041800 11215821 10240187 9417735 8910486 8485820 8172827
3940H172827k77189j22786j00091j66969j22652m9124r7510p5829M9047J28654
3930G338378r379P2349K88325K74091K86681J97392M05830L57673K36230L94291
3920I841861O13282N90131P65563O58328N38439Q56421Q76791O12968O7118o20414
3910A4800488j051198q93429o36134l11889k21394l59875n71881n12282l48493
3901I893913j92283L5998J23686K15700L10562L14772L94499M50530N71406O21820
3891A2740603N43434N50727L99186L30889K15517P1697P1567j76184l65261m74415
3881A3907760n20289p10967n47926o34780n30846p46560o32744o49509o40072
3872H294067m86089l99300l28360k47031k34668j30234j05398p4558j50946j86472
$$ plain form
3940 8172827 7895638 7772852 7672761 7505792 7383140 7334016 7236506 7160677 7209724 7338378
3930 7338378 7328999 7401348 7689673 7963764 8250445 8447837 8853667 9211340 9447570 9841861
3920 9841861 10455143 11045274 11810837 12469165 13007604 13864025 14740816 15353784 15420902 14800488
3910 14800488 13749290 12855861 12219727 11907838 11686444 11326569 10754688 10242406 9893913
3901 9893913 9701630 9737628 9861314 10077014 10387576 10702348 11096847 11547377 12118783 12740603
3891 12740603 13284037 13834764 14233950 14564839 14780356 14852053 14923620 14747436 14382175 13907760
3881 13907760 13387471 12676504 12128578 11493798 10962952 10216392 9583648 8934139 8294067
3872 8294067 7807978 7408678 7080318 6833287 6598619 6468385 6362987 6288429 6137483 5951011
3862E951011o3943j84545j75188j24887j52318j87310p1827j61389j42793j85859
3852D500952q3876k51254k22506p1514o3609p1928o6387J019j09554J0395l7384
3841C534354k6531j53807k22490l9792J5366l3078j22974n7317k7855l7238l4677
3830B793961k01726k8430N9182k3155N0327q7042q0962n5349q3231J6166O7308
3819B427049N8349J2830o7483l5098p777j1135Q8986L4756r7780Q0997m147n5849
3807B423698j00631k13169j11100Q4196k3463j1124j24494j25240r2087r23N0127
3796A755790n9640L8030L9763q8914N4806j130J3676P3061O8062M9141N2946p7274
3784A918317r8237J26110Q0745r6966P596j52267q3247j16962o6596J06672J476
$$ plain form
3862 5951011 5887068 5702523 5527335 5402448 5250130 5062820 4990993 4829604 4686811 4500952
3852 4500952 4417076 4165822 3943316 3871802 3808193 3736265 3669878 3670897 3561343 3571738 3534354
3841 3534354 3507823 3354016 3131526 3091734 3107100 3074022 2951048 2893731 2865876 2828638 2793961
3830 2793961 2592235 2563805 2622987 2599832 2650159 2563117 2482155 2426806 2343575 2359741 2427049
3819 2427049 2485398 2498228 2430745 2395647 2387870 2376735 2465721 2500477 2402697 2483694 2479547 2423698
3807 2423698 2323067 2109898 1998798 2082994 2059531 2048407 1923913 1798673 1706586 1705663 1755790
3796 1755790 1696150 1734180 1773943 1685029 1739835 1738705 1752381 1825442 1893504 1942645 1995591 1918317
3784 1918317 1820080 1946190 2026935 1929969 1937565 1785298 1702051 1585089 1518493 1625165 1626641
3773A626641r4960o9472q0187j08279p8736k5830J1289p496M5522o042l6193N350
3761A181607m597m4092q0540p8533P5318J1583j875L1777n866K9393m6013r63
3749A067199O0191N0951p8335R795L4069k9146j9736N0560M371m1462j27619k0857
3737I59981R066j1010m5642M4536K7796o8538J5019J5976l2529M5958p151o7415
3725H86047m835P938m96r4219n0561j8183J13157M4126k3511O176j2453p4007
3713G79179j03058M1164K13782l3109L6782O4547l4901l5684M5514j4616q7472
3702H72128k07547O6684k443K16j42845L6j7409n3314M7149J82814l8756o9387
3690F37326K4299N4170m0036N116O5948O1553j6473r9227j326N8064K8667L8181
$$ plain form
3773 1626641 1531681 1462209 1382022 1273743 1195007 1169177 1180466 1172970 1218492 1212450 1176257 1181607
3761 1181607 1177010 1132918 1052378 973845 1049163 1060746 1058871 1090648 1084782 1114175 1068162 1067199
3749 1067199 1127390 1178341 1100006 1109801 1143870 1114724 1094988 1145548 1149919 1108457 980838 959981
3737 959981 969047 958037 912395 956931 984727 916189 931208 947184 914655 960613 953462 886047
3725 886047 881212 889150 888654 794435 743874 725691 838848 882974 859463 865639 853186 779179
3713 779179 676121 717285 931067 897958 934740 999287 964386 928702 974216 959600 872128
3702 872128 664581 731265 728822 729038 586193 586229 568820 515506 562655 745469 706713 637326
3690 637326 661625 715795 675759 680875 746823 808376 791903 692676 691350 749414 778081 816262
3678H16262R3419k9458K2967j7397K8077R8410N8213j75879j73376J1840n330
3667G27748k5467q5711q3695L9745j9269M2406O2630O0878K3806L5553m7110M5413
3655G76927j6943N9377p8670p9765l6013K8842K4227K123r8980N738M2008L6549
3643F65420j02743L9769Q2011o4974J08510k6947j30626J5140M6228m776Q910
3632F35922M4004k477q0126J2101K0658q1376L263q719r105o316l0888p083j7636
3619D72222O1127J6816L5858k1493j8501m1014O2627L1812P7557j26364n5567
3608D95080Q1507M6846l7408n3673N8764j9821j6304J01389k0596M7300K2373
3597G05457P650O9034J1485p1503m0398n6991k8702M9109K2202j16238M4367k6670
$$ plain form
3678 816262 909681 880223 903190 885793 913870 1012280 1070493 894614 721238 733078 727748
3667 727748 702281 616570 532875 572620 553351 595757 658387 719265 743071 778624 731514 776927
3655 776927 759984 819361 740691 660926 624913 653755 677982 680105 581125 586863 628871 665420
3643 665420 562677 602446 684457 619483 727993 701046 570420 585560 631788 627012 635922
3632 635922 679926 677449 597323 609424 630082 548706 551969 543250 534145 527829 496941 489858 472222
3619 472222 533349 550165 586023 564530 546029 505015 567642 599454 677011 550647 495080
3608 495080 576587 623433 586025 532352 591116 571295 554991 656380 635784 683084 705457
3597 705457 713107 782141 793626 722123 681725 624734 596032 645141 667343 551105 595472 568802
3585E68802o4224P3945j5885p544p761N6929p4327K4684K1718K2056P3946o8551
3573F03788l9142O3035O7719n4625k6708q052o5548P9055J5246k1136m8424J3232
3561E78440n208J18037J276l0274M1589K4193j4647J5010Q44q3036K1375N3281
3549G20880O0436O8089o7061p6359N7437Q0181o2339R2451j1584q3739N0984J4885
3537H44261n4299m7959P5996J56663l8689l5598m3689p849Q1829J2579L4516K83
3525I78044l3323J53876k7522j950R0114N397k9908O9144M5822q2861k3658N4376
3513A197551n5888K5527N5833j13068L870M2429k7348J8029K7601o221k0383R7046
3501A244978J2618p6531K2590K8472J00192J02221k483j31896P9782R207n8081
$$ plain form
3585 568802 504578 578523 562638 555094 547333 604262 529935 554619 576337 598393 672339 603788
3573 603788 564646 627681 695400 640775 614067 606015 540467 619522 634768 613632 565208 578440
3561 578440 573232 691269 692545 662271 703860 728053 713406 728416 729260 646224 667599 720880
3549 720880 781316 849405 782344 705985 763422 843603 781264 873715 862131 778392 829376 844261
3537 844261 789962 742003 817999 974662 935973 900375 856686 848837 930666 943245 977761 978044
3525 978044 944721 1098597 1071075 1069125 1159239 1164636 1134728 1203872 1249694 1166833 1143175 1197551
3513 1197551 1141663 1167190 1223023 1109955 1113825 1156254 1128906 1146935 1174536 1168315 1147932 1244978
3501 1244978 1257596 1181065 1203655 1232127 1332319 1434540 1432057 1300161 1379943 1389150 1331069
3490A331069J37835Q0925r9896j2346Q3716J06921p1823j178L3727O5266r9234
3479A554982P3951P8420l5044K2793p4956j397J35997o9862L0800M3163K141m3282
3467A717706O1322J33405Q690o3525P162K0400J9859J33088L2983j8909k4720
3456B027461N4128P4528l5466n3862Q8440K03319L1988M5601J60786P1595R9454
3445B767972J2684J33694J05862J07111R4144R7990J57517M4664O0341M0158J33933
3434C756070K56850J97925K94476L10622K16896L58508L70931N15224N67053O07507
3424G452062R33825R81541J297591J606297J953995K302449K797957L329017L039250
3415B5693984P27661k878342m111248l507842k457130j518528j062273p13588
$$ plain form
3490 1331069 1468904 1549829 1449933 1437587 1521303 1628224 1556401 1555223 1588950 1654216 1554982
3479 1554982 1628933 1707353 1672309 1695102 1620146 1618749 1754746 1684884 1715684 1758847 1760988 1717706
3467 1717706 1779028 1912433 1921123 1857598 1864760 1885160 1905019 2038107 2071090 2052181 2027461
3456 2027461 2081589 2156117 2120651 2066789 2155229 2358548 2390536 2436137 2596923 2668518 2767972
3445 2767972 2780656 2914350 3020212 3127323 3221467 3319457 3476974 3521638 3581979 3622137 3756070
3434 3756070 4012920 4210845 4505321 4815943 5032839 5391347 5762278 6277502 6844555 7452062
3424 7452062 8385887 9367428 10665019 12271316 14225311 16527760 19325717 22654734 25693984
3415 25693984 26421645 23543303 19432055 15924213 13467083 11948555 10886282 10172694
3407A0172694o82203m44885l40785k45786j57235k550J82351Q3050K02775L81441
3397I148867M90085P23448P12028R06881J164959J474809J862426K261919K787857
3388B1533279L310455M119309M865554O215557O132399K707949m354924q373022
3380C6156556p457883n562440l695612k674081k046871j472392r98271r42590
3372A1306416q19116p02415n06267l55674l15323j44825k122m3803R9303Q4660
3362H600834K93743K70554N41860P87132R98589J306105J423998J861163K266884
3353A8350862K762603K951494J577541j406318l937730l881058l056873k015121
3345A1345400j544564j181795q48162o83645m88763l90370n30590m75658k66342
$$ plain form
3407 10172694 9490491 9045606 8704821 8459035 8301800 8299250 8481601 8564651 8767426 9148867
3397 9148867 9638952 10362400 11074428 11981309 13146268 14621077 16483503 18745422 21533279
3388 21533279 24843734 28963043 33828597 40044154 46176553 48884502 44529578 36156556
3380 36156556 28698673 23136233 19440621 16766540 14719669 13247277 12249006 11306416
3372 11306416 10487300 9784885 9278618 8922944 8607621 8462796 8460674 8416871 8516174 8600834
3362 8600834 8894577 9165131 9706991 10494123 11492712 12798817 14222815 16083978 18350862
3353 18350862 21113465 24064959 25642500 24236182 20298452 16417394 13360521 11345400
3345 11345400 9800836 8619041 7770879 7087234 6598471 6208101 5677511 5201853 4935511
3336D935511k79091j28202k55011j90375j30512j01978k41496r6660r1689j02844
3326C317653n1422j15900j27186R8585j0091j11620P349o242j68588p3962o4218
3315B694358j5289j3046K9344M5739m3803q914n7104q4670l1013J52340K6691
3304B694633j0158j15840J7213j09542j201L5818J5246j797j4706L9280l9677
3293B509269J989l4893k4912M9801L3576J23290L6214q1119K5397R6246j15438
3282B619420P8049J23699r6579J8048K6999O8244R7685R5864O4050K7575m9020
3271C074034Q8488p08J00323J49078J5542O5256J70090J22036K78307K40552J86395
3260D489393J89551J49317K83071K83812K72537K66437K37343L59592L97709L75596
$$ plain form
3336 4935511 4656420 4528218 4273207 4082832 3952320 3850342 3608846 3512186 3420497 3317653
3326 3317653 3266231 3150331 3023145 3121730 3111639 3000019 3007368 3001126 2832538 2758576 2694358
3315 2694358 2679069 2666023 2695367 2741106 2697303 2688389 2631285 2546615 2515602 2667942 2694633
3304 2694633 2684475 2568635 2585848 2476306 2475105 2510923 2526169 2524372 2509666 2548946 2509269
3293 2509269 2511258 2476365 2451453 2501254 2534830 2658120 2694334 2613215 2638612 2734858 2619420
3282 2619420 2697469 2821168 2724589 2742637 2769636 2837880 2935565 3031429 3095479 3123054 3074034
3271 3074034 3162522 3161814 3262137 3411215 3426757 3492013 3662103 3784139 4062446 4302998 4489393
3260 4489393 4678944 4828261 5111332 5395144 5667681 5934118 6171461 6531053 6928762 7304358
3250G304358K00924R4185m1906j66333j73287l40815n33140m00377l90299m81140
3240E072170l87373l29540k23165j71519k42130l05253j12940j49507o6735l2306
3230C051702j18506k2279p7533j09682j69050j03720m6019J9352j19955j69332
3220B134978j00048n0212l4335j95054n2346l448q4736J5138M7094L1064O209
3209A714304l5489L0862M0555l5140K5919K8780P0233R353L5874R652P4278M768
3197A973949P6031L6878j17999j70571j2866j47216j18610k0290o8796L4446j69464
3186A295492M2975J285r154o7498q2297n6077J1707J9084j1554J0768n5047M0212
3174A139896J4363q4320O4339Q4626K9059M7146j4985K021O4341l0851n3475j0838
$$ plain form
3250 7304358 7505282 7599467 7557561 7391228 7217941 6877126 6343986 5943609 5553310 5072170
3240 5072170 4684797 4355257 4132092 3960573 3718443 3413190 3300250 3150743 3084008 3051702
3230 3051702 2933196 2910917 2833384 2723702 2554652 2450932 2404913 2424265 2304310 2134978
3220 2134978 2034930 1984718 1950383 1755329 1702983 1699535 1614799 1629937 1677031 1708095 1714304
3209 1714304 1678815 1709677 1750232 1715092 1741011 1769791 1840024 1849377 1885251 1894903 1969181 1973949
3197 1973949 2049980 2086858 1968859 1798288 1785422 1638206 1519596 1499306 1430510 1464956 1295492
3186 1295492 1338467 1339752 1330598 1263100 1180803 1124726 1136433 1155517 1143963 1154731 1099684 1139896
3174 1139896 1154259 1069939 1134278 1218904 1247963 1295109 1280124 1282145 1346486 1315635 1262160 1251322
3162A251322n9036J4306l1492j68521r805J20673j07373q0262j7560l2176q0759
3151G99317m6788M5076l5103m0012K5804j05615n7536M1735P5259O9470O3187
3140H34794p3464j04958L0760Q3843j2972l2976r5001L9723J25910j16789K4890
3129G03760J76874n214j5406n862j14097L5201r8141m343j4456P0044L7621j00726
3117F65255k7894l4899o9635M8276N7838k7156j9134M6504m2346K9759m4377O2919
3105F45110M8973N3246L0856j7236j22225j05639R3986J34969K3551o0842m4046
3094F80703J20686j49377J02579k3833J5933o2069j53881l4953j57395L4826J2621
3083C85840Q4021k4507q938m39M3606p3716Q4261Q4727j801j74421l8652J8004
$$ plain form
3162 1251322 1192286 1206592 1175100 1006579 996774 1117447 1010074 929812 912252 880076 799317
3151 799317 752529 797605 762502 722490 748294 642679 585143 626878 702137 771607 834794
3140 834794 761330 656372 687132 770975 758003 725027 630026 669749 795659 678870 703760
3129 703760 880634 875420 860014 854152 740055 775256 677115 672772 658316 728360 765981 665255
3117 665255 637361 602462 532827 581103 638941 611785 592651 639155 596809 626568 582191 645110
3105 645110 694083 747329 778185 760949 638724 533085 627071 762040 785591 724749 680703
3094 680703 801389 652012 754591 730758 746691 684622 530741 495788 338393 373219 385840
3083 385840 469861 445354 436416 435977 479583 405867 490128 574855 573054 398633 359981 377985
3071C77985l0999P4101j4419K6675j9968L4625n7161n5852O6836o9478M5893O321
3059C84559J2247p6310N3673n0984o7745q885L0863r5540L9656J04318K1473q1065
3047B66260Q069j0767N5766J4403R55n3415p8069R7105L4657J22765N0231j1622
3035D96338j26428k2377p1321l7813N4990N4766L7591k0590O9271j8320n678K8537
3023D38966r075j13416k7027J34560m2442K1924J3587j7292P8377J8682Q8325
3012E85169Q4487m9970l114O716J42107p176j13538k7648j8313m6484O9939L223
3000F25398N223J1842o1210M0652M320k0110L1402O1715M8498j7768j08547j6955
2988F04460P251N5842L0594K1661m945j0636J04795J40100P8064K6195P7357o564
$$ plain form
3071 377985 346986 421087 406668 433343 413375 448000 390839 334987 401823 332345 378238 384559
3059 384559 396806 320496 374169 323185 255440 246555 277418 181878 221534 325852 347325 266260
3047 266260 274329 263562 319328 333731 334686 281271 203202 300307 334964 457729 507960 496338
3035 496338 369910 347533 276212 238399 293389 348155 385746 365156 434427 416107 410429 438966
3023 438966 429891 316475 289448 424008 381566 403490 417077 399785 478162 496844 585169
3012 585169 669656 619686 616572 623288 765395 758219 644681 617033 598720 552236 622175 625398
3000 625398 630621 642463 581253 621905 626225 606115 637517 699232 747730 729962 621415 604460
2988 604460 611711 667553 698147 719808 714863 704227 809022 949122 1027186 1053381 1130738 1124174
2976A124174K5568R2938p2052P513l3024L394l2220p3380j9340R3999r0931m1613
2964I85026K0420L9734k7564j14171l119N5592p6459j75398J07896q040r577M7260
2952H41600Q1092J8299J57944P761M3695J23615J695j11898j05018j15985L6035
2941I78835R5308N5459O4072J5786J41878Q473m6183k9487o1653Q1503L0424r7874
2929A236541O0877r520o0183q586J2077p282m967N9357n2040j10286O0395K8004
2917A204387K3105L8045O0413L7560K5794j6381P1215M1263M0795L3052m7723
2906A511525L365j0712p8613l5955l8349n9053j9327l3005m5758p8140M5096k3733
2894A137341n6858P8016J3923o5778l2671K8966r144p6917J40290O1173j67151
$$ plain form
2976 1124174 1149742 1242680 1170628 1178141 1145117 1148511 1116291 1042911 1023571 1117570 1026639 985026
2964 985026 1005446 1045180 1017616 903445 900326 955918 879459 704061 811957 803917 794340 841600
2952 841600 922692 940991 1098935 1106696 1150391 1274006 1275701 1163803 1058785 942800 978835
2941 978835 1074143 1129602 1193674 1209460 1351338 1359811 1313628 1284141 1222488 1303991 1334415 1236541
2929 1236541 1297418 1287898 1227715 1219129 1231206 1223924 1218957 1278314 1226274 1115988 1176383 1204387
2917 1204387 1227492 1265537 1325950 1363510 1389304 1372923 1444138 1485401 1526196 1559248 1511525
2906 1511525 1514890 1504178 1425565 1389610 1351261 1292208 1272881 1239876 1194118 1115978 1161074 1137341
2894 1137341 1080483 1158499 1172422 1106644 1073973 1102939 1093795 1016878 1157168 1218341 1051190
2883A051190K4805M1764m8486P022J607L8630k6342L8590q1568k9213p109J1003
2871A021893j52710j6094p0348r4280J06100Q3411M0236j744p7335q1599q0304
2860F77226M6024j70483J9902J11060p8762L6590r2881m7398j3361K7330K810
2849E18057Q980r220J3389o8024J6658l2089q7849K4168n354n2685n4924N6812
2837C27919l0896j01939M6414N2374j1427m7469l3731k9906O1836M1231K0590
2826B94996M159K6505l9007n1306p7397m6733J046N5094J4258j7550J8919J4735
2814A97719n2438L2310L130o2237k3977P5262o5009n5438K1349J09752J9219p0127
2802A29515j5578j8438k3541m1293J8444J0049R8451l4245O3932J5630L1863j4262
$$ plain form
2883 1051190 1075995 1117759 1069273 1076295 1077902 1116532 1090190 1128780 1047212 1017999 1010890 1021893
2871 1021893 869183 853089 782741 688461 794561 877972 918208 916464 839129 757530 677226
2860 677226 723250 552767 572669 683729 604967 641557 548676 501278 487917 515247 518057
2849 518057 527037 517817 531206 463182 479840 447751 359902 384070 378716 326031 271107 327919
2837 327919 297023 195084 241498 293872 282445 234976 201245 171339 233175 274406 294996
2826 294996 299155 325660 286653 235347 157950 111217 112263 167357 181615 164065 182984 197719
2814 197719 145281 177591 180721 118484 94507 169769 104760 49322 70671 180423 199642 129515
2802 129515 113937 95499 71958 30665 49109 59158 157609 123364 187296 202926 234789 220527
2790B20527l4480k2939j42167O1867l5364M2974L2113j4809r617o0399N1606O8618
2778A57930o9422o6102N0537J08478j13013J7809O5714m0458K8916j8824N5316
2767A76881k8043j9417L9112p8024k1199O3785j42476J3161R0495j3959K4561
2756A04877j0770k7325O5281p6446m7135O4669J2615j04132K0822l8938N9772
2745B3290O9733n232O1313q3510K3429l1067K2463r274j326j0654p6652J485J13636
2732I7634K0004l8075l1509j5432m0600Q092J76M0516j0331R176K3680n4919O0337
2719F8749J8201j48406R9143Q0953m024p7009n7713O0364n8271O6144k377j7568
2707B8186j596o5026l3838J21943P439K9043j17133M0282N8412o4623K6783O4359
$$ plain form
2790 220527 186047 163108 20941 82808 47444 90418 122531 107722 98105 37706 89312 157930
2778 157930 88508 22406 72943 181421 68408 86217 151931 111473 140389 121565 176881
2767 176881 148838 129421 168533 90509 69310 133095 -9381 3780 94275 80316 104877
2756 104877 94107 66782 132063 55617 8482 73151 85766 -18366 2456 -36482 23290
2745 23290 93023 87791 149104 65594 89023 57956 80419 71145 69819 59165 -17487 -16002 97634
2732 97634 117638 79563 48054 32622 -7978 114 290 40806 30475 39651 63331 8412 68749
2719 68749 86950 -61456 37687 118640 114616 37607 -20106 40258 -18013 48131 45754 28186
2707 28186 26590 -38436 -72274 49669 57108 86151 -30982 9300 67712 3089 29872 94231
2695I4231L285j180R523n5642l1359p1037K0952K1619L8495O8698k1435p8919
2683b769k1141N0140n6233j9803K2231J32782l9489p0703r488J7798J06616l6264
2671G3677n9n1705l6682M2010J2767p386N8273j616r8627M6893L4935R819j809
2658H0490K3013J8092N8646r9544q9274J00861N7740j10650k5289O2008M9374
2647A25467J1927p3683j788o4722k1821R2899l0084M0788q591J1088Q2017m3663
2635A19834N2128k2367M4335M7733R0l1180j817J4045m3974p5391M5131R0413
2623B38980M4836l590k040m4397l2086J5905K7633q6778Q5817m5786q1771P2840
2611A89563M090L3832K6622p3874k7117M8766j3159j14725j63O2045l0262j8738
$$ plain form
2695 94231 97516 96336 105859 50217 18858 -52179 -31227 -9608 28887 97585 76150 -2769
2683 -2769 -23910 26230 -30003 -49806 -27575 105207 65718 -4985 -14473 3325 109941 73677
2671 73677 73618 21913 -14769 27241 40008 32622 90895 89279 -9348 37545 72480 82299 80490
2658 80490 103503 121595 180241 80697 -8577 92284 150024 39374 14085 76093 125467
2647 125467 137394 63711 61923 -2799 -24620 68279 38195 78983 70392 81480 163497 119834
2635 119834 171962 149595 193930 241663 241753 210573 208756 222801 178827 103436 148567 238980
2623 238980 283816 280226 278186 233789 201703 217608 245241 158463 244280 198494 116723 189563
2611 189563 193653 227485 254107 180233 153116 201882 188723 73998 73835 135880 105618 86880
2599H6880N0252J59588L6906o4187q3760m2872L927M1178q920p820M9190r630
2587B10732K358n5793o6982N8378k1520R0288o3258p8341l9475M2701r584M0018
2575A09522J15403k9767p3090l767L1011m0319N7808k9591N9542n81q4395M9287
2563A61063K1418M0794l7052n4134L6018K784O3342l8269L2111j59159j3926O1283
2551A16273k2307M6880m3228J5618j12m3141J7951J2103k8007j07790K8988O5543
2539E8771m8073P6714M4428r1940j75K0171m0564m3297L9158q8360k3042R6624
2527D15L3636M3937q2446k4287J4728P948m5339K7914K1986O4494k4850k8265
2515I871O177P780j5580J8888j07383O4026J09352j17562o3637O2921k615N5954
$$ plain form
2599 86880 137132 296720 333626 269439 185679 142807 146734 187912 178992 171172 220362 210732
2587 210732 213090 157297 90315 148693 127173 217461 154203 75862 36387 79088 69504 109522
2575 109522 224925 195158 122068 118301 149312 108993 166801 137210 196752 196171 111776 161063
2563 161063 182481 223275 186223 132089 168107 170891 234233 195964 228075 68916 54990 116273
2551 116273 93966 140846 97618 113236 113124 69983 87934 100037 72030 -35760 -6772 58771
2539 58771 10698 87412 131840 39900 39725 59896 19332 -23965 15193 -73167 -96209 415
2527 415 34051 77988 -4458 -28745 -14017 -6069 -51408 -23494 -1508 62986 38136 9871
2515 9871 16048 23828 8248 27136 -80247 -16221 93131 -24431 -88068 -25147 -27762 28192
2503B8192K5997m4995J1860m423M0218r2670l6214P746N585L3960N1677j9946
2491F987J7624k5945o1052l802J11979l1485k4510J15156Q258j36630n0413M0090
2479c3743J5714K5739q9582k1672J1853L560M7787l9117p6760J16054K6736q6921
2467a00352Q5905k1244o0456K3596J11508p5850q2699M4367J33304o7826j22977
2456a32724L4731m2866P7733N4258J67845m7902n5528L4528q8310K6211L8566
2445F6542p3389O7458J0949m0217m3528m8678P027n9768Q3681R1040j28525L1715
2433c5693L6227n9415j5976k996j2180J29532M2420j65397n67J10203m741j988
2421A9429R0226p7009l2907M01l0835q799J3670M1171m6647J6107N2282M3849
$$ plain form
2503 28192 54189 9194 21054 16631 56849 -35821 -72035 -64289 -58704 -24744 26933 6987
2491 6987 24611 -1334 -62386 -66188 45791 14306 -10204 104952 113210 -23420 -73833 -33743
2479 -33743 -18029 7710 -81872 -103544 -91691 -88131 -40344 -79461 -156221 -40167 -13431 -100352
2467 -100352 -14447 -35691 -96147 -72551 38957 -36893 -119592 -75225 58079 -9747 -132724
2456 -132724 -97993 -140859 -63126 -8868 158977 111075 55547 90075 1765 27976 66542
2445 66542 -6847 60611 71560 31343 -12185 -60863 -53836 -113604 -29923 61117 -67408 -35693
2433 -35693 534 -58881 -74857 -77853 -90033 39499 81919 -83478 -84045 26158 21417 19429
2421 19429 109655 32646 -261 140 -30695 -39494 -25824 15347 -31300 -15193 37089 80938
2409H0938J5544j61657l4219M4881Q6579k1922m9099Q1307K3958m4373p1301J21139
2397G1775j3466j7588k262K8901m1555j04881R8296l5461P1112N3995J2132j2342
2385A08656j51330K1016J07501m9707L0564R1763l3413j7104J8724M943p832M8319
2373A72100J0740j5978l2683J7699Q297P2529p5531p5279M807J4108O7083j12327
2361E5565P9736l7979N3891J7150j25001l3999R1933L8853j19747l7079j0737
2350b7414Q1023k9687j0483n8351N6068m8456l8950M1997K325L779n3241Q3049
2338A659O788q8697N6031P4905m0001o0877R8001K175O5840M0072r5617m5590
2326A4689q5022J42604j6646n1988l4192J15795P5326j4012l1357j2054M0399
$$ plain form
2409 80938 96482 -65175 -99394 -54513 32066 10144 -38955 42352 66310 21937 -49364 71775
2397 71775 58309 40721 38459 67360 25805 -79076 19220 -16241 54871 108866 120998 108656
2385 108656 -42674 -21658 85843 36136 66700 158463 125050 107946 126670 131613 123781 172100
2373 172100 182840 166862 134179 151878 160175 232704 157173 81894 86701 100809 167892 55565
2361 55565 135301 97322 151213 168363 43362 9363 101296 140149 20402 -16677 -27414
2350 -27414 53609 23922 13439 -44912 11156 -37300 -76250 -34253 -31928 -28149 -81390 1659
2338 1659 8447 -80250 -24219 50686 10685 -50192 47809 49984 115824 155896 60279 14689
2326 14689 -70333 72271 55625 3637 -30555 85240 160566 146554 115197 103143 143542
2315A43542o4357J8176j1457p4173O4688j142R6406j04511j13326M596P7312j1186
2303B4568M7920r8115J02557R2564q8050l1816r9062j1635R7153N6107n4422L1283
2291F9052k1107p1576K1459M5435j4265N6234j6602M2743q9096L331P672l502
2279B9778N902J1373r682N7512n5542n2217J9464J7357J6877M1293J1225R4289
2267A87629J579k8448p8638J4943N2281J5317J8614q1292Q9581p0613k0405q5965
2255A4583L1498K936k6380J06157p4758q4046J3410P7894J3515j6104O2955n5336
2243F6324L3736J1709l6915j3769l6789o335O3604J00147l2587j7822P0781K476
2231B04560p0351J49683j04268l6401n8520o311Q4885k1436K2622O4174k4872
$$ plain form
2315 143542 79185 97361 85904 11731 76419 75277 171683 67172 -46154 -41558 35754 24568
2303 24568 72488 -25627 76930 169494 81444 49628 -49434 -61069 36084 92191 37769 69052
2291 69052 47945 -23631 -2172 43263 28998 85232 68630 111373 22277 25608 33280 29778
2279 29778 35680 47053 37371 94883 39341 -12876 6588 23945 40822 82115 93340 187629
2267 187629 189208 160760 82122 97065 149346 164663 183277 101985 191566 120953 100548 14583
2255 14583 46081 49017 22637 128794 54036 -30010 -16600 61294 74809 58705 121660 66324
2243 66324 100060 111769 74854 61085 24296 17961 81565 181712 149125 131303 202084 204560
2231 204560 134209 283892 179624 143223 84703 78392 163277 141841 164463 228637 203765
2220B03765K7878o5236R191M9655l0731m9998j3739J07847J4506j5940L5388M3041
2208C15627O1296m2530r2782k06p6721m2581K695K9042J12350K4775R0734L8541
2196D20240j6622r2825p3152M4441j4955j8656l9433M5999J02663p527P9809k7542
2184D02440n2352M7243O9771N4378j405m9015M2466j078k5988P6743L5186l3236
2172E65153k50J14964N4163J6108p323O8156M6095J7571n1577P0655j2288L9151
2160I20578K3790J0998P6905M7374m5292l8386k8835J05385J15040R335k8134
2149A168758J30304l7039P2909K5202L3415J3023J02617J62468J33755O9686p1515
2138A803583O6189R6880K50401K18432J43948J95864J78518J65440K54577K03870
$$ plain form
2220 203765 231643 166407 175598 225253 194522 144524 130785 238632 253138 237198 272586 315627
2208 315627 376923 334393 241611 241405 164684 122103 124798 153840 266190 290965 381699 420240
2196 420240 403618 310793 237641 282082 267127 248471 209038 255037 357700 350173 429982 402440
2184 402440 350088 397331 467102 521480 520075 471060 513526 512448 486460 563203 598389 565153
2172 565153 564903 679867 734030 750138 742815 810971 857066 874637 823060 893715 881427 920578
2160 920578 944368 955366 1032271 1079645 1034353 995967 967132 1072517 1187557 1196892 1168758
2149 1168758 1299062 1262023 1334932 1360134 1393549 1406572 1509189 1671657 1805412 1875098 1803583
2138 1803583 1869772 1966652 2217053 2435485 2579433 2775297 2953815 3119255 3373832 3577702
2128C577702K47940L39748L77778N35539N58062N56307M25360N85602O27879R49390
2118H781307J176986J560411J951037K381082K844641L406592L916864N140732
2110C1159652N877182M763346q59449p419864p530297n660839l877622k742562
2102A3709547k085477j672515j178497q28195q00912n94637m68481l24898j05484
2093E650451l09213n32527n12454m30904k28217k67372k49568j61341k22544j63544
2083B572767j89564j20389o5527Q532j23442q2832l6117j13726j35029J7300l1400
2072A700573o0126q4057l7475p6356j70046k5217m9066p3861J4203n4781r9219
2061I84572K2167O0886l9105j11692j51271N059Q8153J4138j16592l0909j0643
$$ plain form
2128 3577702 3825642 4165390 4543168 5078707 5636769 6193076 6618436 7204038 7831917 8781307
2118 8781307 9958293 11518704 13469741 15850823 18695464 22102056 26018920 31159652
2110 31159652 37036834 41800180 40940731 33520867 25990570 20329731 16452109 13709547
2102 13709547 11624070 9951555 8773058 7944863 7143951 6549314 6080833 5755935 5650451
2093 5650451 5341238 4808711 4296257 3865353 3637136 3369764 3120196 2958855 2736311 2572767
2083 2572767 2383203 2262814 2197287 2205819 2082377 1999545 1963428 1849702 1714673 1731973 1700573
2072 1700573 1640447 1556390 1518915 1442559 1272513 1247296 1198230 1124369 1138572 1083791 984572
2061 984572 1006739 1067625 1028520 916828 765557 770616 858769 872907 756315 725406 714763
2050G14763l4075K6770q4632j824N7531m0406o5034m3279O0968k2096K8165l9426
2038E57425j28363N4247L526R961j11235k1986P9003j1680Q112J07880j9894j0132
2026E16864r9611J693k8882j8346n4731J06753k1855o8360o3993k7611N0774j30467
2014A62228L3460J04967Q9066n2702m7437J2314M1195j04885n6251K1846N8294
2003B62095l3987j9317j8539j6393j1889m9934m7661P606R1312N6269j31260l8091
1991E0211R6009m4047m753k1748J92453j69223j20451J56549L997P6827O3921
1980B79745o8581j17203l8020l1817k6983J14077P0289K8451q498o9714n945k8312
1968I7489K6042p3405k1965J48376L9736o9070k5977l6538o4581j15806m7698
$$ plain form
2050 714763 680688 707458 622826 621002 678533 638127 573093 529814 590782 568686 596851 557425
2038 557425 429062 483309 486835 496796 385561 363575 442578 430898 439010 546890 526996 516864
2026 516864 417253 418946 390064 371718 316987 423740 401885 333525 269532 241921 292695 162228
2014 162228 195688 300655 389721 337019 289582 301896 343091 238206 181955 203801 262095
2003 262095 228108 208791 190252 173859 161970 112036 64375 71981 163293 219562 88302 50211
1991 50211 146220 102173 97420 75672 268125 98902 -21549 135000 138997 215824 279745
1980 279745 211164 93961 55941 24124 -2859 111218 181507 209958 201460 131746 125801 97489
1968 97489 123531 50126 28161 176537 216273 147203 121226 84688 20107 -95699 -143397
1957a43397J1162J02894P5187o1955O2882K9812n9668L5105L834n3644j7292J8867
1945C787R0557R6156j12492r9775L9187J5088l8777N1424l8141J0685L701m6083
1933b4683j7862M4430N6490p0405J4666m5921J10839P4984n8611m4048n6221L0281
1921A3939K4541k5423J19362K680M424k2655j05064r4681O2344K1213K1423K7654
1909D9757p4762q69Q7655k3720k5451Q505l0272J19072K3179r5206j09691j9030
1897i0833J34335m9127m1522J62442m8428N7266o255j51534J4354J5663O6126
1886F2487k6015m4490k8617k947K46P4585Q2468m1484l8387m075J06129J467o3341
1873G8026o1103K0517r5827R0567N891o2671Q0436J8866m2195l9594n6006M766
$$ plain form
1957 -143397 -132235 -29341 45846 -16109 46773 76585 16917 52022 55856 2212 -15080 3787
1945 3787 94344 190500 78008 -21767 17420 32508 -6269 45155 7014 17699 21400 -24683
1933 -24683 -42545 1885 58375 -12030 2636 -43285 67554 142538 83927 39879 -16342 13939
1921 13939 38480 13057 132419 135099 139523 116868 11804 -82877 -20533 680 22103 49757
1909 49757 -25005 -25874 61781 38061 12610 21115 -9157 109915 133094 37888 -71803 -90833
1897 -90833 43502 -5625 -47147 115295 66867 124133 117878 -33656 -19302 -3639 62487
1886 62487 36472 -8018 -36635 -39582 -39336 35249 117717 76233 37846 33771 139900 141367 78026
1873 78026 16923 37440 -58387 32180 38071 -24600 55836 74702 32507 -7087 -63093 -58327
1861e8327J03272N5355L2201n3219n5324P016o940L7191k0824l5279l1961k2546
1849d9385J5592M1484l0607R5723R0524j9273j0113L4475L0074k6287M5576L1433
1837B49216k9696p9348r888m9145m8595L9951N0131l3675j4892r2763l6201j9661
1825g4566K4090o160K2958o252O6343J24282J8091m8369l7120J3109r6763L1733
1813C1376o2839O7814r7510k7639Q0173m4612K7032j02524L5765J02002j1879
1802b841p609J2342l8729R3282m4387M4408M8599m9142k6968r8733q3471O0652
1790i2597O6909k7333j48984P1950J11433m5505R7447m8424P8378K6816n9431
1779C0659r0034k1443n9602M3240K7905L9375J19065j00005r462j01074N1108
$$ plain form
1861 -58327 44945 100300 132501 79282 23958 30974 24034 61225 40401 5122 -26839 -49385
1849 -49385 -33793 7691 -22916 72807 163331 144058 133945 168420 198494 172207 217783 249216
1837 249216 219520 140172 130284 81139 32544 72495 122626 88951 74059 -18704 -54905 -74566
1825 -74566 -50476 -56636 -33678 -39930 26413 150695 168786 120417 83297 96406 -357 31376
1813 31376 -31463 36351 -61159 -88798 -8625 -53237 -26205 -128729 -92964 9038 -2841
1802 -2841 -10450 1892 -36837 56445 12058 56466 105065 55923 28955 -69778 -153249 -92597
1790 -92597 -25688 -53021 -202005 -130055 -18622 -64127 33320 -15104 63274 90090 30659
1779 30659 -59375 -80818 -140420 -97180 -69275 -29900 89165 -10840 -20302 -121376 -70268
1768g0268M7441o7231j4247j9305m5991R6040k3508J7310P085M41K2132q6563
1756a36664N461P2073J7793M6983k2194r3205J43958m18m7238J7869P9667l7427
1744D6658n4441o6525R9925k0489l5316k1366j1088K1520Q2375O838j68034K8623
1732i1320N8679N5642l596m0808J00876j1911q7883M5004M0169j10456q3734K5174
1720a04164N1210k9373k2722M2526n4422P9886K5121M9780m5517N2886Q1277o6293
1708F0195O5735O7197r5389K3938K7928j3887j21104l6980j0161J13618N286l8886
1696D7490M6644k5593j02877j2268O0950k1473q0658P7370Q5494o5814L3773j14288
1684g1250j00626N1479R4901j2913K9225o1797p3504M4982L3120J01078r8k117
$$ plain form
1768 -70268 -22827 -90058 -104305 -123610 -169601 -73561 -97069 -79759 -72674 -72233 -50101 -136664
1756 -136664 -131203 -59130 -41337 5646 -16548 -109753 34205 33787 -13451 4418 84085 46658
1744 46658 -7783 -74308 25617 5128 -30188 -51554 -62642 -41122 41253 48091 -119943 -91320
1732 -91320 -32641 23001 19405 -21403 79473 67562 -20321 24683 64852 -45604 -129338 -104164
1720 -104164 -52954 -82327 -105049 -62523 -116945 -37059 -11938 37842 -7675 45211 126488 60195
1708 60195 125930 193127 97738 121676 149604 135717 14613 -22367 -32528 81090 86376 47490
1696 47490 94134 68541 -34336 -46604 14346 -7127 -87785 -10415 75079 9265 43038 -71250
1684 -71250 -171876 -120397 -25496 -38409 -9184 -70981 -144485 -99503 -66383 34695 34597 32480
1672C2480r8157K516O639J0090Q8356j42542J4699m0348m156K342Q9922J57447
1660A19288o5151o5027L0398n4403N4159r514L907q6578K1275Q3550J03424j06836
1648B8492K080n3450R091Q3536n475j2757j45511L7672K4509Q5315j33765m8246
1636a28509P6233L4392l9057j3914M6287l681m1884M285j9586R1986o634p214
1624g296j38680P1523Q0458j14547J11712M5247J4315O99k0198m6291l5688j7277
1612e6023m3126j6730O7935O4349K5097l9459O3062J6019L994o9159m6533L4900
1600D326M5911m6183l1654j6438Q8706j6477j47767O7610m7012L6293L7494o976
1588c2167l7924K0098M6566M4281k9622j17310R1173k023j29646Q8616M7734J16144
$$ plain form
1672 32480 -65677 -63161 -56522 -46432 41924 -100618 -85919 -126267 -130423 -128081 -38159 119288
1660 119288 54137 -10890 19508 -34895 19264 9750 13657 -72921 -51646 31904 135328 28492
1648 28492 30572 -22878 -13787 69749 64274 51517 -93994 -56322 -31813 53502 -80263 -128509
1636 -128509 -52276 -17884 -56941 -70855 -24568 -28249 -70133 -65848 -85434 6552 -82 -7296
1624 -7296 -145976 -74453 6005 -108542 3170 48417 62732 63431 43233 -3058 -38746 -56023
1612 -56023 -99149 -115879 -47944 16405 41502 2043 65105 81124 85118 15959 -30574 4326
1600 4326 50237 4054 -27600 -44038 44668 28191 -119576 -51966 -98978 -62685 -25191 -32167
1588 -32167 -70091 -49993 -3427 40854 11232 -106078 -14905 -16928 -146574 -57958 -10224 105920
1576A05920k3988j30143j8784L935l0625r1943N476R0295J6777N8243J8161J0311
1564A3635L7972l0026k0231p1871J21256J0353k2459l209P5954r7811M1513m5538
1552I538n9158R8588l4744l1577J6751j2838o4915j6552R4768K9919j03228L8952
1540c4496j0924P4545K7667O745j18796r3222J16665K07202r1232o3688r9504
1529g9038P5778j1758q7143K4446k0760L887j5182P4106Q2336j8653r1232L6414
1517b6799O8726p8118n9647K6907j206M2876L084p839M3664Q3475j05222q0282
1505i0381Q2921N3966O245p2209k1879P8674r9161K5682l1105P8946L3176K6452
1493G1327o020K4741o4482q0039J36527L1311m6202L7790P6059j30083p567J02297
$$ plain form
1576 105920 81932 -48211 -66995 -63060 -93685 -185628 -180152 -89857 -73080 -14837 3324 13635
1564 13635 51607 21581 1350 -70521 50735 61088 38629 35420 111374 13563 55076 9538
1552 9538 -49620 48968 14224 -17353 -602 -13440 -78355 -94907 -139 29780 -73448 -34496
1540 -34496 -45420 29125 56792 63537 -55259 -148481 -31816 175386 84154 20466 -79038
1529 -79038 -3260 -15018 -102161 -77715 -98475 -94588 -109770 -35664 46672 28019 -63213 -26799
1517 -26799 41927 -36191 -95838 -68931 -70137 -27261 -24177 -32016 11648 95123 -10099 -90381
1505 -90381 -7460 46506 52751 -19458 -41337 37337 -61824 -36142 -67247 11699 44875 71327
1493 71327 65307 90048 25566 -54473 82054 113365 67163 104953 181012 50929 43362 145659
1481A45659j52661O857L0855n1186j7144l6513P3681R801M795o2221K3986R7634
1469G3543l7311k8176L4346j5253K3328l993k1948K093l3592m2721M8276L4568
1457C3160L4190K7728J276k1916q0954n1141R5070m567j7190M957q002o6602J3254
1444d0737o974k0991J40241r2064r3291j4918m047q459j5183M6718J06382K0882
1432A7559m7014K4807L5691j05316M595J6732o9359K0952J15375j268o3121o3321
1420a13688O248J36040K7612N0109r2173M4496m9288o0242R280J31390P9303m7481
1408A21606m0965r1743j3890l2910m448N7975k7960L887N7927o62J625j5415j20670
1395a05643L4276J22227J5322j36732m928N1210l5064P2481K7650n2927q0053
$$ plain form
1481 145659 -7002 -145 30710 -20476 -37620 -74133 -452 9349 14144 -48077 -24091 73543
1469 73543 36232 8056 42402 27149 50477 46484 24536 26629 -6963 -49684 -1408 33160
1457 33160 67350 95078 96354 74438 -6516 -57657 37413 32846 15656 20613 12611 -53991 -40737
1444 -40737 -47711 -68702 71539 -20525 -113816 -128734 -132781 -141240 -156423 -109705 -3323 17559
1432 17559 -29455 -4648 31043 -74273 -69678 -52946 -122305 -101353 14022 12754 -50367 -113688
1420 -113688 -107440 28600 56212 106321 14148 58644 9356 -50886 -41606 89784 169087 121606
1408 121606 80641 -11102 -24992 -57902 -62350 -4375 -32335 -28448 29479 28817 30442 15027 -105643
1395 -105643 -71367 50860 66182 -70550 -75478 -24268 -59332 13149 40799 -12128 -92181
1384i2181P4998o59o9353m626Q4244M0753m9478o4431K7401j1556L650M0356M9730
1371B8848j834J4277k4081N3024P596j063N7934r6207n4811n5912K3844M9319
1359I34n1618J8227N2411k3790n5808n0537m1820m6424N4994J3527J20056M2134
1347C2286n4764P0969l5547m3418q1111Q4398K1870Q3238r2714j00589J04055
1336a1327L3074P2029p0391m8903N289p213J44193l5653j11999l9773R326P277
1324e4071N3582O5840l1164m6808o447J6544O6033M5929j13364r9028j2907Q9226
1312b6635Q4499o2609m7292P2226o234O2662K4051l0462j1141j2473l6828J2349
1300B2113n0740j22464K70N5810O2860n798L7453n674r9127J7511r485J464p982
$$ plain form
1384 -92181 -17183 -17842 -87195 -91821 -7577 33176 -16302 -80733 -53332 -64888 -61238 -20882 28848
1371 28848 27014 41291 17210 70234 77830 76767 134701 38494 -16317 -72229 -48385 934
1359 934 -50684 -32457 19954 -3836 -59644 -110181 -152001 -198425 -143431 -129904 -9848 32286
1347 32286 -22478 48491 12944 -30474 -111585 -27187 -5317 77921 -14793 -115382 -11327
1336 -11327 21747 93776 23385 -25518 -20229 -27442 116751 81098 -30901 -70674 -61348 -54071
1324 -54071 -489 65351 34187 -12621 -19068 -2524 63509 109438 -3926 -102954 -115861 -26635
1312 -26635 57864 -4745 -52037 20189 13955 76617 100668 70206 59065 46592 9764 22113
1300 22113 -28627 -151091 -150821 -95011 -32151 -37949 -496 -6170 -105297 -87786 -97271 -95807 -103789
1287a03789L416R7693J2137n2984Q5917J3315n5291j8935O3707r518L1956m1194
1275B6430J8095L5736J4891p3940j55139M5335N4153J1830l9025J3474j50708
1264a98868O1296N6982J0193l245r840M2702j6172m2051P2835M2469p3719j209
1252e8627J07101J9795P108r6987l9261Q688o2394P6111k9841k3341R8344P4965
1240H1661j63193k5068Q5609m8187J5048R3902j839o0757N7574J19509j18850
1229C5409L0379L4040N2760j55378n1995J7767L1067l8251L9344l1099j09975
1218a45932L0867M2810M2950K8628L0749k7628m4050l6765L143k7324Q161J37254
1206D2863O839p2348j6523j9625K298J0771l4689L6977L9095j0136k3656m3916
$$ plain form
1287 -103789 -100373 -2680 9457 -43527 42390 55705 414 -18521 45186 35668 67624 26430
1275 26430 44525 80261 95152 21212 -133927 -88592 -34439 -22609 -61634 -48160 -198868
1264 -198868 -137572 -80590 -70397 -73642 -83482 -40780 -56952 -99003 -26168 16301 -57418 -58627
1252 -58627 48474 68269 75377 -21610 -60871 -52183 -114577 -38466 -68307 -91648 6696 81661
1240 81661 -81532 -106600 -20991 -69178 -54130 39772 37933 -22824 34750 154259 35409
1229 35409 65788 99828 152588 -2790 -54785 -37018 -5951 -44202 -4858 -35957 -145932
1218 -145932 -115065 -72255 -29305 -677 30072 2444 -41606 -78371 -75228 -102552 -94391 42863
1206 42863 49702 -22646 -39169 -58794 -56496 -45725 -80414 -43437 -4342 -14478 -38134 -82050
1194h2050J79548m2352k1672o330j4563j04445Q072R0865M5201n5954K8519J8805
1182D3644p4991M4421j10934q4684M8097K5206o309q890P5569n8160n3931K5241
1170a35721N143k8371M7119K7389P5208j09906k2208J41696J3607p7552j6660
1159h0256O9548K3737o6162k4444N1891n0880L0236N2937K6222p1056l7997N9884
1147a6340O0393l1551L6220K8445k5608k2698j07478P4678j5291n8822J9050K535
1135e6467j909l1718L0628L8939Q884k6851M6304n7029J2858M2951o4028R037
1123d8401J3818k9197j50180J41070L0597j8120j1065P2589L9411m3124j6216
1112a8818j5383J1915r8356O538J60361M626L4810K9865K7587P559j91429K9615
$$ plain form
1194 -82050 97498 55146 33474 27144 12581 -91864 -83792 7073 52274 -3680 24839 43644
1182 43644 -31347 13074 -97860 -182544 -134447 -109241 -115550 -124440 -48871 -107031 -160962 -135721
1170 -135721 -130578 -158949 -111830 -84441 -9233 -119139 -141347 349 13956 -63596 -80256
1159 -80256 -10708 13029 -53133 -77577 -25686 -76566 -46330 6607 32829 -38227 -76224 -16340
1147 -16340 44053 12502 48722 77167 51559 28861 -78617 -3939 -19230 -78052 -59002 -56467
1135 -56467 -58376 -90094 -59466 -20527 -11643 -38494 7810 -49219 -36361 6590 -57438 -48401
1123 -48401 -34583 -63780 -213960 -72890 -42293 -60413 -71478 1111 40522 -2602 -18818
1112 -18818 -34201 -22286 -120642 -114104 46257 50883 85693 115558 143145 150704 -40725 -11110
1100a1110M8652l5995J5946k7820j3766N9280k3187K9901o6683J0883k0453R0456
1088E6104o0563l4921N7739q2295L335P4732K8041j2804m1884m7021L9533k7415
1076d7419J05487L9279j26497m4845J28537K7776j21306L4640O3867J6141r7830
1065b2170Q007l7683K1188j5006N1298n6541k1889j8879j6740J31800p7019N574
1053d8060N8019q1217N0043J19227n0683r1927J323K1532O5945n5239j4710O3235
1041C7488j06262p794o7576n9200J48447Q9464l9328j10075R2825k9858j6067
1030f7936O2956k7802L1121K9532O8590M2016p2328J8106o8262O171o4012o9237
1018a11085R6704N3663N9843k3335m890N202k2889k08735J07941L7156l4109L5636
$$ plain form
1100 -11110 37542 1547 17493 -10327 -24093 35187 12000 41901 -24782 -13899 -34352 56104
1088 56104 -4459 -39380 18359 -63936 -60601 14131 42172 29368 -12516 -59537 -20004 -47419
1076 -47419 58068 97347 -29150 -73995 54542 82318 -38988 -4348 59519 75660 -22170
1065 -22170 -14163 -51846 -30658 -45664 5634 -50907 -72796 -91675 -108415 23385 -53634 -48060
1053 -48060 9959 -71258 -21215 98012 47329 -44598 -43275 -21743 44202 -11037 -25747 37488
1041 37488 -68774 -76568 -144144 -203344 -54897 34567 -4761 -114836 -22011 -51869 -67936
1030 -67936 -4980 -32782 -1661 27871 96461 138477 66149 84255 15993 22164 -41848 -111085
1018 -111085 -14381 39282 99125 75790 70900 76102 53213 -155522 -47581 -10425 -44534 -8898
1006h898K9273O9637K5605J7704p3806q3616q42N0002k4287l6834N3202o3662
994d6522m2547J11401J05804j45555n9627L638J8396R8745l5156M2654J40566
983A91797o8722j69752j2970O8331L4408L0265r9219Q526j1455j00679p620O9793
971f7297q205K9578N2424k0657m4086N7186O8677j7424n5642j05345J6224j650
959i6217J3908R9728l8163Q531M7k1355k3539n537O9913N9712P288p8732o2306
946f6722K1468O5394K1682j1236n7514L2761m6507Q866l3461k0945P1566M5902
934C1254p352k1158j8923K8812K8986k9312m324l755J5803j4498L3369l846R1436
921A26492m0161j15962m7277K3246J9458L4549J0234k0261K2784J1308m3203o4159
$$ plain form
1006 -8898 20375 90012 115617 133321 59515 -24101 -24943 25059 772 -36062 17140 -46522
994 -46522 -89069 22332 128136 -17419 -77046 -73408 -55012 43733 8577 51231 191797
983 191797 123075 -46677 -59647 8684 43092 73357 -25862 -17336 -28791 -129470 -137090 -67297
971 -67297 -75502 -45924 6500 -14157 -58243 -1057 67620 50196 -5446 -110791 -94567 -96217
959 -96217 -82309 17419 -20744 -12213 -12166 -33521 -57060 -62597 7316 67028 74316 -4416 -66722
946 -66722 -45254 20140 41822 30586 -26928 5833 -40674 -31808 -65269 -86214 -14648 31254
934 31254 23902 2744 -16179 12633 41619 12307 7983 4228 20031 5533 38902 35056 126492
921 126492 86331 -29631 -76908 -53662 -34204 345 10579 -9682 13102 24410 -18793 -82952
909h2952N7621J2477q6457N7345P8105k9049o0801K1704K5803j00813J72337q8514
$$ plain form
909 -82952 -25331 -12854 -99311 -41966 36139 7090 -53711 -32007 -6204 -107017 65320 -23194
$$ [...]
##END NTUPLES=NMR SPECTRUM
##END=
