##TITLE=1H_EC-3266(1-2)
 CDCl3,8 sc, 
 27.10.2021
##JCAMPDX= 6.0         $$ Bruker NMR JCAMP-DX V2.0
##DATA TYPE= NMR SPECTRUM
##DATA CLASS= NTUPLES
##ORIGIN= UXNMR, Bruker Analytische Messtechnik GmbH
##OWNER= root
$$ XWIN-NMR		Version 3.5
$$ Wed Oct 27 11:52:10 2021 Russian Standard Time (UT+4h)  she@DPX200
##.OBSERVE FREQUENCY= 200.1313468511
##.OBSERVE NUCLEUS= ^1H
##.ACQUISITION MODE= SIMULTANEOUS
##.ACQUISITION SCHEME= undefined
##.AVERAGES= 8
##.DIGITISER RES= 18
##SPECTROMETER/DATA SYSTEM= spect
##.PULSE SEQUENCE= zg30
##.SOLVENT NAME= CDCl3
##.SHIFT REFERENCE= (INTERNAL, CDCl3, 0, 15.7215)
##AUDIT TRAIL= $$ (NUMBER, WHEN, WHO, WHERE, WHAT)
$$ ##TITLE= Audit trail, XWIN-NMR		Version 3.5
$$ ##JCAMPDX= 5.01
$$ ##ORIGIN= Bruker BioSpin GmbH
$$ ##OWNER= she
$$ F:/spectra/data/she/nmr/H-F/1/pdata/1/auditp.txt
$$ ##AUDIT TRAIL=  $$ (NUMBER, WHEN, WHO, WHERE, WHAT)
(   1,<2021-10-27 11:50:59.42 +0400>,<she>,<DPX200>,
      <created by zg, POWCHK disabled, PULCHK disabled
       configuration hash MD5:
       00 E9 B6 7A A2 85 ED C7 34 08 36 98 17 FE 4E 26
       data hash MD5: 16K
       C0 62 BC F0 9D 86 02 C6 D9 A3 DC 91 EA BE 48 0A>)
(   2,<2021-10-27 11:51:01.93 +0400>,<she>,<DPX200>,
      <Start of raw data processing
       efp BC_mod = 2 LB = 0.24 FT_mod = 6 PKNL = 1 PHC0 = -15165.89 PHC1 = 27.20082 SI = 16K 
       data hash MD5: 16K
       35 B3 FD C3 24 53 D3 FE 07 D8 C6 EA 91 48 EC 99>)
(   3,<2021-10-27 11:51:21.40 +0400>,<she>,<DPX200>,
      <pk PHC0 = 14.21438 PHC1 = -17.4 
       data hash MD5: 16K
       F2 2D 19 2A EB 12 A1 40 80 51 0A C7 8F 76 58 A1>)
(   4,<2021-10-27 11:51:24.75 +0400>,<she>,<DPX200>,
      <abs ABSG = 5 
       data hash MD5: 16K
       99 88 A2 FD 87 70 72 E4 EE 50 97 45 4B CF 60 C1>)
$$ ##END=
$$ 
$$ hash MD5
$$ FF 5B FA B6 EC B5 16 71 29 C8 F8 BA A9 6F 00 C4
##$RELAX= 
##$RELAX= 
##$RELAX= 
##$RELAX= 
##$RELAX= 
##$RELAX= 
$$ Bruker specific parameters
$$ --------------------------
##$DU= <F:/spectra>
##$EXPNO= 1
##$NAME= <H-F>
##$PROCNO= 1
##$TYPE= <nmr>
##$USER= <she>
##$AMP= (0..31)
100 100 100 100 100 100 100 100 100 100 100 100 100 100 100 100 100 100 
100 100 100 100 100 100 100 100 100 100 100 100 100 100 
##$AQSEQ= 0
##$AQ_mod= 1
##$AUNM= <au_zg>
##$AUTOPOS= <>
##$BF1= 200.13
##$BF2= 200.13
##$BF3= 200.13
##$BF4= 200.13
##$BF5= 200.13
##$BF6= 200.13
##$BF7= 200.13
##$BF8= 200.13
##$BYTORDA= 1
##$CFDGTYP= 0
##$CFRGTYP= 5
##$CHEMSTR= <none>
##$CNST= (0..31)
1 1 145 1 1 1 1 1 1 1 1 1 1 1 1 1 1 1 1 1 1 1 1 1 1 1 1 1 1 1 1 1 
##$CPDPRG= <>
##$CPDPRG1= <>
##$CPDPRG2= <>
##$CPDPRG3= <>
##$CPDPRG4= <mlev>
##$CPDPRG5= <mlev>
##$CPDPRG6= <mlev>
##$CPDPRG7= <mlev>
##$CPDPRG8= <mlev>
##$CPDPRGB= <>
##$CPDPRGT= <>
##$D= (0..31)
0 1.2 0 0 0 0 0 0 0 0.06 0 0.03 0 0 0 0 0.0002 0 0 0 0 0 0 0 0 0 0 0 0 
0 0 0 
##$DATE= 1635321058
##$DBL= (0..7)
120 120 120 120 120 120 120 120 
##$DBP= (0..7)
150 150 150 150 150 150 150 150 
##$DBP07= 0
##$DBPNAM0= <>
##$DBPNAM1= <>
##$DBPNAM2= <>
##$DBPNAM3= <>
##$DBPNAM4= <>
$$ [...]
##$SUBNAM2= <"">
##$SUBNAM3= <"">
##$SUBNAM4= <"">
##$SUBNAM5= <"">
##$SUBNAM6= <"">
##$SUBNAM7= <"">
##$SUBNAM8= <"">
##$SUBNAM9= <"">
##$SW= 18.0517286264689
##$SWIBOX= (0..15)
0 0 2 0 0 0 0 0 0 0 0 0 0 0 0 0 
##$SW_h= 3612.71676300578
##$TD= 16384
##$TD0= 1
##$TE= 0
##$TE2= 300
##$TE3= 300
##$TEG= 300
##$TL= (0..7)
0 120 120 120 120 120 120 120 
##$TP= (0..7)
150 150 150 150 150 150 150 150 
##$TP07= 0
##$TPNAME0= <>
##$TPNAME1= <>
##$TPNAME2= <>
##$TPNAME3= <>
##$TPNAME4= <>
##$TPNAME5= <>
##$TPNAME6= <>
##$TPNAME7= <>
##$TPOAL= (0..7)
0.5 0.5 0.5 0.5 0.5 0.5 0.5 0.5 
##$TPOFFS= (0..7)
0 0 0 0 0 0 0 0 
##$TUNHIN= 0
##$TUNHOUT= 0
##$TUNXOUT= 0
##$USERA1= <user>
##$USERA2= <user>
##$USERA3= <user>
##$USERA4= <user>
##$USERA5= <user>
##$V9= 5
##$VALIST= <valist>
##$VCLIST= <CCCCCCCCCCCCCCC>
##$VD= 0
##$VDLIST= <DDDDDDDDDDDDDDD>
##$VPLIST= <PPPPPPPPPPPPPPP>
##$VTLIST= <TTTTTTTTTTTTTTT>
##$WBST= 1024
##$WBSW= 4
##$XGAIN= (0..3)
0 0 0 0 
##$XL= 0
##$YL= 0
##$YMAX_a= 191697
##$YMIN_a= -262936
##$ZGOPTNS= <>
##$ZL1= 120
##$ZL2= 120
##$ZL3= 120
##$ZL4= 120
##$ABSF1= 15.72705
##$ABSF2= -2.3248
##$ABSG= 5
##$ABSL= 3
##$ALPHA= 0
##$AQORDER= 0
##$ASSFAC= 0
##$ASSFACI= 0
##$ASSFACX= 0
##$ASSWID= 0
##$AUNMP= <proc_1d>
##$AZFE= 0.1
##$AZFW= 0.1
##$BCFW= 0
##$BC_mod= 2
##$BYTORDP= 0
##$COROFFS= 0
##$CY= -3
##$DATMOD= 1
##$DC= 0
##$DFILT= <>
##$DTYPP= 0
##$F1P= 0
##$F2P= 0
##$FCOR= 1
##$FTSIZE= 16384
##$FT_mod= 6
##$GAMMA= 0
##$GB= 0
##$INTBC= 1
##$INTSCL= 0
##$ISEN= 128
##$LB= 0.24
##$LEV0= 0
##$LPBIN= 0
##$MAXI= 10000
##$MC2= 0
##$MEAN= 0
##$ME_mod= 0
##$MI= 1.114404
##$NCOEF= 0
##$NC_proc= -6
##$NLEV= 6
##$NOISF1= 3.799351
##$NOISF2= 2.8
##$NSP= 0
##$NTH_PI= 0
##$NZP= 0
##$OFFSET= 15.72155
##$PC= 1
##$PHC0= -15151.67
##$PHC1= 9.800821
##$PH_mod= 1
##$PKNL= yes
##$PPARMOD= 0
##$PSCAL= 0
##$PSIGN= 0
##$REVERSE= no
##$SF= 200.130006855174
##$SI= 16384
##$SIGF1= 3
##$SIGF2= 2
##$SINO= 5.538805
##$SIOLD= 16384
##$SREGLST= <1H.CDCl3>
##$SSB= 0
##$STSI= 16384
##$STSR= 0
##$SW_p= 3612.71676300578
##$SYMM= 0
##$S_DEV= 0
##$TDeff= 16384
##$TDoff= 0
##$TI= <>
##$TILT= no
##$TM1= 0
##$TM2= 0
##$TOPLEV= 0
##$USERP1= <user>
##$USERP2= <user>
##$USERP3= <user>
##$USERP4= <user>
##$USERP5= <user>
##$WDW= 1
##$XDIM= 16384
##$YMAX_p= 298087855
##$YMIN_p= -790040
$$ End of Bruker specific parameters
$$ ---------------------------------
##NTUPLES= NMR SPECTRUM
##VAR_NAME=  FREQUENCY,     SPECTRUM/REAL,   SPECTRUM/IMAG
##SYMBOL=    X,             R,               I
##VAR_TYPE=  INDEPENDENT,   DEPENDENT,       DEPENDENT
##VAR_FORM=  AFFN,          ASDF,            ASDF
##VAR_DIM=   16384,         16384,           16384
##UNITS=     HZ,            ARBITRARY UNITS, ARBITRARY UNITS
##FACTOR=    0.220516191357247, 1,           1
##FIRST=     3146.35390683097, 0,            0
##LAST=      -466.362856174813, 0,           0
##MIN=       -466.362856174813, -790040,     0
##MAX=       3146.35390683097, 298087855,    0
$$ Real data points
##PAGE= N=1
##DATA TABLE= (X++(R..R)), XYDATA
$$ [...]
9563 61181 196205 190759 72364 38744 104687 141871 147090 123831 152103 150327 173343 156894
9551 156894 163416 184285 126186 72130 51414 117004 142121 67356 56617 112573 144477 150423
9539 150423 69354 108645 197881 214546 176361 156041 150231 212490 289216 183055 152187 210833
9527 210833 165871 187120 186219 198483 134819 111306 138601 155886 274676 178058 161276 151194
9515 151194 120399 142258 158474 164186 222009 185068 251725 298595 153596 68313 116462 134691
9503 134691 101408 201197 221271 245092 286727 254406 207045 194293 223729 222023 256032 188980
9491 188980 37735 137428 166953 194073 183938 206567 298186 227158 126102 260111 280880
9480 280880 288631 326663 276187 245644 318487 284264 333261 305922 277696 200174 182294 184909
9468 184909 312172 296129 371421 318826 222786 203477 159684 134966 156478 173693 172716 279546
9456 279546 359180 308358 239542 200010 196225 264681 328408 360760 291010 305160 326414 307531
9444 307531 326039 328869 393549 447722 472141 446585 393166 352007 391522 389114 480188 503987
9432 503987 530539 596245 573164 507714 612692 520166 467866 621608 675898 710371 668982
9421 668982 570685 544034 662400 721190 760700 660976 661143 698119 703463 661347 702252 684793
9409 684793 746022 829779 765126 699368 723704 637130 663520 653658 647564 652855 645016 718772
9397 718772 796893 850255 882587 888296 933622 877671 966156 966598 896488 898841 944803 1027134
9385 1027134 1066244 1073615 1098925 1086721 1072965 1149242 1217617 1220333 1159231 1090716 1133307 1053359
9373 1053359 1012666 1048518 1062101 1104848 1211795 1211015 1094744 1117169 1145809 1136378 1261652
9362 1261652 1316813 1261410 1286345 1453405 1559121 1516657 1612679 1768438 1843485 1983068 2076386
9351 2076386 2263274 2398091 2635121 2871552 2999274 3204750 3585937 3873127 4139561 4425995
9341 4425995 4581663 4725217 4945519 5051330 4921856 4801455 4636086 4391544 4125601 3856090
9331 3856090 3556611 3423823 3207720 3083102 2989137 2856807 2640227 2563296 2490274 2391071
9321 2391071 2406778 2304697 2332703 2355822 2295533 2364293 2396541 2534273 2552722 2553660 2708118
9310 2708118 2834937 2933387 3000238 2976770 2959554 2964027 2973179 2988292 3019910 3046277 3000023 2972811
9298 2972811 2896789 2782962 2741447 2747775 2812260 2874757 2963908 3007966 3070209 3182030 3372633
9287 3372633 3470625 3480611 3566943 3845874 4044477 4235267 4433826 4664434 4787869 4926412
9277 4926412 5080969 5262142 5327424 5357263 5407648 5461021 5389231 5271613 5141572 4980688
9267 4980688 4857151 4733274 4550856 4405416 4399103 4253657 4053468 3818435 3696442 3558719
9257 3558719 3571737 3527479 3640307 3721845 3849518 4033250 4040413 4170552 4291321 4398731
9247 4398731 4441936 4681260 4896659 4922942 5068884 5120347 5299851 5286827 5297862 5270383 5115742
9236 5115742 4985359 4840100 4710181 4423227 4125730 3919754 3794594 3643972 3534514 3349848
9226 3349848 3196319 3244078 3165497 3159679 3137720 3070214 2956429 2817953 2840410 2928295 2859316
9215 2859316 2769209 2758240 2742499 2783569 2848240 2816204 2712479 2797940 2822854 2845917 2789154
9204 2789154 2723944 2787618 2690885 2635482 2742223 2688713 2607070 2615362 2743899 2641307 2711336
9193 2711336 2705642 2545842 2457841 2536274 2577109 2588527 2699736 2725362 2830010 2880163 2823196
9182 2823196 2751802 2780783 2786075 2677130 2729647 2829460 2788883 2786721 2752079 2767313 2759934 2780839
9170 2780839 2716627 2714752 2748816 2717568 2758690 2697640 2630266 2623060 2603681 2539583 2413593 2377441
9158 2377441 2450298 2419295 2457765 2381195 2322174 2276084 2286924 2373285 2270662 2196192 2297948
9147 2297948 2407129 2301346 2417409 2556632 2583913 2603814 2708651 2753835 2740764 2694419
9137 2694419 2824733 2830153 2907725 2867110 2869234 3005437 3037062 3053456 3159635 3138776 3108183
9126 3108183 3253078 3320600 3279401 3290669 3484804 3530285 3590863 3700696 3679089 3713169 3789379
9115 3789379 3877404 3931883 3968577 3975561 4018971 4146408 4340541 4516583 4645107 4548627 4657246
9104 4657246 4771892 4852661 5084572 5092852 5304577 5482945 5649581 5849907 6052258 6214162
9094 6214162 6388627 6570589 6738919 7080144 7350051 7594940 7823982 8010263 8353522 8685002
9084 8685002 9062083 9550544 10001181 10423893 10827766 11281187 11812360 12324258 12935918 13622202
9074 13622202 14231307 14852295 15639546 16538729 17628347 18986299 20307255 21583128 23219585
9065 23219585 25104930 27365266 29968262 33119978 36505810 39668502 42853905 46460844
9057 46460844 50725382 54904580 57405018 58068910 58090380 59131785 61364866 64357486 65482891
9048 65482891 63665448 59286691 53835446 48920873 45230254 42899033 41456852 40555674
9040 40555674 39909593 39113561 37836415 36656832 35949897 35645594 35669470 35989058 36807293
9031 36807293 38204410 39662912 41628863 44128153 47092086 50698038 54683986 58634646
9023 58634646 62294533 65837767 69184091 71688222 73838891 76728441 80822956 84426116
9015 84426116 85434135 83996134 82125393 80065152 76936148 71332770 63368491 54895601
9007 54895601 47991723 42823903 38999980 36041935 33825320 32081529 30687192 29489056
8999 29489056 28179264 26789986 25170850 23821916 22659836 21711678 20801770 19825182 18905789
8990 18905789 18061900 17253031 16541240 15922891 15227057 14623611 14109778 13581677 13127225
8981 13127225 12604168 12103825 11792026 11309872 10824617 10518106 10243838 10045361 9756599
8972 9756599 9421299 9064700 8792807 8584245 8369270 8292244 8070755 7853259 7719201 7479956
8962 7479956 7298045 7203907 7040789 6857267 6681722 6561535 6331689 6203195 6128274 6121917
8952 6121917 6024456 5931651 5847898 5788166 5748716 5511328 5475487 5477442 5492185 5397253 5267167
8941 5267167 5245567 5256722 5178369 5207034 5198111 5117830 4985441 4870893 4926419 4966620 4854920
8930 4854920 4932492 4967470 4903324 5013479 4969747 4998611 4942539 4879900 4946086 5002570 4965883
8919 4965883 4907795 4968316 5077079 5112015 5119257 5156049 5090975 5171663 5213782 5252751 5298956
8908 5298956 5347659 5355230 5456203 5483751 5639157 5648388 5747287 5854727 5853586 5990729 6055274
8897 6055274 6130154 6252821 6311063 6320593 6482600 6633124 6729827 6898929 7008189 7116273
8887 7116273 7250103 7372583 7572533 7870058 8164904 8353243 8534109 8800192 9106048 9237341
8877 9237341 9504569 9890687 10180247 10669135 11147862 11664180 12181142 12662676 13224434 13767955
8867 13767955 14362789 14969118 15670155 16305611 16968576 17609349 18229057 18996663 19724716
8858 19724716 20395001 21218954 22091659 23287795 24621888 26165337 28075224 29965117 31913899
8849 31913899 33652494 35457070 37662492 40326625 43069776 44894248 46019023 47118616
8841 47118616 47982003 47484206 45209216 42285413 39995532 38642763 38171817 38266921 38878566
8832 38878566 39564038 39477933 39042316 38703632 38481832 38497726 38961019 39580045 40300592 41290550
8822 41290550 42715445 44545262 46408090 48387577 50422702 52694475 55206918 58599597
8814 58599597 62772613 67152598 71822025 76323939 80048385 82474618 83499450 82464176
8806 82464176 78545220 72773858 67282176 63208509 60683510 59251151 57231943 53772148
8798 53772148 49786088 46521878 44185884 42449740 40905553 39652397 38596395 37762315
8790 37762315 37336828 36975442 36624338 36584324 36574436 36922112 37462052 38269342 39563525 41236413
8780 41236413 43218384 45135931 46522581 47286358 48051240 49542691 51506248 53312044
8772 53312044 54447458 54020427 51832865 48195685 43734549 39046180 35055210 32165130
8764 32165130 29982434 28322861 27111372 26202772 25427727 24499522 23371715 22304082 21584069
8755 21584069 20981286 20370992 19581862 18879118 18332040 17835083 17327249 16817175 16382610
8746 16382610 16056751 15854035 15753953 15567477 15580267 15570097 15609731 15621215 15582264 15673247
8736 15673247 15766363 15855355 15931603 16030621 16313522 16603615 16997968 17319359 17731310 18303567
8726 18303567 19094640 19883548 20856220 22205700 23918714 25846040 28062005 30488105 33440955
8717 33440955 36781305 40542265 44856255 50012053 55667483 62747238 68063502 65386442
8709 65386442 55698288 46094797 40202418 36631509 34486452 33298816 32949835 32958109 33596594
8700 33596594 34699376 36537146 38278547 39148630 39117751 39145290 39721139 40931391 41583052
8691 41583052 40551023 37968807 35493508 33895937 33034155 32028554 30205360 27883763
8683 27883763 25889022 24484318 23558630 23031172 22604898 22484416 22586608 22735457 23105888
8674 23105888 23697588 24469781 25445858 26666593 28058771 29647633 31027490 31961519 32772459
8665 32772459 33841370 35283272 37148133 39455756 41737459 43285040 43546772 42336319
8657 42336319 39661245 35826879 31939214 28859510 26568638 24961063 23980940 23339851
8649 23339851 22825445 21948875 20596614 19329272 18277453 17555493 16937506 16645853 16359264
8640 16359264 16221521 16335823 16431891 16670774 17094319 17484349 17810243 18348732 19078730 19437789
8630 19437789 19338876 19030092 18872334 18982754 19217576 18906314 17825591 16399612 15289838
8621 15289838 14727329 14044023 13253278 12150762 11118674 10306675 9685879 9168393 8675232
8612 8675232 8280537 7818667 7530139 7398550 7082903 6788514 6682461 6516551 6266940 6106657
8602 6106657 5965619 5843906 5676128 5540368 5344652 5074929 4969411 4824020 4705562 4483182
8592 4483182 4395733 4231601 4100704 3901768 3682467 3585790 3517431 3421359 3356770 3281253 3204813
8581 3204813 3238314 3067827 3011242 2863297 2671135 2694368 2580373 2548797 2530346 2527552 2444225
8570 2444225 2360804 2320752 2313021 2365240 2228272 2202352 2140296 2019695 1999634 1899122 1765762
8559 1765762 1722344 1856324 1766159 1746584 1780312 1699640 1645679 1664299 1657584 1648646 1527218
8548 1527218 1448873 1459404 1477703 1438968 1424012 1347704 1422340 1414059 1273659 1276180 1289084 1288040
8536 1288040 1224489 1250354 1122797 1134876 1133597 1116560 1106751 1108060 1134825 1190020 1036106 1024270
8524 1024270 1043613 931378 878294 888442 811646 796677 849543 824603 811635 900544 776727
8513 776727 725178 775966 814022 896712 800120 679393 753193 847919 732577 729025 725407 704063
8501 704063 744283 731627 801906 760008 726184 838419 706814 645472 690519 701883 621830
8490 621830 624701 689704 663916 658531 651295 680146 696214 688998 688768 699061 695772 695463 649889
8477 649889 601360 645596 677265 693700 692303 708152 712683 565754 593159 563899 513679 583364
8465 583364 499937 583566 575238 576270 545741 471740 540258 566564 601636 570323 562056 644615
8453 644615 628195 596394 579771 592254 574186 582229 629339 540124 530649 661753 664643 682080
8441 682080 795066 762872 783693 776742 663775 632463 572253 549267 527497 408386 478471
8430 478471 459942 409450 351567 428284 489769 416330 499658 458597 484288 474429 449320 397717
8418 397717 339398 402399 383208 295595 335696 376662 280481 287037 299888 391626 393804 359992
8406 359992 333465 386826 295652 273253 256951 198017 109602 183008 311842 358861 392357
8395 392357 250488 116639 75762 125232 142502 265240 282290 188843 156686 95606 174464
8384 174464 161334 85436 166724 170686 239549 178913 122267 142240 246882 238822 204723 165811
8372 165811 142249 106683 101003 93735 109378 29067 -24223 93333 83462 111934 188066 94869
8360 94869 107838 153625 66227 22454 100091 82272 156650 130232 98110 22071 50690 149946
8348 149946 131773 113269 33624 72027 89528 -45486 96411 160838 139406 85302 59532
8337 59532 124718 178595 193509 152433 248580 184454 173319 254433 260013 154531 210861 140043
8325 140043 54824 94408 141106 182467 299588 226263 90217 115073 229481 248976 105780
8314 105780 94932 190718 232763 254893 209804 272645 180792 135672 88537 90946 124352 142249
8302 142249 224447 315531 268212 168806 248324 351278 368839 230948 212123 155454 138772
8291 138772 188922 172495 170422 157748 196112 289527 234745 153841 19087 69876 132854 102561
8279 102561 136094 52559 92210 100364 55152 196922 259683 175527 146816 232178 293914 242073
8267 242073 244479 275477 226973 249519 221553 93801 29782 67132 187755 160561 67155
8256 67155 181043 188367 83696 59954 48738 51086 38451 24502 61 18492 65116 85680
8244 85680 120002 39399 130131 156639 189782 215974 244780 335241 263120 289273 248263 284192
8232 284192 249002 170780 183335 176563 219915 152423 17844 25204 26659 34440 -66235 23613
8220 23613 39470 -16567 -17259 90121 47348 78846 52859 99843 186789 -16798 -65509 40139
8208 40139 -39053 -87731 -81365 -49229 35291 -7886 53344 -140430 -86056 -17205 -25356 -107206
8196 -107206 -135652 -229522 -93448 -790040 -737183 369851 273295 315192 210256 87502
8186 87502 110038 130773 124355 118963 240974 249453 155565 -3419 -94984 -92505 -46918 1154
8174 1154 41777 -7052 -98786 17097 26491 -66265 -122172 -125189 -39009 -28298 -72793 -95524
8162 -95524 39091 83701 85884 51714 67579 -5304 -8989 34430 14590 5229 43057 -14233
8150 -14233 -24183 150693 141495 99326 17097 -55205 724 -51372 -66454 168261 177738 -32799
8138 -32799 -53727 -41059 29887 -4816 -22355 97960 55571 32615 49484 21802 -53121 -53357
8126 -53357 -93612 -76492 -21307 23016 43735 -7430 -88718 37197 72834 -101340 -46058
8115 -46058 -138785 -71288 -55699 -14656 -3049 -93405 -154870 -97017 -111862 -103728 -67977 -68633
8103 -68633 -37160 -83168 6509 19956 -113314 -156227 -56528 -21723 -94027 -93227 -4057 -32721
8091 -32721 -63708 -38792 -9089 -19827 -80402 -75385 -124704 -132319 -125861 -139860 -129554 -97840
8079 -97840 -72637 -130702 -47084 -9716 -56141 8237 -113190 -119073 -125237 -134732 -42242 -75268
8067 -75268 -35977 -40558 27089 -10622 15346 54117 -21825 -60621 36787 -27892 -15667 -21677
8055 -21677 4911 -64280 -78070 -108886 -89974 -147023 -109599 -11114 17571 -38716 -23951 -49995
8043 -49995 3284 -25628 -58900 59785 -8619 4063 -75244 13541 64980 7652 -36883 -52918
8031 -52918 -138809 -139059 -166401 -98395 -33003 -70097 -99245 -97126 -75075 -114458 -134659 -210248
8019 -210248 -125635 -37433 -132990 -121624 -88903 -40922 14172 27566 61654 65997 43297 45939
8007 45939 -6983 -56894 -65096 -109524 -113896 -111951 -89723 -24659 29091 5267 34254 -15104
7995 -15104 -54515 29865 -87898 -67543 -62952 -52754 -66023 17220 61539 65501 62297 -19518
7983 -19518 -84484 -102520 -113055 -102376 -61500 -4905 -50499 -85000 -26772 -40451 -63258 -125740
7971 -125740 -78995 -130960 -114121 -54479 -52726 -66167 -109378 -44086 -6799 81641 121413 30155
7959 30155 -83005 -65084 6811 35495 -20262 -212924 -199623 -220655 -181058 -111662 24710
7948 24710 131792 67938 23254 -36382 -36218 -116043 -109281 -28448 22890 -61395 -2834 31756
7936 31756 93530 88750 74795 -35431 -6356 -35306 -46942 39656 -44916 21559 -95079 -192212
7924 -192212 -117575 -119893 -119482 -55066 -121458 -218443 -134496 -91121 -30647 18667 -6304 54348
7912 54348 254 -49123 -36729 7513 4797 40743 70823 -73007 -54890 27519 -47735 -12281
7900 -12281 -74458 -100436 -31688 -46778 -158913 -206863 -159600 -38239 -35818 27756 -70549 -80645
7888 -80645 -18535 9084 -23065 -123487 -210938 -129026 -119820 -161828 -169947 -155604 -78531 -131519
7876 -131519 -184919 -94246 -68457 -35621 -30379 -100086 -92797 -21135 53203 -32987 -28334 -27753 41817
7863 41817 18672 -76099 -86214 -52503 -64377 -84117 -101632 -10038 19864 12880 82610 13110
7851 13110 -33751 -44700 -91261 -110473 -129705 -116619 -80951 23389 7088 -14628 -37974 -53169
7839 -53169 -138105 -234868 -187652 -198770 -174670 -121173 -153608 -110524 -151389 -111372 -36799 4184
7827 4184 -68396 -50921 -108331 -130488 -78001 -37448 -4982 -47014 -68889 -77110 -87343 -150588
7815 -150588 57022 66666 -12346 -32238 -107515 -132085 -98307 -49444 -33435 71114 66434 21078
7803 21078 -66688 -22952 -19979 -65843 -113651 -119020 -67357 -99663 -56525 -72361 -112305 -131050
7791 -131050 -131860 -129961 -165007 -113074 -84130 -33530 -86444 -88406 4369 -43340 63062 -1978
7779 -1978 -32851 -35997 64451 70226 7567 -97525 -223470 -145462 -80383 -81222 -546 -64501
7767 -64501 -49490 -71212 -116997 1893 61198 -60836 -124645 -30558 41746 26531 -11475
7756 -11475 -85197 -82653 -56665 7574 -83186 -98359 -6253 -78067 23707 64085 -34483 -133969
7744 -133969 -175633 -75569 -113618 -128299 -145621 -148130 -66574 -77999 -165796 -109740 -38978 -41657
7732 -41657 -55154 -86693 -21510 -110888 -103317 -48314 -893 -102849 -90381 -36901 -31875 31293
7720 31293 -9456 -109162 -213317 -156140 -84912 -106307 -66841 17067 -29070 -13464 -70495 -95478
7708 -95478 -80298 -117328 -44512 -71039 -45327 -76496 -71378 35045 -42222 -110290 -42764 -47000
7696 -47000 -13786 -59195 -101339 -147935 -74190 -12166 81264 -41187 -77727 -792 15730 -74058
7684 -74058 -40270 -25663 -104143 -107751 -85519 -36726 1115 -41999 -57089 -55152 -17380 -69701
7672 -69701 -194680 -99297 997 -69660 -104617 -72224 -120847 -154329 -67339 -233 -52492
7661 -52492 -97375 -86400 -13389 81279 16149 -32237 -88726 -106667 -102947 -84241 -83856 25083
7649 25083 100573 -25288 -73417 -102886 -104238 -35111 -53500 -103360 -36926 -110728 -125295 -102263
7637 -102263 -48930 -100109 -109331 -175666 -104154 -32246 13172 -64146 -5817 108217 45956 14799
7625 14799 63259 -14709 22651 -16031 8245 41358 -27642 -47904 -110544 -48025 30096 52854
7613 52854 -22217 27693 -2707 -21518 -5086 -91382 -4729 14644 42640 34746 38293 34376
7601 34376 90496 47430 5423 -24192 -36335 242 66151 21262 -12305 119834 67039 -20695
7589 -20695 17633 50087 77846 53738 115681 96830 15363 70883 62058 24532 17899 -30238
7577 -30238 -137784 -122799 -17471 -15705 -97765 -9095 -35975 -26386 22222 -35424 66888 50901
7565 50901 39108 48166 60241 -368 -59497 -56912 -42110 -24809 135758 87689 41267 145401
7553 145401 -24792 -21697 -45015 -77191 -142564 -88160 -15300 37130 98231 94155 38184 -39850
7541 -39850 -90785 75875 42814 -20807 -67154 58428 82498 112254 85858 25683 56895
7530 56895 -4084 16850 22993 -62173 81160 155687 90903 59672 68742 68722 35625 93729 6942
7517 6942 -52753 4715 2836 83252 13587 28735 34664 -10912 -14335 -66942 -874 49614 44921
7504 44921 152983 141557 84972 127627 102934 79622 -3640 99607 151369 214667 295420
7493 295420 394315 158904 83175 132562 67863 108754 146747 194099 79692 127755 256882
7482 256882 347513 314761 354954 384681 431440 523967 522453 375889 324033 345250 338676 406573
7470 406573 305852 134843 103724 95498 56281 88054 6532 94133 68021 142105 67403
7459 67403 64155 103205 93695 140616 224964 301784 139972 46645 73855 6232 56022 127746
7447 127746 91973 73311 120643 164231 189878 260637 208027 107758 248813 231630 121071
7436 121071 157891 218771 217981 159157 163560 122566 167520 108553 148494 139227 150397 165674
7424 165674 177397 171487 153847 163904 137000 113703 20952 159557 163073 173601 84070 80844
7412 80844 144629 219565 195585 131923 249553 79031 19593 126477 210857 101862 155094
7401 155094 201463 173540 148597 144781 176385 165574 175631 76136 66181 20599 114698 151059
7389 151059 97421 35515 32889 97440 22340 85199 105124 124453 149542 60370 46364 97499
7377 97499 77907 92358 92782 38477 48096 32073 147863 156227 80347 188969 60393 30322
7365 30322 31732 128261 215828 115966 112972 213261 184243 215054 107662 53880 164830 184857
7353 184857 153901 174456 137566 141303 202333 181720 202205 145899 165641 227017 204795 105439
7341 105439 19578 -12794 26476 78913 142572 127252 144325 53799 17876 164144 132088
7330 132088 61580 38213 102960 46816 36535 109420 34334 1004 111071 80292 -14923
7319 -14923 77866 271254 351994 225147 93090 93757 245828 207487 155964 137582 201259
7308 201259 143673 62411 90463 30860 78534 206942 177752 167592 203129 224908 211384
7297 211384 190987 116336 152025 179238 174475 151807 251993 285796 243016 228411 144218 196203
7285 196203 237873 210602 208320 199155 263298 215182 187396 148743 114735 132872 164932 246975
7273 246975 197451 214376 212742 154758 222780 206181 257857 243294 233056 260226 236444 274740
7261 274740 272564 265034 254709 324104 317436 309023 234214 274506 237132 213344 285484 297009
7249 297009 261702 229671 279028 292705 273642 337956 337055 169699 211067 345914 268402 241739
7237 241739 241264 308575 289580 375503 332092 375795 293022 293536 364680 353231 381290 429680
7225 429680 398916 320681 383887 475396 374051 362987 300035 338072 369658 386935 445158
7214 445158 444116 505658 468926 567531 583186 546499 577299 657961 609990 548381 492949 459889
7202 459889 550970 511952 488842 631825 576906 527122 491130 564595 615473 603103 560439
7191 560439 503965 488639 525274 705725 656595 585180 652813 741725 741065 729750 683924 669041
7179 669041 641061 717389 889797 932090 939792 830770 905535 940901 957197 1049484 1067314
7168 1067314 974697 1057115 1007008 1249796 1322712 1333008 1314899 1311670 1412135 1547060 1610682
7157 1610682 1668503 1665523 1685530 1818962 1905185 2003879 2037180 2138831 2179442 2203730 2214023
7146 2214023 2291574 2416880 2357214 2366578 2397834 2571567 2663121 2670039 2712769 2882520 2791101
7135 2791101 2793716 2931115 2883466 2875925 3027089 3120051 3101198 3261093 3276077 3478725 3604789
7124 3604789 3717771 3761659 3921445 4003130 4139127 4246189 4417591 4667566 4761219 4943857
7114 4943857 5181416 5474493 5831933 6129180 6416827 6818661 7298302 7702912 8123514 8567506
7104 8567506 9120567 9676479 10343867 11115409 12057607 13035336 14001875 15021418 16029869
7095 16029869 16983186 18037364 19380573 20879289 22780500 25295084 28380456 31979118
7087 31979118 36104272 41006532 46867609 53404132 60659505 68845931 77532846 85773621
7079 85773621 90957312 90794591 84649481 74063231 61691703 50687765 42046807 35455505
7071 35455505 30638024 27004530 24212631 22066911 20224084 18670716 17303319 15953533
7063 15953533 14857674 13853067 12785965 11863900 11014767 10290665 9675446 8991744 8432338
7054 8432338 7921903 7474469 7036805 6737408 6434939 6269073 6107924 5930488 5623184 5389026
7044 5389026 5294904 5187826 4940698 4708733 4522468 4429732 4409182 4233037 4066703 3990682
7034 3990682 3804872 3750508 3551791 3394701 3317157 3225765 3079067 3045808 3098812 2984500
7024 2984500 2928673 2751238 2657740 2547122 2471653 2482104 2314101 2256016 2217858 2123253 2132701
7013 2132701 2132377 2091861 1961611 1969343 1999901 2085953 1930705 1865527 1972830 2013582 1908493
7002 1908493 1814827 1732418 1659521 1713691 1656314 1685777 1627492 1526532 1500531 1560625 1486252
6991 1486252 1525716 1463564 1448972 1386176 1405233 1437652 1420140 1428113 1424090 1400053 1261638 1348820
6979 1348820 1400107 1446036 1416289 1327158 1322222 1305817 1357147 1377865 1402712 1455209 1469903 1378776
6967 1378776 1515371 1559011 1452628 1457930 1446824 1457434 1454869 1427532 1347742 1197532 1022557
6956 1022557 990176 974681 961349 861950 851980 782910 776263 728599 634430 593010 610898 718252
6944 718252 799260 701143 628487 565993 577233 568170 534327 534089 506716 565905 579502 499061
6932 499061 495338 534964 437368 510539 444092 450204 483206 516918 529829 486823 551913 465157
6920 465157 410797 491817 442633 347110 344555 387187 411784 337549 326416 281269 309954 357781
6908 357781 402650 262677 219054 262583 227424 284225 196181 190473 184600 219254 310890 271860
6896 271860 277565 271472 227863 227431 127222 152937 210493 230749 217702 101840 21019 184886
6884 184886 326433 304528 303586 191752 107862 136373 226942 174079 148964 168403 124037 92265
6872 92265 211134 150450 144081 176867 135178 144163 153506 230854 272452 278340 263261 221402
6860 221402 159797 95327 46937 186196 219802 228744 112447 47789 79136 107034 128520
6849 128520 148454 122648 109543 94988 54545 64346 115529 159081 121708 135136 118597 122364
6837 122364 81430 112422 138491 205672 172904 86024 79274 125048 125344 -4836 14895 84066
6825 84066 104617 96293 28569 13808 59328 31821 66088 101220 100862 180704 247878 212996
6813 212996 149764 112337 -51444 -6437 114798 52448 120957 163119 143334 116712 53474
6802 53474 63506 68330 145520 125993 110601 135803 99086 154351 197887 180878 176012 233380
6790 233380 246884 150839 105300 164231 86596 46962 48543 62584 -17052 31235 67567 -4567
6778 -4567 -8327 -531 -32684 29306 49609 -6753 -29613 -59350 56891 84483 121205 97105
6766 97105 59824 86998 138175 76076 101093 123206 79559 91844 117795 28438 20191 6581
6754 6581 -39984 -25277 -62616 -106932 -74808 57190 -58600 -59359 -45551 54816 120154 36299
6742 36299 80198 106559 125872 70496 61689 160531 158140 65689 20525 20307 65767 83497 -33658
6729 -33658 -42193 -46676 -26796 80786 24878 -78 47487 56077 -43631 -34755 25127 5002
6717 5002 -62563 19677 131047 83573 80086 -33590 25938 6939 27422 65465 73266 6203
6705 6203 -32031 32465 161204 216970 111552 108185 101729 106116 63045 159022 188313 209921
6693 209921 215315 201329 98395 93184 135858 99710 158280 142727 163269 204713 340608 404277
6681 404277 400818 414095 447217 434458 479401 533571 525126 514444 381186 295992 267669 243120
6669 243120 315694 332709 193687 157556 211900 181589 157240 133407 135259 82494 25423 -74784
6657 -74784 2607 108122 14558 40293 21618 37341 89720 140048 67329 201104 100927
6646 100927 90401 125940 68494 56629 -7169 77333 116688 4024 -5239 28459 39017 -24471
6634 -24471 -68193 14009 -23094 -22434 75583 217517 101210 22026 47948 100127 52370 -45589
6622 -45589 -73008 -51697 26590 43951 -18159 -27960 -5066 -45086 -87291 -30757 -14360 8315
6610 8315 117437 96947 17346 -46655 29645 77419 52470 -2387 45798 -25915 -43014 84460
6598 84460 68501 61712 -17552 -122037 -146074 -113757 -118447 -136206 -78340 81379 35408 77174
6586 77174 101711 -18293 -42736 -55166 -17721 107247 33776 87523 6073 5890 99884 126584
6574 126584 127521 88051 82257 53845 1143 66390 58476 37754 53419 40318 -22545 -115267
6562 -115267 -86056 -138682 -67699 20768 67964 3377 14112 4905 4770 36015 -25537 -2335
6550 -2335 -19617 -101261 -28574 76504 158229 75435 3813 57658 68477 14322 -45665 -123884
6538 -123884 -124428 -65096 11667 -2978 5186 -75135 -31394 -38302 -41506 -77773 25871 32714 14517
6525 14517 59796 107936 139737 52003 43539 -22814 -59492 -1588 6839 34518 41535 72990
6513 72990 76250 24468 74138 44664 -69121 -70511 36099 23388 20607 -20212 -40425 -72890
6501 -72890 -97881 -87868 -634 68318 45227 68584 89221 -9550 -35714 -77639 -67278 -66580
6489 -66580 47425 70519 62987 -3095 -26443 -49569 -23697 38538 -43433 -45456 17448 31328
6477 31328 -48328 37572 -67512 -46399 75287 84273 103917 84999 89026 34080 99285 96723
6465 96723 127300 114668 55086 21621 91616 41854 -25990 -101783 20845 -16985 -65853 230
6453 230 61496 9338 -89591 -12789 149740 40147 -110250 -128775 -124375 -84007 -108637 -10730
6441 -10730 43940 50945 -50796 -41853 -24892 48537 8871 -30596 1008 7487 59611 80000
6429 80000 86232 3945 -19190 134069 70122 111316 102810 104276 9859 61390 253611 172887
6417 172887 114836 31766 20877 95999 109986 80262 -110423 -122621 -22707 377 37236
6406 37236 89388 159976 127997 105229 65132 54879 57155 41646 64670 71314 117189 92812
6394 92812 17710 -4487 56831 -41225 1162 51956 60592 39797 -68369 -2743 48736 10559
6382 10559 25283 11274 18670 107929 26469 83742 15199 -8031 16785 95053 125989 82064
6370 82064 -21587 -53973 94707 147612 189458 99587 105023 31683 62432 126190 162043 138142
6358 138142 109044 100394 16010 6600 68658 110270 29365 8832 43006 21445 128348 44344
6346 44344 -9091 8343 5891 178726 96256 81062 50455 34624 60377 51988 206518 223647
6334 223647 138760 51935 65926 23388 24580 111079 22079 40991 -1127 20272 42642 10351
6322 10351 33150 46493 127721 32177 31926 95111 186936 185241 125739 69673 92264 96968 98436
6309 98436 158287 128406 191765 101779 153485 133154 73067 61939 45182 94401 114784 106539
6297 106539 165646 104208 92354 104787 120798 119332 143437 166817 204940 173176 148100 174053
6285 174053 186233 211059 265687 143527 35803 44096 24392 62913 128137 174500 253582
6274 253582 295638 172397 126966 127344 137294 163871 130305 135078 247372 224162 152818 161586
6262 161586 200896 233694 169880 285274 386380 290765 252483 281030 311099 283189 297368
6251 297368 359818 382886 455128 467010 425781 507454 467191 498786 437153 452988 427928 300010
6239 300010 259484 350576 399444 405943 348502 325044 382852 367811 423014 455929 490308 370958
6227 370958 321818 338534 344159 456669 473009 478175 549827 520556 553650 717932 735687 650392
6215 650392 667551 587088 445626 327524 398830 470787 485847 440540 414043 451835 423544
6204 423544 394226 368454 339680 392509 515679 451788 450670 378999 432551 458750 466532 442827
6192 442827 565650 490137 497319 555418 505510 467858 412035 393567 336239 370739 410607 351799
6180 351799 322835 368907 373661 386204 394168 342980 313077 324560 290298 259841 262248 311203
6168 311203 306595 246005 260899 301553 314044 287749 300635 368794 390209 439910 380416 416875
6156 416875 382976 378183 377643 296984 325976 422212 331474 203842 281793 371728 369304 357856
6144 357856 430294 464905 358460 329058 251747 253432 290217 359468 425898 470102 402951 403362
6132 403362 386464 411315 279411 363542 363214 359955 366636 353590 373902 442441 450530 435755
6120 435755 437045 383526 474514 505860 475709 430207 602018 548504 581458 603650 659485 569196
6108 569196 544014 551081 515260 426378 506543 475461 420911 591611 640188 577214 650291 583582
6096 583582 488784 619317 677501 603061 649804 705701 631934 660571 610617 687689 725966
6085 725966 660955 712187 754551 686938 674872 673701 671397 752993 791960 868913 808305 742525
6073 742525 811989 753028 784808 755984 675370 802506 825302 881724 876886 859204 864539 925514
6061 925514 879428 909773 915740 844854 864241 906807 920588 921166 877920 893251 990849 1095553
6049 1095553 1157163 1099374 1212799 1163236 1062594 1039249 1166798 1194414 1182077 1128910 1149992
6038 1149992 1158240 1251580 1257091 1262075 1287994 1272507 1241270 1389356 1494390 1464776 1465739 1530863
6026 1530863 1488383 1494419 1653152 1769503 1799004 1779088 1811116 1749707 1879471 1867925 1868391
6015 1868391 1820716 1798476 1959415 1959463 2040568 1998605 1947949 2019468 1999996 2095639 2279344 2503873
6003 2503873 2591689 2582428 2720368 2851705 2932604 2993488 3049573 3164612 3188063 3239389 3270810
5992 3270810 3213120 3173719 3209445 3126560 3123007 3170274 3251854 3292367 3452520 3464438 3534411
5981 3534411 3542201 3564813 3717529 3831731 3945734 4064668 4256687 4384172 4486869 4731010
5971 4731010 4927669 4896186 4941957 5027110 5241365 5175530 5185041 5202258 5243965 5273356 5361409
5960 5361409 5559101 5677453 5635162 5691840 5892512 6151325 6275285 6358773 6593065 6629197
5950 6629197 6876480 7175259 7335202 7566176 7774897 8101161 8364918 8625470 8869136 9126747
5940 9126747 9491429 9772143 10188712 10593243 11020292 11531638 12072126 12694100 13591455 14478826
5930 14478826 15458059 16795236 18343738 20122407 22172578 24265943 26858972 29721015
5922 29721015 32884003 36369817 40157627 44257906 48432308 51903400 53249763 51541677
5914 51541677 47337929 42685606 38530502 35420203 33139334 31467181 30509393 30060936
5906 30060936 29966918 30386439 31061265 32193939 33619570 35331933 37722820 40568313 43994252
5897 43994252 47889332 52394555 57547155 63581990 70214369 77341387 84988676 92312810
5889 92312810 97519772 97589577 90876529 80004477 68928180 59817441 52682446 47427377
5881 47427377 43523307 40463467 38327802 36748211 35789459 35172507 34795491 34726783 34818249
5872 34818249 35042700 35525939 36323731 37503881 39028030 41094893 43569067 46263940 49232640
5863 49232640 52366505 55074477 56221029 54527609 49896455 43818686 38264954 33722941
5855 33722941 30170302 27317452 24979253 23234560 21752136 20490098 19556467 18754265
5847 18754265 17974268 17234060 16537745 15775095 14902307 14085493 13257696 12573503 11948441
5838 11948441 11286018 10840444 10423998 10077901 9676197 9319509 9094394 8845749 8601150
5829 8601150 8417900 8362481 8257553 8038252 7861859 7784352 7632812 7310484 7188984 7129344
5819 7129344 6995806 7030794 6988601 6918756 6904515 6889597 6875104 6848050 6945236 7143118 7261950
5808 7261950 7307157 7269796 7154006 6862004 6352610 5998017 5661875 5481101 5314104 5210418
5798 5210418 5168619 5131953 5031521 4881123 4807091 4688975 4644100 4520125 4527354 4363640 4220393
5787 4220393 4188104 4115835 3972844 3962473 3880111 3841741 3818571 3761076 3747582 3655150 3586908
5776 3586908 3526344 3444616 3450067 3436708 3474589 3382904 3386791 3399108 3387004 3447740 3482667 3445623
5764 3445623 3369316 3390972 3311855 3262638 3237614 3238009 3265520 3306259 3269948 3295893 3290565 3244597
5752 3244597 3377748 3511618 3589606 3542903 3487397 3338887 3316309 3373838 3350069 3328197 3327141
5741 3327141 3445955 3473775 3472690 3582978 3735496 3808853 3908009 3921999 3983030 3993315 3983979
5730 3983979 4096649 4136932 4156799 4200368 4302675 4460186 4548566 4706816 4815281 4793551
5720 4793551 4755599 4529274 4453867 4419970 4228018 4336463 4275435 4333820 4411488 4585494 4636391
5709 4636391 4797665 4983297 5007701 4995403 4813776 4724156 4630841 4544066 4558998 4618572 4615389
5698 4615389 4527700 4561895 4650883 4622221 4598018 4509631 4363661 4214910 4083455 3985149 4147211
5687 4147211 4101299 4162825 4241116 4325326 4242568 4256837 4357093 4378074 4360968 4117580 3916504
5676 3916504 3748551 3671022 3671491 3605024 3553535 3516022 3506960 3426897 3489352 3359325 3319685 3265251
5664 3265251 3274559 3194716 3117114 3184375 3183252 3214144 3176091 3315861 3398575 3450246 3539281 3576161
5652 3576161 3466959 3427924 3293802 3313983 3177610 3109473 3219436 3185358 3101600 3176044 3245554
5641 3245554 3341159 3473153 3535484 3548328 3547319 3419588 3346494 3313986 3362579 3425756 3492647
5630 3492647 3359449 3306643 3290830 3596964 3608512 3501005 3559109 3526871 3644096 3702340 3714203
5619 3714203 3764599 3899025 3976167 3995931 4088596 4223504 4260833 4300821 4286216 4335227 4397398
5608 4397398 4351044 4274565 4334282 4343044 4404032 4384236 4327062 4307834 4370230 4325173 4344473 4460884
5596 4460884 4535385 4549783 4665150 4763313 4917423 5061200 5239266 5307956 5494561 5593093
5586 5593093 5677147 5840690 6040306 6164069 6148788 6225134 6216380 6258751 6425860 6578386 6744575
5575 6744575 6848189 6981240 7108689 7243734 7498759 7650335 7824126 8061648 8393148 8808952
5565 8808952 9238190 9664625 10193032 10639624 11065535 11698790 12327068 13040599 13755508 14221478
5555 14221478 14542649 14503512 14391054 14390141 14532178 15020209 15731715 16483857 17322658 18413062
5545 18413062 19745144 21218529 22953198 24933997 27157666 29599446 32117588 35004808
5537 35004808 38103069 41302095 44411746 47007085 48568604 48737241 47382844 44984105
5529 44984105 42280502 39703872 37654001 36178459 35056523 34244673 33943589 34000497 34420925
5520 34420925 35088491 36239349 37833132 39836620 42389767 45294649 48801897 52697311
5512 52697311 57130197 62053513 67385495 72941902 78341345 82952045 85800611 86018139
5504 86018139 82880745 77234179 70106197 63256398 57305118 52294280 48347721 45107635
5496 45107635 42498261 40457230 39109208 38314642 37738040 37435726 37533614 38004819 38678395
5487 38678395 39619620 40812104 42020374 43616468 45444123 47382443 49347251 51091777
5479 51091777 52360326 52367248 50700313 47522026 43642628 39626510 35966945 32820950 30205729
5470 30205729 27985173 26154430 24645564 23460494 22378368 21445222 20484589 19634581 18874335
5461 18874335 18034338 17277006 16603057 15875113 15168503 14498446 13771392 13311078 12788936
5452 12788936 12359166 12012919 11775728 11515598 11337127 11169272 11132266 10989042 10950862 10979669
5442 10979669 10775327 10636815 10481173 10340354 10298742 10114799 9910771 9847137 9735233 9591417
5432 9591417 9406647 9207206 9033060 8884877 8733025 8531197 8371005 8239231 8077561 8000637
5422 8000637 8017905 8042828 8108359 8135974 8243338 8264464 8235319 8204288 8145647 8036098 7811413
5411 7811413 7484101 7270759 7108003 6948647 6880311 6661231 6514061 6461626 6290617 6168815
5401 6168815 6292936 6312301 6265200 6137775 6052087 6044183 5947538 6001407 6073452 6189977 6192096
5390 6192096 6186109 6286196 6383571 6322939 6252451 6319928 6313241 6390645 6313775 6226960 6287304 6421385
5378 6421385 6453153 6406411 6296996 6056591 5886693 5761054 5509122 5335624 5298465 5395382
5368 5395382 5449512 5454356 5604152 5698272 5849660 5921064 5979846 6021766 6151260 6183337 6210908
5357 6210908 6224109 6200786 6268622 6434360 6653868 6800126 6862802 6785999 6558130 6198459
5347 6198459 5858380 5760054 5668787 5649335 5662250 5657893 5683263 5743632 5938620 6034949 6079764
5336 6079764 6230925 6398238 6485809 6612775 6518827 6335390 6163537 5867634 5741962 5625086
5326 5625086 5473601 5533545 5483116 5394657 5065416 4806928 4593493 4474810 4380990 4394217
5316 4394217 4353716 4341593 4303885 4328870 4349123 4360760 4501788 4625386 4654581 4688793 4751023
5305 4751023 4640411 4476784 4296789 4136636 3836690 3663272 3594939 3378738 3301607 3225344
5295 3225344 3256600 3212234 3220770 3245175 3234770 3189125 3113350 3143130 3055005 3056436 3063939 3065839
5283 3065839 3044746 3073945 3070947 3090341 2982115 3025289 2944908 2690409 2568227 2532903 2505403
5272 2505403 2463629 2394943 2404491 2392279 2279408 2198757 2200564 2248058 2260394 2288608 2276149 2272655
5260 2272655 2228710 2084934 2069069 2071570 2103464 2009919 2025857 1995741 2027896 2036753 1973668 2021471
5248 2021471 2064459 2077228 2034252 1955399 1930560 1996071 2049832 2048020 2148959 2240946 2184723
5237 2184723 2123744 2042752 1959058 1811225 1754273 1941269 1901214 1763663 1760938 1767642 1778378
5226 1778378 1771702 1879839 1834095 1857650 1881634 1953188 1951644 1872972 1802540 1690580 1739870
5215 1739870 1698778 1548112 1664804 1729105 1753395 1844119 1825052 1683194 1631354 1652586 1580033
5204 1580033 1530254 1393504 1381843 1307513 1308609 1388955 1355570 1242267 1154387 1224868 1241494
5193 1241494 1125061 1101843 1193150 1147207 1208529 1259607 1224538 1184840 1273962 1311193 1352801
5182 1352801 1399980 1421565 1345330 1331239 1390843 1304877 1229051 1186394 1151726 1187422 1285718
5171 1285718 1225949 1195699 1156349 1131441 1134023 1141200 1209953 1251809 1191376 1251661 1176770 1167927
5159 1167927 1137326 1078388 1176027 1171515 1198479 1187411 1184804 1214599 1192253 1175107 1205728 1144369
5147 1144369 1262262 1251737 1176762 1227616 1262340 1223613 1112407 1092467 1036147 1057270 1124274
5136 1124274 1018546 977249 1086312 1042491 965741 997733 1005136 1043153 962111 986130 1079216
5125 1079216 1048170 998184 1072530 1072049 1004107 944301 956415 980474 858724 899640 919511 885442
5113 885442 829816 915199 922453 804903 724117 780946 744626 720624 755081 739930 748279 777789
5101 777789 782329 807245 856499 792045 786861 714480 611141 619538 640447 711568 708621 701223
5089 701223 655443 607406 678315 678951 762098 790532 684629 581948 600095 652861 610989 631550
5077 631550 713341 618172 639729 620049 737743 714158 575227 556061 595907 611992 616630
5066 616630 628317 536891 542086 481867 455974 452867 520900 454307 462962 535445 530527 514150
5054 514150 566288 557000 504126 465527 460646 472696 531687 429683 490379 583261 571594 544618
5042 544618 418031 546449 579572 506389 489582 485423 420787 449923 391742 495690 542345
5031 542345 492004 486032 511023 493966 614219 652113 674335 665419 602639 618513 658977 576736
5019 576736 543701 659404 727472 704640 632252 731606 737316 690746 639961 743060 615631
5008 615631 635901 612219 661170 668853 608092 558085 525815 490668 444330 585312 767065
4997 767065 699345 605609 558016 540515 609274 652874 604003 494352 505972 579544 668310
4986 668310 604624 506713 496893 645178 592310 660712 672376 582628 592266 527979 604000 540574
4974 540574 578470 579939 640346 647148 640134 603381 518091 652499 700439 584683 529982 615447
4962 615447 584022 617517 600449 582777 633779 621897 573767 578186 527456 550373 551858 557776
4950 557776 628711 754207 642858 579571 556507 663266 719313 644645 642188 628417 692026
4939 692026 636957 590460 566334 681654 720160 697365 685205 622054 605293 652710 639942
4928 639942 606867 592449 650820 728839 796397 743629 618199 720201 656561 674562 717043
4917 717043 706654 692489 669475 653842 597003 714826 749143 697139 658840 585190 638124
4906 638124 715131 682403 742719 699703 635499 661128 620003 706882 699538 591694 570505 647946
4894 647946 656199 597438 599679 589283 679572 789920 785830 750943 766518 778540 688541 668368
4882 668368 686986 686053 704199 840664 923030 789325 780209 784325 714975 697148 792179 806443
4870 806443 855937 866655 800272 766819 749538 756387 820232 789032 837153 886758 911894 912836
4858 912836 894132 907256 889135 824976 831589 1003926 985008 875602 915626 944089 950834 894375
4846 894375 999067 962656 912340 1041493 988970 976234 995983 1071490 1074261 1072206 1074367 1128020
4834 1128020 1203905 1231183 1208712 1241432 1328764 1330130 1335279 1343678 1423140 1474903 1336777 1359883
4822 1359883 1326171 1248214 1244804 1365756 1418232 1355619 1325459 1351579 1429484 1496283 1509265
4811 1509265 1459655 1431026 1459970 1513197 1550561 1609472 1630386 1646053 1637054 1633682 1719528 1832515
4799 1832515 1808550 1833627 2001046 2010138 2078276 2232654 2262551 2311696 2369858 2356236 2403865
4788 2403865 2618104 2643600 2750247 2861417 3026385 3283159 3383215 3574068 3762217 3893902
4778 3893902 4302887 4800108 5199251 5663919 6266876 7001503 7832288 8870992 9918642
4769 9918642 11181435 12670734 14188878 16209662 18352581 20226246 21355111 20765841
4761 20765841 18720707 15882083 12903697 10714304 9148621 7997572 7084179 6502571
4753 6502571 6179911 5883105 5436371 5043475 4838851 4657257 4525521 4221065 4056545 3978565
4743 3978565 3795835 3642923 3571816 3558680 3491421 3431007 3396708 3403813 3380802 3330725 3273005
4732 3273005 3298055 3379812 3356820 3390274 3380548 3417736 3418279 3496522 3619694 3678908 3722796 3845263
4720 3845263 3902727 4017276 4158321 4280572 4363674 4576213 4963848 5279272 5826954 6436561
4710 6436561 7032309 7768046 8550574 9611925 10735836 12032462 13616345 15404900 17323376
4701 17323376 19219354 20309435 20324523 19480297 17671152 15157560 12545691 10497856 9014887
4692 9014887 7917188 7232038 6580350 5984946 5613287 5216645 4964291 4840469 4661562
4683 4661562 4364619 4114597 3923532 3808466 3738814 3552134 3386023 3257436 3122286 3052228
4673 3052228 2980919 2919402 2894653 2824180 2801964 2919999 2870830 2804764 2782116 2771842 2686557
4662 2686557 2734989 2687316 2692095 2601214 2440463 2493795 2509780 2539663 2517019 2380973 2373233
4651 2373233 2374505 2314335 2364829 2455067 2523538 2407761 2349218 2312264 2299011 2285276 2246563
4640 2246563 2325485 2274311 2220375 2253261 2261092 2127811 2107772 2184353 2185138 2112317 2190028 2251347
4628 2251347 2213853 2286828 2264935 2241876 2319251 2247004 2298798 2310734 2207700 2216646 2222247 2281492
4616 2281492 2279409 2307028 2360310 2304102 2285504 2267139 2322197 2404120 2324537 2320234 2219173 2258883
4604 2258883 2316621 2317749 2339628 2337366 2271516 2307822 2311579 2287986 2367408 2495337 2464176 2372088
4592 2372088 2376104 2393932 2494704 2579197 2576237 2509399 2500298 2620106 2569869 2675735 2620699
4581 2620699 2664692 2684682 2628698 2626447 2650922 2698155 2727290 2732739 2776359 2815133 2825802 2778306
4569 2778306 2771773 2882199 2848431 2996023 3032650 2998927 3000665 2994096 2989373 3000184 2974466 3002118
4557 3002118 3180434 3218911 3154090 3216846 3181152 3133579 3170173 3255678 3212938 3344353 3320301
4546 3320301 3324386 3455216 3519511 3506900 3485499 3495994 3605144 3645497 3672040 3696056 3757972
4535 3757972 3699048 3691642 3858449 3909927 3896889 3886723 3943438 4025553 4097594 4077575 4114129
4524 4114129 4116585 4090706 4193466 4233381 4269636 4427508 4442643 4559381 4625686 4575129 4638510
4513 4638510 4661973 4645745 4716419 4689416 4749407 4857469 4847040 4924632 4875750 4891031 4965604
4502 4965604 5028396 5028687 5114162 5124392 5070810 5250603 5283719 5325615 5353990 5420206 5526469
4491 5526469 5589463 5737933 5725012 5736949 5841967 5935157 5955174 5941953 5918107 6057122 6243727
4480 6243727 6350958 6377253 6349790 6393372 6328944 6406927 6516712 6649609 6787089 6672811
4470 6672811 6723385 6892191 6883139 7022325 7070874 7061798 7177066 7358666 7469140 7551936 7663367
4459 7663367 7684233 7728501 7889020 8109077 8235085 8465371 8607876 8722849 8953783 9112651
4449 9112651 9336885 9579919 9742220 9771191 9815383 9610104 9380244 9223935 9111842 9032322
4439 9032322 9090969 9137189 9135684 9112722 9132566 9131562 9228170 9154514 9151054 9243876 9258227 9242971
4427 9242971 9340558 9377528 9323213 9450324 9385813 9527889 9633300 9660861 9638849 9566954 9615986
4416 9615986 9724223 9776837 9851932 9959064 10037121 10088391 10227974 10287891 10276151 10310933 10270570
4405 10270570 10361808 10519314 10505754 10461333 10322149 10234920 10227482 10156766 10135071 10206326 10284894
4394 10284894 10331948 10250640 10213426 10284257 10311652 10216864 10336984 10421540 10426434 10504249 10569577
4383 10569577 10647143 10718149 10712684 10740301 10773688 10729162 10774276 10862980 10851608 10757902 10705838
4372 10705838 10668696 10699956 10736931 10690770 10578959 10449883 10363544 10389446 10266521 10193219 10148107
4361 10148107 10103679 10013072 9898911 9826330 9738927 9740138 9719764 9754581 9845014 9911315 9930730
4350 9930730 9862464 9920003 10082208 10141013 9979463 9878024 9894824 9819902 9737786 9735384 9779230
4339 9779230 9668531 9657913 9558779 9448711 9376207 9274916 9121705 8997907 8938467 8714417
4329 8714417 8615422 8550302 8438911 8256897 8134105 8159862 8190586 8088149 7989804 7852479
4319 7852479 7846446 7903957 7845676 7849892 7828142 7893287 7802289 7818433 7854996 7754520 7624488
4308 7624488 7576769 7425920 7269233 7213549 7012780 7099644 6964267 6891854 6892256 6788391 6725569
4297 6725569 6813177 6841409 6730423 6664854 6665990 6664421 6510569 6453965 6378547 6423213 6406123
4286 6406123 6410993 6462537 6571846 6513904 6539150 6554604 6520117 6451783 6339732 6220713 6256401
4275 6256401 6240703 6276483 6316704 6405427 6571266 6517396 6418039 6290061 6309477 6396982 6461606
4264 6461606 6461003 6431891 6390993 6351087 6373198 6423104 6424471 6512903 6503409 6606470 6901220 6959902
4252 6959902 7058320 7124774 7097917 7332817 7481640 7534125 7533418 7722555 7835093 8019101 8219299
4241 8219299 8384053 8583028 8677065 8898846 9006346 9187469 9422201 9461364 9584420 9827848
4231 9827848 10185165 10307952 10468509 10623035 10720589 10867644 10971868 11108088 11209346 11308970
4221 11308970 11565297 11645840 11683028 11782582 11844984 11936399 12016936 12093323 12305372 12552662 12719936
4210 12719936 13051346 13299342 13623029 13985970 14249211 14553166 14963562 15258107 15603951
4201 15603951 15988253 16333195 16764033 17206883 17608467 18127934 18645932 19258769 19982900
4192 19982900 20836631 21820904 22796640 23679364 24757211 25959098 27105603 28142597 29279489
4183 29279489 30613447 32056274 33946264 35851663 37898474 40355959 43204740 46621963
4175 46621963 50670066 55425946 61280606 68091761 76235562 85907495 97184413 110253003
4167 110253003 125379856 142482388 161860885 183412306 207697004 234507723 263519931
4160 263519931 288530098 298087855 283854599 248578624 205630406 167691451 139775692
4153 139775692 119421504 104148911 92260247 83043557 75645414 69734313 64630755 60377552
4145 60377552 56568151 53013546 49778645 46955426 44235013 41751282 39564174 37534761
4137 37534761 35806490 34364347 33173612 32416309 31720753 31224629 31086687 31185493 31498351
4128 31498351 31898049 32125547 32128956 31956305 31861865 31565831 31028027 30566702 30204329 29766131
4118 29766131 28941993 27531455 25938413 24374106 22935937 21811611 20851746 20047335 19316844
4109 19316844 18719596 18142095 17725947 17264904 16771210 16346817 15881726 15341689 14799366
4100 14799366 14259975 13880174 13539001 13349365 13089169 12978533 12686747 12495745 12256531
4091 12256531 11974835 11724318 11541508 11414183 11349763 11348925 11214967 11108133 11002035 10892123
4081 10892123 10770290 10856802 10823741 10832580 10870522 10936538 10931847 10585813 10352575 10216584 10006856
4070 10006856 9798884 9660046 9614187 9534627 9446524 9308360 9151338 9106640 9053470 8996031
4060 8996031 8862857 8799444 8686869 8571031 8554066 8434201 8217497 8042216 8001520 8020496
4050 8020496 7893393 7899239 7796191 7753389 7783213 7905806 7918385 7920104 8006550 8030675 8087795
4039 8087795 8091122 8090998 8063734 8134399 8155853 8194793 8273269 8359279 8506857 8659369 8974766
4028 8974766 9216455 9430334 9826466 10080864 10354607 10494942 10433005 10077564 9707799 9491161
4018 9491161 9319535 9165566 9138114 9031506 9082414 9136164 9129869 9230600 9246583 9463187 9648299
4007 9648299 9857503 10046461 10439322 10872109 11247891 11746942 12304144 13078632 13706864 14402280
3997 14402280 15290413 16199264 17158396 17829288 17985401 17802646 17530945 17408313 17326380 17140928
3987 17140928 16617625 16026604 15653041 15523048 15552531 15844198 16221971 16809657 17456032 18316335
3977 18316335 19305338 20285780 21532372 22901783 24219151 25491664 26335116 26651383 26272277
3968 26272277 25347649 24512152 23749076 23343177 23293010 23329907 23520076 23675235 24032610 24672863
3958 24672863 25359643 26299854 27434749 29004240 30840001 33073034 35741097 38617044
3950 38617044 41660276 44967018 48334117 51295580 54030023 56877155 59443517 60342166
3942 60342166 58688234 54855595 50108743 45926494 42572412 40080068 38294667 36894462
3934 36894462 36079764 35478117 35182581 35354734 35847960 36654533 37725553 39307163 41280148
3925 41280148 43736751 46442847 49527554 53356624 57402988 61876507 66783665 71696771
3917 71696771 76054785 78576468 78099863 74252124 68200281 61521027 55396383 49988955
3909 49988955 45637091 42282655 39842497 37914990 36314301 35247938 34498333 33934579
3901 33934579 33714702 33883504 34316802 34995505 36053716 37359500 38888639 40712115 42876363
3892 42876363 45417776 48121896 50629207 52457281 52743227 50673719 46681691 41901955
3884 41901955 37332047 33497773 30568579 28202145 26414179 25072604 23995498 23134180
3876 23134180 22356222 21829938 21484079 21116392 20974292 20778965 20829159 20880081 20902125 20956582
3866 20956582 21073639 21328541 21567623 22036389 22481343 22841280 22712713 21999872 21097759
3857 21097759 20128730 19384196 18790851 18138760 17319400 16343886 15397798 14530290 13830762
3848 13830762 13273826 12945205 12536061 12088911 11749434 11418306 11117811 10844834 10648537
3839 10648537 10362874 10079391 9850146 9602903 9392536 9241505 9124466 8928963 8736769
3830 8736769 8645969 8540158 8396771 8348483 8275496 8330224 8303167 8166966 8134480 8076533 8134885
3819 8134885 8156931 8250892 8287758 8285701 8371019 8390964 8408001 8473913 8477388 8526891 8516000 8511558
3807 8511558 8360120 8213883 8140812 7991370 7887047 7810877 7674875 7547066 7592773 7580520
3797 7580520 7586204 7662424 7810018 7972592 8139842 8276550 8259465 8328856 8532481 8729859
3787 8729859 8956791 9353473 9713513 10084680 10477528 10798512 11288951 11594060 11889070 12347460
3777 12347460 12757028 13366988 14020965 14603153 15134837 15740713 16306189 16682849 16734947 16454420
3767 16454420 15781632 14859122 13919495 12951672 12164036 11653760 11154844 10699833 10339022
3758 10339022 10040381 9819392 9713437 9557954 9243246 8995364 8653595 8514289 8316403
3749 8316403 8058767 7957087 7854753 7724450 7707093 7614991 7542591 7453637 7533498 7492215 7312741
3738 7312741 7117256 6864523 6637527 6527837 6358730 6256541 6224574 6223593 6280838 6248943 6188637
3727 6188637 6167029 6170719 5994944 5849832 5901313 5751592 5735327 5748543 5686406 5739760 5808694
3716 5808694 5879288 5871233 5710424 5637918 5561217 5318602 5269370 5154455 5075170 4975807 4785081
3705 4785081 4615691 4556219 4573524 4549233 4454429 4476892 4491528 4479286 4444028 4344101 4257690
3694 4257690 4234348 4229538 4254445 4286522 4244223 4184529 4210669 4201788 4151813 4090406 4108260 3998966
3682 3998966 3951142 3725307 3621141 3706869 3649970 3584440 3505354 3550429 3487970 3315274 3252301
3671 3252301 3124907 3100280 3013874 2974702 3082332 3041060 3002726 3115927 3068924 3113346 3118920
3660 3118920 3093919 3170503 3147983 3092047 3035744 2970954 2900168 2809103 2795394 2901147 2890278
3649 2890278 2741365 2653224 2692039 2710655 2626714 2576357 2614137 2625275 2624462 2554594 2508674 2509918
3637 2509918 2516175 2434028 2499573 2485783 2395084 2522324 2575330 2670227 2746694 2719191 2611792
3626 2611792 2524365 2481265 2474522 2540053 2435621 2464799 2528120 2451345 2344711 2236692 2187134
3615 2187134 2166787 2093086 2140090 2155125 2030835 1980606 2071948 2030349 1970986 1958121 1934871
3604 1934871 1943740 1939378 1806871 1811581 1839091 1839024 1830438 1821858 1838663 1752997 1638677 1695580 1676727
3591 1676727 1694429 1615821 1685648 1718420 1657704 1740795 1688467 1614284 1619781 1726235 1726468 1713744
3579 1713744 1741398 1676369 1679789 1666408 1581948 1540496 1516168 1481721 1480478 1572223 1561565 1540287
3567 1540287 1538859 1466789 1456236 1516953 1574391 1654247 1632167 1637337 1577666 1537306 1465536 1423506
3555 1423506 1392199 1463360 1557598 1469568 1424437 1444910 1425578 1406519 1404827 1537081 1516916
3544 1516916 1456952 1453668 1396039 1370528 1335438 1322110 1350359 1357364 1305418 1247280 1197995 1215355
3532 1215355 1244978 1184602 1189872 1190595 1151145 1229509 1240412 1306124 1239251 1228065 1280600 1342186
3520 1342186 1291610 1291597 1315596 1355243 1410268 1358518 1313576 1283986 1267652 1285613 1303223 1179355
3508 1179355 1274916 1112525 1069209 1032938 1109306 1147470 1141338 1179429 1036525 940594 1011188
3497 1011188 981761 894764 1010411 1031278 1021957 1151625 1093205 1066778 1016119 1022486 1029361 1004522
3485 1004522 1034118 1001634 1004218 848777 897957 970023 1040094 921698 847841 924282 897468
3474 897468 978807 934652 803365 898191 942007 984505 982130 985177 927659 951136 926237 895775
3462 895775 968374 970026 984009 982004 932736 887503 910861 980635 948437 813774 721633 765938
3450 765938 896656 892275 770055 780576 786632 758022 851409 874299 764073 728745 777679
3439 777679 925216 1007222 910944 927966 1008025 1036484 1110413 1035039 959045 908317 872544
3428 872544 980765 1013200 966361 1034760 1057350 976994 939075 892108 863586 821324 943371
3417 943371 953744 995733 981769 1062784 1118456 1150596 1133762 1152692 1172984 1081238 1093640 1066273
3405 1066273 1055842 1068473 1228672 1222613 1198398 1234540 1198145 1120190 1105814 1170268 1186962
3394 1186962 1137669 1205575 1119203 1140533 1222675 1189657 1181019 1135001 1121237 1174377 1252664 1180057
3382 1180057 1244655 1292425 1218732 1218857 1201178 1159195 1148893 1194130 1147366 1094695 1093014 1166738
3370 1166738 1207150 1287880 1253017 1244735 1269253 1277994 1265962 1175648 1108804 1199901 1179000 1202779
3358 1202779 1256684 1196491 1224386 1298401 1362442 1284053 1159159 1017347 1030606 1094468 1199207
3347 1199207 1261933 1162316 1094571 1166768 1175594 1253135 1265590 1364992 1411246 1401929 1411857 1423215
3335 1423215 1429571 1479477 1362659 1336854 1333025 1354049 1438439 1420926 1448238 1468267 1491141 1367533
3323 1367533 1274593 1273738 1250009 1328955 1339264 1333215 1362578 1491530 1548788 1610721 1673616 1722593
3311 1722593 1760296 1742580 1775750 1817833 1922751 1923126 1887069 1829646 1766787 1708971 1714248 1781090
3299 1781090 1780121 1787399 1830568 1799454 1717663 1816438 1783943 1761479 1977632 1959660 1966245 1891823
3287 1891823 1909055 1921298 1965794 2089088 2089966 2072342 2092793 2221239 2327812 2352578 2483824
3276 2483824 2509072 2523372 2604548 2597759 2680018 2706849 2650808 2704533 2790332 2952412 3101912
3265 3101912 3215765 3267794 3379275 3521851 3641843 3807097 4012601 4162072 4314095 4448215
3255 4448215 4412832 4540139 4635512 4632737 4433804 4341044 4102403 3825284 3755370 3585990 3518108
3244 3518108 3350585 3269530 3274310 3162047 3179741 3166682 3025663 2706329 2398572 2294817
3234 2294817 2243697 2215195 2045219 1987369 1936881 1846078 1719223 1660958 1599694 1620151 1482931
3223 1482931 1414144 1475025 1489094 1452665 1496031 1550986 1675549 1689561 1719894 1823168 1959309
3212 1959309 2096395 2271384 2410348 2591378 2838418 2926060 2781585 2318525 1976083 1759705
3202 1759705 1631855 1402015 1388387 1376204 1245454 1145386 1177301 1151846 1137711 1038566 988782
3191 988782 1010890 931454 906480 801968 764469 810158 841499 918543 974689 1098047 1056200
3180 1056200 1079141 1217877 1373399 1375459 1517928 1639719 1644311 1387147 1212983 1090918
3170 1090918 924791 751535 657046 633847 678633 540037 471884 600661 577978 626487 549218
3159 549218 498836 460814 502559 407200 318838 371587 405900 456140 444534 402229 344829 325330
3147 325330 355304 300113 318406 308336 394165 344029 286767 290558 366242 258858 180406 174319
3135 174319 192183 365096 321477 214842 254687 196909 162101 191173 263880 229839 214928
3124 214928 117513 40727 157610 154117 231374 289886 300820 309780 284525 146399 89938 128401
3112 128401 74960 122449 197605 154761 97993 201721 174401 215332 209323 186292 168741 118145
3100 118145 58592 69267 160335 158779 115149 95090 136735 27893 121755 203365 159093 192949
3088 192949 250219 163592 136365 77563 95902 113807 46124 138892 126010 54028 145555 232357
3076 232357 220306 112646 140683 160681 181261 103574 79304 81419 108079 26506 42717 151131
3064 151131 160627 185171 45369 87754 116582 82223 56739 150745 88901 46063 -12439 -34054
3052 -34054 32878 128224 115384 86507 87505 21230 1824 -24972 -19354 -29634 51552 90946
3040 90946 78226 87331 56470 -5011 -9405 24199 153587 221943 129168 18224 138634 180315
3028 180315 87606 43786 -26181 15593 23827 -18722 -46004 68883 130732 116498 224726
3017 224726 215604 120761 99039 134706 203493 157930 45811 -14146 40490 104939 29702 26395
3005 26395 76852 84443 114843 139141 67935 116076 23760 29028 147507 106282 153076 142013
2993 142013 138729 167153 208203 200218 109715 66763 184634 155597 180540 189690 161041 139291
2981 139291 105109 120060 169096 124034 176507 258311 236652 147169 135896 261275 315561
2970 315561 168369 85579 162802 154364 181374 219333 180357 182034 106278 52135 96965 140471
2958 140471 180537 121739 102890 130021 224186 190138 186162 246437 262818 227253 257237 276964
2946 276964 297005 241395 300471 301866 256195 305136 342471 317210 372857 377885 341473 293308
2934 293308 246741 197544 206238 300122 306101 273995 329969 307481 225613 262828 258897 299035
2922 299035 416546 385142 347308 425303 427748 333435 395989 365130 403102 438547 464553 468686
2910 468686 411893 474089 388516 312745 429800 361211 350961 300883 223271 373696 293077
2899 293077 324334 307114 274129 308744 236016 202277 221346 310051 355776 266599 301271 168649
2887 168649 170660 228824 197810 312965 382475 215907 244236 262196 247444 147713 127893
2876 127893 142903 189391 207263 246792 227778 257871 231705 219188 263775 233255 249746 204417
2864 204417 215847 200356 79265 50837 73714 64981 67114 99777 73572 109544 84158 51302
2852 51302 76318 29485 88766 27107 87394 78911 22385 -10720 84239 45977 41801 3214
2840 3214 46922 35974 54104 116589 146465 113932 -5977 8631 58628 132217 101621 76971
2828 76971 97074 73100 68646 17214 108216 133620 142265 158703 93973 114166 141726 51048
2816 51048 -6539 10915 75926 86428 24929 31108 -56107 -112396 -111975 -3785 38820 121126
2804 121126 55379 83938 57580 19090 10788 -64790 -42947 303 -12988 33049 29261 62619
2792 62619 -30185 -97459 79186 38132 -39957 -34798 39095 -56877 9663 4570 10240 82948
2780 82948 21211 78123 89770 52779 33928 126858 128359 59795 98253 5674 -20317 -24301
2768 -24301 -42212 -50213 -104125 -93675 11499 71040 86921 -8927 -75703 -18867 -48483 -58649
2756 -58649 -14769 -2612 19747 23333 24610 50229 61717 31590 39784 -22876 -20487 -45146 -61972
2743 -61972 -85571 -12641 -20574 -12055 -17688 24398 1186 -35052 42440 6613 89648 76364
2731 76364 63029 4062 -115884 -43057 49627 4842 49101 6139 -25625 -25090 -408 63115
2719 63115 36904 -13919 30852 -58088 -91051 -102201 -98339 -129513 -79062 -85097 -20002 -53994
2707 -53994 -65797 -60017 -144039 -43640 60699 38360 -38860 -79674 -30138 37552 42117 -27243
2695 -27243 -55713 31598 32116 -20168 -4255 22664 1882 62165 72198 39611 75335 120420
2683 120420 -16434 11306 118064 95329 9270 42067 14478 -81768 8281 -38918 -62948
2672 -62948 -106462 -21664 -55451 -113046 -122673 -17194 23849 -27593 -42156 -101468 21969 14852
2660 14852 -23808 -2480 -14116 -60671 -54238 16324 11021 13526 61126 55585 80454 74310 77188
2647 77188 -703 -103738 -103621 -33949 115911 95206 58761 1885 -39604 -13129 -26892 2429
2635 2429 737 -12299 -7885 64502 59001 81505 53124 -68716 -99866 -127810 -72170 -16280
2623 -16280 -137717 -88402 -31975 -38335 -57181 -50025 -15821 132209 3544 12027 22578 -19861
2611 -19861 -46209 -44199 -9345 152210 139743 26093 -26179 73930 123714 9529 -148705
2600 -148705 -133045 49773 55924 -23367 -12183 46897 86453 100930 -8173 18539 -28944
2589 -28944 5143 74479 184533 161353 151271 85802 -33813 -2453 54076 89043 48910
2578 48910 -8684 124260 44808 21928 107356 158769 107321 10451 -73274 -89467 -48841 89921
2566 89921 23028 29192 66240 -5183 39939 9155 -22950 -42069 33583 68814 -12855 46947
2554 46947 33992 -23317 -17878 -40562 -49231 -28433 1337 51344 215201 42895 -117030 -54814
2542 -54814 -36939 33232 -99862 -30729 -135081 -152347 -71693 -51371 -73823 -47202 13473
2531 13473 -80337 -6574 -48896 -7152 12934 -13940 -56684 -80392 -42750 38410 -28010 -58690
2519 -58690 18686 61439 37015 3392 39311 -92717 -70425 -25793 83748 45438 -175871
2508 -175871 -178407 -122645 -95385 -62632 -72637 -146076 -110385 -45070 43283 1010 7688 -52391
2496 -52391 -88766 -68524 -26138 -65769 -58644 -22435 -86938 -33752 -92924 -110406 -68728 -89280
2484 -89280 23802 39999 72187 42731 15361 -72529 -91773 -52826 -38994 -4315 -58233 -63037
2472 -63037 -55166 39489 71817 -6192 -35651 -111560 -44033 -23542 11212 39965 36496 29948
2460 29948 -39779 -18232 84376 -58730 -88733 -101284 -73386 -74544 -118920 -94462 -154227 -57491
2448 -57491 -31714 -83550 -64937 -70367 -10902 15465 -115620 -122891 4469 75915 25764 94393
2436 94393 81384 115617 184920 66329 -789 52979 -12925 62970 42449 73993 114755 75666
2424 75666 34223 108288 -16154 -4282 71832 -31713 -30567 50717 100731 99311 19394 -31392
2412 -31392 36259 31631 4922 -5898 118020 129977 217109 238528 126731 49129 31558 31444
2400 31444 32184 24555 3706 32857 -78071 -85069 -75702 20992 38582 10047 112612 151064
2388 151064 181910 192422 197059 178727 229592 274750 340383 337795 322769 275649 238441 214343
2376 214343 169237 54216 -53368 -39302 68923 141571 27110 -59631 906 -44642 -4285
2365 -4285 127193 163985 268506 171923 70601 70222 148756 158220 96832 131369 70511 103987
2353 103987 28807 -68784 -13773 -21235 -11707 -56558 6903 48228 58190 86635 41807 172712
2341 172712 251425 175427 39536 107805 122899 14261 27521 189786 212760 159869 159724
2330 159724 143067 161807 114287 118536 102881 125036 155295 112467 104690 92126 53039 100489
2318 100489 59758 90323 159044 153368 99705 73532 77802 91759 100829 116229 51119 41945
2306 41945 100590 168434 83419 74428 119081 111503 145332 79951 106121 133069 118402 54117
2294 54117 -7210 36750 144293 104914 34193 105242 112800 86570 77569 114213 121554 213530
2282 213530 309854 242330 189866 195063 137906 17504 31950 -34825 72205 137045 180251
2271 180251 234852 350367 260191 160312 189528 81275 68815 128917 118900 196816 161915
2260 161915 117972 176626 198823 264875 214999 155830 127192 166604 112348 117909 228916 250655
2248 250655 238460 265056 220000 213325 207319 219715 100156 116806 279296 221600 265204 308924
2236 308924 312485 270858 252415 285225 339113 301320 299331 263553 286616 325815 427030 348134
2224 348134 220336 278939 327785 440808 501473 447827 496578 427643 364051 391536 406885
2213 406885 438706 480480 572842 493919 469925 561878 576343 585559 589183 680301 543992 510547
2201 510547 653336 641014 651454 718134 719795 725862 748606 790575 856680 816151 921806 973138
2189 973138 968369 1033758 1214561 1141264 1183658 1170852 1276661 1288461 1286113 1287524 1343162 1248215
2177 1248215 1344971 1367484 1289192 1317887 1376828 1392790 1399759 1431905 1454657 1485621 1529706 1621609
2165 1621609 1662384 1686252 1722515 1816799 1884476 1840638 1950401 2055223 2069930 2226667 2250151
2154 2250151 2317143 2412882 2445128 2597535 2770425 2891060 3111513 3278838 3409969 3569765
2144 3569765 3831434 4078663 4238977 4537728 4726434 4928991 5200642 5631117 5968934 6378573
2134 6378573 6867749 7438063 8118619 9011486 9938732 10751628 11716338 12922412 14763437
2125 14763437 16705658 18940619 21541843 24901331 28642644 32703223 37411426 42639152
2117 42639152 48757843 55852537 58226526 51640928 40153009 31229072 25505112 21449176
2109 21449176 18427287 16085808 14279426 12931785 11893728 11069707 10438838 9856286 9388644
2100 9388644 8835035 8185218 7454498 6809977 6236223 5805947 5304324 4912947 4650407 4392694
2090 4392694 4196197 3938014 3726410 3606839 3500429 3418329 3352005 3217784 3106005 2947351
2080 2947351 2712622 2657506 2516684 2471103 2377046 2378081 2268446 2236453 2171781 2084053 2041343
2069 2041343 1996645 1903974 1938749 1799443 1798059 1694294 1698221 1670103 1556650 1504164 1514180
2058 1514180 1411647 1355096 1265522 1270875 1301022 1264049 1230896 1296669 1258780 1213277 1143592
2047 1143592 1121077 1102985 1100729 1064459 921000 925979 944116 880387 858796 922381 932021 921679
2035 921679 945733 966667 926572 883079 741390 793657 786476 815217 754333 757770 779675 690161
2023 690161 625714 706943 631112 673944 611071 675204 642354 608800 586868 562819 583025 627886
2011 627886 610202 596664 557661 442478 464833 489199 446986 457066 424373 349527 341495 291627
1999 291627 315048 259027 291212 355345 363960 282152 262138 246470 241988 303929 274080 168590
1987 168590 157624 246574 311568 327120 416610 327015 275127 321732 335794 243088 259038 311582
1975 311582 293624 211063 155801 192936 251733 202206 195715 141860 148986 198624 164549 292960
1963 292960 253441 231184 229150 301731 290132 200348 232277 174775 130672 71174 66146 85342
1951 85342 115237 134835 143343 264534 162319 198238 234477 179093 181264 275624 227010 60182
1939 60182 148003 84792 121348 204525 153067 190911 213800 154446 99693 133478 103662 86428
1927 86428 143085 84470 76182 116170 168565 143476 134804 165275 136157 91735 119772 116106
1915 116106 103689 169999 170862 205570 158611 158609 127293 86081 102250 134613 142063 100200 39278
1902 39278 -37049 33949 126412 144052 112287 88448 67395 21892 -48737 -31953 2690 65882
1890 65882 38667 16320 79814 1369 -17162 10913 84709 128192 175237 159565 113053 -32696
1878 -32696 48730 127672 42775 346 68892 86203 65109 -2035 -26823 61654 52376 129735
1866 129735 160648 84184 37347 53117 -17592 132546 167931 49084 57231 24635 112095
1855 112095 73754 150881 140906 154668 210899 134708 96230 181389 318200 262808 180866 90468
1843 90468 76420 144624 201246 148925 55671 -6967 108390 79336 12106 -17125 83718
1832 83718 133071 23418 -732 25643 8218 7189 -52641 -32834 -384 1386 15882 29253
1820 29253 2187 5750 -27088 -11367 80294 87716 -18482 -10894 22435 -31068 -29781 27933
1808 27933 31744 6209 26212 71658 -9828 -33171 -24439 -37417 -809 -65192 -24781 -4354
1796 -4354 -56022 -74020 -139316 -125296 -32172 -18116 -6778 -89953 -85260 -66089 -90582 23934
1784 23934 -38106 -61528 -117455 -69178 -98887 -125675 23111 -22561 -2844 -151409 -97228
1773 -97228 -40310 41151 16286 48384 61164 50814 60076 -56157 -133211 -43999 -147522 -123714
1761 -123714 -27723 -7033 -47218 -46411 -37213 -141844 -38126 7475 -10492 -89057 -122616 -93863
1749 -93863 -81675 -37464 -34264 78217 22975 -18777 -22314 -125674 -33925 6032 14697 -118238
1737 -118238 -185862 -154489 -67992 -95386 -64132 -16882 68030 8069 -63809 -35197 -30540 -64036
1725 -64036 -43891 -14160 -13874 -3773 -26783 -93659 -94182 -105980 -52651 -67568 -58518 -13819 -52309
1712 -52309 -68379 -98431 -108568 -80688 2580 -34607 -31047 -27992 -83027 -50849 -57657 -50991 -23813
1699 -23813 -15913 49059 70711 47126 126131 65800 82709 63062 -63320 1763 54913 72160
1687 72160 -9993 42214 65647 15286 -40724 -45759 -57805 -25873 14863 16558 -36325 -98440
1675 -98440 -44261 -69116 -191158 -83390 -65789 -37519 83241 161279 65970 -11845 -10416
1664 -10416 16545 -4476 -709 1754 49109 60141 40655 36469 -58258 23037 7744 -5515
1652 -5515 9984 81187 -26709 -93146 -18954 -100535 -95419 -91151 6416 1624 2771 36818 33112
1639 33112 -10497 -9701 -53750 -87491 -73375 7886 -2627 -56568 -12352 -106791 -85203 -113703
1627 -113703 -80237 40982 -5240 -141452 -89608 20379 27200 6749 24478 28682 86344
1616 86344 50182 -19108 -4349 12258 -19451 -96902 -70740 5068 -73703 -105663 -32928 15224
1604 15224 -5221 -16495 -27175 75139 -20132 -67653 90983 23626 19883 22669 -95181 -47600
1592 -47600 47210 724 -30900 -42842 -92981 -36871 -28559 -103178 -136125 -46910 -69478 -130487
1580 -130487 -97809 -55428 -47231 -96943 -38085 -95089 -110110 45198 12147 -85404 -113450 -24672
1568 -24672 11940 103177 -41552 -88958 -121655 -118706 -128610 -72498 -101028 -101721 -14915 45350
1556 45350 81060 27526 5707 -9518 -67187 -168567 -58044 -83111 -74735 -95977 16072
1545 16072 -90951 -218421 -140737 -133331 -58020 17297 -48298 -109869 -96419 -94571 -19958 80406
1533 80406 40641 22491 -46661 -138762 -183265 -182418 -191236 -164494 -129396 -57550 -114167 -94649
1521 -94649 -140466 -99974 -90227 4655 17146 36687 51273 25272 35143 42495 -94256 -124393
1509 -124393 8074 -36916 -75713 -1244 -1841 -89327 -54108 36285 -276 3397 160245 129271
1497 129271 28403 37929 3485 -40102 -88051 -74423 -77338 -138385 -87295 -85887 -32919 3693
1485 3693 70292 4439 -32048 -8437 -14615 1222 -8738 -48502 -84655 -118836 -24430 -2190
1473 -2190 -66449 -61306 -83979 -100453 -28233 -5781 -4775 31776 -129746 -111066 -8366 46469
1461 46469 49451 41905 38550 -23531 1573 2165 16566 -49004 -13013 98950 68756 -14723 21737
1448 21737 61845 100546 92398 -1555 -115073 -189545 -239573 -147774 -123615 -35737 -50852 -115415
1436 -115415 -146110 -59172 39154 22017 -126297 -73847 81687 74887 34587 -109754 -102876
1425 -102876 -31263 -42622 -67810 -74317 -52658 -82675 -51344 -41939 -5356 1253 11131 -45210
1413 -45210 41824 85477 56556 -17665 -126752 -70822 -58673 13714 44729 -36613 20080 9103
1401 9103 -62195 42463 40319 -104129 -125342 -80343 -108462 28807 76575 37491 -15943 29309
1389 29309 -90772 -86849 -22128 -19319 -7957 4803 48295 17566 -85794 -135096 -171748 -66035
1377 -66035 -71658 -35800 -3630 -24253 -75658 -44747 5880 1621 32792 12098 -28054 -42072
1365 -42072 -25482 27990 14969 -18982 29885 -1850 13586 1710 884 -34590 -24484 -32690
1353 -32690 36305 90729 40559 -50622 -39194 9158 49871 -66270 -102202 -15293 -11072 -1359
1341 -1359 31292 80305 -3847 79684 15508 -8414 14069 58988 114709 126859 -6476 -11122
1329 -11122 5423 -60958 -68380 -16093 108194 34515 109313 24582 102923 98387 80395 104460
1317 104460 26373 -35071 -39733 22232 -47448 -86507 -60483 -14423 -43536 -89915 -88135 -41152
1305 -41152 41514 87396 63330 3523 5094 -15289 -2255 57056 73012 43007 31122 46006
1293 46006 24548 88661 46224 -36530 34518 24671 -56780 -10244 -3032 36121 92610 103819
1281 103819 36089 -52923 -69070 13440 -38721 -37120 21349 14534 -11072 -8404 -60818 -83540
1269 -83540 -115526 -28228 -44844 -49550 28000 55578 81045 -88456 -55157 -18655 12412 -50800
1257 -50800 -30597 -108903 -50990 8208 34681 44718 4175 42558 -55155 -37357 32031 94687
1245 94687 65111 -116366 -31089 14301 -66207 -69649 -75411 10205 22494 -59206 51673 98584
1233 98584 96610 128863 72876 110217 40859 25330 -48132 -53939 -54709 -99256 -48342 30435 -37508
1220 -37508 -115143 -26785 -109 -2437 40470 48370 -17263 -16855 -8980 -36931 -3625 46670 6889
1207 6889 17324 11053 -6681 -43623 9023 96372 78692 16839 166806 280645 241812 184011
1195 184011 126986 27391 -110456 -127836 -48527 53560 84115 24580 9900 89193 -13037
1184 -13037 35090 -23792 -172943 -43644 103772 38958 65190 35904 -68839 -11100 -15956
1173 -15956 -179013 -167681 -60579 6583 53800 26716 -74471 -98086 10575 -32020 -5856
1162 -5856 24352 -28128 -92828 7887 13043 -198581 -80425 -1308 6588 53153 11535 37028
1150 37028 11618 -26916 -50864 794 72404 17327 -58806 -35685 -15566 -95938 -64638 1568
1138 1568 -13329 -6780 -54469 -38905 -7861 -3233 7861 63395 72436 69368 69913 42992 -59436
1125 -59436 -61491 -123647 -98728 -40092 4172 -60464 -78876 -162048 -52119 -27886 -145120 1842
1113 1842 6823 -57781 -57668 -61507 -42399 15574 84419 58375 -10478 75114 -42830 -67026 -53482
1100 -53482 11581 -76548 -49542 -43953 5140 51145 101968 72659 -64316 -69267 -33781 -57915
1088 -57915 -60828 -27794 -66895 -54982 47108 -40405 -81374 -111630 -82148 -21905 -26555 -23548
1076 -23548 -36322 15951 -42692 -49817 3756 -35335 -44132 -80988 -73198 28960 -85934 -132230
1064 -132230 -115581 -44173 -46188 46782 32375 -58081 -95527 -155477 -73050 -106182 -16713 51766
1052 51766 105490 25150 -57695 11947 -68914 -31397 78572 -73572 -122862 3082 66320
1041 66320 142261 103319 76632 81179 145244 101981 37118 18271 58240 -42526 -9426 100823
1029 100823 60647 25632 36428 62749 62245 -31289 -95809 -127473 -36095 -26532 24919 44459
1017 44459 -71217 -96209 22927 105896 38262 17329 -46615 39487 -79443 -71754 20749
1006 20749 69127 11224 -9149 87638 73411 -761 -41024 69680 121636 146110 43104
995 43104 16915 -75493 -129767 -125800 -65181 27787 -20808 -24198 94769 50955 -38941 -101521
983 -101521 -81265 99445 131488 -24049 -101666 -124002 -103887 31903 35460 37381 -25584 -23414
971 -23414 -23320 -75769 -107418 -147790 -31320 33393 60311 89632 58451 14443 -36620 -39452 -67366
958 -67366 -107971 -20909 -16026 -67832 -20775 -32597 935 -44783 -24120 44447 31789 49590
946 49590 -61493 -105900 -80787 -80140 -46426 -75207 22407 57481 56312 78367 94933 55402
934 55402 -89270 -36530 31718 35349 53262 656 44287 -14520 15243 64313 30493 96627
922 96627 121814 79404 81293 -5055 54736 -23598 -142015 -3205 32966 108388 117894 -3630
910 -3630 74175 -2306 -120713 14262 -14573 -58431 -122332 -6492 -6408 -48352 73093 82040
898 82040 38503 6221 79833 79359 -50697 -52028 -44024 -129670 -130420 -42343 -12037 -86295 13935
885 13935 51216 -17334 -9808 -76541 -97814 -90313 -104553 -72014 -11369 55659 25052 109100
873 109100 63184 -34570 -23554 -37528 -4781 7148 -52775 -35374 76640 -21696 33912 -56822
861 -56822 -23524 90374 29508 24492 78902 83444 126745 73208 5942 -18361 -29570 39313
849 39313 44067 -14060 5959 68254 82477 59993 10537 49923 12308 -10621 50126 66476
837 66476 61261 7753 48403 -67082 -28848 32989 -42356 -88713 -139599 -44542 75507 151114
825 151114 95692 -18267 -120412 -68653 -55428 -65855 -135873 -43742 17387 -18611 1834
814 1834 20763 -26324 -10444 -17967 -6794 -56733 -24814 -70346 -62861 -6189 78288 44582 -42620
801 -42620 1914 -1335 8233 28204 60781 34857 19621 -65947 -34892 -96345 -76314 -58314
789 -58314 2249 -64714 -17609 7488 8426 48082 -61805 -13538 14786 62289 367 8376
777 8376 16317 66132 78797 -2509 36599 -28066 -49888 96274 40447 -64929 -110351 -165895
765 -165895 -68616 17078 -68519 -71592 -49600 38891 -5383 21143 31269 6592 145 -17747
753 -17747 -15747 10808 7669 -4265 -15849 -6289 -3186 -62312 -24465 -13828 -30548 21503 2652
740 2652 -52183 -41904 -50160 -42727 -126975 -72555 -89917 -72552 -131903 -26610 9545 -21817
728 -21817 -4719 -19885 -118058 -98382 -72880 12443 -478 19922 5857 4100 10620 -34073
716 -34073 -13149 95273 31233 -2704 17731 -24037 -54033 38551 15173 -89818 -6712 10665
704 10665 11563 -24406 81537 -24093 98881 116983 70042 21903 -15953 -38091 10434 7606
692 7606 -40848 33789 127370 93604 147990 139702 22708 33939 113978 61891 52681 44797 64070
679 64070 142070 109751 100809 74643 70745 66640 56228 119570 151870 110006 81007 56010 45070
666 45070 34565 112266 158539 71082 26619 65124 -65715 21013 78590 -27132 -79173 -25614
654 -25614 21429 20550 24417 37193 651 31788 48365 -47707 -94436 -75140 -34824 21452 80746
641 80746 94929 64879 -19635 -92776 -65842 19461 25268 -7720 -85282 -107093 -94292 -63338
629 -63338 -30073 -68125 -37368 15273 -31746 46870 13678 -15827 28883 89341 -22791 -44506
617 -44506 -36524 -55507 -36211 -10764 94560 189055 2665 -16347 56173 62521 79740 86568
605 86568 88543 98693 149621 28612 43398 -17068 -16998 36973 42865 108810 72768 13858 -12711
592 -12711 63124 38919 -42665 -9672 32789 -77168 -99928 -47207 -83498 -18655 23543 40016
580 40016 -48871 -4174 -25174 -49450 -59973 3383 -49053 -28101 -32985 -86869 -29083 -69885
568 -69885 -109013 -68569 -40356 -10500 -24023 -36913 36974 -24269 47728 124961 113356 -5234
556 -5234 6209 58594 54311 44004 -15322 10908 22916 -76206 -53380 39655 25998 47537
544 47537 -7227 -64930 -80892 -32249 -51695 -27118 -17676 -43109 -30003 -83000 -114596 -100323
532 -100323 -49504 49658 -11026 -3384 -6081 -13257 -3057 112833 77421 51685 -29841 -45283
520 -45283 19206 7869 -12119 -104120 -67377 -11835 115345 119796 48303 149611 134641 88455
508 88455 32885 -47554 -66822 -67812 -50511 -326 44199 -6144 25556 -13997 -50656 -55800 -7850
495 -7850 -105945 30955 -46598 -203758 -100685 -4823 -22918 -14925 77534 62232 127704 165626
483 165626 35103 -6941 -106004 -127691 84227 -7834 -57192 -25255 -97075 -30736 -44693
472 -44693 -42197 -30674 -50834 26279 106692 97856 20289 -27834 -51560 -6710 24550 35049
460 35049 37229 20570 29522 60224 103236 84647 46058 41595 -46381 -73120 -37620 -108860 80191
447 80191 158330 58461 -1545 -29830 11957 -52710 -28963 -22485 -40247 -37669 -24314 93976
435 93976 111097 17796 10520 23936 9510 -1511 25788 77907 -4491 -31610 46902 -4861
423 -4861 27387 10765 -72230 -39140 53460 166694 36193 26014 30275 91450 99159 46082
411 46082 32174 58556 62967 119005 111995 104283 45871 -67400 -55494 -594 -58008 -89646
399 -89646 -112273 -17415 22807 33692 55575 -35039 66251 7175 12002 -28308 -4321 27362
387 27362 -64632 -50141 -42592 -16629 -12813 -23076 28054 -18879 52201 -47085 17679 25485 46377
374 46377 153900 127351 23958 -32627 1922 22830 81361 135154 86571 43725 -7225 163902
362 163902 101115 7522 86 -13131 3674 -6524 37167 -38333 -16408 62613 22049 34162
350 34162 -16913 6974 11853 33959 9950 -29864 -14037 -72535 -87422 -70309 121850 125369
338 125369 70355 -18853 -24981 28907 47254 -125269 -117405 -15515 -38102 -44152 -47529 -17846
326 -17846 64731 1903 33786 -631 5830 82318 27634 -21530 3692 72689 8379 -70731
314 -70731 -39604 -58417 -37722 16443 -37969 -11088 26544 31223 9157 64682 150540 -435
302 -435 11957 54529 37542 65265 140340 34909 60137 74362 -44166 -23648 -23905 25699
290 25699 41810 1768 -20245 -28322 31000 42169 -40826 80648 -32997 -62881 -23337 8473
278 8473 109262 121224 112380 46509 30915 -56138 -104522 -89433 -45353 19146 25010 56285
266 56285 -13447 43529 -254 53118 120433 24951 -77555 -31554 10863 53585 18815 45761
254 45761 18623 29335 71117 20546 17905 137255 140451 -19026 -17825 96215 71162 112721
242 112721 117893 80305 80463 37979 -35104 -70131 -18552 -1208 -73423 -73390 -21515 -160671 61400
229 61400 111007 37648 49277 67445 -73502 20750 38281 101972 35570 -55099 24772 111586
217 111586 57594 -34664 1736 21408 63649 48521 99812 96358 -26621 -70172 4162 5794
205 5794 -85946 -15986 -30863 -11842 -25737 99838 179039 32544 30439 26593 55183 43946
193 43946 -105736 -154631 -95816 -23237 -45465 11302 -40696 22883 44272 18921 -37500 -69107
181 -69107 -73035 -127429 -32406 -6296 36463 -15510 58566 6587 76823 26309 -16237 -43881
169 -43881 -47951 13222 88073 72467 37442 21177 66156 65636 51658 74682 19485 -10366 -9177
156 -9177 7129 72738 81669 84601 24730 -3112 -8962 -20636 17789 51733 9351 33693 60727
143 60727 97631 38154 30736 1765 -73162 -85514 -43669 -15422 -39493 14739 -30941 -109874
131 -109874 -58701 61755 92501 30924 -12061 -12210 8374 -17851 -3307 -64679 -19117 53464
119 53464 64586 24457 11927 34521 32362 67560 62845 74309 35057 3831 18703 61489
107 61489 90324 52760 26785 78704 68523 -33924 -36605 75735 113485 111686 98074 51217
95 51217 47291 130316 116749 72232 1098 -5080 69693 88106 49425 3903 675 -53361 -43881
82 -43881 21297 31408 50542 8366 -10241 -30081 374 26649 -8674 -48180 34016 47830
70 47830 48319 -26757 -18875 -72551 21709 64225 41929 14147 -92 19537 30202 68762 20687
57 20687 -8359 53072 -17843 -10961 2222 -27026 -75680 375 64313 39466 42097 34402 95776
44 95776 41969 57232 84803 109346 49848 8786 -1157 -18489 15793 -137 -53744 -67665
32 -67665 -30488 38052 23084 -36112 4410 74927 6834 -58134 -47978 -48592 -8072 30127 -11573
19 -11573 29 14845 49623 92252 17039 -16895 10848 12210 67904 134055 115263 20031
7 20031 25766 75708 41498 22185 10751 -7762 10885
0 10885
$$ Imaginary data points
##PAGE= N=2
##DATA TABLE= (X++(I..I)), XYDATA
16383 -596240 -587108 -617956 -576749 -574070 -590522 -637277 -588739 -611800 -584991 -553728 -511452 -461776
16371 -461776 -412443 -439578 -387051 -417817 -429793 -363542 -388252 -350187 -247816 -266642 -272121
16360 -272121 -261202 -302913 -310396 -252229 -250241 -343865 -261974 -199859 -211536 -108708 -109948 -127381
16348 -127381 -153598 -168797 -156765 -163176 -99294 -139106 -81987 -77525 9874 -47399 -38057 37859
16336 37859 24593 -4752 -37023 12306 121504 120215 121917 137730 106899 120048 179394 223894
16324 223894 171005 193799 199008 234781 265322 253378 232130 199542 340208 348072 243816
16313 243816 263937 259099 353612 340596 416645 397446 419422 366583 422847 453350 471100 433831
16301 433831 500720 529975 548518 504589 459590 518045 585090 687971 581887 554168 561540
16290 561540 525160 524932 627558 657200 559376 567663 597716 628964 664367 764569 748819 712777
16278 712777 731877 731249 756056 817049 831719 771290 758258 716058 737573 773176 855407 903923
16266 903923 877151 843066 815205 813549 865023 804821 911169 960027 931044 931121 933192 1026015
16254 1026015 1011190 1052237 1098289 1016743 1004187 946331 977320 987661 974957 1041884 976662
16243 976662 1030749 1012065 1002464 1039474 1115323 1104583 1110782 1082051 1008878 1156466 1095623 1086385
16231 1086385 1140111 1144708 1168396 1132795 1146827 1214373 1283217 1248427 1196508 1220376 1175993
16220 1175993 1144867 1164323 1154534 1079400 1153595 1229810 1282739 1290225 1175252 1120073 1235674
16209 1235674 1204961 1109323 1204338 1249411 1198991 1254000 1274570 1239818 1277654 1367751 1324792
16198 1324792 1347331 1293564 1245071 1319711 1249110 1229039 1230122 1262707 1369426 1424957 1317444
16187 1317444 1273753 1326958 1334723 1345052 1345637 1309289 1303178 1357074 1357707 1341188 1265457 1243142
16175 1243142 1319965 1376258 1409204 1402219 1461032 1491707 1491701 1541204 1446688 1461244 1576766 1585521
16163 1585521 1449782 1332254 1314596 1293648 1443341 1570364 1557714 1535893 1428570 1422551
16153 1422551 1535499 1578145 1485019 1432704 1501946 1514153 1562376 1525478 1547273 1520579 1467352
16142 1467352 1541759 1513957 1512619 1531691 1601149 1650758 1686083 1630339 1583917 1573929 1580519 1536835
16130 1536835 1514582 1659868 1684349 1605118 1600966 1659170 1612552 1543475 1629133 1632340 1657047
16119 1657047 1522332 1461303 1611479 1645180 1666531 1621840 1603585 1597949 1619864 1611583 1672680
16108 1672680 1531430 1562716 1677790 1811348 1701587 1602573 1547420 1605702 1729148 1700856
16098 1700856 1587004 1582860 1536290 1642109 1605289 1589206 1640531 1623259 1621167 1721254 1637062
16087 1637062 1528888 1559073 1586169 1610606 1650290 1710960 1652030 1734789 1699347 1657605 1667523
16076 1667523 1619755 1658816 1565331 1526285 1639552 1567872 1640905 1606747 1609998 1582248 1573546
16065 1573546 1565690 1576711 1675933 1633968 1519416 1528996 1514775 1561941 1532884 1624050 1658929
16054 1658929 1708837 1630903 1529048 1611934 1594918 1558374 1557967 1634864 1627533 1570221 1601141 1630479
16042 1630479 1631859 1626414 1568209 1517505 1562445 1553158 1677512 1738820 1652917 1648426 1582096 1642454
16030 1642454 1668765 1628494 1630106 1596585 1617789 1671598 1669319 1658224 1672523 1672171 1602265 1624442
16018 1624442 1732512 1625668 1576276 1680647 1752109 1674171 1605147 1586018 1573753 1606935 1615160
16007 1615160 1612161 1713520 1713460 1631430 1561827 1585960 1574097 1552044 1530938 1608742 1668173 1643399
15995 1643399 1720253 1714317 1601355 1682713 1684837 1717355 1651397 1594302 1624748 1663659 1686877
15984 1686877 1639402 1652879 1719352 1687600 1696238 1629672 1526130 1477365 1506119 1519769 1584771
15973 1584771 1660143 1639799 1580972 1539444 1593096 1624720 1745334 1772938 1725292 1740290 1717056
15962 1717056 1759567 1787125 1664992 1690018 1763916 1789043 1682613 1733673 1802634 1677856 1522962
15951 1522962 1543105 1554059 1663452 1549260 1638877 1529783 1551346 1638346 1637192 1707027 1694221
15940 1694221 1688024 1734571 1620146 1691794 1833489 1859493 1841679 1708438 1627300 1516348 1575710
15929 1575710 1615869 1595614 1672352 1616024 1581932 1599368 1617292 1596211 1667655 1636678 1597131
15918 1597131 1676416 1631711 1569560 1633118 1498822 1551931 1516734 1484855 1587428 1656434 1800727
15907 1800727 1798540 1767364 1807193 1780706 1754503 1803609 1773638 1853362 1743046 1681317 1743532
15896 1743532 1771272 1605918 1684345 1742875 1734079 1676415 1726567 1806938 1767862 1660182 1673882
15885 1673882 1616229 1705502 1724881 1632722 1725920 1796649 1732645 1697999 1607433 1598165 1692820
15874 1692820 1659299 1713540 1690768 1751580 1699985 1610929 1608004 1606434 1571298 1686021 1651402
15863 1651402 1555262 1622455 1654564 1645953 1701008 1749971 1656952 1608518 1558898 1659963 1684797
15852 1684797 1610466 1668312 1590607 1634160 1744912 1676256 1659521 1608560 1657196 1706652 1779881
15841 1779881 1732587 1727205 1670552 1656089 1672152 1688343 1708526 1656729 1620600 1675769 1701791
15830 1701791 1637762 1570501 1568797 1556462 1650898 1692144 1660557 1677952 1639375 1717390 1737096
15819 1737096 1663122 1597996 1696384 1765363 1692401 1745340 1805669 1736174 1681216 1634697 1654837
15808 1654837 1790252 1718479 1697536 1657863 1651182 1688107 1664249 1630762 1626137 1640196 1745973
15797 1745973 1748000 1702879 1756102 1729280 1661652 1684172 1797877 1788746 1753284 1878583 1796204
15786 1796204 1700684 1812979 1707604 1717182 1740581 1686567 1746377 1850379 1746050 1652018 1707821
15775 1707821 1741290 1711798 1793998 1762709 1796421 1832811 1771200 1733563 1737488 1772662 1724166
15764 1724166 1628957 1661685 1684079 1736983 1752568 1691268 1672614 1625493 1590378 1602397 1661590
15753 1661590 1698095 1703754 1728801 1716074 1732246 1694392 1617084 1651062 1728186 1605552 1652714
15742 1652714 1699240 1711364 1742056 1751968 1698384 1672176 1678601 1685261 1722580 1697672 1669723 1677326
15730 1677326 1747422 1793195 1730993 1728665 1743884 1673021 1671828 1730044 1708014 1651585 1591702 1611437
15718 1611437 1685717 1732298 1677838 1707322 1683656 1706409 1816046 1858302 1846443 1877418 1903746
15707 1903746 1795062 1762312 1737858 1645056 1669008 1719689 1696101 1706503 1695163 1649002 1602661
15696 1602661 1642295 1708617 1652265 1685723 1654291 1609283 1612137 1665607 1691825 1651197 1696154
15685 1696154 1675174 1712367 1739513 1647070 1684191 1785566 1702601 1660615 1583810 1673728 1665280
15674 1665280 1673119 1694852 1766940 1709433 1725476 1731311 1727098 1673036 1650130 1708592 1754294 1736507
15662 1736507 1797070 1813930 1769059 1648757 1633144 1722142 1680321 1680763 1669601 1673137 1670084 1653191
15650 1653191 1652695 1624516 1673090 1606626 1678680 1751424 1737463 1739686 1717296 1721891 1756438 1766652
15638 1766652 1640698 1618366 1590230 1612938 1676313 1680777 1596182 1585907 1683198 1779513 1744025
15627 1744025 1671717 1650907 1682941 1666955 1690015 1701618 1627967 1670841 1691593 1627437 1695887
15616 1695887 1689381 1756858 1808233 1663260 1571148 1587907 1636866 1624334 1620314 1722734 1735948
15605 1735948 1640814 1676571 1742185 1749304 1698911 1703684 1817112 1837526 1712351 1733510 1837162
15594 1837162 1923984 1931227 1894929 1846727 1822815 1824094 1787978 1805706 1784619 1759982 1764389 1751068
15582 1751068 1804072 1741089 1739577 1780717 1817716 1887231 1789016 1764216 1787949 1847145 1874082
15571 1874082 1872660 1803011 1714131 1722136 1699718 1723199 1753433 1659000 1774341 1778794 1778085 1826799
15559 1826799 1853333 1788432 1824650 1837644 1775251 1761692 1797749 1732107 1739503 1747014 1773974 1805196
15547 1805196 1792840 1768921 1831568 1832796 1817268 1734537 1692787 1779572 1776115 1838597 1745721 1805980
15535 1805980 1759296 1737101 1705239 1679017 1673620 1656090 1779859 1840896 1743060 1817163 1786106
15524 1786106 1635773 1637313 1634937 1618868 1671019 1696644 1714180 1787222 1828131 1784783 1715396
15513 1715396 1752100 1683715 1673672 1616112 1652387 1684093 1677702 1680371 1642496 1753518 1741740
15502 1741740 1742763 1857130 1825431 1795567 1810435 1784609 1743985 1740163 1792723 1856215 1776571
15491 1776571 1688405 1730742 1743547 1729724 1781556 1863310 1882849 1848694 1820622 1765114 1700144
15480 1700144 1675678 1668820 1696231 1656923 1766904 1752123 1729742 1814701 1779747 1751830 1821245
15469 1821245 1711080 1636749 1769934 1807110 1847651 1797823 1680420 1694314 1753966 1780081 1730092
15458 1730092 1819173 1880041 1826697 1767630 1725943 1686960 1774819 1810089 1835370 1745128 1654453
15447 1654453 1722542 1830117 1835140 1761687 1782187 1682479 1710772 1712412 1660319 1762442 1727603
15436 1727603 1745556 1649599 1690660 1761198 1780053 1792330 1781966 1783360 1755508 1770734 1732164
15425 1732164 1832450 1643334 1577060 1746929 1758079 1726184 1734646 1788540 1839886 1811843 1856203
15414 1856203 1915537 1882285 1817577 1883956 1848660 1896503 1880444 1858151 1836168 1822415 1806983
15403 1806983 1756487 1778115 1772513 1815850 1838581 1815736 1806359 1812184 1789277 1791335 1828292 1858266
15391 1858266 1795530 1791470 1884573 1796314 1724245 1738237 1686043 1679723 1749536 1787000 1751122 1660399
15379 1660399 1784711 1775707 1763258 1857251 1972796 1939786 1855155 1888467 1762235 1807869 1795328
15368 1795328 1803232 1791112 1678748 1587445 1663133 1728750 1760344 1730128 1739437 1704082 1736851
15357 1736851 1777303 1794282 1849821 1824687 1756470 1724149 1787964 1735146 1782012 1866789 1800313
15346 1800313 1720329 1837105 1861481 1798549 1844917 1754505 1778335 1841786 1856473 1884482 1847510
15335 1847510 1766932 1744694 1798551 1794440 1828945 1906271 1760443 1777574 1770992 1711618 1707604 1789972
15323 1789972 1839194 1826359 1835004 1833530 1813304 1722419 1785883 1793642 1686230 1663808 1665741 1636358
15311 1636358 1749170 1830725 1782109 1834592 1804352 1803584 1718454 1773063 1848424 1851948 1843107 1820977
15299 1820977 1800443 1777340 1761676 1766368 1899857 1886534 1908481 1806848 1811755 1849802 1871311
15288 1871311 1808043 1798645 1773692 1769797 1815938 1817289 1785194 1740651 1793144 1941115 1886261 1864763
15276 1864763 1738766 1759564 1787893 1804182 1801629 1760503 1675646 1708115 1754285 1750605 1723144
15265 1723144 1742619 1742757 1787486 1652695 1573003 1734999 1743970 1761654 1717324 1717850 1715565 1757838
15253 1757838 1688161 1768081 1899268 1942623 1870501 1816708 1807738 1747924 1688424 1729033 1748574
15242 1748574 1714761 1755295 1740614 1809425 1819622 1812403 1859804 1740354 1745340 1736615 1712007 1771178
15230 1771178 1776741 1805258 1829243 1802036 1903866 1945337 1902810 1819350 1745600 1715125 1688705
15219 1688705 1816560 1825726 1699602 1781752 1719879 1659607 1683954 1861295 1830630 1819821 1841534
15208 1841534 1883453 1805893 1777157 1864190 1916325 1958082 1855377 1817915 1780799 1764105 1820086
15197 1820086 1791283 1800835 1815738 1795340 1861865 1908894 1855870 1769814 1884335 1891154 1925034
15186 1925034 1791488 1769628 1877363 1877350 1855151 1782885 1774635 1737149 1818027 1900997 1887637 1869177
15174 1869177 1839236 1815639 1896031 1871355 1847686 1889838 1871039 1927699 1846262 1898148 1849015
15163 1849015 1651050 1754466 1807564 1757169 1792141 1820787 1820064 1783782 1792834 1816115 1797679
15152 1797679 1870231 1850814 1806900 1746971 1718094 1677351 1713934 1781080 1760557 1851981 1870213
15141 1870213 1737535 1787494 1794320 1841911 1941702 1811026 1780952 1870506 1836464 1797055 1807225
15130 1807225 1738659 1828251 1821847 1895224 1870504 1794035 1813892 1798321 1817893 1780529 1779838 1843962
15118 1843962 1790683 1707664 1861716 1889941 1844192 1848310 1910997 2007386 1942246 1808205 1924144
15107 1924144 1973801 1914750 1892667 1906031 1871507 1790508 1748126 1855795 1845444 1775110 1876196
15096 1876196 1798674 1842252 1868968 1798770 1802994 1871882 1930346 2020928 1954066 1905982 1855778
15085 1855778 1801670 1819784 1867764 1838905 1847437 1814130 1813159 1839606 1776335 1779830 1828461 1827075
15073 1827075 1761384 1760252 1748255 1902265 1937297 1822150 1728319 1779235 1796139 1781488 1845079
15062 1845079 1835978 1868858 1974241 1912399 1838647 1913483 1841195 1970367 1923210 1917390 1909731
15051 1909731 1893674 1888338 1948165 1955662 1879390 1890445 1854544 1837728 1891160 1835141 1821146 1770264
15039 1770264 1736490 1740557 1858472 1838772 1885830 1819512 1843987 2027928 1949650 1897614 1820793
15028 1820793 1827789 1767201 1829208 1841254 1827166 1788249 1894288 1862520 1855402 1914687 1818454
15017 1818454 1851162 1832583 1767559 1821638 1793787 1839960 1746784 1759663 1813864 1850561 1801552
15006 1801552 1874591 1857268 1773560 1769069 1824966 1850463 1945475 1935038 1844124 1945434 1906980
14995 1906980 1854091 1932465 1967776 1966921 1766657 1798306 1879528 1957292 1977312 2024237 1987410
14984 1987410 1836755 1791635 1768141 1813343 1899193 1883174 1823883 1915043 1973148 2017705 1918154
14973 1918154 1929964 1843865 1820268 1906456 1908124 1927599 1959946 1866768 1810510 1783156 1875745
14962 1875745 1949162 1910738 1929051 1977022 1963123 1897103 1906633 1880293 1775222 1864473 1885787
14951 1885787 1882667 1879333 1825033 1803809 1783979 1868710 1864971 1902987 1853945 1815485 1904034 1904251
14939 1904251 1945606 1951959 1900214 1963892 2064126 1924940 1836406 1817844 1801619 1839777 1808790
14928 1808790 1851495 1859888 1837153 1802177 1677636 1795357 1858255 1760675 1807369 1942933 1874634
$$ [...]
##END NTUPLES=NMR SPECTRUM
##END=
