##TITLE=1H_EC-3265(III-18)
 CDCl3
 8 sc, 
 16.02.2022
##JCAMPDX= 6.0         $$ Bruker NMR JCAMP-DX V2.0
##DATA TYPE= NMR SPECTRUM
##DATA CLASS= NTUPLES
##ORIGIN= UXNMR, Bruker Analytische Messtechnik GmbH
##OWNER= root
$$ XWIN-NMR		Version 3.5
$$ Wed Feb 16 09:25:19 2022 Russian Standard Time (UT+4h)  she@DPX200
##.OBSERVE FREQUENCY= 200.131346
##.OBSERVE NUCLEUS= ^1H
##.ACQUISITION MODE= SIMULTANEOUS
##.ACQUISITION SCHEME= undefined
##.AVERAGES= 8
##.DIGITISER RES= 18
##SPECTROMETER/DATA SYSTEM= spect
##.PULSE SEQUENCE= zg30
##.SOLVENT NAME= CDCl3
##.SHIFT REFERENCE= (INTERNAL, CDCl3, 0, 15.716)
##AUDIT TRAIL= $$ (NUMBER, WHEN, WHO, WHERE, WHAT)
$$ ##TITLE= Audit trail, XWIN-NMR		Version 3.5
$$ ##JCAMPDX= 5.01
$$ ##ORIGIN= Bruker BioSpin GmbH
$$ ##OWNER= she
$$ F:/spectra/data/she/nmr/H-F/1/pdata/1/auditp.txt
$$ ##AUDIT TRAIL=  $$ (NUMBER, WHEN, WHO, WHERE, WHAT)
(   1,<2022-02-16 09:23:23.37 +0400>,<she>,<DPX200>,
      <created by zg, POWCHK disabled, PULCHK disabled
       configuration hash MD5:
       00 E9 B6 7A A2 85 ED C7 34 08 36 98 17 FE 4E 26
       data hash MD5: 16K
       3B 6D 11 9B B8 81 86 A6 30 DB 58 E2 D7 C5 69 78>)
(   2,<2022-02-16 09:23:29.00 +0400>,<she>,<DPX200>,
      <Start of raw data processing
       efp BC_mod = 2 LB = 0.24 FT_mod = 6 PKNL = 1 PHC0 = -16229.89 PHC1 = 11.40078 SI = 16K 
       data hash MD5: 16K
       42 2D EA 16 4D 8F CD 22 D2 8B EB F0 16 FA 66 75>)
(   3,<2022-02-16 09:23:51.71 +0400>,<she>,<DPX200>,
      <pk PHC0 = 1.367992 PHC1 = -1.8 
       data hash MD5: 16K
       BB 97 3E 6A 5D 04 3A 73 BC 11 E0 7B 72 5F 5A 96>)
(   4,<2022-02-16 09:23:56.18 +0400>,<she>,<DPX200>,
      <abs ABSG = 5 
       data hash MD5: 16K
       60 B0 40 55 EC 7F 61 56 7F 17 97 BA 5A 30 49 B0>)
$$ ##END=
$$ 
$$ hash MD5
$$ 1D 04 0E B5 D0 10 6E 23 56 33 23 51 97 05 20 2A
##$RELAX= 
##$RELAX= 
##$RELAX= 
##$RELAX= 
##$RELAX= 
##$RELAX= 
$$ Bruker specific parameters
$$ --------------------------
##$DU= <F:/spectra>
##$EXPNO= 1
##$NAME= <H-F>
##$PROCNO= 1
##$TYPE= <nmr>
##$USER= <she>
##$AMP= (0..31)
100 100 100 100 100 100 100 100 100 100 100 100 100 100 100 100 100 100 
100 100 100 100 100 100 100 100 100 100 100 100 100 100 
##$AQSEQ= 0
##$AQ_mod= 1
##$AUNM= <au_zg>
##$AUTOPOS= <>
##$BF1= 200.13
##$BF2= 200.13
##$BF3= 200.13
##$BF4= 200.13
##$BF5= 200.13
##$BF6= 200.13
##$BF7= 200.13
##$BF8= 200.13
##$BYTORDA= 1
##$CFDGTYP= 0
##$CFRGTYP= 5
##$CHEMSTR= <none>
##$CNST= (0..31)
1 1 145 1 1 1 1 1 1 1 1 1 1 1 1 1 1 1 1 1 1 1 1 1 1 1 1 1 1 1 1 1 
##$CPDPRG= <>
##$CPDPRG1= <>
##$CPDPRG2= <>
##$CPDPRG3= <>
##$CPDPRG4= <mlev>
##$CPDPRG5= <mlev>
##$CPDPRG6= <mlev>
##$CPDPRG7= <mlev>
##$CPDPRG8= <mlev>
##$CPDPRGB= <>
##$CPDPRGT= <>
##$D= (0..31)
0 1.2 0 0 0 0 0 0 0 0.06 0 0.03 0 0 0 0 0.0002 0 0 0 0 0 0 0 0 0 0 0 0 
0 0 0 
##$DATE= 1644989002
##$DBL= (0..7)
120 120 120 120 120 120 120 120 
##$DBP= (0..7)
150 150 150 150 150 150 150 150 
##$DBP07= 0
##$DBPNAM0= <>
##$DBPNAM1= <>
##$DBPNAM2= <>
##$DBPNAM3= <>
##$DBPNAM4= <>
$$ [...]
##$SUBNAM2= <"">
##$SUBNAM3= <"">
##$SUBNAM4= <"">
##$SUBNAM5= <"">
##$SUBNAM6= <"">
##$SUBNAM7= <"">
##$SUBNAM8= <"">
##$SUBNAM9= <"">
##$SW= 18.0517287032376
##$SWIBOX= (0..15)
0 0 2 0 0 0 0 0 0 0 0 0 0 0 0 0 
##$SW_h= 3612.71676300578
##$TD= 16384
##$TD0= 1
##$TE= 0
##$TE2= 300
##$TE3= 300
##$TEG= 300
##$TL= (0..7)
0 120 120 120 120 120 120 120 
##$TP= (0..7)
150 150 150 150 150 150 150 150 
##$TP07= 0
##$TPNAME0= <>
##$TPNAME1= <>
##$TPNAME2= <>
##$TPNAME3= <>
##$TPNAME4= <>
##$TPNAME5= <>
##$TPNAME6= <>
##$TPNAME7= <>
##$TPOAL= (0..7)
0.5 0.5 0.5 0.5 0.5 0.5 0.5 0.5 
##$TPOFFS= (0..7)
0 0 0 0 0 0 0 0 
##$TUNHIN= 0
##$TUNHOUT= 0
##$TUNXOUT= 0
##$USERA1= <user>
##$USERA2= <user>
##$USERA3= <user>
##$USERA4= <user>
##$USERA5= <user>
##$V9= 5
##$VALIST= <valist>
##$VCLIST= <CCCCCCCCCCCCCCC>
##$VD= 0
##$VDLIST= <DDDDDDDDDDDDDDD>
##$VPLIST= <PPPPPPPPPPPPPPP>
##$VTLIST= <TTTTTTTTTTTTTTT>
##$WBST= 1024
##$WBSW= 4
##$XGAIN= (0..3)
0 0 0 0 
##$XL= 0
##$YL= 0
##$YMAX_a= 128393
##$YMIN_a= -210878
##$ZGOPTNS= <>
##$ZL1= 120
##$ZL2= 120
##$ZL3= 120
##$ZL4= 120
##$ABSF1= 15.71384
##$ABSF2= -2.33801
##$ABSG= 5
##$ABSL= 3
##$ALPHA= 0
##$AQORDER= 0
##$ASSFAC= 0
##$ASSFACI= 0
##$ASSFACX= 0
##$ASSWID= 0
##$AUNMP= <proc_1d>
##$AZFE= 0.1
##$AZFW= 0.1
##$BCFW= 0
##$BC_mod= 2
##$BYTORDP= 0
##$COROFFS= 0
##$CY= -3
##$DATMOD= 1
##$DC= 0
##$DFILT= <>
##$DTYPP= 0
##$F1P= 0
##$F2P= 0
##$FCOR= 1
##$FTSIZE= 16384
##$FT_mod= 6
##$GAMMA= 0
##$GB= 0
##$INTBC= 1
##$INTSCL= 0
##$ISEN= 128
##$LB= 0.24
##$LEV0= 0
##$LPBIN= 0
##$MAXI= 10000
##$MC2= 0
##$MEAN= 0
##$ME_mod= 0
##$MI= 1.114404
##$NCOEF= 0
##$NC_proc= -7
##$NLEV= 6
##$NOISF1= 3.799351
##$NOISF2= 2.8
##$NSP= 0
##$NTH_PI= 0
##$NZP= 0
##$OFFSET= 15.71604
##$PC= 1
##$PHC0= -16228.52
##$PHC1= 9.60078
##$PH_mod= 1
##$PKNL= yes
##$PPARMOD= 0
##$PSCAL= 0
##$PSIGN= 0
##$REVERSE= no
##$SF= 200.130007108158
##$SI= 16384
##$SIGF1= 3
##$SIGF2= 2
##$SINO= 5.538805
##$SIOLD= 16384
##$SREGLST= <1H.CDCl3>
##$SSB= 0
##$STSI= 16384
##$STSR= 0
##$SW_p= 3612.71676300578
##$SYMM= 0
##$S_DEV= 0
##$TDeff= 16384
##$TDoff= 0
##$TI= <>
##$TILT= no
##$TM1= 0
##$TM2= 0
##$TOPLEV= 0
##$USERP1= <user>
##$USERP2= <user>
##$USERP3= <user>
##$USERP4= <user>
##$USERP5= <user>
##$WDW= 1
##$XDIM= 16384
##$YMAX_p= 348190433
##$YMIN_p= -636742
$$ End of Bruker specific parameters
$$ ---------------------------------
##NTUPLES= NMR SPECTRUM
##VAR_NAME=  FREQUENCY,     SPECTRUM/REAL,   SPECTRUM/IMAG
##SYMBOL=    X,             R,               I
##VAR_TYPE=  INDEPENDENT,   DEPENDENT,       DEPENDENT
##VAR_FORM=  AFFN,          ASDF,            ASDF
##VAR_DIM=   16384,         16384,           16384
##UNITS=     HZ,            ARBITRARY UNITS, ARBITRARY UNITS
##FACTOR=    0.220516191357247, 1,           1
##FIRST=     3145.25112838613, 0,            0
##LAST=      -467.465634619645, 0,           0
##MIN=       -467.465634619645, -636742,     0
##MAX=       3145.25112838613, 348190433,    0
$$ Real data points
##PAGE= N=1
##DATA TABLE= (X++(R..R)), XYDATA
$$ [...]
9354 2089637 2201402 2307962 2324273 2147072 2382203 2482322 2632251 2772001 2808040 2742796
9344 2742796 2710302 2970794 3141321 3107614 2958224 3182013 3369802 3350974 3445177 3682668
9334 3682668 3828911 3616119 3547032 3509951 3642913 3658854 3668014 3757824 3917847 3886146 4068436
9323 4068436 4140039 3984540 4056024 3956935 3971493 4188892 4365992 4423549 4544997 4651510
9313 4651510 4848856 5023930 5560857 5885679 6077976 6221413 6583453 6924907 7242125 7636639
9303 7636639 7972110 8362735 8511118 8766810 9012614 9271997 9536978 9627977 9608878 9438379
9293 9438379 9152935 8680972 8431731 7960579 7675577 7373335 7321587 7376254 7127976 6926687
9283 6926687 6732698 6574004 6377493 6280233 6283588 6200547 6195352 6411386 6615057 6687444 6913715
9272 6913715 7061596 7282288 7725581 7959753 8340342 8578478 9056291 9594355 9936502 9955869
9262 9955869 10038912 10542776 10800706 10664581 10381045 10109317 9824103 9466869 9196529 8867595
9252 8867595 8526784 8442960 8699714 8499039 8586123 8725479 8693406 8990307 9124898 9036136
9242 9036136 9128799 9195040 9169765 9358396 9595838 9643817 9746872 9697301 9495634 9049005
9232 9049005 8487718 8006063 7576478 7603816 7450203 7394892 7326874 7287839 7189274 7089683 7130433
9221 7130433 7017999 7103704 7159007 6904306 6984308 7153533 7589172 8049074 8259933 8568481
9211 8568481 8882929 9314988 9375524 9586376 9735825 9710742 10123481 10514089 10999250 11084959
9201 11084959 11238487 11251575 11065713 11024289 10329727 9823563 9489941 8895861 8405723 8025536
9191 8025536 7786531 7821183 7764816 7736628 7773389 7798048 7595827 7287783 7095112 7045061 7119907
9180 7119907 7231680 7331715 7287598 7196067 7155954 7167220 6968381 7117033 7063806 6860016
9170 6860016 6601995 6462727 6388507 6327778 6387981 6412336 6477141 6447521 6474080 6606073 6553441
9159 6553441 6550861 6612367 6587060 6526636 6657472 6677985 6548225 6690846 6924459 7046841 6961266
9148 6961266 6980473 7320067 7498672 7360037 7361230 7496545 7545703 7714651 7875432 7921383
9138 7921383 8143247 8463278 8673351 8769477 8960476 9049880 9289913 9424804 9631177 9986402
9128 9986402 10424260 10680996 10940130 11440145 11748954 12171298 12572118 13125875 13841283 14214582
9118 14214582 14593232 15248801 16036498 16608685 17291316 18332946 19123586 19919762 20948551
9109 20948551 21775411 22688181 23949000 25332442 26779333 28424652 30245472 32241489
9101 32241489 34338385 36747796 39341171 42464220 45946518 49977836 53893501 57257174
9093 57257174 60312413 62573790 64252033 65736157 67630829 69603540 71166380 70832172
9085 70832172 68331486 63618855 58073410 53258316 49430992 47004020 45496479 44553894
9077 44553894 43845481 42811691 41816268 40766916 40191118 40002424 40291651 40694659 41366642
9068 41366642 42860476 44739071 47016894 49701864 53007223 56432771 60140665 63705479
9060 63705479 67264226 70302345 73121963 76178472 79683849 83111708 86378309 88784062
9052 88784062 90369888 90366566 88364201 84372294 79119557 72150807 63932462 55396428 47634595
9043 47634595 42011929 37948424 35155830 32949478 31211204 29730095 28381980 26866691
9035 26866691 25473849 23911539 22523195 21505136 20579028 19833804 19382149 18801265 18325602
9026 18325602 18137950 17766411 17487328 17341312 17237367 16881223 16855565 17035828 17071362 16916452
9016 16916452 16897220 16866057 16509103 16111528 15935609 15671264 15291345 15032368 14729388 14571313
9006 14571313 14381227 14342319 14007902 13796084 13361819 13081733 12884414 12738222 12576421 12528640
8996 12528640 12356535 12524984 12466911 12375889 12373229 12367446 12470500 12731063 12794973 12893106 13392289
8985 13392289 13703321 14078725 14422697 14886253 15110895 15400364 15732088 15979237 16301108
8976 16301108 16407144 16292533 16459206 16822978 16983233 17342370 17509507 17557289 17382385 17303733
8966 17303733 16995015 16432109 15954090 15854339 15843348 15703492 15641026 15394025 15211835 15073151
8956 15073151 15075168 14970185 14825797 14461061 14086259 13681841 13445490 13281681 13060937 12738508
8946 12738508 12676543 12772339 12907463 13058318 13004438 12861596 13172286 13359795 13597407 13962484
8936 13962484 14529508 14853149 14980637 15163644 15425758 15736042 16182535 16556224 16870910
8927 16870910 17355560 17520282 17574543 17297745 17239237 16946168 16684981 16440466 16086136 15801854
8917 15801854 15733972 15762758 15939673 16024050 15994283 16138754 16357448 16785617 16912745 17018093
8907 17018093 17230482 17581010 17945409 18337019 18930138 19632360 20190002 20657673 21392143
8898 21392143 22010491 22590577 23266288 24086247 25130090 26020820 26975728 28211181 29652169
8889 29652169 31021116 32448131 34144647 35940505 37647880 39562145 42010720 44497828
8881 44497828 47130940 50076374 52880658 55724302 58591730 60972356 62084851 61938899
8873 61938899 61005730 58892336 55688190 52435806 50045333 48618870 47692129 47166595 46721681
8864 46721681 45986750 45140644 44285335 43664121 43777681 44357802 45293931 46585363 48394104
8855 48394104 50522895 52871458 55395366 57957049 60639450 64123570 67864995 72191855
8847 72191855 77647597 83566377 89072236 94757603 99665713 102920539 103970248 102332268
8839 102332268 98833686 93342884 87546451 82303054 77577338 73391948 69490682 65370109
8831 65370109 61020283 56323159 52578187 49711412 47294378 45227478 43718556 42487232
8823 42487232 41887367 41664661 41721287 42208119 43112494 44133898 45544127 47084950 49095591
8814 49095591 51210955 53187734 55029972 56557901 58106475 59398670 61046798 63088794
8806 63088794 64869703 65680022 65263023 63126790 59419648 54371759 49140084 44051045
8798 44051045 39985759 36643299 34159912 32096456 30473031 29018466 27753143 26465557
8790 26465557 25350925 24238298 23334455 22350680 21650397 21147866 20575800 20063239 19564325
8781 19564325 19371463 18872487 18578554 18410058 18053289 17925067 17684947 17271192 16999443
8772 16999443 16592153 16232760 15925582 15422489 15235177 15402862 15367758 14976292 14716589 14791325
8762 14791325 15023201 14935950 14814386 14752610 15142641 15226422 15138140 15195267 15434193 15917636
8752 15917636 16047505 16380391 16586914 16690583 16904246 17154792 17465230 17721110 18180461
8743 18180461 18711561 19120556 19598186 20141294 20757367 21259828 21812422 22239740 23198087
8734 23198087 24040901 25197230 26390516 28044317 29895134 32427381 35343209 38959688
8726 38959688 43121669 48321454 53536314 59199209 65226665 72777095 81251174 92620735
8718 92620735 106571857 123114219 133483332 138782407 136489659 126455410 109082505
8711 109082505 88406508 75199843 65061269 57880235 51602715 47436521 43927982 41698752
8703 41698752 39519529 37920798 36520983 35876757 35251590 35005379 34881346 35282969 35886806
8694 35886806 36582478 37460962 38197626 38780413 39741865 40959922 42865623 45417186 48344393
8685 48344393 51073791 53158814 53542247 52732405 50388971 47131111 43595247 39954787
8677 39954787 37174308 35153746 33601924 32414899 31071772 29466369 28000550 26723980
8669 26723980 25598582 24753533 24264262 23433818 22570878 21827463 21097602 20464111 20046859
8660 20046859 19935059 19980801 20235671 20714136 21271042 21549157 21914235 22424622 22596069 22853675
8650 22853675 22892871 22612305 22095631 21287112 20193562 19259170 18495215 17454778 16429674
8641 16429674 15160737 14168661 13583963 12803131 12166325 11717925 11259146 10696772 10504094
8632 10504094 10067773 9662156 9405844 8930302 8525866 8261165 7769227 7620153 7319267
8623 7319267 7142550 6736535 6319128 6143437 6022416 6087848 6035501 5705541 5874246 5675563
8613 5675563 5414551 5420449 5173368 5264363 5014112 4744995 4518068 4543582 4567039 4430236
8603 4430236 4268118 4195637 4158547 4034055 4092908 3833322 3745962 3584521 3295298 3306546
8593 3306546 3297998 3186945 3222261 3264769 3256851 3331529 3141327 3013743 2954633 2849338 2978696
8582 2978696 3011780 2910793 2714508 2521463 2736176 2616483 2638790 2643243 2535793 2520776
8572 2520776 2496921 2733751 2509805 2399994 2205576 2209032 2348594 2214808 2100857 2017003
8562 2017003 2023702 2216020 2152632 2236288 2202805 2021088 1896343 1853262 1959838 1777908 1874113
8551 1874113 1972870 1913144 2004867 1653824 1547273 1633671 1630446 1766471 1607031 1450002 1573559
8540 1573559 1526619 1310304 1290378 1378173 1486911 1472388 1412659 1277229 1224322 1312493 1289424
8529 1289424 1355581 1323532 1276201 1381208 1344097 1249851 1323936 1278635 1320629 1503042 1493733
8518 1493733 1413666 1251543 1395185 1325657 1304381 1570837 1368525 1294589 1349747 1200819
8508 1200819 1146283 1122730 1032542 1087752 1077896 1141946 1253936 1114882 1034484 851712 1051810
8497 1051810 926890 999453 942098 860063 788320 923160 1049667 906686 709350 654847
8487 654847 892295 899740 689339 853920 974097 1023468 922029 674479 1018482 1082678
8477 1082678 1121903 998170 1052406 1082708 1011473 1036151 780775 923781 914571 803969 759895
8466 759895 752200 826047 501269 509726 619219 621038 681179 460626 383391 411287 347154 591448
8454 591448 722501 709859 673421 674088 515782 521381 433427 221035 282422 369178 327003 376388
8442 376388 443119 545344 664549 449306 467181 607872 267929 408432 448417 445709 539461
8431 539461 617548 558413 446748 489061 202954 291971 139445 127692 297510 340495 231628
8420 231628 241633 314927 391583 369645 188404 168984 212369 293277 311911 371407 394840
8409 394840 540145 259133 -6600 217994 187123 158875 118172 325807 325111 207956 330552
8398 330552 225320 213882 270238 233857 46652 124972 51840 66702 56335 126506 165968
8387 165968 303008 391784 174469 -29056 -96977 74345 -16408 177554 80485 90235 141831
8376 141831 23302 146132 206140 85699 408666 334539 149302 17851 189496 208288
8366 208288 64438 133213 266292 165658 -58047 -16317 56963 26994 68874 162681 115517
8355 115517 72553 71845 47654 117337 217587 320825 149472 75425 96871 -41320 -9838
8344 -9838 -81656 -186900 133481 211127 113298 103211 14077 134896 193954 229002 -46708
8333 -46708 -46515 -32256 46399 -54973 -70921 -139262 270693 390885 448992 260721 216583
8322 216583 216375 303847 191462 269379 266358 104520 88699 122636 331652 270093 193446 7630
8310 7630 15323 161119 234597 165859 84246 74857 145881 267249 254888 183295 -21811 46109
8298 46109 210039 179066 130476 166616 89828 40408 118039 50263 152243 65626 -94216
8287 -94216 -9463 195487 115994 131531 55878 119157 230362 174442 41879 -30704 73895
8276 73895 -151181 -122094 84615 224098 112818 -8375 37277 -121229 -165405 -134732 -199877
8265 -199877 -89734 -45141 -92799 72778 -106976 57911 147597 133176 148437 314134 87294
8254 87294 189389 183205 83531 166284 178043 76412 171341 188936 174447 258637 186634 265461
8242 265461 480660 288035 255451 398821 503178 444374 196115 214252 183333 -37081
8232 -37081 -93511 -129497 -231461 65682 53724 167301 5922 -142 42681 82768 12
8221 12 -142589 -122241 -36228 76472 27732 6330 79587 44681 -63023 -108338 108852 271791
8209 271791 45395 -93257 6616 -261294 -283910 -188095 -59026 -131767 -81238 93489 122482
8198 122482 263649 -26355 71755 254908 248117 443138 -214452 -636742 -226041 -95635
8188 -95635 -17090 -127794 -242668 -149164 -99493 -127827 -31409 -204470 -107138 -187204 -248455
8177 -248455 -208976 -223606 -223508 -137736 -177556 -152990 -37557 18950 -22493 -139897 -359318 -322848
8165 -322848 -90647 -17310 -32794 -93283 -52910 -129355 -170780 -10192 39863 38243 -172094
8154 -172094 -208891 -133391 -251868 -155850 -89787 67860 205172 -73033 -271952 -91850
8144 -91850 -56841 -163974 -20250 72485 -118509 -4063 -47408 -410597 -468084 -349303 -200197
8133 -200197 42984 -179432 -137337 -111616 -164642 -87591 2972 -139743 -42069 59094 -178655
8122 -178655 -438669 -302716 -61068 -60904 -8828 110477 15475 -193535 -319082 -165432 -127217
8111 -127217 -242877 -183451 -71255 -68231 -8249 74424 59770 6004 -62537 -130637 -297682
8100 -297682 -263904 -277052 -151962 -169251 -205010 -205391 -72948 -494 -24060 18901 -81034 -76860
8088 -76860 -119875 -14635 124435 12333 -16451 121586 -20020 164429 36454 -127436
8078 -127436 -119326 -43201 23812 -8380 -143569 -233017 -194921 -33078 51804 -213885 -151172
8067 -151172 -191072 -105526 97557 -102542 -122986 -111089 -89978 -102301 -51098 45685 75126
8056 75126 3532 -252871 -64696 -251631 -34219 93668 49370 3641 -91368 -223109 -295449
8045 -295449 -218903 -106746 48389 -7554 37705 121543 68817 54870 94956 9178 -122023
8034 -122023 3325 -24139 -149164 -170728 -129343 29882 234202 198930 262105 129806 7296
8023 7296 -57641 -110940 14943 87105 65908 -155170 -138482 -54945 -71173 74056 -177322
8012 -177322 -143789 63016 31167 15477 -50576 -257262 -364827 -249511 -334915 -284253 -74176
8001 -74176 -84126 -178965 -3930 -92261 -79763 10433 71465 -114269 -283548 -258990 -226744
7990 -226744 -211316 -173908 -146007 -196150 -128468 -160117 -104568 -69483 -116713 -175799 -122758 -114146
7978 -114146 -268872 -119945 89930 -18470 -203281 -148250 -209897 -180657 -128099 -42106 -222411
7967 -222411 -225824 -116363 24670 77772 -172750 -317289 -125858 -109091 3172 130502
7957 130502 198003 50289 -9114 28028 -27137 49597 -34785 -122678 -166554 60090 170174
7946 170174 -65581 -78736 152251 -47874 -72280 -2983 -59264 -65746 -26382 54275 -7079
7935 -7079 -116552 46428 -34615 -269897 -290253 -181123 -180252 -116927 -32722 -101885 -134336 -133197
7923 -133197 -117727 -61845 -14122 -77295 -139283 -96155 -26469 -211087 -71430 -49753 -24962
7912 -24962 -52108 -242521 -325170 -415463 -360110 -266951 -150868 -178258 -55431 -174163 -52285
7901 -52285 150376 6874 -122649 -256007 -170657 -171481 -226737 -46367 -137022 -156181 -4943
7890 -4943 16266 -94936 47816 -67355 -96730 -40430 22054 -81066 -92933 -58579 -176054
7879 -176054 -75685 -18186 -139518 -283768 -252714 -245013 -137749 -175900 -262629 -172813 -210122
7868 -210122 -56577 53401 52775 86890 -38711 -94732 -352372 -235701 -53774 -20302 -74333
7857 -74333 109396 101812 -80448 -126982 -30521 -75145 74979 121768 -128881 -149884 -86864
7846 -86864 38914 -76806 -75273 -132795 -104092 11493 -39758 -247386 -44388 191742 -35055
7835 -35055 -251367 -272637 -186507 -165942 -159205 -233467 -158664 -211490 -31083 -151302 -215992
7824 -215992 -107175 -61766 -7273 -177288 -336672 -105249 -73075 -170643 -77308 -129798 -89113
7813 -89113 -91864 70667 -118642 -149369 -267099 -31842 176614 -160411 -93429 -52937 -253103
7802 -253103 -160898 -233351 -215239 -112259 84011 5245 -72579 -141386 -137227 -17054 -53368
7791 -53368 -75312 -269835 -36037 56046 647 -141996 -86319 -30825 -16967 -233997 -293174
7780 -293174 -197780 -47890 31439 -37880 -106132 20605 53705 134579 98886 174352 7124
7769 7124 24827 -53618 -253393 -102054 -139105 1524 149433 190456 -44573 -198570 68406
7758 68406 99545 -123400 -116113 -138999 -124146 -178481 -231196 -221044 -9867 63203 -149657
7747 -149657 -221433 25305 17962 15209 28781 128198 167488 334147 312809 -64671 -86428
7736 -86428 -24054 -172104 -122296 -73455 -16346 72299 99601 11411 -73856 85702 27165
7725 27165 -198051 -161119 -227720 -180148 -109554 -140116 -190506 -231488 -43546 -135389 -217972
7714 -217972 -219483 -155415 -254339 -204818 -66640 -116805 -225167 -247339 -103814 -26348 113489
7703 113489 -99934 -135147 112597 338443 337338 241365 -499 131876 -27506 -14568 144936
7692 144936 40546 -30233 -197384 75015 48171 68142 157890 110736 -33526 42601 209488
7681 209488 88662 76024 69813 282820 343763 335430 407322 550101 420638 344287 409669
7670 409669 472152 552318 168941 109134 415760 341157 207209 124158 -63691 41628 15005
7659 15005 -61404 4587 90191 261755 222079 62096 167931 308972 118180 -8967 45033
7648 45033 118841 241845 179807 93319 12780 -21925 -28803 -75903 -172393 -116549 -44790 -120361
7636 -120361 -144929 -188159 -55204 -28762 -136599 145921 124874 -34737 138210 54517 39921
7625 39921 296324 85872 -15381 -100789 66843 231677 26957 -60676 97830 -236328
7615 -236328 -101444 -39437 -49425 -82260 -129129 -110161 -139212 -134989 -161711 204084 5076
7604 5076 -118579 -100468 -50950 -117444 -141080 -28974 -26529 90317 126799 178752 -5692
7593 -5692 -65527 -120372 -194658 -302361 -285242 -213113 -178356 -62822 -16309 -102424 -53162 21610
7581 21610 18024 -115179 -3623 -28399 48871 -61439 -85385 159405 68864 -55896 -120980
7570 -120980 -179828 -280087 -197860 -154668 -55072 -179939 -292248 -186396 -132199 -230688 -105242
7559 -105242 77507 121898 -12481 36416 99481 123079 82966 64995 216734 296691 -105835
7548 -105835 75441 90198 58349 -89248 -40720 -14218 -34302 -148628 -227564 -184801 -14460
7537 -14460 52104 123203 512681 448656 321076 208475 294807 290753 335147 261133 214857
7526 214857 253642 333828 185218 -105693 -205732 -209749 -18094 69070 84191 -75118 32380
7515 32380 221263 168105 87922 149916 -43330 190730 111092 229511 359241 450010 242709
7504 242709 336125 453432 452052 507695 371291 509712 660384 459255 170512 313322
7494 313322 364269 472522 430999 325867 181811 219869 -9703 -13140 36554 23488 51445
7483 51445 33480 41922 305831 298400 183360 262584 168239 161807 309923 155298 400458
7472 400458 298022 297978 385971 165390 129411 215847 48707 -23390 -36276 342076 305465
7461 305465 342396 412679 418890 365659 151288 212502 294848 316491 134981 51227 82860
7450 82860 42765 173501 181385 117168 143452 23702 -103199 145061 174670 101204 154796
7439 154796 121196 86341 168996 441336 180412 102165 141327 152023 217116 145436 -8293
7428 -8293 207767 401458 342535 308714 332366 310427 64456 3953 115646 86089 27144
7417 27144 58917 55414 119974 250111 122031 156180 338652 256012 179129 117387 192779
7406 192779 77316 -9174 -70675 91593 142746 102124 283011 185612 250811 354090 327635
7395 327635 191946 244557 119599 174473 92353 228778 214260 284937 356975 326946 360828
7384 360828 170600 112550 212437 153055 159655 200920 177295 122078 220690 257270 228390 -44619
7372 -44619 -83747 138049 349401 415864 221608 291714 304518 315004 379545 330356 309143
7361 309143 450561 416154 129992 109794 102884 182600 151691 59791 66029 205085 202841 270031
7349 270031 284958 281435 518145 493714 330614 300187 365887 289711 129949 76127 267983
7338 267983 145931 281224 58105 254475 352947 310470 374612 488594 369940 292560
7328 292560 421539 413841 276367 196111 139678 18695 176187 144948 211214 276171 298911
7317 298911 191853 83156 298369 506136 730307 586616 566195 525064 499282 478892
7307 478892 366438 585042 340592 460537 430735 427806 532293 544742 325160 263886 416197
7296 416197 548582 731615 567066 571008 631565 512201 611660 702004 576449 496401 499566
7285 499566 481265 574341 722484 687676 723772 549848 537199 483601 392913 169587 141371
7274 141371 445904 544719 503785 590256 586213 630978 646116 619571 682943 794234 724764
7263 724764 527953 512047 776782 766213 795805 715683 542067 759292 671769 601253 705485
7252 705485 760350 747436 837233 628779 1025774 1056678 843776 1003700 880718 995937
7242 995937 897028 835340 1023597 1012944 1060256 1060837 1184736 1268518 960617 1081879 1031523
7231 1031523 1251863 1554043 1384238 1232706 1176599 1337977 1284097 1169200 1125745 1270168
7221 1270168 1013445 1139777 1187390 1148951 1183280 1175571 1356440 1320284 1161538 1174528 1271664
7210 1271664 1475401 1484467 1569572 1654126 1586056 1606979 1707754 1825838 1451383 1532594 1778339
7199 1778339 1914670 1758752 1755759 1870902 1920109 1843898 1730567 1928815 2136465 2068937
7189 2068937 2012208 2088538 1932003 1890918 1951427 2036539 2227449 2402078 2204421 2094144
7179 2094144 2326346 2259128 2298713 2346238 2378272 2374118 2390962 2689064 2723792 2787390 2754446
7168 2754446 2758100 2734465 2944017 2865856 2859907 2965168 3028088 3301038 3267055 3207945 3244736
7157 3244736 3409556 3304847 3346948 3514305 3608341 3807876 3879646 4185042 4428999 4650088
7147 4650088 4884005 5000767 5007266 5143107 5339374 5574060 5816996 6099229 6277938 6634561
7137 6634561 6936675 7060995 7408740 7578794 7768636 8371464 8808538 9189055 9715455 9998877
7127 9998877 10551467 10787636 11268251 11777941 12301843 13187619 14084799 14999656 16389378
7118 16389378 17939061 19964883 22343522 25040062 27799411 31202925 35192610 40000304
7110 40000304 46034193 53617821 63029820 74114442 84790008 93717790 98860374 98698155
7102 98698155 92820194 82805571 71296614 59711858 50519125 43747461 38761639 34965942
7094 34965942 32000849 29103282 26232966 23625257 21448580 19324771 17540904 16076667
7086 16076667 14730403 13629715 12760626 11707564 11003970 10509187 9838796 9581103 9144293
7077 9144293 8711490 8648400 8427600 8177995 8070156 8221838 8121292 7972543 7808781 7747659
7067 7747659 7627107 7207296 6921315 6541990 6069510 5735171 5437904 5330158 5074084 4959683
7057 4959683 5034695 4694480 4549338 4565340 4403118 4447109 4383473 4357038 4537255 4622172 4629572
7046 4629572 4531581 4597432 4522513 4818289 4910270 4913134 4680996 4609093 4370563 3842529 3405559
7035 3405559 3142452 2994627 2842328 2809521 2806207 2630979 2505070 2385643 2157964 2239881
7025 2239881 2267388 2173539 1996899 1951126 1888325 1849976 1779668 1938228 1754101 1949932 1918669
7014 1918669 1652698 1663990 1647047 1764954 1863783 1642761 1792433 1701555 1529674 1537191 1423025
7003 1423025 1411670 1593561 1389015 1261070 1289887 1313633 1294994 1390525 1243346 1214297 1207978
6992 1207978 1178699 1106221 929650 842073 895822 786967 810785 940118 943317 880748 700400
6981 700400 674453 755582 756506 662145 749833 905772 994809 1064841 957300 685931 817433
6970 817433 903593 893224 619094 591632 717406 833909 752884 806820 683099 720416 759644
6959 759644 881622 812544 867924 776250 720674 670718 720991 938535 893714 893734 745501 717856
6947 717856 726630 746323 650674 673699 611391 413459 373624 439832 621790 551931 419293
6936 419293 415579 315933 319835 457602 464262 309121 291396 380103 284489 410032 283226
6925 283226 223772 186978 354338 250856 195620 181707 237783 297455 278645 240983 338069
6914 338069 368739 266807 398759 438306 326425 289881 320692 350383 325411 272780 280324
6903 280324 279699 239967 380109 371647 322850 285662 201824 334182 317896 204273 269987 228087
6891 228087 215245 181595 356302 286830 139054 356510 449296 329363 274047 242269 138401
6880 138401 165016 246272 191488 119899 238247 236916 331418 114481 53548 -46784 117928
6869 117928 78047 253344 247376 229869 102100 68123 188954 208865 154738 256316 84513
6858 84513 -3205 72345 21802 230530 245324 133832 186230 212340 203604 358153 167056
6847 167056 -201785 -11850 82796 78005 100241 107260 153684 207324 151681 97632 15549 56129
6835 56129 24130 58523 78640 71098 302469 495069 373052 282032 208022 56509 -137862
6824 -137862 426 88706 75533 172336 -11449 38143 127881 -20493 7128 -66570 -93809
6813 -93809 78391 10525 -7983 -183078 -63518 178826 245167 13198 -103923 67413
6803 67413 204350 271460 137163 24279 123750 211294 130758 139186 254630 59129 112559
6792 112559 129120 219925 -18507 -157420 44259 152417 42650 -142233 -205828 1916
6782 1916 -238175 9780 75834 101208 218912 178232 67065 9449 108494 124585 113721
6771 113721 263132 376002 89780 162807 121451 433731 286137 263433 278883 338366 392934
6760 392934 425392 280495 116361 170049 341812 332183 198671 368227 216695 84400
6750 84400 152309 105090 162049 257632 322769 403419 335444 427002 459480 638656 652520 338852
6738 338852 247875 205137 333020 257604 258351 304526 293300 289793 222801 122307 272657 392702
6726 392702 149524 174808 87709 -28454 162359 58886 65423 182154 91683 133846 188206
6715 188206 304228 269513 303259 191293 415406 541773 564927 382338 493527 490635 389881
6704 389881 635717 875674 891898 668461 609350 537111 134569 161068 307847 189708
6694 189708 161028 201148 273529 120224 10356 61708 285817 294637 67098 3629 171315
6683 171315 213185 277573 108414 -10505 31507 39934 4184 27552 38282 23251 -9285
6672 -9285 -84067 17687 -14516 64868 27502 55803 90433 77082 173514 277538 342200 218027
6660 218027 174384 25361 4793 319883 296463 207298 40540 -74344 147416 249311
6650 249311 185805 71892 96716 19575 100921 81665 49430 198856 192817 160159 316238
6639 316238 207741 81458 75994 219059 226153 301582 466771 401959 235093 190501 152455
6628 152455 76753 171566 28726 -190907 -8905 295827 381361 394860 227792 244843 273547
6617 273547 124368 66738 115642 204290 216895 188419 11409 127519 -47108 105358 188994
6606 188994 88093 -99162 24575 305756 168823 160455 -41004 -40899 21238 -87927 -128878
6595 -128878 -32030 -101185 -185865 -187555 -254341 -61544 -119087 -40015 185680 -66821 17021
6584 17021 119290 -66 119162 52915 46416 67175 -9764 114650 208948 198010 151398
6573 151398 -38260 -27155 215695 240622 67598 27119 158184 310324 344900 195143
6563 195143 202763 135560 211966 284290 298010 287808 271512 151390 98083 66160 -6591 155007
6551 155007 302555 148054 66807 188071 6788 -75775 129793 163604 107598 68937 25427
6540 25427 72481 114062 -65509 -46776 -31417 105437 176307 298500 297261 191259 138071
6529 138071 122271 281318 253186 301444 136139 27423 195340 152220 129247 240471 167307
6518 167307 303304 133753 91459 179452 147319 73609 -14383 391863 432280 416118 517522
6507 517522 289581 81183 141814 108428 230745 350075 179927 216414 216402 281851 119036
6496 119036 114151 236597 176649 272004 214042 113049 136087 245335 268830 285063 412059
6485 412059 371875 488974 529425 250772 254480 110769 122635 113022 81628 68121 195532
6474 195532 178333 367993 474710 370378 309570 217094 228298 334839 156938 226248 154617
6463 154617 95609 158527 101018 370979 281016 240485 231036 470500 479916 334470 507464
6452 507464 569842 478890 291890 388111 265196 251298 244163 187776 100853 136807 416451
6441 416451 384523 386190 214423 244601 335629 353512 321082 251234 104956 315924 396335
6430 396335 479883 412742 239962 354907 227763 148933 267454 359865 450247 441723 412479
6419 412479 449116 356080 239452 218462 231881 267032 351141 516528 514941 356406 264335
6408 264335 484694 509409 565256 646314 627731 445215 479850 472649 616050 419190 359820
6397 359820 616603 728904 626401 361705 461824 592403 564238 436729 499311 446464
6387 446464 703863 671638 569815 648627 451966 350221 506624 463011 299964 341917
6377 341917 497991 476798 443378 673721 559040 652813 809423 612234 743847 709042
6367 709042 704143 611038 592876 590502 681209 709181 706393 793912 718805 666471 760339 889691
6355 889691 716761 694579 763645 855340 791438 804357 878086 785319 729442 832866 619818
6344 619818 561603 800306 753812 750457 696531 540596 486842 464347 491874 797175 887051
6333 887051 749917 533361 701993 895640 875994 892522 967424 1021473 1140499 1275915
6323 1275915 1038400 877606 905643 935089 888586 813390 871973 818148 836829 871325 703637
6312 703637 937646 975118 876286 786605 647593 724299 1070565 1030037 1022384 963772 847938
6301 847938 949593 851971 760654 940749 964988 955727 838346 786284 830769 808576 955984
6290 955984 838191 885129 774530 790813 808153 712182 728293 799739 1026912 1166669 1046703
6279 1046703 827810 679408 767953 827578 827802 805217 814854 856360 926621 751368 777351
6268 777351 828021 737148 937498 1051123 943933 909416 890715 849955 999709 956000 1024971
6257 1024971 884867 741048 810621 854162 1132906 1227734 1310723 1187077 1224140 1091600
6247 1091600 989298 1009769 971904 875886 1041919 1152995 1124978 1111451 869836 812294 1032109
6236 1032109 1261168 1058172 905305 1086070 1038751 1011579 1033724 945624 935057 1028014 1145712
6225 1145712 1219187 1151395 1145353 1052857 1128947 1126141 1036643 1162731 1100240 1220258 1278859
6214 1278859 1292767 1254421 1248845 1256982 1219625 1389986 1426777 1346900 1330435 1428110 1687494
6203 1687494 1668528 1479115 1591355 1586456 1542555 1742301 1644034 1617868 1836761 1763113 1924901
6192 1924901 2131836 1861638 1714924 1620958 1712504 1597462 1461140 1478101 1614606 1898139
6182 1898139 2157136 1991214 1881164 1760764 1779832 1849452 1878513 1936999 1933199 1931418 1817247
6171 1817247 1862285 2105907 2124628 2210336 2261698 2212046 2048564 1863370 2067622 2082752 2074185
6160 2074185 2151052 2179858 2090755 2016220 2088982 2209821 2333544 2346680 2133062 2080877 2196529
6149 2196529 2397464 2460429 2385333 2290066 2166849 2380987 2446959 2393760 2432431 2521394 2306778
6138 2306778 2403188 2647581 2556600 2509916 2752251 2663079 2629784 2740528 2887599 2849551 2773456
6127 2773456 2971957 2967914 2998165 2866529 2974967 3244397 3158966 3185307 3248303 3410872 3260040
6116 3260040 3300083 3503330 3285630 3239337 3351267 3551098 3425969 3394971 3556281 3688088
6106 3688088 3891982 3823477 3877135 3890580 3702700 3888848 3972042 4215783 4242489 4262866 4238823
6095 4238823 4220277 4453742 4447486 4482186 4617589 4454974 4545869 4736099 4820718 4898365 4913813
6084 4913813 5188277 5297492 5317731 5427060 5645368 5804375 5931535 6039597 6288417 6565377
6074 6565377 6854406 7104860 7211796 7419915 7291146 7297711 7177267 7196127 7136005 7216400
6064 7216400 7272648 7203705 7307737 7492037 7729998 7876252 8084975 8095511 8157211 8419511
6054 8419511 8701701 9039801 9152212 9497522 9877031 10251839 10499345 10761559 11447052 11877791
6044 11877791 12275492 12984785 13798437 14497482 15276686 15754473 15797021 15676588 15138130 14931274
6034 14931274 15175296 15421766 15708721 16297934 16823256 17439650 18342896 19146462 19831410
6025 19831410 20797851 22075411 23479509 24901192 26468296 28509030 30934993 33761459
6017 33761459 36855022 40007266 42560239 44510988 45780194 46418925 46509148 46654783 46922687
6008 46922687 46724431 46371443 45926141 45332862 44751927 44821760 45424168 46372425 47652493
5999 47652493 49336659 51135579 53030615 54838397 56787409 58943509 61605290 65009861
5991 65009861 69496044 74750061 79280024 82263623 83221282 81925215 78454123 73508467
5983 73508467 68760303 65143628 62821629 60902846 59222027 57860747 56378590 54612025
5975 54612025 52823243 51002338 49282059 47716745 46305188 45479377 44739379 44080075 43303904
5966 43303904 43038685 42886658 42846904 42572472 42088166 41125999 39662959 37459991 34832716
5957 34832716 31794980 29232443 27007296 25173000 23765185 22804341 21904374 21167238 20476907
5948 20476907 19956874 19136694 18892357 18369098 17737822 17295983 16615620 16125471 16007425
5939 16007425 15886150 15334818 15082434 14894694 14950799 14639651 14498583 14607767 14751805 14521442
5929 14521442 14443426 14401629 14290167 14288280 14102144 13966954 14002595 13690029 13665332 13743714 13925140
5918 13925140 14177547 14277232 14581458 14465723 14590506 14814607 14766888 14912087 15081427 15348704
5908 15348704 15579958 15729311 16203345 16593821 16853102 17175858 17746126 18206092 18448040
5899 18448040 19224929 19563392 19973494 20545885 21472784 22630385 23441383 24516253 25434353
5890 25434353 26408576 27776179 29310293 31250262 33594074 35998207 38933669 41918825
5882 41918825 44688437 47076131 48698735 49611237 49982314 50444774 50856893 51309385 51682167
5873 51682167 52418208 53262636 54639249 56137728 57972274 59889436 62117966 64296352
5865 64296352 66422490 68472387 70502644 72371660 74291993 76723249 79561697 83062671
5857 83062671 86852664 90027346 92004906 92106450 90195826 86744870 82371078 78112862
5849 78112862 74439960 71692520 69301173 66959180 65205449 63482961 61816845 60647738
5841 60647738 59570650 58872454 58406303 57973718 57646844 57127110 56923688 56327013 55857876
5832 55857876 55691706 55635500 55249685 54375305 53131702 51427960 49250997 46812582 44666287
5823 44666287 43254980 42494989 41999659 42249602 42168725 41890055 40896598 38915770 36567398
5814 36567398 33967706 31567358 29814374 28180001 26860772 25666007 24201561 22871930
5806 22871930 21874503 20913881 20059523 19325424 19103714 18711225 18545451 18467140 18266592 17901096
5796 17901096 17898863 17888639 17611493 17444619 17306696 16960470 16818454 16893597 16972288 17141222
5786 17141222 17377999 17365440 17044935 16573943 16087343 15381232 14731835 14009198 13310299 12743862
5776 12743862 12470743 11992565 11771971 11456642 11430862 11344966 11160612 11056632 10919694 11044973
5766 11044973 10753248 10581000 10601418 10801880 10712020 10861068 11066983 11121635 11161554 11240258
5756 11240258 11094866 10944181 10766254 10503379 10029070 9702558 9198279 9030582 8853717
5747 8853717 8397481 8173032 8112014 7591780 7224288 7146348 6949588 6899143 6781000 6419602
5737 6419602 6265345 6367599 6393382 6458726 6188200 5934170 6033610 6035940 5906103 5642234
5727 5642234 5786409 5568516 5422783 5053582 5071420 5092347 5021401 5116000 5059664 4878552
5717 4878552 4639576 4667095 4562746 4291719 4161215 4109678 3809882 3852776 3906354 3735932
5707 3735932 3756167 3996492 3842858 3789438 3661314 3470385 3339361 3308345 3311229 3243810 3194454
5696 3194454 3325127 3349646 3381386 3365298 3047714 3124970 3216524 3096797 3091437 2947233 2899621
5685 2899621 2972047 2662621 2471378 2775824 2921648 2770475 2637935 2705645 2620954 2529137
5675 2529137 2675125 2520556 2417864 2780640 2910268 2787002 2665663 2728785 2796827 2724776
5665 2724776 2637074 2728339 2820518 2828031 2689531 2643026 2491038 2525584 2703404 2713469 2703023
5654 2703023 2593131 2571529 2633289 2723832 2727378 2671059 2813430 3019908 2903993 2904139 2843815
5643 2843815 2921331 2904687 2818897 2840157 2890960 3165812 3177829 3116936 3142832 3016398 3029620
5632 3029620 3100139 3097122 3148395 3116467 3332383 3289838 3198696 3084654 3117892 3313266 3407894
5621 3407894 3339992 3197448 3244336 3288346 3444702 3482126 3485032 3499161 3534091 3560892 3659602
5610 3659602 3732222 3561912 3437891 3408146 3385743 3517273 3524074 3411720 3432646 3385154 3359143
5599 3359143 3396733 3416418 3293730 3509615 3442871 3462759 3714440 3726247 3760783 3846275 3818220
5588 3818220 3969806 4047154 4044636 4049318 4161780 4345406 4637062 5119752 5585926 6058369
5578 6058369 6608067 7146051 7624882 8576479 9684623 10781563 12437975 14826002 17405755
5569 17405755 19388859 20330253 20150529 18666445 15932321 12919102 10356309 8459209
5561 8459209 7422883 6616047 5912960 5457483 5305242 4665123 4393117 4227692 4047711
5552 4047711 4023021 3819765 3598229 3787298 3585313 3400070 3516054 3586345 3663766 3963799
5542 3963799 4143920 4226565 4237449 4302884 4020109 3898069 3762619 3272878 2981414 2833524
5532 2833524 2633127 2555492 2488004 2412303 2355362 2420619 2190863 2021612 2164489 2298918
5522 2298918 2390442 2356397 2244666 2122264 2120217 2045787 1763978 1732472 1762189 1764178 1798728
5511 1798728 1500181 1582959 1522825 1578767 1573058 1820790 1750848 1512922 1517709 1563605 1520357
5500 1520357 1268219 1239981 1401585 1580435 1787503 1822751 1619107 1571046 1651970 1683016
5490 1683016 1685697 1540115 1315056 1201782 1360858 1326764 1436213 1240867 1176883 1331143
5480 1331143 1324873 1269670 1146863 1150879 1166363 1236658 1222342 1228456 1115107 980054 1121057
5469 1121057 1164485 1147443 1166801 1283514 1232309 1280848 1174144 1368774 1277814 1358468 1355894
5458 1355894 1308366 1477460 1182120 1048389 1220824 1305085 1551915 1447308 1398479 1502312
5448 1502312 1443918 1655897 1579384 1309882 1303011 1302714 1262722 1282245 1236238 1259573 1267503 1371468
5436 1371468 1597194 1561877 1403068 1534946 1682295 1620577 1541310 1534831 1551699 1684189 1646122
5425 1646122 1503093 1563634 1503574 1460136 1530290 1706324 1918987 2057544 1939969 1642378
5415 1642378 1831348 1956557 1947975 1914111 1756139 1732205 1903790 2002016 1976093 1966625 2096559
5404 2096559 2225764 2496587 2554955 2505742 2799438 2747079 2707003 2813864 2834867 2753256 2698827
5393 2698827 2734528 2635149 2779128 2978012 2995584 3003991 3140658 3095068 3085786 3237795 3157559
5382 3157559 3093569 3341378 3321338 3378854 3546887 3727110 3642165 3642712 3568657 3737362 3803729
5371 3803729 3880339 3784669 3353471 3241235 3305650 3245727 3297519 3271776 3220588 3034701 3143777
5360 3143777 3438576 3331121 3300720 3317698 3099702 3336627 3450255 3435065 3384862 3342051
5350 3342051 3170559 3121284 2986355 3039953 3053434 3044919 2969813 2740349 2696212 2480323 2269472
5339 2269472 2156351 2090334 1847114 1860630 1890036 2036872 2038402 2046314 2032499 2080730 1964313
5328 1964313 1751676 1991481 2044729 2070378 2205143 2163187 2168019 2148851 2076781 2065987 1930128
5317 1930128 1723964 1789360 1988239 1928487 1854986 1828936 1889420 2001879 1950751 1961588 1748792
5306 1748792 1957162 1904289 1702981 1803985 1859978 1768992 1865112 1926814 2172927 2155418 2033009
5295 2033009 2116536 2088400 2023352 2190351 2228531 2167246 2183073 2336345 2398581 2503361 2449461
5284 2449461 2475839 2543280 2589971 2777827 2895734 2991765 3279793 3393033 3307306 3449819
5274 3449819 3385870 3377201 3411273 3502739 3733365 3948122 4012585 3773440 3652499 3904366 3858890
5263 3858890 3749435 3622711 3621514 3523194 3643072 4106854 4264275 4632983 4979615 5275503
5253 5275503 5500316 6020364 6162796 6325722 6328248 6216231 6172126 6086602 6272154 6319997
5243 6319997 6275386 6222876 6029067 5964758 5853167 5517403 5376647 5078613 5040509 4977708
5233 4977708 4809141 4603553 4384291 4301601 4454880 4476773 4446437 4407905 4493336 4530661 4300158
5222 4300158 4436294 4544125 4551411 4540019 4570063 4722396 4819517 4754156 4758573 4711347 4618914
5211 4618914 4437806 4185847 4053095 3918657 3942112 3776288 3647719 3664484 3517714 3524182
5201 3524182 3404147 3507684 3677130 3514943 3268106 3392037 3363627 3280856 3228573 3236067
5191 3236067 3304987 3250056 3033680 3042801 3099058 2777187 2926648 3072445 2904113 2846468 2955869
5180 2955869 2914013 3021853 2932377 2874883 2868710 2815338 2820066 2863570 2598141 2561066 2520441
5169 2520441 2711844 2853842 2807834 2831483 2937599 3207322 3303500 3321614 3400572 3243699
5159 3243699 3329236 3483035 3478449 3260542 3106644 3078982 3009998 2915525 2903362 2959925 2969983
5148 2969983 2903515 2923260 3010304 2843057 2886387 2975377 3080768 3123546 3056600 3050591 3045497
5137 3045497 3034285 3176668 3436899 3342476 3211194 3352924 3469909 3546588 3710683 3691538
5127 3691538 4002022 4405850 4409093 4473672 4565746 4544771 4312043 3949755 3717613 3628438 3618316
5116 3618316 3494611 3489741 3499735 3270993 3193452 3476355 3531984 3444071 3590706 3664103 3608766
5105 3608766 3680935 3700671 3589390 3594869 3607561 3656339 3821832 3958126 4053555 4039672 4049194
5094 4049194 4390157 4341269 4214079 4165915 3969160 4034624 4006764 4043751 3938424 3985254 4080510
5083 4080510 4329524 4542684 4773244 4909212 5039074 5335976 5329473 5461136 5845660 6038900
5073 6038900 6260192 6496499 6977528 7521935 8216541 8898463 9678823 10633312 11792538
5064 11792538 13184940 15037902 17603828 20267182 22797049 24029830 24352359 23255360
5056 23255360 21223251 18168727 14923177 12599751 10932636 9888218 9060623 8211931
5048 8211931 7835016 7359017 7036458 6768502 6777234 6451201 6189576 6161744 6148378 5986633
5038 5986633 6000685 5979653 6164839 6540856 6611543 6859382 7227805 7786515 8379531 8868858
5028 8868858 9176043 8610695 8098231 7356203 6527046 5928861 5503326 5214049 4849800 4679939
5018 4679939 4457841 4145062 4118294 3858217 3444426 3386265 3295216 3538558 3480165 3333488
5008 3333488 3249186 3076985 3133442 3167958 3150849 3058569 3140150 3150760 3202816 3113693 3267227
4997 3267227 3086235 2996322 3057214 3070255 3096047 3144262 2999482 3159491 3299426 3308224 3373134
4986 3373134 3081389 3074673 3092986 3109010 2885509 2892194 3023068 3050825 3070388 3197853 3219614
4975 3219614 3232374 3133397 3169006 3113911 3265800 3234652 3300052 3485115 3689990 3712698 3911185
4964 3911185 4042775 4059492 4486076 4547880 4520812 5016887 5405055 5864087 6595137 6928753
4954 6928753 7009653 7372140 7036136 6482259 5803082 5293102 4909742 4821067 4539107 4481270
4944 4481270 4453458 4395874 4371590 4456024 4334463 4471068 4579103 4621820 4629725 4536450 4600084
4933 4600084 4756337 4417914 4407267 4755838 4696055 4718516 4635953 4663226 4752266 4863647 4930465
4922 4930465 4771007 4818156 4886803 4994338 5174027 5208781 5153955 5447891 5543818 5570559 5657125
4911 5657125 5902958 5889888 5915808 6030179 5884776 6068112 6304013 6379904 6501887 6588678
4901 6588678 6629746 6531515 6750774 6776179 6797655 6882206 6734435 6957957 7030142 7251790 7431166
4890 7431166 7304201 7393894 7547749 7613255 7718680 8006131 8120428 8139219 8157434 8300779
4880 8300779 8556997 8652564 8699420 8982092 9292515 9425538 9536729 9763997 9926472 10016331
4870 10016331 10323737 10721935 11164644 11339886 11647598 12086350 12498854 12721366 13086099
4861 13086099 13433046 13680546 13966223 14538541 14986377 15740949 16519747 17453057 18512281
4852 18512281 19912077 21217475 22709262 24546624 26760705 29261014 32142832 35209925
4844 35209925 38609644 40440121 41594756 41287223 39980667 37769095 34834581 33237033
4836 33237033 32771718 32653909 33033573 33402479 34179992 34982081 36408282 37783007 39604620
4827 39604620 41558575 44409940 47516246 51920865 57179017 64017802 71390548 80291197
4819 80291197 89535481 100923062 114327939 131640440 152467510 180963471 217875159
4812 217875159 263129823 296746930 315089418 314778015 292054509 250306509 193121627
4805 193121627 151070966 121303379 100975350 86005552 75611222 67194047 60758749
4798 60758749 54828022 50442139 46499042 43110134 40269694 38042098 35986370 34055095
4790 34055095 31949426 30100834 28292793 26684428 25079657 23993499 22732103 21880220
4782 21880220 21248570 20617672 19962242 19439679 18696674 18108588 17713724 17184357 16499859
4773 16499859 15867419 15286343 14964399 14591179 14201252 13941753 13683896 13299838 12926890
4764 12926890 12572180 12277480 12124033 11783430 11682977 11581082 11524133 11562940 11611028 11658357
4754 11658357 12077187 12054458 12134288 12106861 11731490 10927491 10591293 10223207 9636373 9246830
4744 9246830 8721556 8176503 8094803 7605573 7823775 7608425 7366288 7240368 7124455 6955941
4734 6955941 6774503 6634979 6587663 6588732 6413008 6233677 6029931 6099016 6046941 5724234
4724 5724234 5543671 5455495 5513993 5266537 5207054 5170568 5128977 5174881 5165971 4964049 5073247
4713 5073247 5118032 5036960 4978314 4876813 4800858 4643856 4569519 4614609 4419709 4520487 4348014
4702 4348014 4281183 4165430 3945418 3876446 3918695 4031935 4072855 4072498 3829505 3859119 4052139
4691 4052139 4204127 4233146 4095358 4129318 4084896 4378412 4345897 4374590 4551111 4642482 4729691
4680 4729691 4753412 4531965 4488299 4190923 3933290 3983146 3925220 3768095 3721715 3669600 3694411
4669 3694411 3580081 3641418 3836668 3799217 3713158 3721510 4221909 4285107 4318035 4432342 4668541
4658 4668541 4567758 4196186 4059318 3835969 3927360 3832822 3682450 3526274 3428193 3468147
4648 3468147 3513808 3449034 3407683 3376955 3393972 3246994 3241231 3318588 3461404 3515003 3590634
4637 3590634 3851351 3832444 4059443 3927458 4173522 4711878 4981409 5181372 5322926 5344136
4627 5344136 5037716 4523190 4177666 3592789 3408241 3101882 3181165 3034991 2937213 2994437
4617 2994437 3055329 2913620 3055835 2970267 2778533 2838263 2871857 2874975 2669770 2740040 2836087
4606 2836087 2760020 2842231 2831589 2861709 2907691 2946897 3129595 2970600 2877756 2883644 2825919
4595 2825919 2760126 2797634 2774843 2914966 2949906 2731714 2623083 2915262 2817369 2991677
4585 2991677 3051997 2951007 3107549 2922062 3062590 3015102 2891295 2943747 2956879 2815630
4575 2815630 2889643 3041825 3055924 2968253 3050948 3025679 3157400 3280862 3284993 3286679 3339740
4564 3339740 3560744 3697064 3874842 3827515 3795138 4031319 4033333 4022114 4060423 3913295 4053466
4553 4053466 4115618 4140652 4351376 4425424 4403239 4312148 4714064 5028071 5021362 5419220 5714944
4542 5714944 6269593 6760667 7295283 7831997 8531188 9468970 10581640 11820004 13341552
4533 13341552 15309934 17615753 20403079 22688713 24093339 24616362 23530848 21261726
4525 21261726 18280993 15322208 12823903 10977191 9744742 8691135 8009773 7370010
4517 7370010 6837066 6422426 6304933 6017848 5700586 5679627 5476291 5239318 5020446 4814714
4507 4814714 4619839 4563672 4784455 4749729 4606990 4658619 4758877 4690849 5002961 5183368
4497 5183368 5184051 5393911 5727609 5864597 5799060 5831293 5657286 5356966 5108632 4883519
4487 4883519 4642306 4575845 4788760 4892603 4784763 4828370 4788847 4967177 5065727 5012596
4477 5012596 5001245 5168550 5488419 5579679 5861210 6396877 6656286 6783211 6841630 7058139
4467 7058139 7233403 7177620 6843501 6911723 6817004 6916563 7066645 7199041 7207497 7116766 7206196
4456 7206196 7367953 7677921 8270267 8879775 9392882 9951403 10532105 11287383 12229556 13563616
4446 13563616 15174771 17117971 19526380 22018872 23946292 24873226 24749274 23282433
4438 23282433 20873589 17811652 15184110 13275814 11820078 10914158 9985214 9515541 9026278
4429 9026278 8522599 8003883 7598294 7389349 7169264 6992799 6593496 6404919 6290335 6269475
4419 6269475 6222272 6132960 6111045 6189902 6419714 6291580 6057156 5987841 5970711 5791575 5785419
4408 5785419 5636673 5595636 5847401 5986643 5824003 5780989 5907437 6063381 6301486 6453525
4398 6453525 6552817 6911868 6987530 6960494 7120589 7337309 7000123 6687994 6427901 6192542
4388 6192542 6189852 6019222 5765438 5844408 6073560 6161723 6014324 5953157 5981140 5796218 5605254
4377 5605254 5294599 5148632 5122595 5269058 5269756 5040803 4991128 4947332 4873848 4754694 4860177
4366 4860177 4951710 4883717 4729195 4682443 4831521 4921401 4788188 4857363 5013044 4838004
4356 4838004 4889005 4857744 4809785 5006524 5121447 4880109 4802543 5037512 5258225 5199774
4346 5199774 5307797 5351860 5514463 5593328 5386792 5632168 5867044 5721101 5989432 5925402
4336 5925402 5927605 5799030 5517974 5749671 5945217 6012917 6003681 6030168 5998573 6392681 6434278
4325 6434278 6351904 6211481 6492614 6533620 6707095 6851901 6840454 7139922 7220049 7354087
4315 7354087 7438793 7495517 7789201 7828189 8054326 8267463 8246721 8245029 8217675 8361412 8601719
4304 8601719 8759503 8927390 9131689 9212709 9287986 9472105 9485108 9799831 10009603 10127587
4294 10127587 10281745 10489293 10760162 10954196 11254867 11715253 11950567 11942960 12058070 12272449
4284 12272449 12476744 12667601 13195928 13639265 14122227 14686399 15496425 16114292 17016444
4275 17016444 17881511 18998961 20113182 21722458 23398083 25700486 28605259 31492367
4267 31492367 33609740 34611458 34167816 32560669 29724102 26579300 24181214 22303997
4259 22303997 20829434 19696721 18723878 18163188 17793167 17376572 17034863 16798096 16619870
4250 16619870 16648004 16561703 16509916 16394712 16227932 16221559 16390501 16574709 16544535 16467503 16445504
4239 16445504 16618891 16810858 17091081 17208103 17598940 18188458 18298536 18921004 19356612
4230 19356612 19622389 20336371 21167010 21828508 22675156 23526379 24119535 24561476 25124755
4221 25124755 25897593 26498497 27379696 28220180 28824842 29216072 29721454 30298491 30853593
4212 30853593 31754236 32808919 33949146 35282535 36417477 37804680 39300518 40907658
4204 40907658 42136294 43969972 45904794 48580730 51679223 55250915 59099152 64008276
4196 64008276 69974245 77110474 85320773 94526755 104649541 116195454 129676543 145978224
4188 145978224 166254963 192547566 226177181 265889852 304241083 334839434 348190433
4181 348190433 343273842 318154307 278812971 236543882 198603043 171265866 150125786
4174 150125786 133371048 118300114 105725032 95555706 87040710 80059163 74038664
4167 74038664 68494735 63615809 58973717 54971680 51248734 48048841 45358233 43278648
4159 43278648 41191175 39424087 38252669 37004267 35817145 34864033 33936462 33138358 32493355
4150 32493355 31953119 31400565 31072624 30767364 30357783 29821319 28978992 27865545 26449028
4141 26449028 24866012 23716441 22552547 21424182 20659639 19987790 19110965 18362930 17831676
4132 17831676 17374731 16800693 16387031 16004312 15786603 15572716 15308942 14864346 14777363 14456524
4122 14456524 14128988 14083564 14133206 13841727 13641161 13487388 13615273 13468723 13261189 13202799
4112 13202799 13132598 13190155 13173313 13480641 13703633 13649374 13800705 13880734 13982616 13954743
4102 13954743 13958712 14255786 14435022 14931329 15562856 15787801 15866270 15743345 15320071 14679636
4092 14679636 13661402 12984168 12381375 11936657 11675672 11351838 11156728 10963220 10740793
4083 10740793 10502174 10299555 10084686 9931846 9843554 9640355 9598988 9431586 9311942 9283071
4073 9283071 9273330 9140176 8963327 8945570 9132689 9088992 8982084 8774380 8721075 8615132
4063 8615132 8692519 8743228 8624525 8634048 8795389 8856069 8731497 8627896 8777000 9007593
4053 9007593 9333343 9082871 8873730 9112710 9370069 9303859 9381780 9190543 9463991 9620255
4043 9620255 9691628 9740052 9798835 9836871 9845024 9692103 9836999 10183814 10355737 10359999 10239595
4032 10239595 10306979 10171120 10282023 10525014 10468695 10050608 10262523 10492470 10440032 10445262
4022 10445262 10634025 10735697 11309738 11471733 11594086 11930993 12038438 11928963 12074525
4013 12074525 12170095 12013489 12243493 12324147 12375857 12551908 12845211 13070388 13413158 13698053
4003 13698053 13764960 13838073 14008718 14191881 14317792 14498834 14779778 15046474 15402559 15740903
3993 15740903 16485504 17387905 18170398 19299680 20590800 21848867 23383999 24359746 24846563
3984 24846563 25446177 25758212 26080579 26730006 28066875 30193887 33246168 35595961 36897194
3975 36897194 37295747 36461078 34040082 30780458 27911841 25896836 24714584 23851415 23395269
3966 23395269 23184639 23223126 23434481 24031015 25141334 25923699 27020538 28092897 29176685
3957 29176685 30240513 31243441 32789645 35046037 37633011 40053324 41461206 41727418
3949 41727418 40389706 37716538 34157999 31573585 29957947 28625335 27951878 27759898
3941 27759898 27839316 27495553 27358498 27340585 27306007 27423228 27858639 28269919 29122341 29925953
3931 29925953 30453770 30739687 31048145 31327519 32034675 32644404 33695187 34849674 35655404
3922 35655404 36619165 37479573 37866091 38118148 38384078 38560221 38649618 38806161 39318819 39942754
3912 39942754 40710798 41479909 42525430 43670386 45011138 46449351 48056900 49664872
3904 49664872 51249473 53170954 55005764 56807835 58945955 60947711 63172563 65425007
3896 65425007 68258516 71322905 74428893 77735032 80573286 83288304 85690495 88057340
3888 88057340 90732245 93584805 97415693 101812294 107058912 112438398 117164223 120652279
3880 120652279 122239098 122101297 120750195 119632017 119413479 120050080 120803714 122186863 123384291
3871 123384291 124833407 126348864 127442079 128442123 128948619 128727679 127612352 125721498
3863 125721498 123605970 121344815 119262021 117581515 116069020 115247340 115260122 115417842 114582663
3854 114582663 112609635 109320429 104523993 98611506 93067545 88173554 84479888 81673392
3846 81673392 79430458 77660370 75562352 73476913 71168481 68717123 65818987 62863256
3838 62863256 60017842 57377659 55207275 53305507 51469126 49820305 48044012 46189333
3830 46189333 44309060 42504419 40967905 39525736 38716366 37886363 36818277 35828230 34890113
3821 34890113 34014918 33240014 32539061 31852585 31070304 30134848 29316138 28545610 27933232
3812 27933232 26961580 26253089 25761968 25326704 25121989 25142071 25087027 24990400 24846879 24883680
3802 24883680 24744656 24381000 24352505 24369565 24298582 24051768 24045256 23776919 23408067 22909750
3792 22909750 22312376 21923239 21293065 20798953 20575436 20317712 19938431 19777278 19784664 19717427
3782 19717427 19342058 19216297 19330723 19125200 19045349 19158442 19034096 18727733 18517542 18280706
3772 18280706 18257057 18326332 18240713 17970247 17820523 17625932 17157393 16703071 16296617 15979172
3762 15979172 15621004 15113067 14864874 14717313 14520618 14502417 14296405 14054251 14182287 14144859
3752 14144859 14158115 14209440 14232525 14161839 13937397 13863536 14005873 14166258 14262890 14364143
3742 14364143 14644764 14569710 14668956 14915988 15226385 15365386 15766724 16078317 16599842 17399639
3732 17399639 18026023 19010431 20189987 21887927 23980751 25942053 27244549 27826522 27573231
3723 27573231 25957512 23353224 20551797 18462477 16818253 15659606 14793954 14026809
3715 14026809 13430464 13240866 12900161 12479383 12219654 11810266 11742628 11707506 11639960 11471139
3705 11471139 11189213 11123792 11261267 11205626 11259286 11243610 11082167 10792490 10995766 10822865
3695 10822865 10658614 10730346 10847643 10655009 10494445 10462699 10303953 10247747 10204215 10118350
3685 10118350 10328995 10548306 10547941 10436842 10538367 10558959 10891665 11133486 10927286 10891243
3675 10891243 11123167 11316971 11435942 11784551 12204182 12450737 12359948 12234937 12414921 12417894
3665 12417894 12319520 12764322 12760930 12541447 12489006 12650511 12459726 12247894 12282387 12214673
3655 12214673 12030029 12029405 12009362 11640947 11638526 11445944 11306318 11205173 11144953 11382506 11407251
3644 11407251 11452028 11808097 11831627 12045284 12415327 12653310 12959688 13009607 13074572 13294970
3634 13294970 13337944 13286365 13433573 13251078 13076776 13073094 12796978 12545019 12451678 12277928
3624 12277928 12008858 11572653 11270331 11045003 10676716 10252047 10149434 10149222 9905036 9655638
3614 9655638 9524726 9570939 9513018 9598840 9761198 9798096 10059582 9920142 10088573 10167733
3604 10167733 10082587 10319801 10324921 10129772 10222317 10314597 10346588 10497339 10342284 9724062
3594 9724062 9687733 9407956 8947958 8719304 8314727 8081792 7978661 7890310 7678927 7571528
3584 7571528 7445356 7386228 7237048 6922982 6795859 6827668 6744492 6717240 6777910 6909936
3574 6909936 7063575 6946676 6974339 7002590 7212278 6955745 6892498 7041562 6868426 6946779
3564 6946779 6796743 6623621 6592347 6403767 6267940 6244682 6202350 6012633 5910538 5905151
3554 5905151 5797236 5719528 5581759 5539367 5455578 5402464 5452937 5335900 5098606 5139551 5144619
3543 5144619 5069264 5065531 5175210 5136028 5026578 5085512 5079935 4909437 4842798 4881529 5078898
3532 5078898 5112574 5046315 4894475 4815923 4827912 4908742 4921271 4863647 4690779 4744910 4741814
3521 4741814 4941631 4631446 4611062 4709215 4545605 4509598 4364383 4457559 4460166 4310348 4189735
3510 4189735 4197369 4236423 4211825 4037613 4015644 4186408 4034917 4047400 3942976 3940329 3947356
3499 3947356 3858670 3962420 3911830 3763774 3756837 3746058 3822706 3908939 3866615 4034437 3805437
3488 3805437 3675735 3782674 4007211 3867210 3762912 3779867 3875895 4056542 3899244 3973256
3478 3973256 4051061 4110339 4231534 4330993 4378018 4331872 4285773 4314626 4388167 4420552 4294754
3467 4294754 4269192 4263171 4022936 4186173 4263826 4321109 4522519 4581301 4593785 4648401 4700078
3456 4700078 4816328 4873082 4963990 4988607 5169418 5140804 5156017 5442030 5658903 5689538 5749275
3445 5749275 5855524 5990084 6097721 6575566 7202632 7621770 8336090 8631745 8738215 8853286
3435 8853286 8683928 8211924 7519046 6910058 6451056 6378294 6121614 6185894 6174491 6184726
3425 6184726 6276909 6349774 6398082 6331068 6361539 6321218 6357247 6311479 6531054 6678316 6797771
3414 6797771 6986254 7449611 7725347 8142837 8548944 9498901 10601658 11949546 12891985
3405 12891985 13285665 13360691 12602254 11400963 9702424 8513103 7846845 7496076 7075970
3396 7075970 6855793 6675592 6657414 6286793 6355504 6253869 6107438 6124164 6254509 6115470
3386 6115470 5644742 5560552 5581438 5687425 5757649 6091355 6417903 6536770 6767998 6954184
3376 6954184 7395468 7939816 8417830 8676368 8835931 8770838 8352434 7454716 6849777 6355429
3366 6355429 5922016 5665490 5423129 5505494 5490340 5179154 5064801 5053336 4969807 4861609
3356 4861609 4890368 4953398 4738339 4841811 4667536 4807535 4733708 4540126 4568527 4761357
3346 4761357 4668594 4695393 4665577 4749089 4803045 4777448 4892683 4955305 4980246 4944136 4892597
3335 4892597 5102121 5039508 4847639 4794660 4952123 4922582 4898254 4839860 4797189 4742236 4840923
3324 4840923 5098831 5178712 5106103 5221697 5263555 5309692 5217954 5335994 5525933 5652487
3314 5652487 5685086 5899547 6027442 6005326 6383608 6588974 6700478 6889261 7088773 6998739
3304 6998739 6944017 6955248 7134920 7073476 7239220 7482812 7520000 7669465 7783624 7773396
3294 7773396 7844118 8000603 8362496 8700763 8811023 8948651 9038057 9152169 9349190 9669455
3284 9669455 9759732 9704884 10081821 10531236 10741314 11046520 11233660 11639782 12093625 12606335
3274 12606335 13327723 14015466 14635764 15446253 16396182 17360664 18554842 19562597 20955959
3265 20955959 22129662 23419953 24791771 26131471 27315495 28317350 28843489 28845438 28600365
3256 28600365 27925930 26732049 25249154 23668805 21893362 20338594 18943964 17458904
3248 17458904 16319770 15197944 14299224 13197216 12315744 11838627 11169156 10632068 10103037
3239 10103037 9596228 9151591 9108299 8883357 8376288 8092229 7853037 7511573 7296650 7130463
3229 7130463 7034587 6963465 7109585 7112479 6789924 6918563 6769134 6547994 6608657 7037639
3219 7037639 6999891 6906556 6861931 6738912 6679622 6534845 6397889 5959959 5729648 5579297
3209 5579297 5322126 5286030 5295595 5297891 5191143 5051462 4884515 4725902 4731086 4612275 4554294
3198 4554294 4212165 4246749 4376131 4287855 4392008 4329001 4307111 4264881 4171223 4298992 4297658
3187 4297658 4159635 4406424 4630181 4483285 4493652 4660007 4573654 4401906 4276819 4437611
3177 4437611 4480399 4334272 4370527 4274977 4210334 4171311 4077164 3903668 3981982 4005432 3910239
3166 3910239 3756061 3411344 3346479 3411175 3525714 3302708 3232582 3471120 3383456 3375801 3419975
3155 3419975 3432045 3601805 3670258 3549827 3493784 3273864 3248911 3244373 3198806 3246801 3353786
3144 3353786 3308299 3283650 3195133 3188998 3016185 2827082 2892169 2910006 2732496 2861120 2846292
3133 2846292 2772284 2862748 2733619 2784309 2845900 2954510 2997125 3104339 3032199 3036671 3172155
3122 3172155 3416958 3521981 3495881 3431507 3219125 3161753 2995929 2826310 2730032 2750404
3112 2750404 2765632 2641317 2539748 2578492 2538856 2535160 2607743 2570992 2394133 2269232 2396203
3101 2396203 2233424 2132143 2018414 2037121 2036515 2019528 2256481 2322348 2360313 2222460 2197303
3090 2197303 2269957 2411709 2383725 2327504 2115649 2272853 2294724 2222460 2150320 1949763 1849585
3079 1849585 1854371 1676661 1812441 1886728 1866194 1853667 1787921 1817090 1834365 1828121 1512792
3068 1512792 1691220 1789091 1663704 1676640 1766112 1551613 1462500 1489230 1481008 1631715 1475030
3057 1475030 1412696 1437819 1420935 1407926 1438561 1404474 1134474 1414586 1591362 1286155 1331318
3046 1331318 1461327 1440764 1535744 1486762 1400966 1236376 1283352 1292681 1442016 1587242 1327925
3035 1327925 1425121 1535358 1264231 1257828 1332002 1481151 1191844 1223881 1325246 1494188
3025 1494188 1523921 1471727 1371190 1159466 1384578 1311913 1384112 1285538 1251499 1452313 1441076
3014 1441076 1203966 1199680 1475231 1330313 1277860 1383161 1458589 1552657 1579123 1303007 1376064
3003 1376064 1419312 1543755 1417868 1449732 1602380 1565315 1595295 1418588 1346717 1289477 1398864
2992 1398864 1403193 1453021 1555845 1576838 1519377 1666661 1663680 1417678 1468992 1504000 1423528
2981 1423528 1503122 1464151 1493291 1471046 1428595 1356747 1292694 1378723 1620276 1664309 1606578
2970 1606578 1628946 1667404 1614951 1488209 1523981 1505433 1583858 1769906 1696160 1732132 1676091
2959 1676091 1735292 1958517 1776808 1943388 2283591 2280218 2367849 2112598 2057463 2265963
2949 2265963 2320221 2176183 2315662 2521193 2214047 2218739 2176680 2407938 2470718 2378201 2551826
2938 2551826 2604380 2557294 2446227 2300539 2304425 2339696 2298070 2358757 2470746 2350611 2429252
2927 2429252 2624509 2690362 2870599 2745384 3055731 3256451 3305145 3455233 3724977 3739824
2917 3739824 3656065 3484865 3307379 2998750 2501318 2275941 2299525 2325752 2302010 2126307
2907 2126307 1996630 2008862 1928751 1862551 1857275 1731966 1674224 1734017 1778712 1749046 1815901
2896 1815901 1903725 1897337 1826907 1757880 1790539 1854016 1930031 1958204 1901971 1876014 1960380 1778429
2884 1778429 1659606 1637254 1647625 1528115 1298582 1066794 1023164 1173487 1162800 1126883
2874 1126883 1142676 1116739 900103 801527 825983 937056 923566 633995 470344 561352 759838
2863 759838 742779 693595 557076 538299 445770 437337 480213 388190 449277 472571 361197
2852 361197 417153 566570 629409 559799 387404 315766 358941 341199 184487 334232 588842
2841 588842 438924 259368 125731 9195 -107424 55563 312078 253951 119364 210511
2831 210511 144995 220061 338387 312561 408838 210341 178253 367377 364905 230279 253578
2820 253578 270731 131785 405431 280183 237185 173362 204515 230688 274463 210113 72945
2809 72945 94608 98662 322464 387063 352760 264225 72658 120365 342378 464646 313538
2798 313538 152683 43136 -89968 93688 47586 129538 64428 132458 132495 191878 46010
2787 46010 40654 131010 167118 -21860 -130092 137779 145871 238190 174374 -58957 -46769
2776 -46769 -82765 -78575 1687 156835 240059 230144 13247 -28879 112567 -12412 -143860
2765 -143860 -41675 -42426 -32203 102196 -53710 -9950 63628 -31888 60027 69500 -29309 62229
2753 62229 157656 359190 302635 191134 127820 25550 329610 338055 51281 112590 146743
2742 146743 92891 117162 150866 106456 -106269 63836 125826 -64448 -12321 -93545 -61655
2731 -61655 44759 -25334 -150195 -55210 -119336 -230439 -414312 -197585 9618 -129233
2721 -129233 -90181 72099 153696 269888 62031 -100475 12480 147225 182343 56585
2711 56585 107725 111309 39326 -65428 84542 94212 186925 171917 77970 -38196 -293809
2700 -293809 -104316 -21345 80180 165796 121534 85195 -79711 -37806 -62264 -107330 65849
2689 65849 160785 37736 -51356 -55078 -56330 -758 -109408 -95028 224352 80808 -63283
2678 -63283 -223469 -199767 -55964 -75201 181740 -18686 76162 104712 149246 182199 118470
2667 118470 157354 28084 117646 218072 119416 186226 71561 78506 -47569 49521 -93346
2656 -93346 -74372 193608 38988 26075 -12828 20826 30275 -101124 558 -42728 -63568
2645 -63568 -66082 -34848 -14531 93370 283415 48223 -23360 84540 216777 150738 160586
2634 160586 126780 -2772 -161588 -90127 -142568 21281 23295 -34831 -203622 -129785 -22995
2623 -22995 16124 77190 162315 5507 -197074 -204649 -106966 -106802 -58020 -78552 76260 68898
2611 68898 -55488 -116349 -29183 -61717 -161297 -81599 91350 40463 -46458 62055 -35332
2600 -35332 -113424 -75222 29059 -74099 -60566 -102807 -62098 -53085 -82189 -86369 -85033 -75545
2588 -75545 -9686 280436 179756 268877 147505 131482 38083 23897 55318 -24983 -43371
2577 -43371 88197 161719 177672 75594 36369 157012 -35658 -58306 86646 9243 34455
2566 34455 55650 119161 271146 179676 14870 50418 194623 -50174 32979 81111 190861
2555 190861 71011 4107 20419 147605 114680 10087 -257854 -183848 -72522 18669 -91580
2544 -91580 -232613 -169479 -11403 -28341 -51318 -54568 19784 24107 86653 219881 235121 112298
2532 112298 72945 -30166 -107372 -165495 130020 172712 105928 96658 -94322 -123816 -90947
2521 -90947 -59728 167885 112285 208041 244030 92440 50911 -144738 -225984 -127673 -9893
2510 -9893 -20159 55108 -87173 -101610 38717 98400 -292897 -64015 1048 -189476 101233
2499 101233 174865 73332 108875 248260 4824 16188 175148 172744 17917 64174 46570
2488 46570 164745 222868 230735 294339 134849 104038 119465 13488 -51998 -87661 98400
2477 98400 394322 297944 205598 154115 238240 226096 205377 139083 190625 306906 199723
2466 199723 -21242 -99865 -63370 42986 34223 42894 173719 163413 81735 -42870 73773
2455 73773 259835 -36592 78950 40642 102719 175735 206582 148168 214815 379754 405015
2444 405015 400162 228417 221837 158982 34370 123309 35597 -58843 -70659 -168541 1990
2433 1990 48530 1582 158224 80933 63416 -5272 -637 -120434 83095 223793 162856
2422 162856 64382 -144987 -74287 -3809 116056 283157 103475 61730 181394 130385 206284
2411 206284 267908 222209 157394 171109 213476 201871 235331 47443 279953 311401 290528
2400 290528 355860 560246 411455 342963 365006 346421 515390 514854 608929 569414 438213
2389 438213 334190 458024 710165 633650 683107 579679 402906 392627 321394 398248 221651
2378 221651 297390 501708 547587 293227 271736 191399 218830 170586 268224 378627 237995
2367 237995 130988 265793 305841 236765 228564 150587 331048 403655 290958 170399 82963
2356 82963 397212 311560 225531 140113 251969 383025 521949 419782 228402 117352
2346 117352 98960 261280 382692 198332 70296 109494 313721 234167 303455 119579
2336 119579 3213 265242 282358 199515 200659 460825 337920 26575 -92231 77771
2326 77771 105903 -32236 -59344 71911 321981 290476 266966 338516 109969 29199 101334
2315 101334 230610 269667 396923 473171 525892 495469 350051 334656 453470 469230 366327
2304 366327 446141 276186 157892 223282 105448 224686 370173 319470 533507 331330
2294 331330 475057 652246 554808 478486 436165 267262 388601 478130 423600 405588 311614
2283 311614 350054 367965 491659 575557 409816 421744 611147 603531 632168 578325 641543
2272 641543 765341 713126 740957 779655 650591 723390 701769 551549 630971 619995 678752
2261 678752 725049 716078 685220 717514 353875 397432 887293 830892 808605 794725 970189
2250 970189 733462 879343 1003911 800633 746763 958980 870817 878155 919953 1077669 1068600
2239 1068600 789160 817553 956363 965626 1166393 1188506 1280645 1251435 1111200 1156262 1178105
2228 1178105 1144874 1266842 1352768 1227881 1260319 1237946 1464612 1480996 1448028 1529775 1515119
2217 1515119 1647094 1716672 1592301 1520767 1819623 1746740 1745401 1696369 1554384 1491564 1476832
2206 1476832 1525470 1532126 1659861 1708772 1567989 1746059 1900187 1887024 1751172 1812010 1684638
2195 1684638 1630443 1820694 2054415 2052114 2120183 2173573 2028836 2035236 2066648 2145953 2321902
2184 2321902 2224845 2084147 2191017 2327925 2259098 2415777 2407422 2308646 2393604 2675493 2776897
2173 2776897 2923284 2959568 3187517 3137446 3097030 3121697 3306682 3475196 3419377 3593308
2163 3593308 3793714 3930517 4014368 4253884 4321605 4506565 4692296 5085898 5342448 5428618
2153 5428618 5437131 5773577 6116990 6145118 6378773 6709559 7045163 7380780 7647102 8287108
2143 8287108 8743817 9261941 9628289 10404994 11091137 11928086 12882248 13948432 15107678
2134 15107678 16565268 18092627 19931450 21628934 24118812 26625724 30220869 34152121
2126 34152121 39296177 45621953 54899883 66947080 81600946 90484142 95810297 94454175
2118 94454175 86500535 71638641 53372969 42320551 34188726 28897235 24610309 21853015
2110 21853015 19352423 17917767 16531354 15581441 14397944 13832785 13301238 12322683 11036143
2101 11036143 10260619 9364566 8512326 7968618 7538302 6996338 6486228 6024072 6033523 5796764
2091 5796764 5649863 5417209 5176604 4919298 4784887 4581700 4464175 4373313 4186955 3933359
2081 3933359 3910488 3876580 3755976 3399287 3299975 3320769 3147518 2982226 2831841 2797248
2071 2797248 2763491 2525974 2300922 2412965 2511117 2305762 2172945 2086400 2065984 2259290
2061 2259290 2129759 2242873 2121111 1882983 1848075 1824637 1612621 1458295 1462928 1445843
2051 1445843 1474806 1385481 1493168 1654434 1576176 1499932 1359780 1311814 1292374 1354003 1343407
2040 1343407 1189330 1138925 1139514 1183876 1213718 1059818 1252261 1200629 1191706 1194032 981350
2029 981350 893776 1151438 1400228 1107849 954942 963712 1008479 1076526 1168469 1148228 1039187
2018 1039187 959791 896520 892144 1032502 998060 878262 666249 542219 661756 804678
2008 804678 731627 717589 558630 254598 389761 695448 585037 592586 566970 573004 763193
1997 763193 548050 596290 529129 425720 326090 480684 501545 569858 548095 458347 514047
1986 514047 468147 458508 325561 488799 660441 322634 338204 471575 196841 165225 303550
1975 303550 377265 339950 251182 230032 328071 174058 291470 222135 273042 316805 318986
1964 318986 363112 76632 253903 546640 659540 562091 314679 239554 346820 405360
1954 405360 307485 195175 97198 346608 389911 243059 139170 155442 137349 150810 28092
1943 28092 -15210 172372 326265 326061 117537 24291 82139 15860 78559 97289 118826 203311
1931 203311 226336 336792 264978 94116 86353 21761 -18182 48758 140098 460287 231212
1920 231212 256468 185244 392779 357474 379678 189819 -173958 -174642 27232 -33180 70437
1909 70437 283369 238552 41472 115085 250944 194971 -25150 71228 139638 109255 -98180
1898 -98180 -147842 51951 160390 41747 -47472 98673 46144 129310 188754 68064 37940
1887 37940 27188 -200036 -61744 108165 -93675 -47026 -6603 94311 75568 -131745 -49935
1876 -49935 -27286 -7202 111066 -186825 -289339 53183 154911 286484 54508 179622
1866 179622 263672 256726 144724 41549 89681 157747 165735 383282 455944 589894 368134
1855 368134 218718 266974 260337 487403 464672 367398 506248 438823 236218 274409 65112
1844 65112 20761 276462 324683 120530 96872 259033 245383 111260 67823 8389 -99699
1833 -99699 27963 -63193 138551 112716 129337 151763 59988 -142128 -119982 -29978 274535
1822 274535 133906 7504 47866 59212 121080 38328 60961 -96413 -3577 45862 59525
1811 59525 -210026 -210748 -31612 11280 -235439 -147629 80018 149490 286393 153350 -108823
1800 -108823 -67598 -80979 -197665 -94108 -71283 -80909 -97144 103883 93232 -19985 69721
1789 69721 63037 208188 186387 104506 39998 -21394 76957 223105 176948 136168 112115 69469
1777 69469 51402 58203 6134 39529 140057 139167 66278 -49886 -96059 46777 62275 -192573
1765 -192573 28479 99749 -59267 -37668 -266361 -145000 -51601 -122891 -74468 -21110 136063
1754 136063 87197 -266950 -117414 -103791 -131976 -145892 -82328 40937 150447 18113 -80925
1743 -80925 -137674 -85266 -58991 -84053 71720 -26453 -11145 221373 182230 37729 170531
1732 170531 116610 96320 28663 -70572 -77888 -145269 -88002 -45287 -162877 -137684 -23193
1721 -23193 -86646 15977 58732 114264 47614 -131622 -43043 -7679 98402 -313171 -247420
1710 -247420 -32516 -67437 103273 -9071 -21750 -21586 -131947 -21703 65215 -32544 24907
1699 24907 -39077 8642 87640 108449 22536 -192854 -132255 -288759 -185672 3637 160272
1688 160272 -23866 -91977 -57841 55792 -4324 19155 -180047 -140210 59883 -68361 -88623
1677 -88623 -25398 -111088 -202926 -150456 -158727 -34425 -129322 10185 134885 194073 27390
1666 27390 -17070 83741 106751 -86517 -87080 12844 56277 23208 -140419 -70653 73982
1655 73982 -25488 30989 81149 -39007 -214230 -246868 -319085 -427749 -274847 -92447 -71883
1644 -71883 -254253 -223996 -38489 -60195 -163494 -70020 69011 -136019 -46561 166160 107428
1633 107428 -120584 -122275 43406 26716 101971 40988 25617 -25290 -99018 -3778 -205366
1622 -205366 -217288 -167743 -75625 -25945 -131488 -128528 -147038 -47113 76756 -153820 -50324
1611 -50324 -8913 -118259 -91149 -15451 -46635 41802 142316 116243 -32403 -27999 -57414
1600 -57414 -105314 55841 5825 -94948 -123841 -78005 -79943 -19474 -287601 -116115 15891
1589 15891 56707 54199 -1555 -130579 145832 60840 148608 104298 -70403 -167807 25996
1578 25996 258771 -207865 -174330 -243523 -253017 -115229 -73239 -299107 -292633 -125360 -83562
1567 -83562 25590 105010 180440 115954 -79797 -28525 -101564 -47981 -34086 -20545 -154261
1556 -154261 -145258 118876 67964 -22903 -127899 37337 211872 172021 -108706 3554 -26297
1545 -26297 124492 -22522 -150736 -6937 60788 73959 157860 105725 3645 103148 -23622
1534 -23622 35347 58516 -47026 -185772 -125804 -54897 126394 158343 38055 8709 -129893
1523 -129893 110424 136074 -33939 -17083 -41607 -115559 -84357 -18405 19442 -56032 -93621
1512 -93621 53964 95992 -4551 4471 9586 -226712 -301400 -54591 46216 -40084 -145310
1501 -145310 -69486 -120049 -100776 -25425 -154512 53588 789 4326 32505 -82199 -86343
1490 -86343 -189786 -222736 -78261 14687 26602 -72884 -3830 95943 -7075 -12613 -45075
1479 -45075 -34736 60480 -82869 -140474 -15789 156623 -83914 -45958 -204541 -423666 -293085
1468 -293085 -291424 -262411 -118783 -44336 -130719 -222629 -188200 -96296 57783 -52401 -183223
1457 -183223 -93626 -13611 84230 8351 125447 77026 113760 51165 -119593 41599 56958
1446 56958 60613 -20599 233242 187928 112760 -45950 10087 39353 -90839 -93302 -7007 -105522
1434 -105522 -19225 21512 89714 308320 39519 -127860 -129377 61867 46064 -36797 9181
1423 9181 141631 103339 -8180 59219 -204511 -141941 -151366 -316558 -22238 -22191 -174152 -182872
1411 -182872 -89646 -149855 -207899 -106340 -62801 -242001 -188784 -195343 -186666 -132046 -6532
1400 -6532 -216800 -179439 -148978 -16358 -27772 -4120 25540 60796 218805 132009 103033
1389 103033 168687 7918 21620 -77801 -145395 191111 183183 92819 -46120 -118933 -68098
1378 -68098 -13177 139109 97118 66114 -88100 -36831 -16705 29333 239284 -34234 -118406
1367 -118406 104734 117163 70247 49953 31332 -151664 -254708 -173342 -282581 -99518 16858
1356 16858 -26642 10247 44639 -34137 -14784 -82637 181498 102474 31893 51778 44004 33762
1344 33762 -21042 -54441 69153 33850 62221 96989 64953 118205 -10446 -38936 -230651
1333 -230651 -77119 -104222 -48710 -18130 -34417 -101554 -166635 -219226 75688 223620 272050
1322 272050 179887 -35299 -15600 52253 248681 338896 129640 106671 153062 58827 177054
1311 177054 32044 -90645 106050 122299 -24793 -43850 81293 9048 -1630 -35336 40071
1300 40071 -31924 -192614 -50177 -125534 -101000 -8251 -39431 -71415 -134434 -72967 2119
1289 2119 -30337 17405 42835 74773 86394 234736 202242 191121 130826 80181 165550 159052
1277 159052 36595 48340 114436 75370 22223 -24087 -4345 -85125 8186 63569 -18539
1266 -18539 -54870 -111350 87989 -59405 -81129 127782 86054 47113 98310 122209 96332
1255 96332 -71532 -110948 -115129 -105386 -254878 -157793 -26490 -106040 110498 217238 -35227
1244 -35227 35818 -40110 -163008 -147930 -187472 -193259 -9121 -59870 37814 90729 238169
1233 238169 81930 -6822 -112065 -63771 158125 -2249 -96926 -69198 20933 38451 211464
1222 211464 153776 25142 73418 -63961 -215749 -154848 -171416 -54090 50931 81784 -161716
1211 -161716 -78133 19117 20629 -15079 101346 -44449 -53627 -133445 -269027 -240422 -150298
1200 -150298 42772 254472 210742 144271 53428 95541 100133 149908 77445 129476 156617
1189 156617 144520 162623 91848 57907 -50426 -90182 -59298 -112597 -40323 -81397 -108830
1178 -108830 -95315 -232731 -239565 -134658 -159784 -36995 -29822 78811 204483 126011 241915
1167 241915 165022 98925 48724 -92920 -128420 -32073 -9562 225553 287283 101670 -73068
1156 -73068 -32705 41122 37647 7837 85065 105565 -48780 -81364 7258 81698 24527 49653
1144 49653 64853 44356 21857 26153 21040 -31090 46116 71922 58885 -120761 -126011 -126103 45548
1131 45548 83196 -125046 -199232 -81786 45458 -46316 -53227 -55923 56467 127436 7980
1120 7980 -141935 -97955 -135890 -43863 143482 16625 -39659 171687 217691 -12765 49550
1109 49550 -60010 87601 139598 52280 96634 174250 1588 17308 265020 63197 -209055
1098 -209055 -59333 92965 218499 137701 169483 293372 -9935 -53850 -179263 -50254
1088 -50254 92647 -40850 49972 239952 164710 5330 -94464 -107100 -126604 -140153 -120517
1077 -120517 -162537 -63140 37534 74686 45861 125993 92598 -20276 106483 325462 294837
1066 294837 144941 56454 86128 -26732 23145 -39622 16518 277886 165955 18262 -37456
1055 -37456 72229 -33617 -178615 -41399 61505 82054 21463 -143170 59818 26279
1045 26279 -262038 -198387 -96641 -122784 -37067 -72054 -62271 74715 43780 42763 155068
1034 155068 36448 -115571 -52132 -2877 32952 66533 75558 71249 -81813 105605 180763
1023 180763 17417 -57643 61308 -130031 -95365 43069 -73494 70948 125357 111034
1013 111034 -26964 -117249 32794 30979 162004 10958 -192583 47491 195431 55650
1003 55650 8104 -86670 -216843 -26494 -18645 28603 269375 122167 93247 -21092 -117788
992 -117788 -179104 -44244 49632 -122725 -64253 -122615 31922 88667 -117500 -261137 -102135
981 -102135 5072 64108 -13434 -207481 -213807 53890 48809 15132 108 -144406 6469
970 6469 303622 243368 156908 -123373 70198 104669 59534 60481 95467 320766 380366 226296
958 226296 -39972 -92956 50140 -145793 -111995 -83321 -156645 47814 77227 33204 31099
947 31099 -921 -190666 -39305 -47730 39922 -66142 -135706 -46725 -129448 -309654 -219358
936 -219358 37064 8764 1965 157165 132793 -29687 -192996 -307279 -148737 -150463 -343359
925 -343359 -233654 -291417 -406003 -271376 -8548 161668 -11527 -66571 16656 109810 50007
914 50007 -36876 -67202 -53670 98706 261352 105920 -98044 1637 -178280 -126326 -83180
903 -83180 11599 -125042 41341 186055 99457 100779 237052 419922 235233 294028 99745
892 99745 48939 135379 74128 124873 -29233 -124996 68298 176522 76785 94960 26671
881 26671 13816 57802 -174730 -257216 -248714 -154747 -58508 -41298 11829 -51287 -249565 -181603
869 -181603 29072 -156454 -418862 -201929 -115163 -186559 -125157 -44578 -99262 -240513 -107849
858 -107849 -72042 -125679 93289 130003 82283 7225 -7767 -109670 -126340 -58852 -89313
847 -89313 40130 19951 9356 83829 15548 -2100 49492 53199 -78958 -11099 46736 6992
835 6992 -169805 -280036 -290916 -125382 -46882 -113388 -23009 -219077 -359522 -296955 -12161
824 -12161 171300 81923 -49469 -161150 -16423 -113649 -202393 -223108 -275166 -44141 32135
813 32135 -49434 -196752 -202146 -113791 -46715 -150391 -232213 -72992 97544 51174 -31873
802 -31873 -205020 -263473 -65990 -109396 -54654 130161 -95735 95136 156069 54434 45563
791 45563 44099 67078 -36335 -5424 -36139 -263324 -252286 -284571 -53004 42956 59839 194139
779 194139 229180 174216 186568 197556 -16739 -31928 -82761 -156467 -16825 300264 372241
768 372241 145778 -6800 -134204 -353321 -372352 -223212 -58920 11663 -120477 4828
758 4828 34057 121309 188664 209110 260429 -67681 -21076 97288 -58250 -22723 212179
747 212179 -31504 -51972 -167572 -152999 -116477 -194436 -144713 -158782 -148235 41022 78228
736 78228 -158669 -109072 100970 139341 103729 31147 -3194 -181938 1125 87663 -15810
725 -15810 -32288 9228 52894 155673 13222 78573 36130 16369 40906 -70190 -134834
714 -134834 -235218 -28581 173504 -34645 23428 190829 175913 291140 48044 112548
704 112548 149795 135145 210682 -7445 -153595 -152656 -143355 57235 -62913 -140687 -113963 57860
692 57860 -10850 -24561 -13486 183036 149018 -126374 -197677 -247397 -131752 -105293 147211
681 147211 146334 -88507 -120029 -97005 82297 62684 -20262 125447 174007 162195 147951 283561
669 283561 217061 -61839 -70554 111390 -49863 78171 102098 -99778 -9888 110731 180228
658 180228 -31410 2421 212265 76439 13160 25009 -285706 -147383 -70795 -59491 46182
647 46182 156675 42093 -50333 -28159 12635 -256216 -739 -119593 -34296 -14269 -113593
636 -113593 -74583 -107234 -312804 -238372 90495 56754 -69494 -168846 -209249 -95828 -56112
625 -56112 -53891 -7155 -114521 80678 194736 93245 62526 -1793 -47513 208413 37276
614 37276 -51452 -304748 -137331 -158903 64802 148258 78564 -130813 -220183 -159489 1387
603 1387 -155221 -252652 -127744 -51791 -53249 -230151 -349151 -167783 23360 132762 236732
592 236732 148936 -39676 -135983 -166503 -225044 -115594 -78681 -60850 -12191 -39574 -198387
581 -198387 218271 207483 20866 -17482 -30254 96216 -33625 -30395 -189381 -92841 -31563
570 -31563 -53914 14991 -121648 -71840 -19967 -31671 67425 32263 -52025 -62661 -256274 -192836
558 -192836 89213 234117 174073 -78655 -138256 -181985 -50948 137854 9683 -184195
548 -184195 114795 176704 160320 58984 8278 162296 -34072 24535 -2807 132040 235344
537 235344 88050 -90459 196604 121184 -113732 -180753 -178448 -149204 -44297 -102727 -170478
526 -170478 236779 415066 205240 -6542 73498 103315 21783 -157274 -34346 97073
516 97073 23216 -56865 -124048 -66421 -206246 -239804 6288 149883 90789 176167 63369
505 63369 -56667 -76898 7974 -62411 -87657 142500 209736 89276 259113 189152 -92693
494 -92693 -85080 -199605 -33550 129041 80470 -171317 -182426 78735 430265 421317 237720
483 237720 130306 -24431 -192381 -56719 30096 -58840 -72921 23333 130101 -204211 -33871
472 -33871 -21283 -87190 -35434 18432 72982 64576 104471 -36611 -221943 -160185 -84981 66508
460 66508 -53752 -100292 -68619 -118917 -82177 43617 239999 128267 118731 81979 191053
449 191053 179136 149426 -10396 142230 -11699 -66443 41502 -40065 61116 49950 113165
438 113165 155217 33455 28435 61699 -99032 -129393 -113962 38990 349780 217291 204780
427 204780 152070 95962 186848 116135 22554 -19877 -154799 -95249 42256 130712 250867
416 250867 259740 65228 -29739 138257 227552 241361 157841 176898 46863 68026 29352
405 29352 146547 -86066 -232320 -133928 -54961 -164273 -162977 -266565 -129200 -17083 9596
394 9596 110369 -36975 -78144 -88695 -265346 -262033 -234443 -201903 -100559 -154678 86232
383 86232 100211 87956 -33447 -78433 -158217 -184791 -46169 -91692 5840 126564 -125191
372 -125191 -29282 -92690 -80079 -111929 -186166 -37344 -80775 7053 13458 -35973 -117435 1230
360 1230 -41224 -166854 114771 106291 94026 88809 83225 142548 -141174 -280955 -152193 -165063
348 -165063 -198999 9973 20504 -16150 -62980 -65317 31138 -63298 -77377 -18196 -99105 -199902
336 -199902 22108 -58186 -141659 -170258 -163597 -191947 -237753 -168490 -177951 -76224 52321 18695
324 18695 -91881 -215191 -70656 21735 -18521 89790 -83517 8082 -40881 -19304 -28137
313 -28137 -139562 -54612 -111181 52549 11774 -59057 -29030 24098 -112387 -230712 -177620
302 -177620 -73120 -60044 43401 38486 61039 4949 -93679 33236 -180673 -175406 5180
291 5180 -2470 120193 133681 -641 50644 202532 125731 -213968 -159574 -76908 -124510 -152451
279 -152451 -205505 -50880 75999 54401 -7770 128317 272911 172024 186296 62217 -12820
268 -12820 -131511 -166618 109763 -6643 -172391 51949 13215 112582 22950 -190106 -209114
257 -209114 -186950 -339969 -295457 -66558 26748 -29212 30251 -22593 23463 -53283 -49488 -107780
245 -107780 -35652 -2063 -157708 -27153 250878 6465 -385422 -47491 41969 -13099 -35115
234 -35115 -138162 -6084 214258 177774 84299 68095 38942 184929 74307 -25338 125332
223 125332 27496 -36181 -10477 -81058 -203696 -35702 -169756 -352816 -374396 -161536 -197714
212 -197714 -147530 -131544 -138353 -132415 -241951 -110343 -60059 -204707 -87458 -42404 -121360
201 -121360 -92824 -256138 -220097 -182324 -114200 -26254 53819 -149895 40566 -32967 -42864
190 -42864 141871 91753 59710 11840 136175 -6841 -73994 -213672 -107256 -189171 -141386
179 -141386 -140260 -33379 28310 -79653 -52774 39244 -71310 -150633 -74947 -13533 -34927
168 -34927 -62114 -62783 42963 35347 42115 39775 -96934 -81728 -94731 -25673 167930 187998
156 187998 196618 289026 296935 165569 51486 85007 89764 -130479 -90781 53091 -130430
145 -130430 -194453 -72676 155146 101487 58397 -9087 -145385 21727 177695 78886 -82328
134 -82328 -67481 7379 -38071 -16282 66444 169120 88760 -34951 -140477 -156748 -199605
123 -199605 -171716 -61564 -55136 19355 9435 -2868 -120850 -193713 -95414 -206807 -191351 -105744
111 -105744 -59083 -205596 -166675 -150234 -2517 35527 -99988 -66679 47007 29939 -36087
100 -36087 -3364 121078 50945 30557 196661 -36657 16736 29201 5194 99716 -46942
89 -46942 -61799 -29868 -76706 8203 -49528 6572 -70927 -140779 -1847 34920 -62630 13208
77 13208 -91071 -53211 18587 -32542 130100 47914 61062 -24647 -14841 -134166 -97678 152687
65 152687 146577 101958 105146 18749 -19894 55270 134905 24786 -39650 84545 1852 -72497
53 -72497 31001 53398 -10301 -95634 -72167 -81347 43766 44508 -60732 -165178 -59495 -41143
41 -41143 -106921 -127571 -57118 -31856 -99783 -93076 -42993 -164641 -171850 -76416 -81678 52375
29 52375 7381 -94403 -98444 -40784 1694 122081 74172 15756 72120 92495 99557 11085
17 11085 -45173 100389 34667 192 54400 -8735 -21514 20175 -250239 -180236 14059 -31402
5 -31402 -80263 36425 86833 7326 102088
0 102088
$$ Imaginary data points
##PAGE= N=2
##DATA TABLE= (X++(I..I)), XYDATA
16383 -1155196 -1026706 -1115103 -1129504 -1322200 -1065790 -890036 -762981 -882968 -942361 -927864
16373 -927864 -799119 -841431 -917835 -947425 -871210 -772344 -746483 -764619 -805071 -731464 -753142
16362 -753142 -787028 -631928 -572406 -721331 -660406 -572065 -621547 -663166 -662803 -668195 -537036
16351 -537036 -361840 -340097 -340002 -270113 -358715 -252964 -291837 -370004 -253654 -245627 -188726 -144965
16339 -144965 -217282 -179179 -135440 -50621 -68301 61831 64260 -88178 -56167 150020 137582
16328 137582 236197 243714 232101 280699 245658 190254 164781 134863 222336 171697 155619 257367
16316 257367 442443 441668 464611 432419 459274 447922 474702 272749 249329 372114 464119
16305 464119 765694 818905 747750 651109 720804 707379 735158 605950 500587 744494 744029
16294 744029 694167 794822 720418 679414 738638 867917 698029 763824 838855 904267 1029057
16283 1029057 1141051 1112695 1269616 1092454 966532 1028996 1008654 991130 1095627 1053250
16273 1053250 893832 1028801 1176107 1187050 1148955 899696 1012519 1154512 1103124 1241829
16263 1241829 1342288 1334331 1296784 1122059 1267970 1364085 1395555 1432885 1470289 1466155 1410060
16252 1410060 1580363 1520192 1363479 1258372 1240250 1299986 1560008 1626026 1555257 1567962
16242 1567962 1557749 1592238 1686138 1617287 1617839 1443774 1500102 1595206 1848353 1957067 1823183
16231 1823183 1722688 1680244 1858656 1808409 1745742 1834106 1848217 1786701 1718196 1729032 1755752
16220 1755752 1669692 1820775 1760435 1703652 1807478 1841697 1886467 1977934 2093610 1924267
16210 1924267 1984676 1916616 2105812 2013024 2170876 2133775 2039266 1960365 1930621 2060871 2109891
16199 2109891 1936830 1783090 1788794 2131561 2094360 1985240 2026103 2015760 2098388 2187168 2321709
16188 2321709 2206851 2188826 2150506 2238666 2194820 2083093 2130261 2294868 2076953 1940456
16178 1940456 1906304 2021712 2129781 2102802 2130412 2312732 2024123 1946130 2029347 2118218
16168 2118218 2238988 2296204 2386217 2468630 2416174 2347008 2314295 2422082 2365441 2197244 2159500
16157 2159500 2246024 2265540 2278411 2172539 2266121 2289305 2213683 2304698 2581852 2470510 2305510
16146 2305510 2223948 2169897 2378148 2299393 2337109 2444121 2374656 2342677 2368482 2458391 2310926
16135 2310926 2437781 2413945 2365712 2320865 2398299 2396094 2214656 2094105 2225837 2436502
16125 2436502 2497585 2393553 2310286 2567688 2711543 2498751 2447706 2402427 2484681 2553057
16115 2553057 2430827 2421414 2295772 2416277 2376962 2377768 2577271 2510297 2429423 2503975 2495732
16104 2495732 2597628 2615452 2502329 2534868 2669276 2644596 2496744 2345207 2193998 2244403
16094 2244403 2355992 2417932 2437540 2337823 2491884 2325556 2488587 2566366 2614338 2576163
16084 2576163 2477014 2535490 2611749 2409262 2495934 2656149 2460173 2228831 2416695 2413182
16074 2413182 2381567 2509735 2577821 2562816 2756042 2581482 2502790 2420839 2289924 2254513
16064 2254513 2401129 2574077 2646901 2554971 2772512 2785733 2525566 2626929 2671543 2659435
16054 2659435 2484432 2419565 2606178 2847473 2677959 2678217 2773897 2666521 2551177 2559507 2774249
16043 2774249 2656995 2459592 2581191 2781935 2621671 2580591 2625553 2439559 2617201 2563245
16033 2563245 2556238 2455979 2602694 2813481 2652285 2571103 2828709 2672568 2465560 2509451
16023 2509451 2534728 2553807 2629869 2542118 2653476 2431812 2322120 2582053 2870554 2782939
16013 2782939 2617342 2387480 2571711 2668237 2579661 2616247 2448932 2428676 2502151 2499346 2642548
16002 2642548 2420488 2302627 2639266 2531411 2606827 2546678 2544445 2576121 2485225 2398600 2442464
15991 2442464 2670419 2672828 2686428 2429561 2448072 2548404 2560672 2567356 2594990 2788144 2696881
15980 2696881 2607337 2600481 2578416 2639423 2627323 2576735 2684690 2627063 2505309 2352428 2404487
15969 2404487 2374812 2378017 2552554 2449712 2523819 2610457 2535912 2482688 2395792 2640140 2621779
15958 2621779 2612910 2460884 2622581 2570813 2438000 2622159 2809714 2717632 2650276 2673951
15948 2673951 2444512 2546427 2531738 2519924 2422590 2398590 2530296 2533071 2409063 2465343 2397465
15937 2397465 2509163 2539778 2515971 2685955 2636325 2542142 2406572 2288210 2289279 2342085 2520583
15926 2520583 2630064 2649199 2750521 2780140 2606277 2395163 2694542 2584796 2501261 2492209
15916 2492209 2485728 2524241 2503964 2408455 2473448 2634385 2536549 2776918 2655526 2649317 2778552
15905 2778552 2729952 2590085 2688185 2791106 2697699 2410462 2488948 2617018 2544364 2369429
15895 2369429 2452522 2539621 2572634 2449203 2466623 2490921 2357413 2644110 2564410 2434926
15885 2434926 2387220 2560579 2568465 2420099 2588124 2571625 2416977 2332075 2299629 2582433
15875 2582433 2740099 2669020 2685775 2628417 2612884 2505036 2378329 2474032 2547104 2549082 2360882
15864 2360882 2444885 2514637 2489984 2370920 2523870 2515913 2361054 2445013 2376710 2346215 2584095
15853 2584095 2565056 2585531 2548536 2526425 2467654 2551054 2592266 2440782 2683778 2786238 2922236
15842 2922236 2643564 2510447 2565625 2254422 2492294 2411281 2400062 2611863 2679540 2603750
15832 2603750 2530243 2523462 2343229 2434756 2366982 2553604 2633922 2671337 2623436 2425886 2414102
15821 2414102 2663865 2644981 2590515 2651233 2662620 2763675 2705321 2616601 2632954 2673591 2746295
15810 2746295 2761195 2778002 2612396 2624408 2714922 2774773 2682260 2741726 2781044 2468577 2544502
15799 2544502 2633850 2751701 2666681 2478152 2605564 2616801 2506335 2632375 2618867 2659924
15789 2659924 2739483 2753976 2744059 2653127 2695645 2715778 2556111 2699848 2851344 2734389 2512867
15778 2512867 2340863 2566072 2515122 2357354 2581787 2621301 2734257 2579395 2495538 2611258
15768 2611258 2481867 2605261 2672463 2577313 2523174 2570100 2636415 2565167 2660993 2454839 2439233
15757 2439233 2574858 2767610 2781872 2685612 2704368 2709974 2741291 2768795 2843010 2696967 2639925
15746 2639925 2547339 2532390 2758244 2824035 2802177 2669683 2684338 2759424 2632672 2850864
15736 2850864 2857841 2673875 2743078 2766007 2622133 2565465 2451712 2673736 2681958 2638432 2637183
15725 2637183 2603886 2415237 2613677 2851372 2673430 2629301 2524693 2662823 2830447 2812564
15715 2812564 2956206 2943521 2667105 2632677 2510685 2669269 2575342 2613541 2582753 2632017
15705 2632017 2724371 2486431 2488328 2562079 2639115 2804344 2863804 2830584 2932431 2839045 2644306
15694 2644306 2509096 2624976 2500432 2495612 2491314 2537266 2500552 2462437 2494388 2438054 2490853
15683 2490853 2692716 2496030 2555257 2722166 2671485 2680002 2700968 2646790 2715334 2939673 2923024
15672 2923024 2668908 2544463 2463745 2718301 2819744 2852297 2725085 2428390 2614373 2677988
15662 2677988 2535717 2594863 2570788 2722218 2634791 2684284 2759456 2781147 2797315 2637081 2658902
15651 2658902 2664702 2394016 2562773 2759561 2775183 2744761 2467330 2608311 2568971 2554129
15641 2554129 2625984 2743854 2673596 2530932 2581853 2693532 2674321 2778069 2678947 2642079
15631 2642079 2574052 2668129 2803094 2888596 2822133 2912371 2695156 2649606 2597168 2637371 2718885
15620 2718885 2719967 2643523 2568047 2663705 2707101 2603142 2585182 2421816 2442036 2498476 2649245
15609 2649245 2613449 2524624 2601878 2658589 2677461 2720106 2557974 2512843 2447556 2564123 2567589
15598 2567589 2582518 2819812 2698878 2669444 2581660 2652438 2682960 2607148 2743522 2803289 2889716
15587 2889716 2888455 2723709 2732476 2641825 2693588 2854378 2729684 2515479 2536746 2650686 2593594
15576 2593594 2669539 2770676 2740207 2825800 2812041 2643757 2663364 2798195 2755735 2708971 2751262
15565 2751262 2817177 2668179 2683906 2637988 2435540 2364345 2591870 2667776 2564135 2642846
15555 2642846 2667290 2417209 2338907 2540692 2514620 2587691 2678339 2786008 2829844 2707769
15545 2707769 2842176 2685981 2453982 2474438 2692102 2550367 2750122 2722687 2747395 2741514
15535 2741514 2840031 2675014 2518309 2740525 2712762 2706565 2595393 2671944 2778101 2840312
15525 2840312 2719241 2690118 2722367 2484862 2586489 2470684 2603383 2659169 2671159 2678870
15515 2678870 2740558 2695583 2632908 2763235 2811627 2845754 2676733 2658149 2571096 2576749 2737361
15504 2737361 2743295 2640652 2791694 2742649 2464732 2598088 2670688 2804581 2747200 2734986
15494 2734986 2862548 2666647 2652934 2687903 2718020 2637504 2697942 2925929 2788670 2694891
15484 2694891 2659019 2701708 2698895 2666882 2606667 2681993 2879687 2610613 2603352 2706822 2847766
15473 2847766 2851524 2721434 2651586 2591588 2805830 2948935 2652098 2673727 2773677 2706373 2739993
15462 2739993 2677026 2672972 2715353 2521325 2496771 2513598 2548016 2547695 2620047 2567209 2613375 2635685
15450 2635685 2656830 2721320 2532160 2618171 2700797 2577671 2472871 2472486 2632456 2746731 2776612
15439 2776612 2680661 2601453 2593527 2718185 2815467 2864808 2966799 2782852 2500681 2565599 2710234
15428 2710234 2765934 2629234 2834259 2794706 2797697 2792408 2728881 2850048 2860384 2765499 2426151
15417 2426151 2575011 2695462 2736921 2809999 2798013 2704490 2720189 2771896 2642848 2723791 2926411
15406 2926411 2616378 2442514 2579004 2632172 2832815 2754051 2810064 2829849 2761179 2794803
15396 2794803 2788722 2649576 2621955 2755637 3001655 2810979 2787131 2764901 2709350 2815168
15386 2815168 2757594 2917690 2814408 2791472 2889248 2793623 2817521 2823900 2837605 2829041 2789180
15375 2789180 2709127 2589690 2363529 2458251 2587464 2637287 2790554 2746706 2721716 2713230 2885356
15364 2885356 2779760 2670111 2691615 2643552 2616091 2840954 2739985 2725083 2825080 2634973
15354 2634973 2528387 2756498 2907888 3048947 3202733 3272811 2934238 2803218 2705351 2617743
15344 2617743 2631201 2680832 2689930 2708996 2648742 2706311 2649694 2541618 2697747 2462067 2618373
15333 2618373 2581768 2587497 2637156 2665953 2741779 2610412 2651345 2912885 2847575 2650006 2572328
15322 2572328 2602632 2731662 2774342 2755554 2670483 2752758 2725516 2589581 2668241 2664915 2819840
15311 2819840 2724531 2607444 2775876 2774871 2645007 2535780 2705137 3008166 2977835 2764760
15301 2764760 2697074 2711415 2752616 2932133 2929523 2943840 2917906 2666468 2789868 2701463 2900678
15290 2900678 2977032 2828521 2664541 2638899 2818525 2869092 2923083 2868582 2908804 2987945 2801282
15279 2801282 2830755 2770470 2841460 2651605 2665894 2746491 2615390 2705746 2643736 2739903 2806112
15268 2806112 2811705 2710622 2799661 2915893 2870808 2988767 2890854 2815799 2767421 2879211 2708550
15257 2708550 2609141 2722269 2676705 2606430 2582345 2595886 2612856 2647230 2788320 3010656 2990350
15246 2990350 2985297 2842410 2979158 2840175 2750579 2816860 2730409 2721867 2863007 2851831 2869055
15235 2869055 3105726 2965018 2888995 2868186 2835338 2873220 2866251 2833070 2808026 2681108 2660928
15224 2660928 2758350 2842662 2904889 2588041 2732211 2948906 2814627 2644750 2550984 2576570
$$ [...]
##END NTUPLES=NMR SPECTRUM
##END=
