##TITLE=1H_EC-3265(III-17)
 CDCl3
 8 sc, 
 15.02.2022
##JCAMPDX= 6.0         $$ Bruker NMR JCAMP-DX V2.0
##DATA TYPE= NMR SPECTRUM
##DATA CLASS= NTUPLES
##ORIGIN= UXNMR, Bruker Analytische Messtechnik GmbH
##OWNER= root
$$ XWIN-NMR		Version 3.5
$$ Tue Feb 15 10:22:47 2022 Russian Standard Time (UT+4h)  she@DPX200
##.OBSERVE FREQUENCY= 200.131346
##.OBSERVE NUCLEUS= ^1H
##.ACQUISITION MODE= SIMULTANEOUS
##.ACQUISITION SCHEME= undefined
##.AVERAGES= 24
##.DIGITISER RES= 18
##SPECTROMETER/DATA SYSTEM= spect
##.PULSE SEQUENCE= zg30
##.SOLVENT NAME= CDCl3
##.SHIFT REFERENCE= (INTERNAL, CDCl3, 0, 15.716)
##AUDIT TRAIL= $$ (NUMBER, WHEN, WHO, WHERE, WHAT)
$$ ##TITLE= Audit trail, XWIN-NMR		Version 3.5
$$ ##JCAMPDX= 5.01
$$ ##ORIGIN= Bruker BioSpin GmbH
$$ ##OWNER= she
$$ F:/spectra/data/she/nmr/H-F/1/pdata/1/auditp.txt
$$ ##AUDIT TRAIL=  $$ (NUMBER, WHEN, WHO, WHERE, WHAT)
(   1,<2022-02-15 10:20:56.85 +0400>,<she>,<DPX200>,
      <created by zg, POWCHK disabled, PULCHK disabled
       configuration hash MD5:
       00 E9 B6 7A A2 85 ED C7 34 08 36 98 17 FE 4E 26
       data hash MD5: 16K
       94 B9 6D 1E FB C4 FE C5 06 51 24 16 55 6C BB 69>)
(   2,<2022-02-15 10:21:00.46 +0400>,<she>,<DPX200>,
      <Start of raw data processing
       efp BC_mod = 2 LB = 0.24 FT_mod = 6 PKNL = 1 PHC0 = -16327.09 PHC1 = 35.40078 SI = 16K 
       data hash MD5: 16K
       97 3D 38 5C F2 D4 CE 14 E2 9D D9 EE D9 C1 33 C0>)
(   3,<2022-02-15 10:21:26.56 +0400>,<she>,<DPX200>,
      <pk PHC0 = 101.5521 PHC1 = -28.8 
       data hash MD5: 16K
       DC AE 19 90 7E 5C CD FC DD 7D 09 B8 D1 7F BF AF>)
(   4,<2022-02-15 10:21:31.34 +0400>,<she>,<DPX200>,
      <abs ABSG = 5 
       data hash MD5: 16K
       95 10 CB 8F 3D 25 CE BF 54 BC 1C D8 90 86 DC 95>)
$$ ##END=
$$ 
$$ hash MD5
$$ 97 AC 5A 9F 94 B9 E6 D8 47 BC C1 33 7F F3 B8 EC
##$RELAX= 
##$RELAX= 
##$RELAX= 
##$RELAX= 
##$RELAX= 
##$RELAX= 
$$ Bruker specific parameters
$$ --------------------------
##$DU= <F:/spectra>
##$EXPNO= 1
##$NAME= <H-F>
##$PROCNO= 1
##$TYPE= <nmr>
##$USER= <she>
##$AMP= (0..31)
100 100 100 100 100 100 100 100 100 100 100 100 100 100 100 100 100 100 
100 100 100 100 100 100 100 100 100 100 100 100 100 100 
##$AQSEQ= 0
##$AQ_mod= 1
##$AUNM= <au_zg>
##$AUTOPOS= <>
##$BF1= 200.13
##$BF2= 200.13
##$BF3= 200.13
##$BF4= 200.13
##$BF5= 200.13
##$BF6= 200.13
##$BF7= 200.13
##$BF8= 200.13
##$BYTORDA= 1
##$CFDGTYP= 0
##$CFRGTYP= 5
##$CHEMSTR= <none>
##$CNST= (0..31)
1 1 145 1 1 1 1 1 1 1 1 1 1 1 1 1 1 1 1 1 1 1 1 1 1 1 1 1 1 1 1 1 
##$CPDPRG= <>
##$CPDPRG1= <>
##$CPDPRG2= <>
##$CPDPRG3= <>
##$CPDPRG4= <mlev>
##$CPDPRG5= <mlev>
##$CPDPRG6= <mlev>
##$CPDPRG7= <mlev>
##$CPDPRG8= <mlev>
##$CPDPRGB= <>
##$CPDPRGT= <>
##$D= (0..31)
0 1.2 0 0 0 0 0 0 0 0.06 0 0.03 0 0 0 0 0.0002 0 0 0 0 0 0 0 0 0 0 0 0 
0 0 0 
##$DATE= 1644906056
##$DBL= (0..7)
120 120 120 120 120 120 120 120 
##$DBP= (0..7)
150 150 150 150 150 150 150 150 
##$DBP07= 0
##$DBPNAM0= <>
##$DBPNAM1= <>
##$DBPNAM2= <>
##$DBPNAM3= <>
##$DBPNAM4= <>
$$ [...]
##$SUBNAM2= <"">
##$SUBNAM3= <"">
##$SUBNAM4= <"">
##$SUBNAM5= <"">
##$SUBNAM6= <"">
##$SUBNAM7= <"">
##$SUBNAM8= <"">
##$SUBNAM9= <"">
##$SW= 18.0517287032376
##$SWIBOX= (0..15)
0 0 2 0 0 0 0 0 0 0 0 0 0 0 0 0 
##$SW_h= 3612.71676300578
##$TD= 16384
##$TD0= 1
##$TE= 0
##$TE2= 300
##$TE3= 300
##$TEG= 300
##$TL= (0..7)
0 120 120 120 120 120 120 120 
##$TP= (0..7)
150 150 150 150 150 150 150 150 
##$TP07= 0
##$TPNAME0= <>
##$TPNAME1= <>
##$TPNAME2= <>
##$TPNAME3= <>
##$TPNAME4= <>
##$TPNAME5= <>
##$TPNAME6= <>
##$TPNAME7= <>
##$TPOAL= (0..7)
0.5 0.5 0.5 0.5 0.5 0.5 0.5 0.5 
##$TPOFFS= (0..7)
0 0 0 0 0 0 0 0 
##$TUNHIN= 0
##$TUNHOUT= 0
##$TUNXOUT= 0
##$USERA1= <user>
##$USERA2= <user>
##$USERA3= <user>
##$USERA4= <user>
##$USERA5= <user>
##$V9= 5
##$VALIST= <valist>
##$VCLIST= <CCCCCCCCCCCCCCC>
##$VD= 0
##$VDLIST= <DDDDDDDDDDDDDDD>
##$VPLIST= <PPPPPPPPPPPPPPP>
##$VTLIST= <TTTTTTTTTTTTTTT>
##$WBST= 1024
##$WBSW= 4
##$XGAIN= (0..3)
0 0 0 0 
##$XL= 0
##$YL= 0
##$YMAX_a= 399977
##$YMIN_a= -641358
##$ZGOPTNS= <>
##$ZL1= 120
##$ZL2= 120
##$ZL3= 120
##$ZL4= 120
##$ABSF1= 15.70079
##$ABSF2= -2.351059
##$ABSG= 5
##$ABSL= 3
##$ALPHA= 0
##$AQORDER= 0
##$ASSFAC= 0
##$ASSFACI= 0
##$ASSFACX= 0
##$ASSWID= 0
##$AUNMP= <proc_1d>
##$AZFE= 0.1
##$AZFW= 0.1
##$BCFW= 0
##$BC_mod= 2
##$BYTORDP= 0
##$COROFFS= 0
##$CY= -3
##$DATMOD= 1
##$DC= 0
##$DFILT= <>
##$DTYPP= 0
##$F1P= 0
##$F2P= 0
##$FCOR= 1
##$FTSIZE= 16384
##$FT_mod= 6
##$GAMMA= 0
##$GB= 0
##$INTBC= 1
##$INTSCL= 0
##$ISEN= 128
##$LB= 0.24
##$LEV0= 0
##$LPBIN= 0
##$MAXI= 10000
##$MC2= 0
##$MEAN= 0
##$ME_mod= 0
##$MI= 1.114404
##$NCOEF= 0
##$NC_proc= -5
##$NLEV= 6
##$NOISF1= 3.799351
##$NOISF2= 2.8
##$NSP= 0
##$NTH_PI= 0
##$NZP= 0
##$OFFSET= 15.71604
##$PC= 1
##$PHC0= -16225.54
##$PHC1= 6.60078
##$PH_mod= 1
##$PKNL= yes
##$PPARMOD= 0
##$PSCAL= 0
##$PSIGN= 0
##$REVERSE= no
##$SF= 200.130007108348
##$SI= 16384
##$SIGF1= 3
##$SIGF2= 2
##$SINO= 5.538805
##$SIOLD= 16384
##$SREGLST= <1H.CDCl3>
##$SSB= 0
##$STSI= 16384
##$STSR= 0
##$SW_p= 3612.71676300578
##$SYMM= 0
##$S_DEV= 0
##$TDeff= 16384
##$TDoff= 0
##$TI= <>
##$TILT= no
##$TM1= 0
##$TM2= 0
##$TOPLEV= 0
##$USERP1= <user>
##$USERP2= <user>
##$USERP3= <user>
##$USERP4= <user>
##$USERP5= <user>
##$WDW= 1
##$XDIM= 16384
##$YMAX_p= 349237639
##$YMIN_p= -715621
$$ End of Bruker specific parameters
$$ ---------------------------------
##NTUPLES= NMR SPECTRUM
##VAR_NAME=  FREQUENCY,     SPECTRUM/REAL,   SPECTRUM/IMAG
##SYMBOL=    X,             R,               I
##VAR_TYPE=  INDEPENDENT,   DEPENDENT,       DEPENDENT
##VAR_FORM=  AFFN,          ASDF,            ASDF
##VAR_DIM=   16384,         16384,           16384
##UNITS=     HZ,            ARBITRARY UNITS, ARBITRARY UNITS
##FACTOR=    0.220516191357247, 1,           1
##FIRST=     3145.25112838912, 0,            0
##LAST=      -467.465634616659, 0,           0
##MIN=       -467.465634616659, -715621,     0
##MAX=       3145.25112838912, 349237639,    0
$$ Real data points
##PAGE= N=1
##DATA TABLE= (X++(R..R)), XYDATA
$$ [...]
$$ plain form
7957 -51046 -48835 -3706 -57995 27542 -18473 15461 99893 23472 17666 9824 64515 94618
7945 94618 42658 79053 90765 60095 -10543 -68138 -32777 -10433 12547 40735 32997 44631
7933 44631 46827 -8285 -18978 -30086 -23187 -78201 -153468 -35759 28493 35919 -152344 -136495
7921 -136495 -62214 -90959 -100650 -49045 -62387 -64595 29755 -1518 31073 12075 -35324 -65965
7909 -65965 -62440 -61895 -56332 -87791 -153489 -204746 -207128 -37850 39333 42352 -3156 -25258 24570
7896 24570 -15172 -88717 -53688 -91776 -60632 -2190 -3724 -39743 -114289 -92326 -55430 -28802
7884 -28802 -1840 -50720 -42401 6028 8240 35769 -28915 -73714 -65870 -27685 -74621 -35931
7872 -35931 -19691 -45578 -112360 -114231 -53627 -31623 -51794 -31638 36692 36882 -46419 -12840
$$ packed form
7957e1046K211M5129n4289Q5537m6015L3934Q4432p6421n806p842N4691L0103
7945I4618n1960L6395J1712l0670p0638n7595L5361K2344K2980K8188p738J1634
7933D4631K196n5112j0693j1108O899n5014p5267J17709O4252P426j88263J5849
7921a36495P4281k8745r691N1605j3342k208R4350l1273L2591j8998m7399l0641
7909f5965L525N45N563l1459o5698n1257k382J69278P7183L019m5508k2102M9828
7896B4570l9742p3545L5029l8088L1144N8442j534l6019p4546K1963L6896K6628
7884b8802K6962m8880Q319M8429K212K7529o4684m4799P844L8185m6936L8690
7872c5931J6240k5887o6782j871O0604K2004k0171K0156O8330J90q3301L3579
$$ plain form
7860 -12840 -12810 -41471 -24520 -66230 -85632 -61324 -115596 -119273 -64248 -71284 -69760 -67410 -134898
7847 -134898 -158378 -59994 -103979 -80826 4646 -39594 -3853 -77947 -82337 -67073 -15474 -22317
7835 -22317 18539 25049 35102 -26737 -45552 -26354 -102719 -65863 -15889 -7690 -43861 -21268
7823 -21268 -9445 23225 82271 28356 -21975 -91181 36755 108457 -38851 -133300 17087
7812 17087 75376 62755 10204 -66143 -31409 50940 58449 -9724 93811 66407 114232 187984
7800 187984 89771 169885 -70159 -284816 -182462 -217120 -125005 -109614 -71495 -181231 -129710
7789 -129710 -127126 13659 8498 8439 377 -31116 64924 17742 -31786 19033 56820 55145 80240
7776 80240 43846 42253 -39949 -8875 35752 11894 -56739 27124 6733 -51201 -39287 -88843
$$ packed form
7860a2840L0k8661J6951m1710j9402K4308n4272l677N5025p036J524K350o7488
7847a34898k3480R8384m3985K3153Q5472m4240L5741p4094m390J5264N1599o843
7835b2317M0856O510J0053o1839j8815J9198p6365L6856M9974Q199l6171K2593
7823b1268J1823L2670N9046n3915n0331o9206J27936P1702j47308r4449J50387
7812A7087N8289j2621n2551p6347L4734Q2349P509o8173J03535k7404M7825P3752
7800A87984r8213Q0114k40044k14657J02354l4658R2115J5391L8119j09736N1521
7789a29710K584J40785n161n9q062l1493R6040m7182m9528N0819L7787j675K5095
7776H0240l6394j593q2202L1074M4627k3858o8633Q3863k0391n7934J1914m9556
$$ plain form
7764 -88843 -51680 -33864 91668 70286 -19164 63622 57306 96548 78691 8671 22355 -18416
7752 -18416 -104357 -74373 -52257 -23916 9653 25935 19247 557 29715 29199 47849 34142
7740 34142 1336 -47778 -15896 32162 33256 80532 73277 -17597 -22566 70939 157266 1216
7728 1216 -52102 -27366 587 -26183 -13301 -12968 -46143 -66985 -94125 -80229 -52918 34489
7716 34489 25793 41254 81949 27111 28899 52453 -3079 2576 -17917 -22277 -26038 -33993 -13131
7703 -13131 -58865 17058 42227 4039 -38753 -29705 -56088 -18061 38601 3233 7758 35091
7691 35091 38039 5217 31845 3846 51423 -9560 -33243 51643 -15753 -23546 27066 42389
7679 42389 33121 95307 173499 136539 206759 246266 287085 279520 208780 137234 47956 85155
$$ packed form
7764h8843L7163J7816J25532k1382q9450Q2786o316L9242j7857p0020J3684m0771
7752a8416q5941K9984K2116K8341L3569J6282o688j8690K9158n16J8650j3707
7740C4142l2806m9114L1882M8058J094M7276p255r0874m969R3505Q6327j56050
7728A216n3318K4736K7953k6770J2882L33l3175k0842k7140J3896K7311Q7407
7716C4489q696J5461M0695n4838J788K3554n5532N655k0493m360l761p955K0862
7703a3131m5734P5923K5169l8188m2792R048k6383L8027N6662l5368M525K7333
7691C5091K948l2822K6628k7999M7577o0983k3683Q4886o7396p793N0612J5323
7679D2389r268O2186P8192l6960P0220L9507M0819p565p0740p1546q9278L7199
$$ plain form
7667 85155 66999 39710 41541 -22776 23963 74133 15073 15399 21483 75644 40093 23468 -56030
7654 -56030 -37521 -5743 -30119 12298 -21453 37993 -23802 -16192 19595 -1243 14271 31945
7642 31945 76335 105999 69444 135175 58606 -7420 -45970 -62058 -32572 -34609 -21956 53651
7630 53651 51264 54099 37404 -34394 35883 58945 17582 20728 31663 35561 -12939 18769 34183
7617 34183 73183 46752 43743 36578 55133 125455 141600 142691 148537 85315 -25004 -1145
7605 -1145 93993 85802 53842 169903 138436 75669 116795 32197 -2017 26725 68170 127867
7593 127867 101909 112349 94200 24768 46538 15475 2809 -5001 -451 5597 -52768 -70816
7581 -70816 971 70559 77244 82050 -8779 46235 50049 109870 152478 85889 75859 26557
$$ packed form
7667H5155j8156k7289J831o4317M6739N0170n9060L26O084N4161l5551j6625p9498
7654e6030J8509L1778k4376M2417l3751N9446o1795P610L5787k0838J5514J7674
7642C1945M4390K9664l6555O5731p6569o6026l8550j6088K9486k037J2653P5607
7630E3651k387K835j6695p1798P0277K3062m1363L146J0935L898m8500L1708J5414
7617C4183L9000k6431l009p165J8555P0322J6145J091N846o3222j10319K3859
7605a145R5138q191l1960J16061l1467o2767M1126q4598l4214K8742M1445N9697
7593A27867k5958J0440j8149o9432K1770l1063j2666p810M550O048n8365j8048
7581g0816P1787O9588O685M806r0829N5014L814N9821M2608o6589j0030m9302
$$ plain form
7569 26557 54430 89074 99643 62995 113185 64426 -30670 28198 5832 64298 58812 97934
7557 97934 174591 87039 71831 23786 -52009 22249 54168 39134 63047 90479 14038 1885
7545 1885 2851 7483 30277 137231 111886 115264 71581 43930 58005 64627 103009 139050 84213
7532 84213 112688 223391 143250 183275 216317 254171 198711 139937 163178 175203 219735 330800
7520 330800 233854 207261 265016 274291 282796 248345 281716 230693 276320 296333 305004 321123
7508 321123 290087 276750 356340 425441 507191 549233 590075 579283 543439 552344 514248 485158
7496 485158 442613 274608 213695 261276 314056 302034 363233 301869 220254 215353 234149 79877
7484 79877 20220 74139 37255 25196 55089 118382 179399 129847 10562 43341 151137
$$ packed form
7569B6557K7873L4644J0569l6648N0190m8759r5096N8868k2366N8466n486L9122
7557I7934P6657q7552j5208m8045p5795P4258L1919j5034K3913K7432p6441j2153
7545A885R66M632K2794J06954k5345L378m3683k7651J4075O622L8382L6041n4837
7532H4213K8475J10703q0141M0025L3042L7854n5460n8774K3241J2025M4532J11065
7520C30800r6946k6593N7755R275Q505l4451L3371n1023M5627K0013Q671J6119
7508C21123l1036j3337P9590O9101Q1750M2042M0842j0792l5844Q905l8096k9090
7496D85158m2545j68005o0913M7581N2780j2022O1199o1364q1615m901J8796j54272
7484G9877n9657N3919l6884j2059K9893O3293O1017m9552j19285L2779J07796
$$ plain form
7473 151137 210797 74557 115047 137232 121291 152157 137237 104466 67423 168746 230976
7462 230976 189822 242599 192801 117000 80757 98814 131004 155266 112280 104629 157986 89344
7450 89344 152452 131512 83422 171581 194521 148997 -1417 -60123 -10653 48891 14628 71029
7438 71029 130469 178643 171208 249061 270193 255829 231847 202846 173696 160959 58167 109931
7426 109931 119356 147430 145146 66144 -15300 76190 117896 213875 174419 143228 256583 260412
7414 260412 205352 139141 98230 128168 142647 111441 100098 99959 100952 155745 230005 105353
7402 105353 122558 163615 128465 164087 164953 134396 215315 260100 254875 229765 164478 200425
7390 200425 206803 181851 241225 190330 168613 131660 166686 245815 279979 246885 210212 192803
$$ packed form
7473A51137N9660j36240M0490K2185j5941L0866j4920l2771l7043J01323O2230
7462B30976m1154N2777m9798p5801l6243J8057L2190K4262m2986p651N3357o8642
7450H9344O3108k0940m8090Q8159K2940m5524j50414n8706M9470N9544l4263N6401
7438G1029N9440M8174p435P7853K1132j4364k3982k9001k9150j2737j02792N1764
7426A09931R425K8074k284p9002q1444R1490M1706R5979l9456l1191J13355L829
7414B60412n5060o6211m0911K9938J4479l1206j1343j39R93N4793P4260j24652
7402A05353J7205M1057l5150L5622Q66l0557Q0919M4785n225k5110o5287L5947
7390B00425O378k4952N9374n0895k1717l6953L5026P9129L4164l3094l6673j7409
$$ plain form
7378 192803 264432 257050 155628 178385 310164 238031 195700 218493 153162 78504 42223
7367 42223 68768 243903 364670 313585 259428 198167 195426 295689 257990 244711 255162
7356 255162 168318 198590 305644 284218 235315 243394 279434 234844 160577 163049 220506 247871
7344 247871 283375 251040 327001 279756 276828 336455 333840 311313 227676 252951 346035 300833
7332 300833 235840 217422 288124 361910 413728 371498 370612 275690 272890 287346 248869 279627
7320 279627 341209 338621 343645 293034 349907 370620 306110 354220 301842 308451 350721 445842
7308 445842 379119 433326 445085 368677 337946 452509 451686 437695 453944 318378 421407
7297 421407 481585 397051 393436 347791 411659 384164 371513 418533 410027 387810 381042 331225
$$ packed form
7378A92803P1629p382j01422K2757J31779p2133m2331K2793o5331p4658l6281
7367D2223K6545J75135J20767n1085n4157o1261k741J00263l7699j3279J0451
7356B55162q6844L0272J07054k1426m8903Q079L6040m4590p4267K472N7457K7365
7344B47871L5504l2335P5961m7245k928N9627k615k2527q3637K5275R3084m5202
7332C00833o4993j8418P0702P3786N1818m2230q86r4922k800J4456l8477L0758
7320B79627O1582k588N024n0611N6873K0713o4510M8110n2378O609M2270R5121
7308D45842o6723N4207J1759p6408l0731J14563q23j3991J6249j35566J03029
7297D21407O0178q4534l615m5645O3868k7495j2651M7020q506k2217o768m9817
$$ plain form
7285 331225 317231 408508 400148 403311 462580 493332 440303 446594 446966 474442 546790 492094 490224
7272 490224 521673 548367 521219 542621 519711 522390 530644 486728 507771 522728 596791 662689
7260 662689 568844 551366 625825 710737 698276 617414 559115 551384 630429 708733 656922 624087
7248 624087 666952 685036 745773 755752 641622 767332 700598 740635 766755 766150 684145 628658
7236 628658 681208 698925 687189 849709 903751 844594 800423 793047 789064 754184 868217 855864
7224 855864 886395 876848 811195 875375 926282 973907 925477 972490 1006698 901600 984445 1047035
7212 1047035 1109829 1099875 1128053 1127079 1167162 1070970 1250726 1321612 1289652 1237421 1294031 1367308
7200 1367308 1436591 1452932 1467074 1624168 1653643 1682206 1778886 1808021 1834161 1835191 1832609 1948478
$$ packed form
7285C31225j3994R1277q360L163N9269L0752n3029O291L72K7476P2348n4696j870
7272D90224L1449K6694k7148K1402k2910K679Q254m3916K1043J4957P4063O5898
7260F62689r3845j7478P4459Q4912j2461q0862n8299p731P9045P8304n1811l2835
7248F24087M2865J8084O0737R979j14130J25710o6734M0037K6120o05q2005n5487
7236F28658N2550J7717j1736J62520N4042n9157m4171p376l983l4880J14033j2353
7224H55864L0531r547o5653O4180N0907M7625m8430M7013L4208j05098Q2845O2590
7212A047035O2794r954K8178r74M0083r6192J79756P0886l1960n2231N6610P3277
7200A367308O9283J6341J4142J57094K9475K8563R6680K9135K6140J030k582J15869
$$ plain form
7188 1948478 1946625 1938767 1943504 2023949 1965751 1991762 2205145 2239158 2291398 2218807 2237038 2368316
7176 2368316 2448117 2374627 2441532 2541616 2634787 2653816 2624391 2678490 2703486 2747776 2713380
7165 2713380 2703067 2770047 2906481 2996491 3113135 3106538 3168308 3237321 3228207 3206135 3277141
7154 3277141 3385936 3408433 3487808 3563974 3799847 3877116 3985084 4076529 4207876 4330868
7144 4330868 4492772 4692095 4907471 5130451 5344702 5598232 5820226 6121695 6404296 6778359
7134 6778359 7064397 7494982 7907090 8245350 8614897 8975534 9284420 9675693 10125849 10704447
7124 10704447 11260946 11971234 12755822 13662149 14582446 15739931 17126473 18739459 20655513
7115 20655513 22930953 25622740 28731260 32430250 36924173 42294366 48902704 57291324
$$ packed form
7188A948478j853p858M737Q0445n8198K6011K13383L4013N2240p2591J8231J31278
7176B368316P9801p3490O6905J00084R3171J9029k9425N4099K4996M4290l4396
7165B713380j0313O6980J36434R0010J16644o597O1770O9013r114k2072P1006
7154C277141J08795K2497P9375P6166K35873P7269J07968R1445J31347J22992
7144D330868J61904J99323K15376K22980K14251K53530K21994L01469K82601L74063
7134F778359K86038M30585M12108L38260L69547L60637L08886L91273M50156N78598
7124A0704447N56499P10288P84588R06327R20297J157485J386542J612986J916054
7115B0655513K275440K691787L108520L698990M493923N370193O608338Q388620
$$ plain form
7107 57291324 67789972 79802693 91526485 99915516 102358840 97665324 86746066 73143989
7099 73143989 59667802 48595933 40395606 34603617 30340492 26992468 24260203 21847535
7091 21847535 19719373 17791596 16229098 14943098 13733595 12775679 12008556 11249424 10518387
7082 10518387 9874704 9462884 8981489 8542936 8252087 7864196 7617358 7389860 7182205
7073 7182205 6970447 6787317 6628651 6498121 6323192 6192074 5910972 5676297 5471372 5202383
7063 5202383 4955531 4714321 4488293 4274045 4160266 3960569 3912130 3883062 3742632 3708747
7053 3708747 3743307 3717345 3724701 3682309 3637814 3620227 3738586 3858767 3949610 4008323 4159886
7042 4159886 4295454 4430434 4470903 4279711 4012661 3589199 3203047 2953289 2794032 2631082
$$ packed form
7107E7291324J0498648J2012721J1723792Q389031K443324m693516j0919258j3602077
7099G3143989j3476187j1071869q200327n791989m263125l348024k732265k412668
7091B1847535k128162j927777j562498j286000j209503r57916p67123p59132p31037
7082A0518387o43683m11820m81395m38553k90849l87891k46838k27498k07655
7073G182205k11758j83130j58666j30530j74929j31118k81102k34675k04925k68989
7063E202383k46852k41210k26028k14248j13779j99697m8439k9068j40430l3885
7053C708747L4560k5962P356m2392m4495j7587J18359J20181R0843N8713J51563
7042D159886J35568J34980M0469j91192k67050m23462l86152k49758j59257j62950
$$ plain form
7032 2631082 2561567 2423078 2284411 2229993 2197562 2124636 2058782 2046134 1863466 1832178 1766453
7021 1766453 1768710 1762485 1717638 1727909 1653495 1564722 1501955 1468298 1424047 1433800 1347742 1268426
7009 1268426 1242979 1217164 1202518 1193961 1174014 1223613 1116620 1082111 1120172 1075776 1001061
6998 1001061 1016731 944779 757984 835878 824069 849996 889478 811827 775208 777828 825078
6987 825078 698383 711513 747438 595368 648083 788875 756702 732103 707179 641162 675818
6976 675818 663210 743369 787440 767902 737350 695004 656370 692114 594220 543737 584371 627834
6964 627834 655826 623766 530609 473753 515595 616651 649818 535965 454820 528095 573555
6953 573555 587041 569991 503199 435979 426086 534027 553786 568714 599560 509024 467669 488231
$$ packed form
7032B631082o9515j38489j38667n4418l2431p2926o5854j2648j82668l1288o5725
7021A766453K257o225m4847J0271p4414q8773o2767l3657m4251R753q6058p9316
7009A268426k5447k5815j4646q557j9947M9599j06993l4509L8061m4396p4715
6998A001061J5670p1952j86795P7894j1809K5927L9482p7651l6619K620M7250
6987H25078j26695J3130L5925j52070N2715J40792l2173k4599k4924o6017L4656
6976F75818j2608Q0159M4071j9538l0552m2346l8634L5744r7894n0483M0634M3463
6964F27834K7992l2060r3157n6856M1842J01056L3167j13853q1145P3275M5460
6953E73555J3486j7050o6792o7220r893J07941J9759J4928L0846r0536m1355K0562
$$ plain form
6941 488231 424631 433114 475725 429938 381100 431813 476720 452585 518335 529054 517224 585819
6929 585819 708069 814759 879803 978813 1170417 1280663 1230905 1131184 914885 747919
6919 747919 700293 670556 529691 457499 446021 501158 485319 405201 289193 339347 360032
6908 360032 394203 334404 315849 282191 250728 217129 223588 290912 286468 269654 224725 228214
6896 228214 320422 247553 263229 273706 332807 260393 297327 323765 232036 291197 281496 218279
6884 218279 125713 102916 122617 238510 184008 162447 75725 176106 273721 248357 239662
6873 239662 251555 236169 127253 173784 237774 173815 206609 201113 204993 138012 188013 207775
6861 207775 217812 214175 171621 104767 199599 225117 216371 133686 151068 223092 164014 187142
$$ packed form
6941D88231o3600Q483M2611m5787m8838N0713M4907k4135O5750J0719j1830O8595
6929E85819J22250J06690O5044R9010J91604J10246m9758r9721k16299j66966
6919G47919m7626k9737j40865p2192j1478N5137j5839q0118j16008N0154K0685
6908C60032L4171n9799j8555l3658l1463l3599O459O7324m444j6814m4929L489
6896B28214R2208p2869J5676J0477N9101p2414L6934K6438r1729N9161r701o3217
6884B18279r2566k2797J9701J15893n4502k1561q6722J00381R7615k5364q695
6873B39662J1893j5386j08916M6531O3990o3959L2794n496L880o6981N0001J9762
6861B07775J0037l637m2554o6854R4832K5518q746q2685J7382P2024n9078K3128
$$ plain form
6849 187142 253966 266463 223109 266436 199666 112703 153194 154583 127761 76244 64121 11795
6837 11795 52859 181209 194616 192466 155615 156966 76651 167446 144294 98815 223648 223249
6825 223249 203593 229924 135481 197118 266832 256110 211028 84708 79889 32769 68084 163747
6813 163747 191556 198347 174726 222814 133605 155682 84979 136258 139655 86937 175274 242595
6801 242595 244972 245060 254799 282967 376079 222377 118726 194528 213526 259233 193858 207247
6789 207247 315842 313051 259932 266613 290036 191671 198129 207079 135346 147970 124347 65197
6777 65197 90076 149728 144312 152272 212425 119444 149300 182823 195249 163644 174675 131738
6765 131738 155856 148313 193680 167023 172858 190805 158194 174570 243437 312480 379468 336930
$$ packed form
6849A87142O6824J2497m3354M3327o6770q6963M0491J389k6822n1517j2123n2326
6837A1795M1064J28350J3407k150l6851J351q0315R0795k3152m5479J24833l99
6825B23249j9656K6331r4443O1637O9714j0722m5082j26320m819m7120L5315R5663
6813A63747K7809O791k3621M8088q9209K2077p0703N1279L397n2718Q8337O7321
6801B42595K377Q8R739K8168R3112j53702j03651P5802J8998M5707o5375J3389
6789B07247J08595k791n3119O681K3423r8365O458Q950p1733J2624k3623n9150
6777F5197K4879N9652n416P960O0153r2981K9856L3523J2426l1605J1031m2937
6765A31738K4118p543M5367k6657N835J7947l2611J6376O8867O9043O6988m2538
$$ plain form
6753 336930 186595 211800 321124 297687 261770 240007 292667 263692 302199 170287 117979
6742 117979 179383 83312 77043 110649 125259 118757 117492 113974 167981 187700 234120 268558
6730 268558 263427 187476 221572 191466 305438 255487 253995 158846 212593 185956 185398 226184
6718 226184 256177 270121 264380 290767 298578 346075 396379 271146 276676 365879 300922 331824
6706 331824 459902 556702 611407 672156 652475 600267 607839 603808 510154 508243 503227 413902
6694 413902 241258 277152 252089 207770 172008 204370 147727 102487 139233 178776 241619
6683 241619 263160 135926 180996 174145 209736 236137 187590 205230 212105 151859 137843 214026
6671 214026 183168 201198 234395 263489 190915 180449 186525 110551 152794 143454 136998 143751
$$ packed form
6753C36930j50335K5205J09324k3437l5917k1763N2660k8975L8507j31912n2308
6742A17979O1404r6071o269L3606J4610o502j265l518N4007J9719M6420L4438
6730B68558n131p5951L4096l0106J13972m9951j492r5149N3747k6637n58M0786
6718B26184K9993J3944n741K6387P811M7497N0304j25233N530Q9203o4957L0902
6706C31824J28078R6800N4705O0749j9681n2208P572m031r3654j911n016q9325
6694D13902j72644L5894k5063m4319l5762L2362n6643m5240L6746L9543O2843
6683B41619K1541j27234M5070o851L5591K6401m8547J7640O875o0246j4016P6183
6671B14026l0858J8030L3197K9094p2574j0466O076p5974M2243r340o456O753
$$ plain form
6659 143751 165277 52704 36794 129095 125262 183585 181642 93617 163054 167053 102414 111256
6647 111256 140624 201119 194112 140761 114243 105238 136957 168136 91710 72965 42897 96044
6635 96044 208879 165528 67988 67286 70448 185766 190449 167208 115864 66232 65956 174792
6623 174792 242594 248202 190944 88572 142733 198974 114420 138080 68662 67857 157396 182866
6611 182866 101017 151839 128169 101247 89992 165945 200758 199084 292906 303810 338404 270376
6599 270376 251554 186902 123686 143803 125235 55617 127126 176821 116634 119439 126575 126341
6587 126341 150463 26821 62409 171986 205677 191311 153277 153715 144828 144993 118709 107982
6575 107982 104913 128594 109668 41849 131723 159464 123785 157073 326745 318712 188017 171893
$$ packed form
6659A43751K1526j12573j5910R2301l833N8323j943q8025O9437L999o4639Q842
6647A11256K9368O0495p007n3351k6518r005L1719L1179p6426j8745l0068N3147
6635I6044J12835m3351r7540p02L162J15318M683k3241n1344m9632k76J08836
6623A74792O7802N608n7258j02372N4161N6241q4554K3660o9418q05Q9539K5470
6611A82866q1849N0822k3670k6922j1255P5953L4813j674R3822J0904L4594o8028
6599B70376j8822o4652o3216K0117j8568o9618P1509M9695o0187K805P136k34
6587A26341K4122j23642L5588J09577L3691j4366l8034M38q887J65k6284j0727
6575A07982l069K3681j8926o7819Q9874K7741l5679L3288J69672q033j30695j6124
$$ plain form
6563 171893 188232 196051 287578 235905 225530 185035 154361 133606 65826 147046 135426 149459
6551 149459 198659 162696 153882 176341 240475 190527 74981 50460 138941 171597 189530 231708
6539 231708 297639 308720 194249 146497 169537 125972 90096 1874 13058 143974 193357
6528 193357 206844 154619 229446 186766 156021 195347 198598 183456 180781 138315 51398 136941
6516 136941 172205 244159 209760 182256 157484 109482 134186 188121 298680 322683 304200
6505 304200 203620 167581 143986 225753 151745 87921 70539 134910 207277 149783 184655
6494 184655 149743 106867 168726 180180 143387 119615 95235 225158 228045 139476 276256
6483 276256 358679 312606 330462 415138 359840 286157 310929 409929 309355 193093 179963
$$ packed form
6563A71893J6339P819R1527n1673j0375m0495l0674k0755o7780Q1220j1620J4033
6551A49459M9200l5963q814K2459O4134m9948j15546k4521Q8481L2656J7933M2178
6539B31708O5931J1081j14471m7752K3040m3565l5876q8222J1184J30916M9383
6528A93357J3487n2225P4827m2680l0745L9326L251j5142k675m2466q6917Q5543
6516A36941L5264P1954l4399k7504k4772m8002K4704N3935J10559K4003j8483
6505C04200j00580l6039k3595Q1767p4008o3824j7382O4371P2367n7494L4872
6494A84655l4912m2876O1859J1454l6793k3772k4380J29923K887q8569J36780
6483B76256Q2423m6073J7856Q4676n5298p3683K4772R9000j00574j16262j3130
$$ plain form
6472 179963 209026 229880 134847 160292 210754 196103 164601 224492 165782 163676 265057 293245
6460 293245 286663 238484 141072 127629 176956 258457 273064 308230 276450 264630 249474 223492
6448 223492 273176 167160 151738 299733 393084 326312 311957 403561 333124 293128 362226
6437 362226 260651 237636 366889 268126 296277 288501 248988 249994 310252 389164 372638 382628
6425 382628 344570 408620 371957 365208 336253 307747 226186 289516 363334 321046 401545 432003
6413 432003 405678 454413 364254 363074 381220 405165 349227 325855 415031 458747 436234 453391
6401 453391 404594 417185 498700 497957 385324 396892 448366 445976 420121 437858 446845 429112
6389 429112 350161 391077 423143 370754 448149 424628 321609 304487 389778 373781 458958
$$ packed form
6472A79963K9063K0854r5033K5445N0462j4651l1502N9891n8710k106J01381K8188
6460B93245o582m8179r7412j3443M9327Q1501J4607L5166l1780j1820j5156k5982
6448B23492M9684j06016j5422J47995R3351o6772j4355R1604p0437l9996O9098
6437C62226j01575k3015J29253r8763K8151p776l9513J006O0258P8912j6526R990
6425C82628l8058O4050l6663o749k8955k8506q1561O3330P3818m2288Q0499L0458
6413D32003k6325M8735r0159j180J8146K3945n5938k3372Q9176M3716k2513J7157
6401D53391m8797J2591Q1515p43j12633J1568N1474k390k5855J7737Q987j7733
6389D29112p8951M0916L2066n2389P7395k3521j03019j7122Q5291j5997Q5177
$$ plain form
6378 458958 516889 423669 515644 540318 520864 478909 481476 618501 556837 607878 569948 523483
6366 523483 509894 462971 553843 615181 458875 472745 435797 475266 496783 531989 572214
6355 572214 620544 682848 641888 593297 603454 638661 628532 593877 625750 604738 638872 568646
6343 568646 608560 553697 600527 626749 564884 659707 710903 686866 668908 699545 643760 655407
6331 655407 643480 701854 753319 840288 849842 869041 877167 817688 808806 842182 816355 854619
6319 854619 827745 880790 897526 868172 872306 824382 827014 771982 784149 735521 681836 702506
6307 702506 662517 746905 714908 714596 699294 732343 692128 716843 756803 779563 834938 784582
6295 784582 712436 680980 715174 730106 669881 588362 645984 649290 738133 688153 671835 620314
$$ packed form
6378D58958N7931r3220R1975K4674j9454m1955K567J37025o1664N1041l7930m6465
6366E23483j3589m6923R0872O1338j56306J3870l6948L9469K1517L5206M0225
6355E72214M8330O2304m0960m8591J0157L5207j0129l4655L1873k1012L4134p0226
6343E68646L9914n4863M6830K6222o1865R4823N1196k4037j7958L0637n5785J1647
6331F55407j1927N8374N1465Q6969R554J9199Q126n9479q882L3376k5827L8264
6319H54619k6874N3045J6736k9354M134m7924K632n5032J2167m8628n3685K0670
6307G02506l9989Q4388l1997l12j5302L3049m0215K4715L9960K2760N5375n0356
6295G84582p2146l1456L4194J4932o0225q1519N7622L306Q8843m9980j6318n1521
$$ plain form
6283 620314 584733 558661 591903 672826 672897 652835 667731 734248 816483 765942 797834 795857
6271 795857 687702 641823 602468 662408 664246 698162 704017 764402 756150 725259 707046 695300
6259 695300 679652 669940 734748 779856 846336 782317 751473 758965 779698 792415 733194 777343
6247 777343 805577 729917 812526 890998 880842 832974 828400 842292 850056 856755 870352 890917
6235 890917 831383 887533 916691 825480 824154 920379 915469 936695 941014 929713 965708 1020185
6223 1020185 999598 983076 966132 993299 1016085 1033834 989138 1066906 1111034 1102871 1176402 1148510
6211 1148510 1088590 1119553 1206716 1233117 1268097 1299179 1197077 1201742 1258425 1249353 1276991 1345173
6199 1345173 1365779 1363443 1402810 1423666 1490056 1554705 1442534 1515587 1574949 1555837 1565142 1560051
$$ packed form
6283F20314l5581k6072L3242Q0923P1k0062J4896O6517Q2235n0541L1892j977
6271G95857j08155m5879l9355N9940J838L3916N855O0385q252l0891j8213j1746
6259F95300j5648r712O4808M5108O6480o4019l0844P492K0733J2717n9221M4149
6247G77343K8234p5660Q2609P8472j0156m7868m574J3892P764O699J3597K0565
6235H90917n9534N6150K9158r1211j326R6225m910K1226M319j1301L5995N4477
6223A020185k0587j6522j6944K7167K2786J7749m4696P7768M4128q163P3531k7892
6211A148510n9920L0963Q7163K6401L4980L1082j02102M665N6683r072K7638O8182
6199A345173K0606k336L9367K0856O6390O4649j12171P3053N9362j9112R305n091
$$ plain form
6187 1560051 1623375 1768209 1674469 1585345 1740236 1729199 1723146 1701744 1681220 1721059 1681300
6176 1681300 1697081 1666395 1689135 1747127 1752561 1818908 1796329 1695508 1697690 1772436 1711003 1740835
6164 1740835 1774785 1782340 1800925 1802031 1842234 1871861 1837251 1856616 1855808 1827903 1838840 1908241
6152 1908241 1911102 1866090 1850043 1931859 1912366 1890062 1883039 1857121 1890282 1863807 1920282 1941778
6140 1941778 1894208 1889896 1940887 1920068 1943568 1996258 2059883 2094455 2121901 2178762 2179475 2190139
6128 2190139 2205099 2246767 2209241 2188507 2249067 2408099 2417494 2386803 2358072 2406225 2471346
6117 2471346 2517506 2538348 2558557 2606025 2632015 2603412 2660985 2670116 2699400 2752572 2763855 2919226
6105 2919226 2971014 3029153 3030590 3051232 3156350 3225720 3278967 3249387 3323890 3431506 3446473
$$ packed form
6187A560051O3324J44834r3740q9124J54891j1037o053k1402k0524L9839l9759
6176A681300J5781l0686K2740N7992N434O6347k2579j00821K182P4746o1433K9832
6164A740835L3950P555J8585J106M0203K9627l4610J9365q08k7905J0937O9401
6152A908241K861m5012j6047Q1816j9493k2304p023k5918L3161k6475N6475K1496
6140A941778m7570m312N0991k0819K3500N2690O3625L4572K7446N6861P13J0664
6128B190139J4960M1668l7526k0734O0560J59032R395l0691k8731M8153O5121
6117B471346M6160K0842K0209M7468K5990k8603N7573R131K9284N3172J1283J55371
6105B919226N1788N8139J437K0642J05118O9370N3247k9580P4503J07616J4967
$$ plain form
6094 3446473 3491639 3520335 3577626 3702951 3750228 3841517 3968011 4077599 4056657 4133487 4227030
6083 4227030 4282941 4360865 4454180 4601386 4680750 4771534 4884973 5077695 5225234 5331535
6073 5331535 5527171 5569613 5624421 5652233 5716733 5801171 5847827 6002608 6180436 6289449 6303066
6062 6303066 6448118 6551671 6661539 6818541 6859746 7068602 7177123 7371606 7584165 7771640
6052 7771640 8023010 8197292 8390874 8581917 8928784 9109089 9285758 9614594 9907143 10199650
6042 10199650 10666913 11085889 11433184 11718072 12067704 12407302 12753637 13097535 13545104
6033 13545104 14017807 14584007 15097509 15582660 16080734 16756089 17606936 18628744 19614130
6024 19614130 20671747 21834848 23016195 24485528 26260846 28394739 31034987 34104302
$$ packed form
6094C446473M5166K8696N7291J25325M7277R1289J26494J09588k0942P6830R3543
6083D227030N5911P7924R3315J47206P9364R0784J13439J92722J47539J06301
6073E331535J95636M2442N4808K7812O4500Q4438M6656J54781J77828J09013J3617
6062F303066J45052J03553J09868J57002M1205K08856J08521J94483K12559J87475
6052G771640K51370J74282J93582J91043L46867J80305J76669L28836K92549K92507
6042A0199650M67263M18976L47295K84888L49632L39598L46335L43898M47569
6033A3545104M72703N66200N13502M85151M98074O75355Q50847J021808R85386
6024A9614130J057617J163101J181347J469333J775318K133893K640248L069315
$$ plain form
6016 34104302 37452359 40626853 42996390 44398773 44741635 44569730 44330910 44086309 43857091
6007 43857091 43559263 43242413 43098917 43119484 43424792 43946018 44968046 46431935 48033439
5998 48033439 49938447 51973547 53943089 55871132 57922821 60264466 63096637 66733755
5990 66733755 71360418 76896678 82425190 85609206 85023169 81406062 75977444 70509842
5982 70509842 66412775 63431872 61272014 59545880 57926179 56370860 54672320 52791822
5974 52791822 50799464 48916544 47269807 45790341 44785100 44008851 43448112 42994421 42615285
5965 42615285 42314518 42034763 41915723 41817477 41413028 40457145 38380877 35452478 32278638
5956 32278638 29193618 26691487 24674091 23149693 21941924 20939773 20204334 19588230
$$ packed form
6016C4104302L348057L174494K369537J402383L42862j71905k38820k44601k29218
6007D3857091k97828l16850j43496K0567L05308N21226J022028J463889J601504
5998D8033439J905008K035100J969542J928043K051689K341645K832171L637118
5990F6733755M626663N536260N528512L184016n86037l617107n428618n467602
5982G0509842m097067k980903k159858j726134j619701j555319j698540j880498
5974E2791822j992358j882920j646737j479466j005241p76249n60739m53691l79136
5965D2615285l00767k79755j19040r8246m04449r55883k076268k928399l173840
5956C2278638l085020k502131k017396j524398j207769j002151p35439o16104
$$ plain form
5948 19588230 19049805 18514267 17897089 17428477 16994316 16438707 15858917 15364571 14893687
5939 14893687 14579778 14251281 14032627 13968226 13780339 13674197 13536247 13472315 13451756 13397845
5929 13397845 13314740 13242300 13176893 13027853 12997317 12985430 12891333 12754121 12899467 12908344 12950495
5918 12950495 13038201 13139020 13201747 13346251 13444015 13541958 13740036 13943768 14121434 14258170
5908 14258170 14522009 14787655 15043533 15379075 15664387 15990731 16236869 16522803 16906918
5899 16906918 17411756 17974613 18494627 19175921 19790169 20454469 21254725 22049765 22971064
5890 22971064 23892805 25046300 26336286 27747816 29620460 31836130 34385226 37280440
5882 37280440 40271639 43007039 44975044 46133660 46697839 46870185 46982974 47341079 47650142
$$ packed form
5948A9588230n38425n35538o17178m68612m34161n55609n79790m94346m70884
5939A4893687l13909l28497k18654o4401j87887j06142j37950o3932k0559n3911
5929A3397845q3105p2440o5407j49040l0536j1887r4097j37212J45346Q877M2151
5918A2950495Q7706J00819O2727J44504R7764R7943J98078K03732J77666J36736
5908A4258170K63839K65646K55878L35542K85312L26344K46138K85934L84115
5899A6906918N04838N62857N20014O81294O14248O64300Q00256P95040R21299
5890B2971064R21741J153495J289986J411530J872644K215670K549096K895214
5882C7280440K991199K735400J968005J158616N64179J72346J12789L58105L09063
$$ plain form
5873 47650142 48277466 49149131 50138401 51302424 52693923 54395707 56292504 58410933 60501658
5864 60501658 62528431 64375139 66180298 68133222 70184304 72563945 75488398 78919134
5856 78919134 82923893 86395236 87966453 86614275 82863489 77794513 72597156 68106512
5848 68106512 64531542 61750828 59547924 57705814 56058311 54372991 52749873 51404463
5840 51404463 50400332 49673856 49174485 48885441 48745060 48706509 48761106 48733115 48761964 48838065
5830 48838065 48819473 48481326 47600159 45955016 43587679 40668936 37704765 35207600 33436182
5821 33436182 32365458 31919997 31921272 31787344 30958007 29339088 27119282 24686486 22582385
5812 22582385 21028080 19891833 18879650 17921697 17108781 16327276 15620013 14978361 14392336
$$ packed form
5873D7650142O27324Q71665R89270J164023J391499J701784J896797K118429K090725
5864F0501658K026773J846708J805159J952924K051082K379641K924453L430736
5856G8919134M004759L471343J571217j352178l750786n068976n197357m490644
5848F8106512l574970k780714k202904j842110j647503j685320j623118j345410
5840E1404463j004131p26476m99371k89044j40381l8551N4597k7991K8849P6101
5830D8838065j8592l38147q81167j645143k367337k918743k964171k497165j771418
5821C3436182j070724m45461J275j33928q29337j618919k219806k432796k104101
5812B2582385j554305j136247j012183r57953q12916p81505p07263o41652n86025
$$ plain form
5803 14392336 13903893 13522629 13186291 12911360 12572137 12344556 12266914 12216171 11976463 11811724
5793 11811724 11630943 11457286 11144215 10831917 10498627 10216196 10165409 10057795 9869588 9633226
5783 9633226 9472716 9139909 8897658 8591998 8299861 8119347 7960912 7682292 7490916 7398359
5773 7398359 7340580 7242812 7087486 7044543 6983896 7010105 6996550 6859440 6919617 6809063 6696790
5762 6696790 6542702 6437824 6444162 6408039 6369039 6305643 6190579 6047205 5890664 5789770
5752 5789770 5619681 5418748 5263851 5150991 5032890 4985330 4833705 4760681 4701840 4528148
5742 4528148 4482815 4386123 4282923 4228056 4161047 4108507 4021791 3987189 4074738 4069142 4010382
5731 4010382 4000847 3997558 4003988 3796212 3534562 3478073 3423104 3399174 3275623 3091195 3023180
$$ packed form
5803A4392336m88443l81264l36338k74931l39223k27581p7642n0743k39708j64739
5793A1811724j80781j73657l13071l12298l33290k82431n0787j07614j88207k36362
5783I633226j60510l32807k42251l05660k92137j80514j58435k78620j91376r2557
5773G398359n7779r7768j55326m2943o0647K6209j3555j37110O0177j10554j12273
5762F696790j54088j04878O338l6123l9000o3396j15064j43374j56541j00894
5752E789770j70089k00933j54897j12860j18101m7560j51625p3024n8841j73692
5742D528148m5333r6692j03200n4867o7009n2540q6716l4602Q7549n596n8760
5731D010382r535l289O430k07776k61650n6489n4969k3930j23551j84428o8015
$$ plain form
5720 3023180 2979281 2936790 2871080 2842794 2772277 2706382 2725862 2570186 2462251 2406583 2359280
5709 2359280 2360773 2344670 2367442 2264089 2298100 2404987 2458305 2307498 2261469 2294243 2276512
5698 2276512 2183434 2031225 1958502 1954984 1905879 1909101 1846608 1845591 1935267 1808041 1742552 1678288
5686 1678288 1671225 1738901 1648330 1631002 1753440 1649678 1550162 1520752 1553589 1597449 1561125
5675 1561125 1579174 1670007 1643707 1675874 1681142 1682815 1730780 1875850 1888349 1852350 1716017
5664 1716017 1716029 1775145 1737614 1755309 1801580 1962457 1961578 1897313 1902855 1976692 2162365 2217412
5652 2217412 2175638 2199182 2280951 2292586 2297724 2233561 2278779 2302819 2266884 2233202 2176972 2230922
5640 2230922 2167776 2244707 2387010 2402368 2401859 2374758 2460167 2539178 2536768 2507176 2513032 2628190
$$ packed form
5720C023180m3899m2491o5710k8286p0517o5895J9480j55676j07935n5668m7303
5709B359280J493j6103K2772j03353L4011J06887N3318j50807m6029L2774j7731
5698B276512r3078j52209p2723l518m9105L222o2493j017Q9676j27226o5489o4264
5686A678288p063O7676r0571j7328J22438j03762r9516k9410L2837M3860l6324
5675A561125J8049R0833k6300L2167N268J673M7965J45070J2499l5999j36333
5664A716017J2N9116l7531J7695M6271J60877q79o4265N542P3837J85673N5047
5652B217412m1774K3544Q1769J1635N138o4163M5218K4040l5935l3682n6230N3950
5640B230922o3146P6931J42303J5358n09k7101Q5409P9011k410k9592N856J15158
$$ plain form
5628 2628190 2644231 2747016 2823311 2935820 3038078 3028277 2936352 2877695 2855948 2824569 2782106
5617 2782106 2844770 2881018 2839449 2822447 2726714 2757591 2767912 2686671 2786107 2819565 2828287 2741474
5605 2741474 2741067 2719507 2667279 2630406 2679424 2798977 2772726 2785346 2783991 2776711 2768271 2864395
5593 2864395 2779896 2788733 2734428 2747561 2791166 2806229 2857847 2950055 2995593 3143598 3283161
5582 3283161 3438444 3535063 3658136 3949327 4243351 4625866 5019733 5531086 6193056 6951122
5572 6951122 7770603 9232974 11074904 13250799 15026769 15583537 14706740 12600866 10056724
5563 10056724 7906469 6478071 5453950 4829091 4329640 3819076 3527009 3274830 2999604
5554 2999604 2906858 2841243 2734174 2614752 2522095 2442408 2442563 2526841 2505277 2461154 2498721
$$ packed form
5628B628190J6041J02785P6295J12509J02258r801r1925n8657k1747l1379m2463
5617B782106O2664L6248m1569j7002r5733L0877J0321q1241R9436L3458Q722q6813
5605B741474m07k1560n2228l6873M9018J19553k6251J2620j355p280q440R6124
5593B864395q4499Q837n4305J3133M3605J5063N1618R2208M5538J48005J39563
5582C283161J55283R6619J23073K91191K94024L82515L93867N11353O61970P58066
5572F951122Q19481J462371J841930K175895J775970N56768q76797k105874k544142
5563A0056724k150255j428398j024121o24859m99451n10564k92067k52179k75226
5554B999604r2746o5615j07069j19422r2657p9687J55Q4278k1564m4123L7567
$$ plain form
5543 2498721 2616184 2750621 2955366 3059792 3092805 3045543 2838054 2687747 2418220 2219928
5533 2219928 2034834 1851481 1755232 1744132 1653718 1644938 1620681 1554049 1592399 1580415 1465655
5522 1465655 1441086 1459724 1520316 1568134 1468761 1377297 1385140 1236466 1111736 1102542 1083988
5511 1083988 1089316 1133554 1111894 958103 961469 961100 1035583 977924 960566 1019566 974462 983954
5499 983954 991914 890259 940748 924959 974424 890195 902407 941589 824341 839784 800457
5488 800457 780497 859398 805990 726314 637932 739457 734298 719115 739669 715076 751334 790930
5476 790930 670346 725669 726933 612049 698711 735483 771972 706167 737309 703873 600803
5465 600803 585935 596137 580671 622478 708547 801070 681431 694555 650395 588512 574410
$$ packed form
5543B498721J17463J34437K04745J04426L3013m7262k07489j50307k69527j98292
5533B219928j85094j83353r6249j1100r0414q780k4257o6632L8350j1984j14760
5522A465655k4569J8638O0592M7818r9373r1464P843j48674j24730r194j8554
5511A083988N328M4238k1660j53791L366l69P4483n7659j7358N9000m5104R492
5499I83954P960j01655N0489j5789M9465q4229J2212L9182j17248J5443l9327
5488H00457j9960P8901n3408p9676q8382J01525n159j5183K0554k4593L6258L9596
5476G90930j20584N5323J264j14884Q6662L6772L6489o5805L1142l3436j03070
5465F00803j4868J0202j5466M1807Q6069R2523j19639J3124m4160o1883j4102
$$ plain form
5454 574410 593459 547048 592026 615003 574617 654924 678234 649504 579127 592155 697907
5443 697907 729807 710790 685467 812809 742075 608800 648690 698487 652529 767667 815537
5432 815537 731680 633555 598486 689867 603380 575177 532569 561684 625625 649729 647520 713512
5420 713512 708358 618023 678805 696324 576300 644982 705212 677645 630782 669512 755676 774885
5408 774885 810748 811307 829553 750857 771425 713519 720360 774032 774418 780961 792290 770269 807547
5395 807547 866782 876251 836477 734439 695652 760137 809453 792906 848356 765510 818369 788507
5383 788507 752785 745845 821012 940662 885496 893855 967896 897963 919589 922710 983935 915677
5371 915677 768994 755247 819559 858237 897986 952847 924390 916771 921249 958343 898659 909559
$$ packed form
5454E74410J9049m6411M4978K2977m0386Q0307K3310k8730p0377J3028J05752
5443F97907L1900j9017k5323J27342p0734j33275L9890M9797m5958J15138M7870
5432H15537q3857r8125l5069R1381q6487k8203m2608K9115O3941K4104k209O5992
5420G13512n154r0335O0782J7519j20024O8682O0230k7567m6863L8730Q6164J9209
5408G74885L5863N59J8246p8696K0568n7906O841N3672L86O543J1329k2021L7278
5395H07547N9235R469l9774j02038l8787O4485M9316j6547N5450q2846N2859k9862
5383G88507l5722o940P5167J19650n5166Q359P4041o9933K1626L121O1225o8258
5371I15677j46683j3747O4312L8678L9749N4861k8457p619M478L7094n9684J0900
$$ plain form
5359 909559 968174 928213 886435 923198 926656 975263 947022 978089 984731 951622 966396 1004315
5347 1004315 939864 837584 771527 801144 863042 844121 937225 928671 908914 932045 842608
5336 842608 804910 770993 738383 757574 800868 754972 858435 906330 928413 865995 777670
5325 777670 838788 857403 825843 888482 940514 893199 960834 993623 885963 851057 842284 786828
5313 786828 891941 851758 794224 723362 741066 827294 842517 848823 860933 823449 892925 855028
5301 855028 914503 916653 861588 799769 812600 883585 987510 981825 978269 1020029 991647 1069512
5289 1069512 1161722 1141041 1068473 1131137 1106346 1184352 1205752 1245577 1342077 1359900 1305264
5278 1305264 1397857 1479690 1543224 1570014 1742765 1834780 1862529 1910584 1840799 1787229 1773374
$$ packed form
5359I09559N8615l9961m1778L6763L458M8607k8241L1067O642l3109J4774L7919
5347A004315o4451j02280o6057K9617O1898j8921R3104q554j9757K3131q9437
5336H42608l7698l3917l2610J9191M3294m5896J03463M7895K2083o2418q8325
5325G77670O1118J8615l1560O2639N2032m7315O7635L2789j07660l4906q773n5456
5313G86828J05113m0183n7534p0862J7704Q6228J5223O306J2110l7484O9476l7897
5301H55028N9475K150n5065o1819J2831P0985J03925n685l556M1760k8382P7865
5289A069512R2210k0681p2568O2664k4791P8006K1400L9825R6500J7823n4636
5278A305264R2593Q1833O3534K6790J72751R2015K7749M8055o9785n3570j3855
$$ plain form
5267 1773374 1804291 1877781 1820452 1863609 1930533 1982465 2086585 2003275 2014027 2067018 2164220
5256 2164220 2318292 2551611 2735304 2985281 3217677 3409733 3494201 3438078 3371112 3234025
5246 3234025 3094839 3071371 3059100 3037799 2947806 2806962 2670210 2598253 2523193 2442021 2494831
5235 2494831 2454413 2449820 2471933 2497895 2467440 2542047 2557989 2443799 2462023 2413569 2515672
5224 2515672 2465067 2431689 2425095 2306243 2203675 2299857 2395706 2341282 2385669 2340099 2290363
5213 2290363 2298336 2323863 2202363 2138159 2178159 2115070 2039989 2048467 1991072 1901395 1835689 1857540
5201 1857540 1848065 1859650 1823643 1830155 1759021 1607827 1617730 1714300 1756622 1737299 1699855 1656792
5189 1656792 1587815 1582323 1543825 1483344 1491134 1545751 1504256 1448395 1463328 1436983 1382822 1403243
$$ packed form
5267A773374L0917P3490n7329M3157O6924N1932J04120q3310J0752N2991R7202
5256B164220J54072K33319J83693K49977K32396J92056Q4468n6123o6966j37087
5246C234025j39186k3468j2271k1301q9993j40844j36752p1957p5060q1172N2810
5235B494831m0418m593K2113K5962l0455P4607J5942j14190J8224m8454J02103
5224B515672n0605l3378o594j18852j02568R6182R5849n4424M4387m5570m9736
5213B290363P973K5527j21500o4204M0000o3089p5081Q478n7395q9677o5706K1851
5201A857540r475J1585l6007O512p1134j51194R903R6570M2322j9323l7444m3063
5189A656792o8977n492l8498o0481P790N4617m1495n5861J4933k6345n4161K0421
$$ plain form
5177 1403243 1409585 1386500 1430216 1424482 1432008 1392189 1299194 1335425 1435933 1522677 1484317 1380728
5165 1380728 1344952 1425393 1512821 1539740 1543594 1614070 1678615 1640566 1713316 1650133 1563466 1470227
5153 1470227 1476865 1461043 1469102 1407750 1338875 1416719 1500332 1567584 1559672 1640604 1673462 1642186
5141 1642186 1597582 1610651 1615620 1589146 1616113 1565221 1555311 1618462 1697670 1670670 1706076 1857923
5129 1857923 2060573 2238373 2334832 2469620 2679547 3039479 3231236 3090303 2898760 2687326
5119 2687326 2390462 2101427 1939688 1859913 1694315 1603063 1600769 1567650 1588406 1585175 1640995
5108 1640995 1662505 1655072 1547265 1572696 1642166 1649650 1587769 1557778 1556468 1568075 1690758 1695343
5096 1695343 1711859 1768775 1837753 1876340 1737501 1683411 1585617 1656450 1681483 1687709 1776383
$$ packed form
5177A403243O342k3085M3716n734P526l9819r2995L6231J00508Q6744l8360j03589
5165A380728l5776Q0441Q7428K6919L854P0476O4545l8049P2750o3183q6667r3239
5153A470227O638j5822Q059o1352o8875P7844Q3613O7252p912Q0932L2858l1276
5141A642186m4604J3069M969k6474K6967n0892r910O3151P9208k7000L5406J51847
5129A857923K02650J77800R6459J34788K09927L59932J91757j40933j91543k11434
5119B687326k96864k89035j61739p9775j65598r1252k294l3119K0756l231N5820
5108A640995K1510p433j07807K5431O9470P484o1881k9991j310J1607J22683M585
5096A695343J6516N6916O8978L8587j38839n4090r7794P0833K5033O226Q8674
$$ plain form
5085 1776383 1817219 1833198 1878602 1882796 1855493 1798270 1852990 1946665 2015878 2156052 2213193
5074 2213193 2296627 2308825 2386324 2501474 2677846 2839951 2959016 3204009 3568547 3869073
5064 3869073 4253503 4636650 5258286 6078256 7005637 7786127 8172223 7938732 7221254 6276014
5054 6276014 5329880 4667456 4201836 3824132 3553362 3257433 3022433 2931773 2934137 2879901
5044 2879901 2833883 2842954 2830548 2794051 2916202 2966658 2900233 2912662 3010848 3026499 3020518 3139827
5032 3139827 3275203 3435442 3727847 4017095 4254510 4287990 4078137 3687336 3275583 2974090
5022 2974090 2837524 2706663 2606761 2443205 2322024 2227375 2185634 2161489 2074650 2063878 2029733
5011 2029733 2051072 2061210 2086338 2050264 1996006 2010749 2027837 2045086 1986843 1995999 2001161 1983568
$$ packed form
5085A776383M0836J5979M5404M194k7303n7223N4720R3675O9213J40174N7141
5074B213193Q3434J2198P7499J15150J76372J62105J19065K44993L64538L00526
5064C869073L84430L83147O21636Q19970R27381P80490L86096k33491p17478r45240
5054F276014r46134o62424m65620l77704k70770k95929k35000r0660K364n4236
5044B879901m6018R071j2406l6497J22151N0456o6425J2429R8186J5651n981J19309
5032C139827J35376J60239K92405K89248K37415L3480k09853l90801m11753l01493
5022B974090j36566j30861r9902j63556j21181r4649m1741k4145q6839j0772l4145
5011B029733K1339J0138K5128l6074n4258J4743J7088J7249n8243R156N162j7593
$$ plain form
4999 1983568 1963236 1927943 1913681 1889346 2011730 2057999 2018712 1996930 2061810 2010049 1948142
4988 1948142 1964462 1933432 1930185 2006632 2108545 2116799 2144015 2142504 2179593 2160538 2188280 2267476
4976 2267476 2147574 2151426 2240764 2181450 2167179 2139830 2180404 2299347 2245042 2275272 2376696
4965 2376696 2438528 2463314 2469646 2449822 2513829 2524301 2593556 2652530 2742265 2894141 3138913
4954 3138913 3194010 3275283 3247046 3172697 3014918 2901105 2919993 2778273 2706017 2721587 2738544
4943 2738544 2801819 2805992 2824299 2821782 2824349 2797075 2850811 2982347 2983707 2968346 2971210 3058786
4931 3058786 3095937 3128440 3185480 3194935 3222228 3372336 3517447 3504992 3608177 3692993 3738755
4920 3738755 3812215 3811015 3825804 3825801 3920849 4109658 4134187 4180676 4177793 4276144 4344092 4439325
$$ packed form
4999A983568k0332l5293j4262k4335J22384M6269l9287k1782O4880n1761o1907
4988A948142J6320l1030l247P6447J01913Q254K7216j511L7089j9055K7742P9196
4976B267476j19902L852Q9338n9314j4271k7349M0574J18943n4305L0230J01424
4965B376696O1832K4786O332j9824O4007J0472O9255N8974Q9735J51876K44772
4954C138913N5097Q1273k8237p4349j57779j13813J8888j41720p2256J5570J6957
4943B738544O3275M173J8307k517K567k7274N3736J31536J360j5361K864Q7576
4931C058786L7151L2503N7040R455K7293J50108J45111j2455J03185Q4816M5762
4920C738755P3460j200J4789lR5048J88809K4529M6489k883R8351O7948R5233
$$ plain form
4908 4439325 4537008 4721476 4870263 4994603 5213802 5390671 5621622 5805811 5967832 6048988
4898 6048988 6122520 6229580 6321477 6481688 6593749 6635193 6618648 6654476 6757705 6824772 6980424
4887 6980424 7119415 7249425 7395544 7516547 7684256 7745167 7757245 7948245 8081896 8138074
4877 8138074 8322058 8441077 8500988 8649060 8833669 9024448 9202071 9526221 9690796 9913892
4867 9913892 10108253 10310609 10458162 10661046 10975269 11092843 11333510 11712870 11924218 12292111
4857 12292111 12621195 13045322 13610503 14264852 14893544 15514423 16217713 17132604 18177375
4848 18177375 19353572 20575944 21828612 22911443 23839046 24601033 25420097 26077576 26536386
4839 26536386 26747284 27084321 27546931 28214685 28958078 30047572 31183938 32475288 33962478
$$ packed form
4908D439325R7683J84468J48787J24340K19199J76869K30951J84189J62021Q1156
4898F048988P3532J07060R1897J60211J12061M1444j6545L5828J03229O7067J55652
4887F980424J38991J30010J46119J21003J67709O0911J2078J91000J33651N6178
4877H138074J83984J19019N9911J48072J84609J90779J77623L24150J64575K23096
4867I913892J94361K02356J47553K02884L14223J17574K40667L79360K11348L67893
4857A2292111L29084M24127N65181O54349O28692O20879P03290R14891J044771
4848A8177375J176197J222372J252668J082831R27603P61987Q19064O57479M58810
4839B6536386K10898L37037M62610O67754P43393J089494J136366J291350J487190
$$ plain form
4830 33962478 35727256 37735075 40086173 42686175 45716860 49018987 52686591 56884615
4822 56884615 62157295 68799272 76991508 86347022 97769605 111837335 128916262 148516595
4814 148516595 172639213 203566636 245263345 296040176 340071877 349237639 321161811
4807 321161811 272190366 210612168 161358961 129008029 106749848 90805231 78627215
4800 78627215 69063874 61269680 54885622 49663604 45422892 41871340 38978460 36495923
4792 36495923 34554618 32981168 31535590 30076710 28600078 27143960 25613485 24116843
4784 24116843 22984203 21933433 21102234 20264184 19390255 18594275 17877714 17154164 16378111
4775 16378111 15653434 15129717 14590137 14005694 13564075 13169856 12594248 12130110 11713413
$$ packed form
4830C3962478J764778K007819K351098K600002L030685L302127L667604M198024
4822E6884615N272680O641977Q192236R355514J1422583J4067730J7078927J9600333
4814A48516595K4122618L0927423M1696709N0776831M4031701R165762k8075828
4807C21161811m8971445o1578198m9253207l2350932k2258181j5944617j2178016
4800G8627215r563341p794194o384058n222018m240712l551552k892880k482537
4792C6495923j941305j573450j445578j458880j476632j456118j530475j496642
4784B4116843j132640j050770q31199q38050q73929p95980p16561p23550p76053
4775A6378111p24677n23717n39580n84443m41619l94219n75608m64138m16697
$$ plain form
4766 11713413 11343343 10969953 10638345 10444203 10174282 10004770 9838322 9631274 9602427 9572403
4756 9572403 9492557 9480379 9600749 9612075 9449667 9234405 8961964 8573349 8147622 7744056
4746 7744056 7496613 7216034 6972585 6730631 6439807 6246852 6111822 5993999 5872871 5720520
4736 5720520 5623835 5517078 5349892 5258185 5173008 5048633 5085346 4918759 4900014 4820049 4708543
4725 4708543 4643322 4576686 4502767 4381050 4214536 4116190 3930238 3793647 3643895 3527554
4715 3527554 3508066 3483681 3387999 3340142 3297306 3297938 3138530 3067692 2941424 2923961 2868647
4704 2868647 2789396 2798779 2722878 2704408 2663500 2533582 2498850 2378950 2374930 2374023 2370500 2461978
4692 2461978 2317793 2287194 2376575 2371167 2417192 2451376 2350583 2343846 2354791 2365011 2374385 2333561
$$ packed form
4766A1713413l70070l73390l31608j94142k69921j69512j66448k07048k8847l0024
4756I572403p9846j2178J20370J1326j62408k15262k72441l88615m25727m03566
4746G744056k47443k80579k43449k41954k90824j92955j35030j17823j21128j52351
4736E720520r6685j06757j67186r1707q5177j24375L6713j66587j8745p9965j11506
4725D708543o5221o6636p3919j21717j66514r8346j85952j36591j49752j16341
4715C527554j9488k4385r5682m7857m2836O32j59408p0838j26268j7463n5314
4704B868647p9251R383p5901j8470m0908j29918l4732j19900m020r07l523R1478
4692B461978j44185l0599Q9381n408M6025L4184j00793o737J0945J0220R374m0824
$$ plain form
4680 2333561 2254911 2199532 2167322 2100498 1968005 2013096 1970641 1948567 1943180 1929407 1970554
4669 1970554 1987004 1965482 2052644 2040364 2110374 2076472 2053418 2205924 2192511 2045930 1963438
4658 1963438 1929408 1878859 1916407 1931311 1835955 1781990 1726897 1734912 1753972 1746914 1713554 1686576
4646 1686576 1689908 1663284 1699886 1626306 1588222 1588005 1636967 1556669 1518705 1627568 1698665 1758977
4634 1758977 1926510 2179304 2238693 2306006 2319325 2403917 2250236 2065492 1912110 1707032
4624 1707032 1584533 1445820 1337106 1377432 1363221 1296271 1416130 1335880 1233435 1204526
4614 1204526 1316146 1247723 1265846 1225078 1213070 1246556 1210396 1285358 1239616 1248271 1241771 1335273
4602 1335273 1435561 1385208 1232196 1225335 1236404 1311624 1222845 1126473 1091691 1136792 1163825
$$ packed form
4680B333561p8650n5379l2210o6824j32493M5091m2455k2074n387j3773M1147
4669A970554J6450k1522Q7162j2280P0010l3902k3054J52506j3413j46581q2492
4658A963438l4030n0549L7548J4904r5356n3965n5093Q015J9060p058l3360k6978
4646A686576L332k6624L6602p3580l8084k17M8962q0298l7964J08863P1097O0312
4634A758977J67533K52794N9389O7313J3319Q4592j53681j84744j53382k05078
4624A707032j22499j38713j08714M0326j4211o6950J19859q0250j02445k8909
4614A204526J11620o8423J8123m0768j2008L3486l6160P4962m5742Q655o500R3502
4602A335273J00288n0353j53012o861J1069P5220q8779r6372l4782M5101K7033
$$ plain form
4591 1163825 1178883 1252390 1294226 1291595 1241398 1257919 1272299 1251433 1253024 1225233 1120764 1213701
4579 1213701 1294552 1244170 1224975 1215781 1201330 1179552 1197328 1168882 1110317 1200377 1154820 1107258
4567 1107258 1140286 1161774 1162607 1186692 1243750 1269226 1391930 1346634 1364860 1271014 1308691 1299587
4555 1299587 1335675 1333958 1317631 1318742 1336218 1422697 1436506 1513246 1514436 1527606 1477282 1514201
4543 1514201 1634653 1680500 1662122 1764315 1804625 1850143 1979747 2170912 2370432 2631338
4533 2631338 2812037 3103715 3540871 3933735 4269352 4469345 4288693 4053432 3620071 3146243
4523 3146243 2795030 2488235 2228713 2094080 2055923 1996131 1981237 1923059 1800994 1766476
4513 1766476 1780163 1739612 1719375 1793350 1753130 1753914 1722311 1882169 1900502 1950489 2008247 2104539
$$ packed form
4591A163825J5058P3507M1836k631n0197J6521J4380k0866J591k7791j04469R2937
4579A213701Q0851n0382j9195r194j4451k1778J7776k8446n8565R0060m5557m7562
4567A107258L3028K1488Q33K4085N7058K5476J22704m5296J8226r3846L7677r104
4555A299587L6088j717j6327J111J7476Q6479J3809P6740J190J3170n0324L6919
4543A514201J20452M5847j8378J02193M0310M5518J29604J91165J99520K60906
4533B631338J80699K91678M37156L92864L35617J99993j80652k35261m33361m73828
4523C146243l51213l06795k59522j34633l8157n9792j4894n8178j22065l4518
4513A766476J3687m0551k0237P3975m0220P84l1603J59858J8333M9987N7758R6292
$$ plain form
4501 2104539 2131178 2192505 2346124 2414920 2578063 2740882 3023597 3271534 3434411 3467165
4491 3467165 3353795 3076853 2928428 2672750 2554706 2517277 2429019 2434921 2388840 2302369 2301241
4480 2301241 2264442 2289274 2407251 2624345 2702049 2769289 2894682 3092043 3267363 3532425
4470 3532425 3822928 3907932 4036316 4027539 3779527 3772743 3711525 3655661 3556747 3509192 3352209
4459 3352209 3142143 3050778 3044823 2943589 2857095 2779143 2832217 2853561 2880873 3026015 3125828
4448 3125828 3290295 3447457 3614564 3867636 4194853 4506831 4934082 5172766 5254874 4963999
4438 4963999 4655767 4339867 4018092 3788598 3651854 3539686 3496949 3491304 3288498 3166497
4428 3166497 3155375 3026087 2952685 2898543 2772548 2714149 2697697 2667471 2689778 2632853 2645356
$$ packed form
4501B104539K6639O1327J53619O8796J63143J62819K82715K47937J62877L2754
4491C467165j13370k76942j48425k55678j18044l7429q8258N902m6081q6471j128
4480B301241l6799K4832J17977K17094P7704O7240J25393J97361J75320K65062
4470C532425K90503Q5004J28384q777k48012o784o1218n5864r8914m7555j56983
4459C352209k10066r1365n955j01234q6494p7952N3074K1344K7312J45142R9813
4448C125828J64467J57162J67107K53072L27217L11978M27251K38684Q2108k90875
4438D963999l08232l15900l21775k29494j36744j12168m2737n645k02806j22001
4428C166497j1122j29288p3402n4142j25995n8399j6452l0226K2307n6925J2503
$$ plain form
4417 2645356 2815612 2808375 2724021 2636160 2581989 2606610 2667130 2655638 2576070 2531613 2480393
4406 2480393 2511479 2610126 2601308 2571967 2637006 2660581 2721498 2740638 2835394 2877345 2979710
4395 2979710 3151905 3111612 3044278 2987558 3007529 2990901 2905251 2894308 2824328 2921536 2939527
4384 2939527 2958828 2979778 3124365 3185554 3074582 2943102 2885642 2863196 2795519 2811512 2854562
4373 2854562 2914718 2764175 2788641 2925973 2931360 2942812 2928189 2936226 2933820 2944629 3011785 3047902
4361 3047902 3115068 3044376 3070962 3108256 3078871 3114652 3185583 3278476 3354804 3330134 3328621 3346253
4349 3346253 3367642 3304149 3373868 3431460 3509889 3551761 3679557 3743737 3773088 3874953 3909689
4338 3909689 3903964 3942206 3927793 3877266 4007178 4049059 4031264 4120710 4212475 4263976 4382323
$$ packed form
4417B645356J70256p237q4354q7861n4171K4621O0520j1492p9568m4457n1220
4406B480393L1086R8647q818k9341O5039K3575O0917J9140R4756M1951J02365
4395B979710J72195m0293o7334n6720J9971j6628q5650j0943o9980R7208J7991
4384B939527J9301K0950J44587O1189j10972j31480n7460k2446o7677J5993M3050
4373B854562O0156j50543K4466J37332N387J1452j4623Q037k406J0809O7156L6117
4361C047902O7166p0692K6586L7294k9385L5781P0931R2893P6328k4670j513J7632
4349C346253K1389o3493O9719N7592P8429M1872J27796O4180K9351J01865L4736
4338C909689n725L8242j4413n0527J29912M1881j7795Q9446R1765N1501J18347
$$ plain form
4327 4382323 4379088 4395490 4357078 4313341 4334043 4283919 4290043 4349875 4355880 4447007 4460106 4394208
4315 4394208 4546728 4738435 4798139 4814187 4870869 4971479 5101335 5183441 5204219 5308108
4305 5308108 5433780 5471243 5525323 5575500 5629180 5692333 5766351 5918290 6085912 6115097 6195238
4294 6195238 6248333 6353944 6466634 6530091 6612116 6703021 6819774 6882600 6894698 6937019 7079746
4283 7079746 7154135 7295732 7445697 7660711 7801467 8038063 8362870 8575845 8863875 9217612
4273 9217612 9566488 9937581 10187576 10575884 11031150 11655997 12217424 12671662 12747504 12614515
4263 12614515 12458118 12280402 12176676 12007762 11730687 11466349 11236672 11126942 11180477 11175077
4253 11175077 11146141 11160749 11277109 11510750 11708577 11865987 11892873 11959952 11987801 11926328
$$ packed form
4327D382323l235J6402l8412m3737K0702n0124O124N9832O005R1127J3099o5898
4315D394208J52520J91707N9704J6048N6682J00610J29856Q2106K0778J03889
4305E308108J25672L7463N4080N0177N3680O3153P4018J51939J67622K9185Q0141
4294F195238N3095J05611J12690O3457Q2025R0905J16753O2826J2098M2321J42727
4283G079746P4389J41597J49965K15014J40756K36596L24807K12975K88030L53737
4273I217612L48876L71093K49995L88308M55266O24847N61427M54238P5842j32989
4263A2614515j56397j77716j03726j68914k77075k64338k29677j09730N3535n400
4253A1175077k8936J4608J16360K33641J97827J57410K6886O7079K7849o1473
$$ plain form
4243 11926328 11954690 12032194 12129311 12218534 12248944 12341904 12569525 12698735 12923740 13237022
4233 13237022 13430412 13603158 14013347 14357919 14732500 15070656 15457434 15983436 16482501
4224 16482501 17033250 17586266 18104421 18635011 19231251 19868512 20474486 21206823 22014671
4215 22014671 22883321 23786883 24779231 25753270 26876228 28017117 29194203 30437023 31643585
4206 31643585 32934270 34450318 36036952 37903692 39957601 42294149 44864550 47972695
4198 47972695 51439563 55313883 59589373 64684279 70734161 77971736 86516511 96544068
4190 96544068 108505718 122901504 139900536 160504487 186003143 218879157 259065835
4183 259065835 300564195 329544079 334722935 312711629 270864980 224160985 182284279
$$ packed form
4243A1926328K8362P7504R7117Q9223L0410R2960K27621J29210K25005L13282
4233A3237022J93390J72746M10189L44572L74581L38156L86778N26002M99065
4224A6482501N50749N53016N18155N30590N96240O37261O05974P32337Q07848
4215B2014671Q68650R03562R92348R74039J122958J140889J177086J242820J206562
4206C1643585J290685J516048J586634J866740K053909K336548K570401L108145
4198D7972695L466868L874320M275490N094906O049882P237575Q544775J0027557
4190I6544068J1961650J4395786J6999032K0603951K5498656L2876014M0186678
4183B59065835M1498360K8979884N178856k2011306m1846649m6703995m1876706
$$ plain form
4176 182284279 151585476 129809659 113317404 99877545 88463191 78759468 70622399
4169 70622399 64062360 58823076 54399257 50487360 46989765 43714891 40929985 38553055
4161 38553055 36512045 34888504 33482025 32302717 31199764 30127345 29129183 28155763
4153 28155763 27268043 26621091 26050231 25612505 25282311 25101840 25242802 25506080 25627540
4144 25627540 25212140 24055029 22552125 20823440 19229773 18061792 17097181 16183001 15487855
4135 15487855 14887409 14324980 13765140 13346226 12963910 12605927 12377108 12006866 11716951
4126 11716951 11438065 11258014 11086606 10893969 10806888 10626693 10515939 10245884 10062906 9912786
4116 9912786 9846732 9690313 9655442 9737099 9726018 9817190 9808625 9828265 9770565 9659183 9603937
$$ packed form
4176A82284279l0698803k1775817j6492255j3439859j1414354r703723q137069
4169G0622399o560039n239284m423819l911897l497595l274874k784906k376930
4161C8553055k041010j623541j406479j179308j102953j072419r98162r73420
4153B8155763q87720o46952n70860m37726l30194j80471J40962K63278J21460
4144B5627540m15400j157111j502904j728685j593667j167981r64611r14180o95146
4135A5487855o00446n62429n59840m18914l82316l57983k28819l70242k89915
4126A1716951k78886j80051j71408j92637q7081j80195j10754k70055j82978j50120
4116I912786o6054j56419l4871Q1657j1081R1172q565J9640n7700j11382n5246
$$ plain form
4105 9603937 9514976 9532890 9488897 9393959 9301336 9229455 9284579 9389076 9482033 9619200 9595637
4094 9595637 9267909 8904857 8381485 7982681 7579944 7324087 7057241 6865284 6749661 6603730
4084 6603730 6491781 6366479 6218166 6100675 6006488 5932871 5871495 5776865 5663145 5692256
4074 5692256 5621625 5570208 5580330 5444060 5459302 5461619 5376241 5379072 5322669 5372228 5310800 5361875
4062 5361875 5378614 5346384 5350246 5340439 5333965 5468876 5486187 5446545 5398105 5310488 5361682 5354862
4050 5354862 5398335 5444469 5485749 5427344 5411993 5440535 5465117 5611496 5564528 5613710 5720275
4039 5720275 5656967 5686496 5746646 5782423 5793578 5867456 5906383 5969669 6010933 6016406 6097603 5999585
4027 5999585 5994683 6052703 6032684 6095544 6261618 6303851 6401197 6587047 6708945 6894611 7159398
$$ packed form
4105I603937q8961J7914m3993r4938r2623p1881N5124J04497R2957J37167k3563
4094I595637l27728l63052n23372l98804m02737k55857k66846j91957j15623j45931
4084F603730j11949j25302j48313j17491r4187p3617o1376r4630j13720K9111
4074E692256p0631n1417J0122j36270J5242K317q5378K831n6403M9559o1428N1075
4062E361875J6739l2230L862r807o474J34911J7311l9642m8440q7617N1194o820
4050E354862M3473M6134M1280n8405j5351K8542K4582J46379m6968M9182J06565
4039E720275o3308K9529O0150L5777J1155P3878L8927O3286M1264N473Q1197r8018
4027E999585m902N8020k0019O2860J66074M2233R7346J85850J21898J85666K64787
$$ plain form
4016 7159398 7366806 7532351 7631462 7637413 7629813 7539805 7385267 7333826 7337498 7434415 7615061
4005 7615061 7834241 7977020 8066638 8146873 8242223 8295242 8404087 8466913 8516136 8702642 8950330
3994 8950330 9273960 9570422 9968425 10505291 11048388 11823525 12848303 13924273 14794908
3985 14794908 15141714 15065088 14602641 14189136 13847976 13796831 14137175 14851348 15768947 16662631
3975 16662631 17047952 16874215 16336638 15530537 14808205 14319607 14052454 13898568 13886819 13897007
3965 13897007 13996851 14325949 14651315 15148863 15742289 16673854 17578251 18246687 18616822 18716829
3955 18716829 18655417 18780159 19258351 20104234 20898106 21237335 21029932 20396187 19562168 19024490
3945 19024490 18678365 18714450 18879371 19154281 19528519 19932220 20326883 20442543 20617882 20756668
$$ packed form
4016G159398K07408J65545R9111N951p600r0008j54538n1441L672R6917J80646
4005G615061K19180J42779Q9618Q0235R5350N3019J08845O2826M9223J86506K47688
3994H950330L23630K96462L98003N36866N43097P75137J024778J075970Q70635
3985A4794908L46806p6626m62447m13505l41160n1145L40344P14173R17599Q93684
3975A6662631L85321j73737n37577q06101p22332m88598k67153j53886j1749J0188
3965A3897007R9844L29098L25366M97548N93426R31565R04397O68436L70135J00007
3955A8716829o1412J24742M78192Q45883P93872L39229k07403o33745q34019n37678
3945A9024490l46125L6085J64921K74910L74238M03701L94663J15660J75339J38786
$$ plain form
3935 20756668 20960243 21424147 21976435 22622132 23330463 23865420 24151805 24220457 24250761 24317624
3925 24317624 24721414 25392754 26168299 26962066 27680105 28536326 29234736 29978355 30650163
3916 30650163 31211190 31679813 32104237 32703838 33566871 34466260 35420764 36298318 37329903
3907 37329903 38540671 39755915 41355401 43139732 45188840 47550270 49996451 52259774
3899 52259774 54414379 56445709 58712155 61271655 64266579 67290541 70449270 73470037
3891 73470037 76335628 78865676 81361021 84047845 87121063 90455509 94563692 99467759
3883 99467759 105167471 111243301 116408649 119245534 119442318 117848994 116032255 115133648
3875 115133648 115622800 116994337 118526595 119949060 121072383 122234944 123685128 125187480
$$ packed form
3935B0756668K03575M63904N52288O45697P08331N34957K86385O8652L0304O6863
3925B4317624M03790O71340P75545P93767P18039Q56221O98410P43619O71808
3916C0650163N61027M68623M24424N99601Q63033Q99389R54504Q77554J031585
3907C7329903J210768J215244J599486J784331K049108K361430K446181K263323
3899E2259774K154605K031330K266446K559500K994924L023962L158729L020767
3891G3470037K865591K530048K495345K686824L073218L334446M108183M904067
3883I9467759N699712O075830N165348K836885J96784j593324j816739q98607
3875A15133648M89152J371537J532258J422465J123323J162561J450184J502352
$$ plain form
3867 125187480 126367603 126593330 125645363 123830968 121476504 119113794 117091493 115162598
3859 115162598 113335141 111943565 111149562 111233933 111877973 111562604 108857923 103986030 97600074
3850 97600074 90991067 85294898 80843058 77366614 74486894 71928487 69690679 67489376
3842 67489376 65079552 62548410 59795715 56852756 53825574 51014545 48526779 46545897
3834 46545897 45013696 43514054 41930042 40089145 38134425 36296178 34724405 33364731
3826 33364731 32353792 31582805 30798964 29830166 28926910 28014391 27224380 26408618 25802995
3817 25802995 25169504 24615858 23863572 22919448 22033251 21061918 20186106 19493744 18945365
3808 18945365 18568125 18257815 18011062 17791399 17653394 17683400 17485462 17286051 17206622 17010975
$$ packed form
3867A25187480J180123K25727r47967j814395k354464k362710k022301j928895
3859A15162598j827457j391576p94003Q4371O44040l15369k704681m871893o385956
3850I7600074o609007n696169m451840l476444k879720k558407k237808k201303
3842F7489376k409824k531142k752695k942959l027182k811029k487766j980882
3834D6545897j532201j499642j584012j840897j954720j838247j571773j359674
3826C3364731j010939p70987p83841r68798r03256r12519p90011q15762o05623
3817B5802995o33491n53646p52286r44124q86197r71333q75812o92362n48379
3808A8945365l77240l10310k46753k19663j38005L0006j97938j99411p9429j95647
$$ plain form
3798 17010975 16833105 16780892 16692617 16584551 16464961 16084404 15643957 15169199 14721437 14306232
3788 14306232 13831526 13455268 13239112 13015482 12800810 12637673 12591641 12611785 12468784 12422835
3778 12422835 12401673 12393222 12355692 12223313 12153316 12003680 11768851 11728004 11725000 11636651 11403338
3767 11403338 11242842 11073423 10990447 10847208 10769339 10720193 10700545 10665670 10724308 10821067 11027281
3756 11027281 11315678 11699590 12172901 12869202 13539951 14264808 15334460 16494213 17908803
3747 17908803 19625166 21384427 22576313 22592212 21393032 19478835 17192217 15191980
3739 15191980 13615654 12298642 11334491 10645241 10075811 9583878 9201122 8804227 8453052
3730 8453052 8229076 7940826 7766480 7613380 7455683 7272346 7138797 7126760 6992843 6784139
$$ packed form
3798A7010975j77870n2213q8275j08066j19590l80557m40447m74758m47762m15205
3788A4306232m74706l76258k16156k23630k14672j63137m6032K0144j43001m5949
3778A2422835k1162q451l7530j32379o9997j49636k34829m0847l004q8349k33313
3767A1403338j60496j69419q2976j43239p7869m9146j9648l4875N8638R6759K06214
3756A1027281K88397L83912M73311O96301O70749P24857J069652J159753J414590
3747A7908803J716363J759261J191886J5899j199180j914197k286618k000237
3739A5191980j576326j317012r64151o89250n69430m91933l82756l96895l51175
3730H453052k23976k88250j74346j53100j57697j83337j33549j2037j33917k08704
$$ plain form
3720 6784139 6617626 6518521 6544750 6434610 6360367 6329143 6266946 6148986 6147671 6156264 6123979
3709 6123979 6029237 5955405 5977596 5966894 5938795 5945101 5983235 5930951 5898179 5939007 5866075 5813215
3697 5813215 5817064 5791937 5738229 5629647 5587786 5557747 5607990 5507050 5457387 5464536 5497063
3686 5497063 5523659 5476849 5526925 5571974 5675174 5848307 6010889 6047003 6054675 6139754 6187118
3675 6187118 6269199 6373408 6509878 6661127 6813091 6926822 7006127 7062379 7165433 7092695
3665 7092695 7046014 7029296 7101743 7050975 7031419 7062506 6948611 6901485 6840760 6880375 6821401
3654 6821401 6869737 6862252 6995784 6880643 6760081 6587206 6576990 6631933 6562884 6530523 6549581
3643 6549581 6644134 6688636 6760711 6847716 6833786 6853260 6976770 6992082 6984996 6933159 6908036
$$ packed form
3720F784139j66513r9105K6229j10140p4243l1224o2197j17960j315Q593l2285
3709F123979r4742p3832K2191j0702k8099O306L8134n2284l2772M0828p2932n2860
3697E813215L849k5127n3708j08582m1861l0039N0243j00940m9663P149L2527
3686E497063K6596m6810N0076M5049J03200J73133J62582L6114P672Q5079M7364
3675F187118Q2081J04209J36470J51249J51964J13731P9305N6252J03054p2738
3665G092695m6681j6718P2447n0768j9556L1087j13895m7126o0725L9615n8974
3654F821401M8336p485J33532j15141j20562j72875j0216N4943o9049l2361J9058
3643F549581R4553M4502P2075Q7005j3930J9474J23510J5312p086n1837k5123
$$ plain form
3632 6908036 6817347 6766380 6733701 6625305 6581624 6637410 6546964 6417140 6296587 6265541 6051169
3621 6051169 5828191 5667748 5470717 5320023 5268075 5178451 4999095 4935362 4973287 4935077
3611 4935077 4920083 4909284 5035977 5037811 4957062 4971861 5025653 5028665 5087937 5141819 5079393 5088899
3599 5088899 5136290 5050954 4976131 4907896 4789722 4654731 4550364 4469953 4261019 4187536 4164799
3588 4164799 4141587 4046616 4001049 3992376 3809490 3667045 3645168 3680593 3568116 3569645 3507469
3577 3507469 3393481 3394368 3376478 3294187 3378945 3452773 3476751 3486216 3414432 3419161 3451183 3435205
3565 3435205 3355317 3296530 3263390 3208662 3180175 3167074 3023504 2948217 2960031 2882439 2820407
3554 2820407 2755497 2762289 2725022 2706797 2700498 2686508 2598882 2504705 2481912 2349819 2290948 2252077
$$ packed form
3632F908036r0689n0967l2679j08396m3681N5786r0446j29824j20553l1046k14372
3621F051169k22978j60443j97031j50694n1948q9624j79356o3733L7925l8210
3611D935077j4994j0799J26693J834q0749J4799N3792L012N9272N3882o2426R506
3599E088899M7391q5336p4823o8235j18174j34991j04367q0411k08934p3483k2737
3588D164799k3212r4971m5567q673j82886j42445k1877L5425j12477J529o2176
3577C507469j13988Q87j7890q2291Q4758P3828K3978R465p1784M729L2022j5978
3565C435205p9888n8787l3140n4728k8487j3101j43570p5287J1814p7592o2032
3554B820407o4910O792l7267j8225o299j3990q7626r4177k2793j32093n8871l8871
$$ plain form
3542 2252077 2294502 2256409 2166546 2127849 2257266 2211033 2106311 2101545 2176447 2279970 2322321
3531 2322321 2222752 2223528 2223708 2236283 2201497 2146043 2013798 1953857 1951768 1974357 1848148 1737539
3519 1737539 1772839 1834935 1828021 1684062 1674198 1736314 1712296 1672448 1609738 1545604 1541086 1478564
3507 1478564 1367835 1429937 1393293 1502455 1464376 1307054 1425265 1365075 1315489 1313300 1255667
3496 1255667 1287080 1297659 1323142 1326103 1302346 1281414 1241636 1155677 1164763 1100913 1154225 1244575
3484 1244575 1174900 1180098 1159815 1132343 1169142 1126261 1078652 1233190 1222542 1165275 1154342
3473 1154342 1166414 1151422 1258136 1305830 1285609 1237003 1149771 1091268 1152404 1203298 1179150
3462 1179150 1104750 1191494 1187948 1159521 1198092 1275748 1334474 1333050 1359143 1422855 1339828 1270632
$$ packed form
3542B252077M2425l8093q9863l8697J29417m6233j04722m766P4902J03523M2351
3531B322321r9569P76J80J2575l4786n5454j32245n9941k089K2589j26209j10609
3519A737539L5300O2096o914j43959r864O2116k4018l9848o2710o4134m518o2522
3507A478564j10729O2102l6644J09162l8079j57322J18211o0190m9586k189n7633
3496A255667L1413J0579K5483K961k3757k0932l9778q5959R086o3850N3312R0350
3484A244575o9675N198k0283k7472L6799m2881m7609J54538j0648n7267j0933
3473A154342J2072j4992J06714M7694k0221m8606q7232n8503O1136N0894k4148
3462A179150p4400Q6744l546k8427L8571P7656N8726j424K6093O3712q3027o9196
$$ plain form
3450 1270632 1176195 1219329 1259261 1318546 1409706 1458485 1403560 1395013 1488378 1560651 1623180 1675949
3438 1675949 1775388 1931557 2029175 2008324 1919224 1674553 1542022 1548141 1490058 1494387 1521742
3427 1521742 1505662 1474133 1497518 1510809 1459896 1507624 1558209 1582914 1475481 1501412 1557642
3416 1557642 1539216 1511689 1481574 1542737 1670394 1787369 1943198 2072041 2162142 2315647
3406 2315647 2564378 2727744 2782198 2660310 2454152 2194921 2054652 1834417 1720440 1713516
3396 1713516 1688978 1543174 1567770 1586315 1359398 1380220 1342526 1359369 1336897 1382941 1359126
3385 1359126 1323614 1259740 1213765 1291374 1301823 1288870 1357161 1415302 1485356 1490246 1614998
3374 1614998 1740289 1838562 1870449 1793551 1766412 1676020 1422138 1355795 1325671 1248760 1243868
$$ packed form
3450A270632r4437M3134L9932N9285R1160M8779n4925q547R3365P2273O2529N2769
3438A675949R9439J56169R7618k0851q9100k44671j32531O119n8083M329K7355
3427A521742j6080l1529K3385J3291n0913M7728N0585K4705j07433K5931N6230
3416A557642j8426k7527l0115O1163J27657J16975J55829J28843R0101J53505
3406B315647K48731J63366N4454j21888k06158k59231j40269k20235j13977o924
3396A713516k4538j45804K4596J8545k26917K0822l7694J6843k2472M6044k3815
3385A359126l5512o3874m5975P7609J0449j2953O8291N8141P0054M890J24752
3374A614998J25291R8273L1887p6898k7139r0392k53882o6343l0124p6911m892
$$ plain form
3363 1243868 1160313 1217641 1178887 1227048 1195219 1167825 1119914 1130624 1093899 1115791 1098634
3352 1098634 1095320 1062591 1076960 1124269 1054005 1109106 1180453 1174692 1157797 1158831 1176810 1217377
3340 1217377 1265490 1249445 1244154 1302406 1282967 1309479 1205872 1206076 1226940 1295299 1287209 1212097
3328 1212097 1172732 1191156 1143892 1139647 1166341 1190307 1250705 1216394 1158257 1144489 1206169 1216235
3316 1216235 1271626 1259192 1260871 1328934 1349707 1355300 1421147 1420769 1448228 1465333 1636667 1703320
3304 1703320 1700267 1751287 1687093 1733519 1779962 1685895 1584883 1634573 1742114 1805145 1770982
3293 1770982 1776647 1859916 1918642 1956884 2029816 2111815 2102806 2145704 2204634 2265649 2249748 2304544
3281 2304544 2373440 2356679 2361713 2491062 2681903 2789836 2919249 3081383 3186124 3345656
$$ packed form
3363A243868q3555N7328l8754M8161l1829k7394m7911J0710l6725K1892j7157
3352A098634l314l2729J4369M7309p0264N5101P1347n761j6895J034J7979M0567
3340A217377M8113j6045n291N8252j9439K6512j03607K04K0864O8359q090p5112
3328A212097l9365J8424m7264m245K6694K3966O0398l4311n8137j3768O1680J0066
3316A216235N5391j2434J679O8063K0773N593O5847l78K7459J7105J71334O6653
3304A703320l053N1020o4194M6426M6443r4067j01012M9690J07541O3031l4163
3293A770982N665Q3269N8726L8242P2932Q1999r009M2898N8930O1015j5901N4796
3281B304544O8896j6761N034J29349J90841J07933J29413J62134J04741J59532
$$ plain form
3271 3345656 3453533 3659916 3910021 4108997 4370821 4698638 5082144 5334791 5603505 5805926
3261 5805926 6091173 6247816 6299240 6298164 6348875 6200766 5927822 5660425 5282322 4921721
3251 4921721 4522020 4190340 3981015 3706943 3398540 3166416 2997543 2866791 2677803 2496638
3241 2496638 2415973 2364418 2286281 2226878 2192395 2212395 2215877 2064812 1926047 1926718 1931371 1981309
3229 1981309 1890001 1857116 1782463 1747208 1798829 1820873 1782271 1749625 1729519 1724733 1701385 1714029
3217 1714029 1683448 1661253 1690723 1606158 1530776 1501786 1499608 1423960 1368775 1309605 1442319
3206 1442319 1430971 1367040 1327159 1351488 1411859 1458646 1449693 1287686 1286294 1317342 1235129 1262730
3194 1262730 1256273 1303773 1374049 1312551 1300167 1266616 1221022 1304096 1304353 1336221 1403998 1374847
$$ packed form
3271C345656J07877K06383K50105J98976K61824L27817L83506K52647K68714K02421
3261E805926K85247J56643N1424j076N0711j48109k72944k67397l78103l60601
3251D921721l99701l31680k09325k74072l08403k32124j68873j30752j88988j81165
3241B496638q0665n1555p8137n9403l4483K0000L482j51065j38765O71M653M9938
3229A981309r1308l2885p4653l5255N1621K2044l8602l2646k0106m786k3348J2644
3217A714029l0581k2195K9470q4565p5382k8990k178p5648n5185n9170J32714
3206A442319j1348o3931l9881K4329O0371M6787q953j62007j392L1048q2213K7601
3194A262730o457M7500P0276o1498j2384l3551m5594Q3074K57L1868O7777k9151
$$ plain form
3182 1374847 1241691 1258103 1306617 1276175 1273653 1351362 1407585 1268219 1243765 1274027 1207921
3171 1207921 1210635 1222356 1200709 1175853 1115819 1123513 1028266 1008822 1088182 1134344 1081141 1058575
3159 1058575 1109623 1123653 1129717 1049160 1063619 1073743 1026065 1100458 1045124 1085430 1041906 943345
3147 943345 995576 968719 933414 1016681 980938 1001118 972716 984795 1005647 880169 950995
3136 950995 971866 1002693 922555 950565 1020101 923377 918552 936529 932237 951042 953617 910323
3124 910323 917168 926618 953156 950153 1031862 1032225 976875 912556 892468 903394 892765 874662 833143
3111 833143 782041 761173 760644 799110 802845 701864 682688 671603 704849 634294 655882 587163
3099 587163 511003 575448 615482 645040 647740 641277 611310 624721 539168 526783 631575 688869
$$ packed form
3182A374847j33156J6412M8514l0442k522P7709N6223j39366k4454L0262o6106
3171A207921K714J1721k1647k4856o0034P694r5247j9444P9360M6162n3203k2566
3159A058575N1048J4030O064q0557J4459J0124m7678P4393n5334M0306m3524r8561
3147I43345N2231k6857l5305Q3267l5743K0180k8402J2079K0852j25478P0826
3136I50995K0871L0827q0138K8010O9536r6724m825J7977m292J8805K575m3294
3124I10323O845R450K6538l003Q1709L63n5350o4319k0088J0926j0629j8103m1519
3111H33143n1102k0868n29L8466L735j00981j9176j1085L3246p0555K1588o8719
3099E87163p6160O4445M0034K9558K700o463k9967J3411q5553j2385J04792N7294
$$ plain form
3087 688869 613656 549787 569920 598958 630897 671935 593223 505673 464886 451817 578934
3076 578934 577717 518991 480810 456304 434696 431415 405999 415192 438102 425104 403845 399010
3064 399010 455621 436185 399558 464816 408061 365263 437027 358536 280961 356665 349046 362308
3052 362308 392479 336311 353242 356089 377777 382542 330680 347028 403030 257976 265775 287266
3040 287266 226645 280909 253217 306864 356723 380337 362612 354792 369364 329527 345528 399577
3028 399577 372127 357229 341945 349895 379966 363494 403294 365223 329097 371052 348792 290489
3016 290489 252478 239449 320987 309215 234021 212705 277382 305205 392770 301508 324251 361184
3004 361184 331008 307328 272515 312580 314567 356437 322608 237246 167211 279136 347439 330273
$$ packed form
3087F88869p5213o3869K0133K9038L1939M1038p8712q7550m0787j3069J27117
3076E78934j217n8726l8181k4506k1608l281k5416R193K2910j2998k1259m835
3064C99010N6611j9436l6627O5258n6755m2798P1764p8491p7575P5704p619J3262
3052C62308L0171n6168J6931K847K1688M765n1862J6348N6002j45054P799K1491
3040B87266o0621N4264k7692N3647M9859K3614j7725p820J4572l9837J6001N4049
3028C99577k7450j4898j5284P950L0071j6472L9800l8071l6126M1955k2260n8303
3016B90489l8011j3029Q1538j1772p5194k1316O4677K7823Q7565r1262K2743L6933
3004C61184l0176k3680l4813M0065J987M1870l3829q5362p0035J11925O8303j7166
$$ plain form
2992 330273 228310 341178 332504 308503 270548 289193 315263 297141 327537 346068 339017 316658
2980 316658 335382 300526 233928 316397 293863 288236 356008 316941 335428 258274 290068 260740
2968 260740 208864 268668 242266 271456 384685 377601 386353 330325 291682 292623 330314 303085
2956 303085 363908 403907 428813 438634 369124 458241 470762 417266 479363 512678 494152 519687
2944 519687 457489 480541 490692 533858 630286 514193 474680 462747 449446 469405 488539
2933 488539 472278 459024 473931 524395 494348 484195 491422 515478 516093 568443 650407 645136
2921 645136 654763 684758 725388 723060 757520 725761 758120 694213 574289 589499 573130 522175
2909 522175 491399 486096 416244 327856 373925 369026 349399 334649 299041 285809 351826 376379
$$ packed form
2992C30273j01963J12868q674k4001l7955J8645K6070j8122L0396J8531p051k2359
2980C16658J8724l4856o6598Q2469k2534n627O7772l9067J8487p7154L1794k9328
2968B60740n1876N9804k6402K9190J13229p084Q752n6028l8643R41L7691k7229
2956C03085O0823L9999K4906R821o9510Q9117J2521n3496O2097L3315j8526K5535
2944E19687o2198K3052J0151M3166R6428j16093l9513j1933j3301J9959J9134
2933D88539j6261j3254J4907N0464l0047j0153P227K4056O15N2350Q1964n271
2921F45136R627K9995M0630k328L4460l1759L2359o3907j19924J5210j6369n0955
2909E22175l0776n303o9852q8388M6069m899j9627j4750l5608j3232O6017K4553
$$ plain form
2897 376379 291960 276617 269594 230044 331858 355627 408762 377769 384147 418363 360060 317200
2885 317200 252637 221713 283143 215885 217076 319672 283106 231547 146634 151970 215195 287160
2873 287160 171966 219122 174143 141235 87105 23407 117046 129164 86467 34338 85276
2862 85276 59163 37739 -24702 -8985 -28934 20624 114316 -17466 -100748 -33068 19588 14819
2850 14819 -27976 -4505 -23348 -9923 -32710 -33364 -26706 -18612 79080 52916 -16716 32098 66090
2837 66090 87034 140189 92324 97757 73889 26565 -45581 -48750 -95 -57796 -77101 -39400
2825 -39400 -16946 31456 2485 -18882 -62622 -13192 -56045 -42740 -94775 -135206 -121718 -7004
2813 -7004 3690 -40762 -13604 -16893 -23288 -44909 -134838 -149053 -143324 -165995 -144040 -62967 -88999
$$ packed form
2897C76379q4419j5343p023l9550J01814K3769N3135l0993O378L4216n8303m2860
2885C17200o4563l0924O1430o7258J191J02596l6566n1559q4913N336O3225P1965
2873B87160j15194M7156m4979l2908n4130o3698R3639J2118m2697n2129N0938
2862H5276k6113k1424o2441J5717j9949M9558R3692j31782q3282O7680N2656m769
2850A4819m2795K3471j8843J3425k2787o54O658Q094R7692k6164o9632M8814L3992
2837F6090K0944N3155m7865N433k3868m7324p2146l169M8655n7701j9305L7701
2825c9400K2454M8402k8971k1367m3740M9430m2853J3305n2035m0431J3488J14714
2813g004J0694m4452K7158l289o395k1621q9929j4215N729k2671K1955Q1073k6032
$$ plain form
2800 -88999 -176973 -125262 -55425 -46781 -36198 -19466 -86212 -90889 -25453 13293 38448 100039
2788 100039 2113 10315 -108670 -123835 -132345 -95208 -66580 -14465 7315 -18975 -48118 -49932
2776 -49932 -80956 -92480 -101887 -56127 18193 76904 20002 -13000 12529 -20680 -43426 -115031
2764 -115031 -40974 47824 16191 5253 -40406 -170103 -138960 -100840 -7529 -21313 -33259
2753 -33259 -37771 -109490 -123212 -69906 -9127 -54795 -63254 -36649 -71763 -33769 -30182 -45174
2741 -45174 -88708 -123483 -169557 -107193 -73797 -121723 -133437 -146379 -178369 -155264 -184487 -161788
2729 -161788 -142204 -233013 -213572 -187906 -69759 -56221 -30065 -49802 -59305 -95644 -48891 -55418
2717 -55418 -36973 -83927 -121510 -150740 -162820 -58297 -5343 -51706 -122673 -36503 -53482 -95481
$$ packed form
2800h8999q7974N1711O9837Q644J0583J6732o6746m677O5436L8746K5155O1591
2788A00039r7926Q202j18985j5165q510L7137K8628N2115K1780k6290k9143j814
2776d9932l1024j1524r407M5760P4320N8711n6902l3002K5529l3209k2746p1605
2764a15031P4057Q8798l1633j0938m5659j29697L1143L8120R3311j3784j1946
2753c3259m512p1719j3722N3306O0779m5668q459K6605l5114L7994L587j4992
2741d5174m3534l4775m6074O2364L3396m7926j1714j2942l1990K3105k9223K2699
2729a61788J9584r0809J9441K5666J18147J3538K6156j9737r503l6339M6753o527
2717e5418J8445m6954l7583k9230j2080J04523N2954m6363p0967Q6170j6979m1999
$$ plain form
2705 -95481 -24584 -19517 8191 24287 -18003 17966 -133618 -86774 -41331 -58666 -91792 -80940
2693 -80940 -89939 -59510 -106628 -134373 -123836 -88673 -66129 -96538 -154265 -169569 -82968 -82570
2681 -82570 -149538 -178643 -98116 -132799 -130850 -129039 -135101 -74577 -76156 -36012 -49900 -33705 -52217
2668 -52217 -62589 -82760 -149494 -89873 -109795 -154893 -106476 -80940 -105282 -125400 -109943 -41910
2656 -41910 -29340 15633 1664 9449 41047 21543 -28581 -53160 -206232 -141765 -86420 -88530
2644 -88530 -98005 -98707 -17851 19114 -15296 4991 47678 -13213 -53659 -150031 -140546 -138332 -146721
2631 -146721 -165476 -149055 -183592 -170149 -160456 -196992 -100178 -46544 -90070 -18869 33321 80184
2619 80184 -62170 -165467 -129536 -134770 -145673 -100994 -3559 -81905 -126185 -15491 -10166 -83526
$$ packed form
2705i5481P0897N067K7708J6096m2290L5969j51584M6844M5443j7335l3126J0852
2693h0940q999L0429m7118k7745J0537L5163K2544l0409n7727j5304Q6601L98
2681h2570o6968k9105Q0527l4683J949J811o062O0524j579M0144j3888J6195j8512
2668e2217j0372k0171o6734N9621j9922m5098M8417K5536k4342k0118J5457O8033
2656d1910J2570M4973j3969P785L1598j9504n0124k4579j53072O4467N5345k110
2644h8530r475p02Q0856L6965l4410K0287M2687o0891m0446r6372R485K214q389
2631a46721j8755J6421l4537J3443R693l6536R6814N3634m3526P1201N2190M6863
2619H0184j42354j03297L5931n234j0903M4679R7435p8346m4280J10694N325p3360
$$ plain form
2607 -83526 -91742 -57907 -93746 -90549 -80602 -109898 -74891 -85464 -91852 -57418 -36008 -116186 -6847
2594 -6847 -88370 -71272 -55986 4451 29127 -15365 42964 38545 -27265 -45925 -49216 -61078
2582 -61078 -14426 36928 7359 34247 -54114 -129291 -78290 -47234 1889 25449 16325 40053
2570 40053 31677 -70450 -69745 -56742 -62376 -135047 -54031 -147507 -190514 -133824 -82934 -69872
2558 -69872 -49755 -96678 -85509 -78476 -73607 -24380 6249 -29017 -132045 -80076 -71200 -55133
2546 -55133 -37978 -76767 -62787 48541 36012 -9249 -38052 -84479 -76697 -57244 -50717 -70048
2534 -70048 -99880 -134829 -113211 -127833 -155942 -142102 -49002 -78841 -42926 -23612 3547 25285
2522 25285 44264 58047 35173 20998 -3065 24331 39131 -40326 -100028 -112292 -118265 -17567
$$ packed form
2607h3526q216L3835l5839L197R947k9296L5007j0573o388L4434K1410q0178J09339
2594f847q1523J7098J5286O0437K4676m4492N8329m419o5810j8660l291j1862
2582f1078M6652N1354k9569K6888q8361p5177N1001L1056M9123K3560r124K3728
2570D0053q376j02127P05J3003n634p2671Q1016r3476m3007N6690N0890J3062
2558f9872K0117m6923J1169P033M869M9227L0629l5266j03028N1969Q876J6067
2546e5133J7155l8789J3980J11328j2529m5261k8803m6427P782J9453O527j9331
2534g0048k9832l4949K1618j4622k8109J3840R3100k9839L5915J9314K7159K1738
2522B5285J8979J3783k2874j4175k4063K7396J4800p9457n9702j2264n973J00698
$$ plain form
2510 -17567 -40680 -119692 -22678 -95590 -131612 -36122 57550 -1749 -63057 -47034 -104927 -77875
2498 -77875 -61224 -57552 20099 15379 -88919 -75157 -66984 -162638 -24607 44517 40324 1797
2486 1797 -44736 -37265 -25345 24761 -29132 61834 49431 45203 16751 20243 22361 15262 -35468
2473 -35468 -98538 -19446 32285 102978 68954 -20333 11183 18424 1369 -13853 53530 45348
2461 45348 66297 55854 9337 -23024 -2059 -16776 -49089 -27292 26835 -32280 18731 19487
2449 19487 -45526 -57131 40597 23999 -2441 48356 53653 40890 52789 34385 -35804 2269
2437 2269 337 91183 45335 4152 -25783 58291 138983 142775 145350 151481 -58469 4905 13147
2424 13147 -9439 -5513 48505 206848 85349 37210 -10028 24067 48428 96053 48899 33263
$$ packed form
2510a7567k3113p9012R7014p2912l6022R5490R3672n9299o1308J6023n7893K7052
2498g7875J6651L672P7651m720j04298J3762Q173r5654J38031O9124m193l8527
2486A797m6533P471J1920N0106n3893R0966j2403m228k8452L492K118p099n0730
2473c5468o3070P9092N1731P0693l4024q9287L1516P241j7055j5222O7383q182
2461D5348K0949j0443m6517l2361K0965j4717l2313K1797N4127n9115N1011P56
2449A9487o5013j1605R7728j6598k6440N0797N297j2763J1899j8404p0189L8073
2437B269j932R0846m5848m1183k9935Q4074Q0692L792K575O131k09950O3374Q242
2424A3147k2586L926N4018J58343j21499m8139m7238L4095K4361M7625m7154j5636
$$ plain form
2412 33263 -3501 13303 42693 48292 81718 94033 91656 130326 149297 168522 86845 133664
2400 133664 216321 156075 211394 234391 270591 305187 201947 256140 300370 361911 409157
2389 409157 372395 425794 404064 423558 467718 402202 326357 292146 217978 128683 111840 148962
2377 148962 110067 114672 130866 116695 112358 56555 104900 124010 144545 52686 -20548 73169
2365 73169 140663 153362 201234 162858 83086 135450 186480 174506 88086 132724 159466 123269
2353 123269 104093 162639 123634 195095 244956 247943 155989 126833 115241 79902 284796 331500
2341 331500 173723 177044 184630 122376 105703 187288 238218 219503 187330 216120 286181 211063
2329 211063 268786 270948 278366 254681 192667 262863 274404 213802 200379 213386 147724 240812
$$ packed form
2412C3263l6764J6804K9390N599L3426J2315k377L8670J8971J9225q1677M6819
2400A33664Q2657o0246N5319K2997L6200L4596j03240N4193M4230O1541M7246
2389D09157l6762N3399k1730J9494M4160o5516p5845l4211p4168q9295j6843L7122
2377A48962l8895M605J6194j4171m337n5803M8345J9110K0535r1859p3234R3717
2365G3169O7494J2699M7872l8376p9772N2364N1030j1974q6420M4638K6742l6197
2353A23269j9176N8546l9005P1461M9861K987r1954k9156j1592l5339K04894M6704
2341C31500j57777L321P586o2254j6673Q1585N0930j8715l2173K8790P0061p5118
2329B11063N7723K162P418k3685o2014P0196J1541o0602j3423J3007o5662R3088
$$ plain form
2317 240812 272086 266507 284278 299144 265532 279725 225873 225660 235036 210852 312207 359886
2305 359886 312917 325290 300028 339060 356681 265386 293378 250645 241314 381472 338809 255541
2293 255541 260320 286963 306253 337647 361551 445023 380410 369651 329918 315019 365975 397382
2281 397382 447676 326018 352311 406619 377806 396217 341887 274079 304097 394424 394035 397521
2269 397521 429608 463281 493419 504842 449302 422322 409004 486481 520490 524767 486924 425770
2257 425770 435485 435165 458442 414234 405398 412245 481239 464310 483602 493392 529310 504221 557212
2244 557212 530372 635974 598335 647669 675749 665654 646845 650847 661024 632242 669172 770910
2232 770910 873190 846360 784003 756932 759266 827982 827983 809061 770937 818496 820040 836294 764015
$$ packed form
2317B40812L1274n579J7771J4866l3612J4193n3852k13R376k4184J01355M7679
2305C59886m6969J2373k5262L9032J7621r1295K7992m2733r331J40158m2663q3268
2293B55541M779K6643J9290L1394K3904Q3472o4613j0759l9733j4899N0956L1407
2281C97382N0294j21658K6293N4308k8813J8411n4330o7808L0018R0327l89L486
2269C97521L2087L3673L0138J1423n5540k6980j3318P7477L4009M277l7843o1154
2257D25770R715l20K3277m4208q836O847O8994j6929J9292R790L5918k5089N2991
2244E57212k6840J05602l7639M9334K8080j0095j8809M002J0177k8782L6930J01738
2232G70910J02280k6830o2357k7071K334O8716Jj8922l8124M7559J544J6254p2279
$$ plain form
2219 764015 828645 876052 954023 1067048 1058749 1125362 1169445 1212244 1276204 1298888 1389885 1370926
2207 1370926 1324860 1364313 1317756 1344221 1385869 1440925 1379402 1460306 1574388 1584729 1549546
2196 1549546 1529513 1520600 1500853 1658939 1764328 1731628 1723843 1790635 1690288 1649553 1742179
2185 1742179 1827626 1879628 1829381 1899715 2019444 1997458 1935418 2035761 2047504 2138071 2145535
2174 2145535 2120044 2239057 2317305 2350914 2389515 2450756 2522422 2629923 2680770 2781408 2839057
2163 2839057 2931455 3095255 3162330 3305563 3421945 3469403 3588304 3788800 3899749 4151821
2153 4151821 4410830 4591271 4811257 5059787 5322606 5626462 5902936 6221470 6448353 6708504
2143 6708504 7120228 7577170 8029662 8510664 9080140 9759113 10629736 11624484 12544093 13349346
$$ packed form
2219G64015O4630M7407P7971J13025q299O6613M4083M2799O3960K2684R0997j8959
2207A370926m6066L9453m6557K6465M1648N5056o1523Q0904J14082J0341l5183
2196A549546k0033q913j9747J58086J05389l2700p785O6792j00347m0735R2626
2185A742179Q5447N2002n0247P0334J19729k1986o2040J00343J1743R0567P464
2174B145535k5491J19013P8248L3609L8601O1241P1666J07501N0847J00638N7649
2163B839057R2398J63800O7075J43233J16382M7458J18901K00496J10949K52072
2153D151821K59009J80441K19986K48530K62819L03856K76474L18534K26883K60151
2143F708504M11724M56942M52492M81002N69476O78973Q70623R94748R19609Q05253
$$ plain form
2133 13349346 14282220 15343820 16599769 18305434 20375424 23145640 26384312 30422610
2125 30422610 35022060 40962697 48714164 59552532 72264509 81024428 78875063 69815556
2117 69815556 56281427 41836035 32667469 26616088 22475915 19213965 16813080 14905377
2109 14905377 13392415 12175626 11435341 10841860 10328555 9535820 8831109 8073503 7409275
2100 7409275 6821695 6278216 5863005 5580586 5281492 5020488 4813845 4542256 4311504 4160390
2090 4160390 3974173 3900520 3745679 3527325 3424710 3273949 3109149 3105587 2998107 2754443
2080 2754443 2621492 2462791 2384219 2334365 2208604 2186444 2173119 2072997 1979066 1905773 1805372
2069 1805372 1784565 1689034 1677585 1624286 1496166 1465965 1480398 1463310 1373510 1322332 1303866
$$ packed form
2133A3349346R32874J061600J255949J705665K069990K770216L238672M038298
2125C0422610M599450N940637P751467J0838368J2711977Q759919k149365r059507
2117F9815556j3534129j4445392r168566o051381m140173l261950k400885j907703
2109A4905377j512962j216789p40285n93481n13305p92735p04711p57606o64228
2100G409275n87580n43479m15211k82419k99094k61004k06643k71589k30752j51114
2090D160390j86217p3653j54841k18354j02615j50761j64800l562j07480k43664
2080B754443j32951j58701p8572m9854j25761k2160j3325j00122r3931p3293j00401
2069A805372k0807r5531j1449n3299j28120l0201J4433j7088q9800n1178j8466
$$ plain form
2058 1303866 1344886 1322287 1176740 1151500 1081605 1030632 1054546 1087300 1060294 1071693 997125
2047 997125 955065 971173 978855 949633 910138 891662 870157 855936 852598 823073 792130 787850
2035 787850 759730 732470 762214 738482 711908 736647 727460 672257 594894 574949 550026 471526
2023 471526 480766 470485 437039 517498 492607 453937 490318 469644 340145 393111 435097 450757
2011 450757 422385 420929 383144 382806 338593 342544 331608 302217 259815 111843 149561 199719
1999 199719 243290 305520 368287 414693 360957 326486 290538 330427 284950 366318 435493 396677
1987 396677 362309 305670 292589 214978 312282 376864 260571 219610 188965 155389 152970 177693
1975 177693 199220 139903 172453 210201 127508 120259 118173 60792 105782 129445 150761 179293
$$ packed form
2058A303866M1020k2599j45547k5240o9895n0973K3914L2754k7006J1399p4568
2047I97125m2060J6108P682k9222l9495j8476k1505j4221l338k9525l0943m280
2035G87850k8120k7260K9744k3732k6574K4739r187n5203p7363j9945k4923p8500
2023D71526R240j0281l3446Q0459k4891l8670L6381k0674j29499N2966M1986J5660
2011D50757k8372j456l7785l38m4213L951j0936k9391m2402j47972L7718N0158
1999A99719M3571O2230O2767M6406n3736l4471l5948L9889m5477Q1368O9175l8816
1987C96677l4368n6639j3081p7611R7304O4582j16293m0961l0645l3576k419K4723
1975A77693K1527n9317L2550L7748q2693p249k086n7381M4990K3663K1316K8532
$$ plain form
1963 179293 131300 112654 21778 -26760 160811 127732 100849 103188 66412 118692 104316 80807
1951 80807 139384 107473 43747 34564 166744 225690 158953 116965 108720 32224 106648 157899
1939 157899 84380 98778 30029 59553 2412 -12810 -12558 32537 -8957 -89289 -106981 -100377
1927 -100377 -95045 -73623 -41904 -55661 -14099 -15095 -59855 42464 50543 56368 -5947 66717
1915 66717 141257 76524 32867 23275 11262 -25456 -399 70211 120712 149360 66342 10166
1903 10166 -33677 -499 -80222 -39493 18 -30695 97102 176988 100666 54631 110496 36519
1891 36519 113226 127264 104150 -78062 -66536 22241 -27585 -6721 69543 43976 -18156 52541
1879 52541 55709 93876 12359 -60938 9880 68934 60149 95656 52434 54109 -10084 32882
$$ packed form
1963A79293m7993j8646r0876m8538J87571l3079k6883K339l6776N2280j4376k3509
1951H0807N8577l1911o3726r183J32180N8946o6737m1988q245p6496P4424N1251
1939A57899p3519J4398o8749K9524n7141j5222K52M5095m1494q0332j7692O604
1927a00377N332K1422L1719j3757M1562r96m4760J02319Q079N825o2315P2664
1915F6717P4540o4733m3657r592j2013l6718K5057P0610N0501K8648q3018n6176
1903A0166m3843L3178p9723M0729L9511l0713J27797P9886p6322m6035N5865p3977
1891C6519P6707J4038k3114j82212J1526Q8777m9826K0864P6264k5567o2132P0697
1879E2541L168L8167q1517p3297P0818N9054q785L5507m3222J675o4193M2966
$$ plain form
1867 32882 66069 3123 -29773 -59990 -27398 46071 59139 -34679 14990 51358 104178 96568
1855 96568 122589 175928 203282 276416 404542 400814 405451 331765 277729 208690 194493 154988
1843 154988 93685 1904 30793 49579 83722 105618 89289 25347 -53548 -84842 -8620 16548
1831 16548 -60319 -50891 -42 25677 -24609 6713 31893 9823 23816 113722 63845 -5550
1819 -5550 -104969 -71308 49111 28678 -100617 -62489 -93914 -110636 -60847 -10227 40671 65292
1807 65292 60330 50009 25830 400 19930 -11926 -53087 -149114 -62356 30235 -10092 -109407
1795 -109407 -24916 -23827 -22768 16072 -1730 -81006 -51852 -89411 -78577 13388 -48785 -161904
1783 -161904 -125581 -65256 -62765 -74726 -36879 11147 6327 23037 -18040 -44786 -5482 -69469
$$ packed form
1867C2882L3187o2946l2896l0217L2592P3469J3068r3818M9669L6368N2820p610
1855I6568K6021N3339K7354P3134J28126l728M637p3686n4036o9039j4197l9505
1843A54988o1303r1781K8889J8786L4143K1896j6329o3942p8895l1294P6222K5168
1831A6548p6867R428N0849K5719n0286L1322K5180k2070J3993Q9906m9877o9395
1819e550r9419L3661J20419k0433j29295L8128l1425j6722M9789N0620N0898K4621
1807F5292m962j0321k4179k5430J9530l1856m1161r6027Q6758R2591m0327r9315
1795a09407Q4491J089J059L8840j7802p9276K9154l7559J0834R1965o2173j13119
1783a61904L6323O0325K491j1961L7847M8026m820J6710m1077k6746L9304o3987
$$ plain form
1771 -69469 -88248 -172714 -178806 -96719 -79337 -33012 -49259 -6826 112820 11719 -15542 50675
1759 50675 -4004 74339 40447 6672 -82809 -130441 -109192 -90199 -75943 -63089 -65860 -58642
1747 -58642 -64751 -45136 -119003 -85956 -57366 -61569 1073 73432 48301 6202 51369 -17285
1735 -17285 -100675 -86756 -88482 -26149 -25182 -18127 -81447 -111755 -98152 -131627 -84741 -3621 -14346
1722 -14346 -65963 -102021 -66916 -65000 5979 -30924 1347 -33379 -91102 -132441 -52136 -24095
1710 -24095 -96690 -112418 -116053 -50363 -73043 -95440 -27615 4447 -55597 -31650 -45393 -51489
1698 -51489 -28046 -21680 -96957 -95127 -13441 -76867 -156842 -122542 -32159 -61662 -101064 -131599
$$ packed form
1771f9469j8779q4466o092Q2087J7382M6325j6247M2433J19646j01101k7261O6217
1759E0675n4679P8343l3892l3775q9481m7632K1249J8993J4256J2854k771P218
1747e8642o109J9615p3867L3047K8590m203O2642P2359k5131m2099M5167o8654
1735a7285q3390J3919j726O2333R67P055o3320l0308J3603l3475M6886Q1120j0725
1722a4346n1617l6058L5105J916P0979l6903L2271l4726n7723m1339Q0305K8041
1710b4095p2595j5728l635O5690k2680k2397O7825L2062o0044K3947j3743o096
1698e1489K3443O366p5277J830Q1686o3426p9975L4300R0383k9503l9402l0535
$$ [...]
##END NTUPLES=NMR SPECTRUM
##END=
