##TITLE=1H_EC-3265(III-15)
 CDCl3
 8 sc, 
 9.02.2022
##JCAMPDX= 6.0         $$ Bruker NMR JCAMP-DX V2.0
##DATA TYPE= NMR SPECTRUM
##DATA CLASS= NTUPLES
##ORIGIN= UXNMR, Bruker Analytische Messtechnik GmbH
##OWNER= root
$$ XWIN-NMR		Version 3.5
$$ Wed Feb  9 10:55:31 2022 Russian Standard Time (UT+4h)  she@DPX200
##.OBSERVE FREQUENCY= 200.131346
##.OBSERVE NUCLEUS= ^1H
##.ACQUISITION MODE= SIMULTANEOUS
##.ACQUISITION SCHEME= undefined
##.AVERAGES= 8
##.DIGITISER RES= 18
##SPECTROMETER/DATA SYSTEM= spect
##.PULSE SEQUENCE= zg30
##.SOLVENT NAME= CDCl3
##.SHIFT REFERENCE= (INTERNAL, CDCl3, 0, 15.7171)
##AUDIT TRAIL= $$ (NUMBER, WHEN, WHO, WHERE, WHAT)
$$ ##TITLE= Audit trail, XWIN-NMR		Version 3.5
$$ ##JCAMPDX= 5.01
$$ ##ORIGIN= Bruker BioSpin GmbH
$$ ##OWNER= she
$$ F:/spectra/data/she/nmr/H-F/1/pdata/1/auditp.txt
$$ ##AUDIT TRAIL=  $$ (NUMBER, WHEN, WHO, WHERE, WHAT)
(   1,<2022-02-09 10:53:42.21 +0400>,<she>,<DPX200>,
      <created by zg, POWCHK disabled, PULCHK disabled
       configuration hash MD5:
       00 E9 B6 7A A2 85 ED C7 34 08 36 98 17 FE 4E 26
       data hash MD5: 16K
       7E 5D 32 D0 FD 42 2B 40 80 EE F8 E6 A1 84 16 A0>)
(   2,<2022-02-09 10:53:45.79 +0400>,<she>,<DPX200>,
      <Start of raw data processing
       efp BC_mod = 2 LB = 0.24 FT_mod = 6 PKNL = 1 PHC0 = -15869.76 PHC1 = 11.20078 SI = 16K 
       data hash MD5: 16K
       18 BB DD A8 A4 1C B2 9F 2D 23 AA B7 2E 46 1E 19>)
(   3,<2022-02-09 10:54:09.04 +0400>,<she>,<DPX200>,
      <pk PHC0 = 0.6494259 PHC1 = 0 
       data hash MD5: 16K
       F6 31 17 0F 7C 4E CF C3 04 FE 83 FB E7 38 40 E9>)
(   4,<2022-02-09 10:54:13.34 +0400>,<she>,<DPX200>,
      <abs ABSG = 5 
       data hash MD5: 16K
       8B CC 40 78 F4 72 80 DA 57 CD 0F 98 65 27 4A 84>)
$$ ##END=
$$ 
$$ hash MD5
$$ 0A 47 AF 2D 55 B6 D3 E4 15 79 45 88 E2 01 88 55
##$RELAX= 
##$RELAX= 
##$RELAX= 
##$RELAX= 
##$RELAX= 
##$RELAX= 
$$ Bruker specific parameters
$$ --------------------------
##$DU= <F:/spectra>
##$EXPNO= 1
##$NAME= <H-F>
##$PROCNO= 1
##$TYPE= <nmr>
##$USER= <she>
##$AMP= (0..31)
100 100 100 100 100 100 100 100 100 100 100 100 100 100 100 100 100 100 
100 100 100 100 100 100 100 100 100 100 100 100 100 100 
##$AQSEQ= 0
##$AQ_mod= 1
##$AUNM= <au_zg>
##$AUTOPOS= <>
##$BF1= 200.13
##$BF2= 200.13
##$BF3= 200.13
##$BF4= 200.13
##$BF5= 200.13
##$BF6= 200.13
##$BF7= 200.13
##$BF8= 200.13
##$BYTORDA= 1
##$CFDGTYP= 0
##$CFRGTYP= 5
##$CHEMSTR= <none>
##$CNST= (0..31)
1 1 145 1 1 1 1 1 1 1 1 1 1 1 1 1 1 1 1 1 1 1 1 1 1 1 1 1 1 1 1 1 
##$CPDPRG= <>
##$CPDPRG1= <>
##$CPDPRG2= <>
##$CPDPRG3= <>
##$CPDPRG4= <mlev>
##$CPDPRG5= <mlev>
##$CPDPRG6= <mlev>
##$CPDPRG7= <mlev>
##$CPDPRG8= <mlev>
##$CPDPRGB= <>
##$CPDPRGT= <>
##$D= (0..31)
0 1.2 0 0 0 0 0 0 0 0.06 0 0.03 0 0 0 0 0.0002 0 0 0 0 0 0 0 0 0 0 0 0 
0 0 0 
##$DATE= 1644389621
##$DBL= (0..7)
120 120 120 120 120 120 120 120 
##$DBP= (0..7)
150 150 150 150 150 150 150 150 
##$DBP07= 0
##$DBPNAM0= <>
##$DBPNAM1= <>
##$DBPNAM2= <>
##$DBPNAM3= <>
##$DBPNAM4= <>
$$ [...]
##$SUBNAM2= <"">
##$SUBNAM3= <"">
##$SUBNAM4= <"">
##$SUBNAM5= <"">
##$SUBNAM6= <"">
##$SUBNAM7= <"">
##$SUBNAM8= <"">
##$SUBNAM9= <"">
##$SW= 18.0517287032376
##$SWIBOX= (0..15)
0 0 2 0 0 0 0 0 0 0 0 0 0 0 0 0 
##$SW_h= 3612.71676300578
##$TD= 16384
##$TD0= 1
##$TE= 0
##$TE2= 300
##$TE3= 300
##$TEG= 300
##$TL= (0..7)
0 120 120 120 120 120 120 120 
##$TP= (0..7)
150 150 150 150 150 150 150 150 
##$TP07= 0
##$TPNAME0= <>
##$TPNAME1= <>
##$TPNAME2= <>
##$TPNAME3= <>
##$TPNAME4= <>
##$TPNAME5= <>
##$TPNAME6= <>
##$TPNAME7= <>
##$TPOAL= (0..7)
0.5 0.5 0.5 0.5 0.5 0.5 0.5 0.5 
##$TPOFFS= (0..7)
0 0 0 0 0 0 0 0 
##$TUNHIN= 0
##$TUNHOUT= 0
##$TUNXOUT= 0
##$USERA1= <user>
##$USERA2= <user>
##$USERA3= <user>
##$USERA4= <user>
##$USERA5= <user>
##$V9= 5
##$VALIST= <valist>
##$VCLIST= <CCCCCCCCCCCCCCC>
##$VD= 0
##$VDLIST= <DDDDDDDDDDDDDDD>
##$VPLIST= <PPPPPPPPPPPPPPP>
##$VTLIST= <TTTTTTTTTTTTTTT>
##$WBST= 1024
##$WBSW= 4
##$XGAIN= (0..3)
0 0 0 0 
##$XL= 0
##$YL= 0
##$YMAX_a= 128697
##$YMIN_a= -211145
##$ZGOPTNS= <>
##$ZL1= 120
##$ZL2= 120
##$ZL3= 120
##$ZL4= 120
##$ABSF1= 15.72155
##$ABSF2= -2.330299
##$ABSG= 5
##$ABSL= 3
##$ALPHA= 0
##$AQORDER= 0
##$ASSFAC= 0
##$ASSFACI= 0
##$ASSFACX= 0
##$ASSWID= 0
##$AUNMP= <proc_1d>
##$AZFE= 0.1
##$AZFW= 0.1
##$BCFW= 0
##$BC_mod= 2
##$BYTORDP= 0
##$COROFFS= 0
##$CY= -3
##$DATMOD= 1
##$DC= 0
##$DFILT= <>
##$DTYPP= 0
##$F1P= 0
##$F2P= 0
##$FCOR= 1
##$FTSIZE= 16384
##$FT_mod= 6
##$GAMMA= 0
##$GB= 0
##$INTBC= 1
##$INTSCL= 0
##$ISEN= 128
##$LB= 0.24
##$LEV0= 0
##$LPBIN= 0
##$MAXI= 10000
##$MC2= 0
##$MEAN= 0
##$ME_mod= 0
##$MI= 1.114404
##$NCOEF= 0
##$NC_proc= -7
##$NLEV= 6
##$NOISF1= 3.799351
##$NOISF2= 2.8
##$NSP= 0
##$NTH_PI= 0
##$NZP= 0
##$OFFSET= 15.71714
##$PC= 1
##$PHC0= -15869.11
##$PHC1= 11.20078
##$PH_mod= 1
##$PKNL= yes
##$PPARMOD= 0
##$PSCAL= 0
##$PSIGN= 0
##$REVERSE= no
##$SF= 200.130006886991
##$SI= 16384
##$SIGF1= 3
##$SIGF2= 2
##$SINO= 5.538805
##$SIOLD= 16384
##$SREGLST= <1H.CDCl3>
##$SSB= 0
##$STSI= 16384
##$STSR= 0
##$SW_p= 3612.71676300578
##$SYMM= 0
##$S_DEV= 0
##$TDeff= 16384
##$TDoff= 0
##$TI= <>
##$TILT= no
##$TM1= 0
##$TM2= 0
##$TOPLEV= 0
##$USERP1= <user>
##$USERP2= <user>
##$USERP3= <user>
##$USERP4= <user>
##$USERP5= <user>
##$WDW= 1
##$XDIM= 16384
##$YMAX_p= 471767447
##$YMIN_p= -2652927
$$ End of Bruker specific parameters
$$ ---------------------------------
##NTUPLES= NMR SPECTRUM
##VAR_NAME=  FREQUENCY,     SPECTRUM/REAL,   SPECTRUM/IMAG
##SYMBOL=    X,             R,               I
##VAR_TYPE=  INDEPENDENT,   DEPENDENT,       DEPENDENT
##VAR_FORM=  AFFN,          ASDF,            ASDF
##VAR_DIM=   16384,         16384,           16384
##UNITS=     HZ,            ARBITRARY UNITS, ARBITRARY UNITS
##FACTOR=    0.220516191357247, 1,           1
##FIRST=     3145.47137602029, 0,            0
##LAST=      -467.245386985488, 0,           0
##MIN=       -467.245386985488, -2652927,    0
##MAX=       3145.47137602029, 471767447,    0
$$ Real data points
##PAGE= N=1
##DATA TABLE= (X++(R..R)), XYDATA
$$ [...]
10142 104789 19682 81812 2722 -7823 75731 124598 -101199 -122288 81003 167829 110292
10131 110292 73672 6831 108702 69114 142096 159091 37206 12405 -48084 -84067 58056
10120 58056 175800 136916 122214 176856 65604 -209495 -129457 -172144 -132772 -41951 -209155
10109 -209155 -167106 61096 91953 52645 -4616 -171796 -104367 -122688 -145388 -124824 -1956
10098 -1956 131875 -96096 80332 135553 75230 -24952 161935 28458 -107637 137420
10088 137420 40020 -66990 -40873 -56289 -224077 -194179 -238962 -3622 247948 65014
10078 65014 -46266 71817 -8699 -98229 190443 85030 215204 135896 -21901 -42280
10068 -42280 43081 81356 -109703 -188496 -188417 -86728 -130088 33076 189738 52025 81150
10057 81150 -123982 -201681 -91234 -37561 -71334 -63782 -79982 -34743 -49743 -53049 -55821 -88056
10045 -88056 -258800 -111536 101563 88665 -32042 -269771 -93129 -149687 -31274 37540
10035 37540 -238346 -442577 -215585 169578 296982 195411 96562 147807 35254 -20066
10025 -20066 -71447 -28590 -82732 -148245 -221948 -42233 -86905 -2843 3578 -141159 32799
10014 32799 97090 85914 34664 -124633 5814 101216 67802 103960 75395 165094 83641
10003 83641 181701 121828 83758 62375 23767 52723 194294 58927 43523 58200 211190
9992 211190 149122 50764 42833 6176 13587 -138331 -24067 -14534 -74216 -67589 59903 -23125
9980 -23125 -19509 45613 67196 31813 -60130 102153 303268 485341 254615 240202 205462
9969 205462 17608 17207 58326 79271 92650 60735 119990 -10093 107457 217274 189693
9958 189693 88635 154122 222692 41064 -8389 11435 24031 35170 -59918 -178892 -145397
9947 -145397 -168724 -256385 -107969 17429 -53135 30825 208332 -43694 23117 98397 8571
9936 8571 46621 34654 -149297 -316953 -77579 -81891 39330 143590 319497 210521 53509
9925 53509 -81410 -124975 -4497 -61788 125740 28510 -72787 -34064 81290 -81830 -98498
9914 -98498 -284146 -334100 -95702 -38920 -81391 23060 82633 139368 -20330 -88081 -154828
9903 -154828 -141170 -76494 -58598 13494 91378 -51720 -111064 -56814 29942 50163 -82669
9892 -82669 44242 -6791 -102843 -71587 202083 62021 20184 -111710 -25998 -78247 -86260
9881 -86260 402 -23622 -41244 12716 -1096 -179998 -216411 -183145 -98182 26864 -155342
9870 -155342 -131540 -59543 -25948 135584 137394 62296 53 72821 -4267 167824 129985
9859 129985 132784 101232 121949 -18447 -116126 -12471 -177606 -109742 -154624 -101783 -78037
9848 -78037 23296 -35557 52995 51416 213736 43552 156186 150021 -18333 2529 -60429
9837 -60429 -83093 -142459 -162149 32624 -38724 154170 246107 63136 63591 -91151 -191831
9826 -191831 -137133 -111354 84205 68768 -131082 -80398 -33413 5334 177 -116429 -238128
9815 -238128 -110121 -52093 -177846 -150275 -10110 -26267 -27007 10083 12429 34540 108467 208203
9803 208203 72221 69860 133915 -48347 35077 59348 87848 36470 -18812 -128086 -75547
9792 -75547 9829 52412 186293 177683 -5908 -44469 -80911 -156222 -23645 92703 78937
9781 78937 -246681 -210348 -53065 205994 58600 92076 69547 -216757 -81335 68310
9771 68310 198040 83922 305793 275159 -80780 55538 222188 -96945 -56498 -27649
9761 -27649 -22447 26987 -60430 -16956 -94474 -149181 -79037 -76407 -114962 -266757 -374215 -258957
9749 -258957 -35128 -197585 -150702 37590 120963 -37199 208558 20035 46086 -25151
9739 -25151 -97086 110484 70465 88610 95274 135243 108876 2129 19472 -264598 -267687 -228467
9727 -228467 -218749 -130134 -198209 61301 23772 -246899 -43577 7342 -33946 159589 17998
9716 17998 31582 88745 81994 -41417 -94642 50283 -138572 -102585 46530 116253 201936
9705 201936 55199 -12158 -54881 -9676 121120 -58547 7541 46072 -87965 -204387 -173053
9694 -173053 -101909 -26581 33527 -125644 -192757 -185427 60934 203489 -15154 -153898 -9468
9683 -9468 -1453 70388 103498 82226 257853 261459 6713 -4431 75327 -65454 -60928 -14929
9671 -14929 133515 254283 215454 255440 154046 141230 121773 227024 171058 190123 235397
9660 235397 256349 121641 -31631 160412 278506 146456 94306 38966 141592 167534
9650 167534 27563 19857 37779 155855 196052 319566 121211 119544 188851 4879 127859
9639 127859 144408 59164 22914 180817 46242 41030 33897 111461 205327 211856 23281 1254
9627 1254 70943 1770 -41774 -51982 107636 284143 156434 -7938 -55961 -51059 -125875
9616 -125875 132589 149636 203027 -104678 -71310 126612 138176 114322 7989 -24100 100338
9605 100338 119726 176161 31289 113011 159734 35280 83025 312153 316605 244200 213139
9594 213139 187631 21936 22024 77734 -265 186515 33801 2293 65365 48382 27912 237457
9582 237457 244583 299300 333419 214999 129482 213840 16734 17480 -25329 148254 141494 75852
9570 75852 228987 346066 254582 433773 294071 -22120 -65694 389816 710734 431215
9560 431215 307562 259290 209887 40320 -11471 152714 110313 141206 222468 406022 344575
9549 344575 402766 435618 292492 121310 136327 259370 85472 19202 186462 83841
9539 83841 7328 -57464 101085 -26646 83433 113639 -84404 -69676 -90093 158048 -17185
9528 -17185 58022 526 -18364 311662 332796 -11694 -61197 91786 -35468 79352 29280
9517 29280 223685 136359 136832 227703 66690 177191 256125 345350 206903 270505 308083
9506 308083 317619 404622 464622 413917 221460 418130 362873 267091 249151 285883 140877
9495 140877 220824 265157 192682 173821 221163 105464 188978 331312 211394 216718 292386
9484 292386 220525 121040 177857 286638 267408 334894 468269 297989 315674 409835 471173
9473 471173 295828 338287 219451 176146 193529 365107 548681 739988 566810 577533
9463 577533 830544 882753 761410 492425 488955 702732 761177 736036 540446 419524 438230
9452 438230 631310 741153 573617 645516 773294 784314 568259 662612 871404 672994
9442 672994 699466 525581 680261 703402 543541 362437 399643 543481 615667 786001
9432 786001 623741 601231 910952 862059 725753 728663 729851 534291 574671 835917 820925
9421 820925 767305 803566 861170 991187 993126 840044 866535 727788 704749 749953 759384
9410 759384 705769 746372 717109 800718 739778 625322 514206 490626 547526 654179 799803
9399 799803 667148 490518 394701 481986 411814 476921 538095 612642 628550 756869 657262
9388 657262 596632 660406 704785 688892 614854 508821 409147 460073 374034 403148 707590
9377 707590 447816 519223 755602 745430 732999 746423 805230 877196 824308 818812 970651
9366 970651 996545 944512 688143 789831 787662 822320 884007 936337 914369 909591 891060 1076003
9354 1076003 1097251 900940 916384 1136862 1276363 1203586 1293677 1464795 1471982 1594338 1531897
9343 1531897 1525750 1669193 2017057 1927110 1928706 1975215 1880975 1680390 1684748 1751709 2056819
9332 2056819 2112503 2021805 2284469 2286254 2365478 2602474 2700873 2586753 2440337 2543712 2810366
9321 2810366 2821244 2788349 2612309 2593806 2533017 2569790 2634507 2633409 2618938 2688772 2716876
9310 2716876 2663344 2739397 2713308 2994418 2798141 2757682 3010177 3199313 3157389 3192686 3310550
9299 3310550 3355676 3358512 3578604 3692785 3497249 3565638 3784184 3885680 3599631 3607389 3377741
9288 3377741 3418971 3539666 3561809 3559764 3491283 3393038 3228985 2960275 2862389 2750709 2793545
9277 2793545 2765908 2692567 2789983 2860325 2896569 2924468 2802800 2677440 2853508 2930081 2995425
9266 2995425 2955899 2800562 2795045 3069005 3090029 3110961 3176472 3252713 3184216 3085120 3152955
9255 3152955 3260941 3264973 3187744 3134486 3115281 3129405 3041775 3016474 3164459 3257385 3235833
9244 3235833 3384952 3582106 3749749 3681147 3625072 3562169 3629537 3832901 3879410 3764307
9234 3764307 3690459 3655785 3464091 3305486 3058693 3169248 3255090 3181476 3109459 3215375
9224 3215375 3318984 3211860 3121769 3206807 3256308 3444491 3528890 3494485 3644046 3663146 3774672
9213 3774672 3844273 3906427 3969090 4103604 3976824 4152485 4342848 4476330 4683966 4609623
9203 4609623 4615514 4857856 4949933 5070273 4922870 4770520 4898503 4916128 4939053 4814435
9193 4814435 4519351 4453121 4322526 4262378 4658841 4844929 4661657 4656860 4561212 4395516
9183 4395516 4293574 4438821 4736486 4803386 4690973 4974211 5211237 5038398 4875983 5118855
9173 5118855 5162160 5109519 5122278 5057502 5222781 5212467 5216703 5225015 5371307 5508048 5492510
9162 5492510 5599059 5670487 5490263 5592190 5846209 6125604 6109954 6104310 6267194 6223912
9152 6223912 6322301 6592659 6335915 6468503 6773832 6808253 7007165 7146870 7460019 7591843
9142 7591843 7690652 7860897 8088350 8267386 8472160 8690859 8846917 9012502 9397044 9670602
9132 9670602 9811533 10030394 10401971 11082564 11242799 11522737 12060211 12249985 12710056 13162653
9122 13162653 13480572 14012424 14582251 15155784 15749958 16201306 16758758 17329476 18008653
9113 18008653 18781673 19442852 20455945 21284756 22209770 23150982 24311233 25889946 27277463
9104 27277463 29261759 31632475 33973114 36999235 40846188 44886046 49366868 53641141
9096 53641141 57991660 63540812 70200381 76175003 79790130 80459993 80071727 82350713
9088 82350713 86829492 91246388 93190184 89715700 82287530 73684326 65514368 59684317
9080 59684317 55820146 53909629 52769616 52020347 50683284 48461233 46055705 44450625
9072 44450625 43663415 43571245 43947077 44921419 46577110 48778017 51577846 55187352 59770796
9063 59770796 64944903 70384009 76063169 81375872 86150709 90754786 94263699 97439890
9055 97439890 102417180 108909702 114919584 117454812 115515426 113013897 110459596 104914331
9047 104914331 96288360 83944050 69973760 59088434 51510319 46000161 41715338 38881923
9039 38881923 36729040 35110767 33534252 31843622 29786332 27733250 25962069 24464246
9031 24464246 23345397 22526266 21685033 20706857 19862219 19147304 18626326 18150959 17691765
9022 17691765 17241961 16752253 16497422 16287918 16096945 15412664 14966846 14727004 14352452
9013 14352452 13897548 13429516 12853320 12425370 11970401 11388144 11130938 11082691 10838452 10276707
9003 10276707 9980716 9670717 9391770 9299777 9034743 8769553 8723567 8704409 8715914 8536648
8993 8536648 8603383 8458610 7967374 7967654 7940212 8001642 7907143 7786124 8100056 8254608 8198012
8982 8198012 8175855 8260132 8144016 8228075 8192230 8297894 8177702 8183217 8067265 8115477 8144416
8971 8144416 8166966 8107184 8062212 8219849 8240628 8203184 7961133 7850285 7849873 7832101 7939261
8960 7939261 7947513 8016694 7930940 7861374 7917495 7941204 8119572 8164245 7933553 8060313 8218306
8949 8218306 8001688 7988670 8345115 8400782 8423198 8476988 8662903 8886303 8973482 8988771 9069433
8938 9069433 9256474 9433804 9685181 9674471 9718188 9789871 9993903 10015846 10243034 10262459
8928 10262459 10397729 10636007 10893454 11253381 11579089 11641335 11662325 11677956 11723411 11730562
8918 11730562 11681199 11534564 11551239 11826498 12195067 12310955 12318114 12582540 12807858 13073704
8908 13073704 13212413 13543168 13995745 14379508 14734826 15096540 15486907 15953701 16538133
8899 16538133 16885131 17505384 18333356 18908381 19601320 20252458 21005479 22073606 23342927
8890 23342927 24717699 26195966 27621060 29508126 31734359 34112115 37072827 39597200
8882 39597200 42259422 44926357 48074989 52401562 56933387 60822201 63335385 64946498
8874 64946498 66211202 65442493 62058810 56613553 51482780 48015070 46371342 45825293
8866 45825293 45676225 45950782 45406347 43846110 42051472 41202458 40661445 41058182 41923015
8857 41923015 43303399 45229033 47486523 50193269 53470127 56704808 60031548 63257746
8849 63257746 67101450 72091373 78313933 85606377 93382000 101109498 108141006 113565662
8841 113565662 116536750 116584741 111920008 104122720 94932527 87315968 82252142 78944022
8833 78944022 75799748 70857917 63930431 57714127 53238211 49618421 46653132 44280215
8825 44280215 42465448 41446549 40700629 40211144 39991193 40482010 41164876 41908030 43283862
8816 43283862 45164195 47621378 50422183 53660288 56742402 59070637 60426204 61448313
8808 61448313 63429905 66470829 70131243 72713683 73830046 72440961 67313882 60622607
8800 60622607 52849396 45904357 40663976 36896803 34214447 32234409 30970557 29891913
8792 29891913 28265899 26418439 24709052 23523340 22332256 21443279 20877272 20440808 19741808
8783 19741808 19064005 18633094 18391533 18008789 17369949 17040139 16892408 16465812 16356352
8774 16356352 16158154 15772556 15364371 15182340 14901211 14730360 14431039 14181218 14138289 14129948
8764 14129948 13935891 13994856 14068604 14296232 14299806 14435373 14262591 14683406 14954589 14932463
8754 14932463 15157627 15168210 15603245 15947620 16077149 16437355 16940839 17382152 17944598 18390386
8744 18390386 18824722 19174513 19476177 19961815 20413365 20974247 21649679 22467148 23147973
8735 23147973 24025078 25273811 26765942 28301604 29946735 31984242 34199107 37434337
8727 37434337 41312178 45587721 50471095 56213176 63244078 71259428 79967442 88885109
8719 88885109 98490116 112090617 129907051 147273544 156820329 150739734 124491094 99747198
8711 99747198 84614914 73977422 65368705 57162215 50741622 45873226 42289084 39453488
8703 39453488 37416689 35936236 34771138 34106739 33833118 33939858 34341961 34868667 35876900
8694 35876900 37438788 39145064 40693963 42093092 42632472 43302303 45194265 48228784
8686 48228784 52318265 56831498 60413144 61996401 61152071 58030288 52640574 46400226
8678 46400226 40964580 37037761 34363620 32681611 31444956 30598767 29377928 27582352
8670 27582352 25277520 23580960 22341347 21282969 20508702 20081027 19477138 18923995 18794875
8661 18794875 18724793 18571131 19038909 19770847 20554170 21636352 22649942 23064752 23161052
8652 23161052 23191225 23730626 24409716 24712104 24061607 22130146 20623462 19536260 18671435
8643 18671435 17827314 16226311 14300214 12915435 12119062 11210323 10468323 10010500 9460622
8634 9460622 9018416 8850954 8393408 7863749 7309363 7096313 6865385 6757153 6482470 6094743
8624 6094743 5816189 5777976 5724708 5632912 5473031 5136819 4897620 4849113 4535570 4554003
8614 4554003 4322549 4250354 4192899 4162038 4087545 3726156 3828200 3900682 3640659 3593708 3699677
8603 3699677 3538280 3385723 3230967 3199302 3253122 3060272 3083504 2973901 2860868 2853379
8593 2853379 2705652 2692716 2448717 2333378 2375082 2369703 2263300 2159672 2053130 2343220
8583 2343220 2285174 2304284 2413828 2396593 2426818 1801876 1706983 1776115 1639586 1768159 1804147
8572 1804147 1894823 1811803 1487620 1580060 1575073 1501544 1626539 1667617 1618343 1620640 1470885
8561 1470885 1478383 1544627 1512832 1637189 1619788 1520179 1553114 1719946 1647834 1378414 1289880
8550 1289880 1308538 1322218 1338016 1228527 1160863 1242794 1343765 1109195 1063828 1130349 1270421
8539 1270421 1257951 1294776 1097587 1092300 1043088 1050095 1016002 1051549 1188578 1248628 1187996
8528 1187996 1057183 1040227 1098855 1260566 1221937 992301 1057983 1033941 776996 832724 862795
8517 862795 892609 1076489 988699 974050 982395 1071782 767594 1013903 1051212 1051618 1082200 1024721
8505 1024721 1005226 747629 739752 905531 806404 904482 784735 601027 614571 737262 613971
8494 613971 444620 493393 635335 605072 695406 827178 726112 743719 683211 645975 649083
8483 649083 613964 715244 825462 739164 721113 523831 693638 715596 635481 803167 1080398
8472 1080398 980004 1006165 985487 953759 703001 651805 482630 748762 885730 811903
8462 811903 786108 541490 398557 579701 442928 304643 441145 396058 437103 365415
8452 365415 358949 358425 316090 556279 586887 487766 338266 474633 327725 389318 446576
8441 446576 282570 451251 461038 471725 521827 561655 511571 370626 297894 328338 241036
8430 241036 257713 340281 455225 495366 409167 169460 36776 26746 166404 379006 470201
8419 470201 433543 373866 340074 323735 223797 95161 51305 30299 112747 341751 378429
8408 378429 307170 338064 286795 88950 147279 256207 208904 143008 282750 486951 393375
8397 393375 173990 187246 192791 13964 136771 109285 51892 117916 297180 410164 322308
8386 322308 360111 245060 200861 148167 87670 21492 102346 222295 190495 370184 305271
8375 305271 314314 210211 197416 277927 347583 250947 295834 402153 300139 246188 244618
8364 244618 205875 249503 234834 236852 542599 332439 361250 451647 325956 43354 107541
8353 107541 158919 175935 163218 208747 353234 415473 448906 311749 38292 41211 113740
8342 113740 155324 -1928 58407 283431 154804 130736 92214 265961 393833 233783
8332 233783 29819 5123 178742 321746 93837 -18759 191427 333114 289821 359343
8322 359343 421635 563123 558295 417135 488990 519691 429153 301152 294667 217705 212598 159306
8310 159306 120725 -12051 -22078 58611 74057 58369 101735 238693 189780 222279 195014
8299 195014 335245 228517 110910 97225 63332 246729 405128 222591 95049 42642
8289 42642 67965 219722 296123 329050 288169 322002 200076 95871 97230 181579 192824
8278 192824 167000 119823 -79359 96460 160210 245189 -44034 80529 190777 139857 205525
8267 205525 -9590 19206 221321 391243 -22746 -31140 45097 171370 195157 163 -131984
8256 -131984 28296 161762 167079 309636 280286 470759 389992 221411 110736 69225 128407
8245 128407 228859 302587 200910 313718 288378 560345 783757 934850 932681 527602
8235 527602 264858 478771 257168 314315 270764 224444 146832 7633 -35514 25453 147386
8224 147386 127669 87357 74353 -90121 83370 132591 -17574 14249 -60644 -59690 80448
8213 80448 191031 22470 42072 44171 -107865 47201 -65678 200972 425676 87345
8203 87345 -42853 109241 294566 229680 396955 409003 386547 293672 781395 761036 1489826
8192 1489826 -1812947 -2652927 -973855 -981518 -751768 -788234 -274149 -412220 -361603 -270768
8182 -270768 -169502 -306724 -334940 -286053 -14672 -152681 69405 -119919 -196477 11412
8172 11412 -9939 -328925 -260470 -15195 151920 74090 -76040 -257194 -406095 -447795 -226225
8161 -226225 -244487 -56782 96247 -80257 -172463 -149437 28856 19245 110030 55019 -48664
8150 -48664 -54133 -114620 -36847 -184292 -291202 -236745 -175824 -242895 -286913 -245444 -169793 -83381
8138 -83381 -75852 47815 -6513 26499 18983 47816 -35140 -206495 -251784 -134354 -171000 -123587
8126 -123587 -92012 -206110 -101175 68741 -14333 -76558 -304082 -94194 42899 -19571
8116 -19571 -1642 -45311 -38998 -156942 -64473 -92661 -171116 -251942 -209733 -196863 -97427 -165862
8104 -165862 -119443 -24477 -12655 132942 148629 64844 -89534 -9374 -50260 2475 -28539
8093 -28539 -45870 -145203 -191734 -71714 -37246 -37357 -41461 -165246 -250852 -293289 -199505 -222094
8081 -222094 -207848 -128678 -189850 -325728 -253332 -207329 -101443 16662 -86992 133175 97388
8070 97388 4754 -126094 -295659 -196429 -61449 -91602 -165813 -141264 -86307 -4611 -3877 -150638
8058 -150638 -288865 -265391 -153043 -183071 -233187 -251679 -262863 43829 -35456 -93561 3038
8047 3038 -84584 39454 131297 136479 -79559 -123708 -142878 87532 44287 -192456 -227021
8036 -227021 -36224 3197 111788 34251 -91194 -69381 -215755 53892 100401 -110086
8026 -110086 6804 -208785 -111818 99896 -99018 -172071 -35703 87131 -48459 -152356
8016 -152356 56539 154796 45031 17436 8406 -1649 -203517 -190384 -172399 -88552 -14269
8005 -14269 -229424 -237099 -183316 -110747 17655 -18325 -18623 -205120 -242184 -226544 -139412 -134131
7993 -134131 -334634 -89522 -86798 -80339 -158208 -210656 -171168 4137 -173378 -386646 -175350
7982 -175350 -57159 -239471 -228203 -139092 -95111 -73958 9519 135874 -85490 -105382 11412
7971 11412 -67078 -286692 -204998 -55803 -60762 -6660 -50781 81868 144817 -192679 -164961
7960 -164961 -132094 -113141 -208606 -126928 -91252 20685 5816 60205 -10644 17671 -1116
7949 -1116 14096 63388 77477 -163885 -91878 89418 -101162 -71647 -81339 166170 -56755
7938 -56755 9651 -207777 -245036 19160 -4185 -6654 73936 -27468 -224638 -179981 -182379
7927 -182379 -171382 -73551 -10373 254063 250626 120707 187169 7791 -61785 -91900 142538
7916 142538 241136 150016 -63572 -173712 -54669 137838 56922 20126 156544 23233
7906 23233 32140 -73202 -107444 -10011 19893 55679 -112823 -107886 -107127 -281118 15130 18225
7894 18225 -102528 5546 -241246 -86692 1935 -350102 -185411 -226888 -382892 -237683
7884 -237683 -104127 31876 -91924 -116084 -162498 -277847 -293826 -286278 -327672 -240313 -246569
7873 -246569 -44394 -94806 -178980 -14519 80436 -17942 -197788 -367314 -278534 -84816 -101372
7862 -101372 -116283 -214689 -110092 -134184 -65629 96960 -56530 -17425 -52113 -234333 -224932
7851 -224932 24686 -145182 -144328 -105825 -124671 -79421 -132402 -77847 -38639 86517 -16638
7840 -16638 -66161 -95943 -93437 -134970 -5083 55190 -95875 78200 203452 -36514 -205906
7829 -205906 -285315 -95268 -50271 -30200 9337 -121724 57856 -16123 -79037 25998 73505
7818 73505 73242 80556 99521 134511 -99480 -74911 152910 -6869 31662 -41513 -26875 97811
7806 97811 3745 -281812 -3242 -139866 -225596 -352662 -107742 -190493 -403573 -174222
7796 -174222 -84840 -66334 15886 -105458 -16400 -3686 -23205 20496 -79085 86398 -26878
7785 -26878 -199915 -243609 -225216 -209181 -162805 -192218 -100930 -221342 -96388 -105515 -220537
7774 -220537 -313558 -205088 -153002 -173586 -517 25688 -33720 -135127 -245915 -57729 68579
7763 68579 -166974 -371866 -277710 -237729 -227442 -65383 62065 -34526 -83474 45566 -149702
7752 -149702 -63686 -98027 -161605 -63617 -80975 85438 -54517 -165431 -49445 -146541 -215404
7741 -215404 -196849 -232158 -19020 69385 132012 59553 -71335 -96175 -99115 -113151 78686
7730 78686 87391 -35594 145691 206644 47445 103669 250437 91427 -29657 15469 -92790
7719 -92790 -268744 -136779 -190223 -244095 -201647 -92386 85776 53207 144458 94625 45509
7708 45509 -20105 -340310 -281032 -51306 -66518 -140413 -88484 -209568 40723 97970 67973
7697 67973 3159 -107564 -13409 -20199 -71410 -37833 -44722 -160267 -79070 8585 114388 54494
7685 54494 -65379 -70934 -92653 -186321 90907 19226 39747 93966 164782 150427 193686 7461
7673 7461 -81566 -14380 118306 207687 173340 152247 161599 268340 300250 41874 -116395
7662 -116395 -52032 -59562 9143 -15120 18127 -10904 -592 -97740 -97773 -173062 -190608 -102389
7650 -102389 302954 219290 -8303 47978 -147625 -166170 113517 -113254 -249480 -273869
7640 -273869 -210455 9852 -61391 -79336 -69094 -97528 -191983 -50886 80794 -78078 -93216
7629 -93216 -15238 155543 224549 30658 4606 -120340 -94929 -197119 -238401 -23693 64592
7618 64592 -24742 -107640 -64272 94267 -76530 19363 -147789 12362 253521 44416 105504
7607 105504 202842 -12967 -237252 -195545 56454 -30801 -22130 252816 305600 357234 179216
7596 179216 213692 12314 -50049 -176959 -17581 -87921 -72562 -19994 -171636 -208598 -88291
7585 -88291 68827 83664 -168103 -404865 -268241 13873 185125 14849 -239447 -297856
7575 -297856 -24028 40029 -69469 -26502 -55677 71727 142594 -35377 -157996 -111817 -229539
7564 -229539 -198621 -88399 -62424 -95729 -131250 65526 -75069 32861 156621 181466 27146
7553 27146 -116214 8570 -20393 -205751 -27823 94307 -68075 24559 161196 73495
7543 73495 -54238 62671 195272 177800 -52429 111756 63363 9718 84437 5341 73343
7532 73343 -140552 -254974 8725 -90146 -23461 -50546 31411 136359 304352 206141 53760
7521 53760 -21067 -116051 -29653 -35487 950 149354 146667 -57426 53096 261660 240140
7510 240140 91402 84349 148314 286518 187576 352225 538656 544229 726051 877513 717641
7499 717641 503504 568963 589424 404416 399747 281230 164515 197062 237877 285065 262143
7488 262143 241613 196147 79593 -28181 63726 138574 90830 59784 104051 168883 136938
7477 136938 254738 205575 28421 139375 276552 280041 351958 160867 100481 68066 -105386
7466 -105386 16067 95723 100920 214498 63990 284952 511039 277365 110964 186741
7456 186741 4981 -239492 41817 135973 177197 200980 60793 -43581 63408 -7364
7446 -7364 -175494 -47321 55068 63919 132878 140124 87372 176954 -41924 -12129 57530 -6614
7434 -6614 15403 193080 213227 -6730 -92325 -195546 -278955 27643 -63640 -55909 98504
7423 98504 -33123 2517 -9179 -110327 -125258 -38642 28493 8772 123148 -52924 82971
7412 82971 -35649 -10611 -62562 -426541 -340880 -82836 -88469 -61254 76950 -72532 97486
7401 97486 47435 -38462 55129 146680 125102 59307 -17079 -20417 88254 124721 98685 163980
7389 163980 -102837 -112244 11545 101970 167384 94074 79959 104377 113476 91382 -94078
7378 -94078 -16190 79499 100706 63718 100059 195416 353209 88308 59142 19584 35590
7367 35590 93056 -29859 200344 129638 11828 85345 76150 187075 165130 187955 399312
7356 399312 293765 363147 385838 188093 449920 425334 220642 176573 263028 219021 -107498
7345 -107498 93023 112620 53260 243268 153885 164258 56244 134797 189593 186097 128887
7334 128887 306728 368364 359377 335143 201845 231076 293287 300807 154517 64945 203171
7323 203171 152840 414572 506865 323580 253792 226193 181164 201596 497244 368426 360685
7312 360685 239425 169756 168783 137859 255937 54243 175177 334323 279006 304756 120158
7301 120158 105144 186445 194204 405640 400334 139855 207934 144492 144123 359306 405415 312636
7289 312636 333304 232185 281953 378017 385008 302977 466157 667139 532483 405767 583209
7278 583209 391330 274539 342560 474960 318009 175445 355659 557600 570654 346125
7268 346125 151609 121842 293054 366463 291242 292403 395580 532079 617513 491419 500435
7257 500435 712366 487556 183819 212082 490413 712383 649635 507937 670018 685306
7247 685306 669750 777720 958145 824913 727325 722683 704068 717811 513048 660969 1000550
7236 1000550 896634 725545 688673 618444 796318 890677 869859 807160 871105 806764 767433
7225 767433 753076 760763 782685 693340 712611 823392 889442 1079519 1294014 1158195 1172222
7214 1172222 1072412 1057051 1217212 1247163 1411181 1555571 1547397 1788336 1931429 1684692
7204 1684692 1687308 1657320 1614403 1757760 1733242 1991195 2094006 1992586 2085165 1918790 2202624
7193 2202624 2215396 2272745 2404470 2407777 2497906 2618443 2601753 2829595 3009796 3046443 2924935
7182 2924935 2983950 3070099 2969673 2832904 2807602 3058589 3193224 3114946 3153672 3229000 3441475
7171 3441475 3475305 3433838 3353863 3415526 3657663 3761992 3744258 3720488 3958317 4104621 4134504
7160 4134504 4080844 4134384 4154485 4449627 4409134 4374259 4678087 4744616 4747804 4918307 4977723
7149 4977723 5295953 5564989 5806349 5847386 5918431 6098131 6376886 6688596 6866448 7101881
7139 7101881 7466056 7906711 8409672 8710048 8964552 9584283 9825772 10237910 10860266 11502145
7129 11502145 11875874 12400524 12961207 13562530 14042885 14656692 15738256 16870816 18205321
7120 18205321 19509049 21036220 23028377 25158014 27888901 31004320 34344095 38475015
7112 38475015 43186202 49155931 56446783 65383370 76405845 89714834 104817214 119876885
7104 119876885 131236184 134953945 128512086 113883703 94883346 76740648 62482036
7097 62482036 51963182 44555881 39140219 35036254 31487038 28404082 25540088 22923248
7089 22923248 20949230 19554912 17944524 16596694 15718213 14913069 14042154 13301077 12491265
7080 12491265 11797998 11062088 10574109 10131743 9803293 9647317 9115717 8718804 8558669
7071 8558669 8330427 7974011 7552105 7345240 6979818 6520200 6148856 5878781 5430746 5210449
7061 5210449 5277360 5220228 4966203 4664129 4510127 4617917 4683464 4539230 4663076 4511847
7051 4511847 4435390 4408884 4330696 4570431 4728251 4812603 4598260 4725911 5049006 5136841
7041 5136841 5390940 5418034 5204730 4545034 4188121 4157581 3596199 3424697 3094464 2981451
7031 2981451 3062427 2748732 2558634 2447958 2400382 2299196 2438595 2447646 2233743 2103875
7021 2103875 1870616 1689943 1630681 1571858 1609947 1669434 1545266 1428998 1485058 1435302 1317939
7010 1317939 1169473 1333777 1397878 1239311 1335297 1342551 1194741 1348948 1382875 1253458
7000 1253458 1015650 1115969 1104898 1059725 887331 904920 867753 1155651 1231881 1040603
6990 1040603 927877 870430 1072724 1101108 1115062 992315 915637 932453 909697 861470 976902
6979 976902 947679 779929 656147 677385 686992 766746 893611 648966 593671 779636 710408
6968 710408 705397 763744 601197 468374 553965 507341 597072 591528 622419 803061 593980
6957 593980 490013 563918 455569 523293 648366 502729 457124 699504 764132 522017
6947 522017 505976 554980 491849 507907 470105 394041 421258 440669 349410 390117 426053 450053
6935 450053 462838 272483 334081 511627 461898 477456 546062 508808 432287 452531 274587
6924 274587 222983 201952 387901 586542 408038 392818 340495 374643 289823 25603 37666
6913 37666 -27237 -75311 54644 235704 343228 271475 218781 462573 486185 407298 263898
6902 263898 292060 305136 340448 280932 156202 336821 319932 138661 287056 422428 278757
6891 278757 173657 151018 185476 347432 345343 182638 62301 68972 23061 -47864 176638
6880 176638 188894 107435 52169 36426 112121 87266 53882 -85698 12734 141844 102494
6869 102494 242066 93020 70785 284871 152222 -22465 160270 244006 282086 212794
6859 212794 102445 65381 3467 240902 150642 110808 75520 -56936 9791 88012 258023
6848 258023 199278 186688 94546 105935 236856 310570 335925 68270 63545 50057 63594
6837 63594 197655 141046 -144999 -196882 -313134 -117880 -8247 83328 124491 206401 221965
6826 221965 169189 143470 131660 325965 184328 184149 121075 115720 323988 -548 734 7082
6814 7082 -43448 116063 -47668 98254 -64726 64239 169464 287321 180717 80931
6804 80931 222606 136310 11164 156906 -49625 -31862 239725 405022 135634 3474
6794 3474 166852 132761 213819 273972 148640 131961 27254 -62724 -65147 -137171 -22014
6783 -22014 134272 348124 286328 71465 157745 7177 -52313 78743 25284 73871 -49744
6772 -49744 -80078 -342710 -436889 -366689 -113660 60469 102132 61311 233740 236215 73561
6761 73561 151993 102536 222537 339910 406309 318593 203656 205234 62513 10529 233111
6750 233111 -59561 -19204 70833 -6160 77628 211658 40976 -57521 25416 144558 186554
6739 186554 108311 90110 86936 259781 229345 130338 150022 197007 75933 227018 234267
6728 234267 296333 178855 135603 180166 67575 73933 294775 292518 36783 109318 197820
6717 197820 251364 207702 406889 260796 223765 203590 160510 312429 442953 400755 573112
6706 573112 461333 529872 748201 608627 592652 552608 705188 489925 222825 145403
6696 145403 40416 180387 213706 126325 163977 231105 257397 238769 135268 84769 268533
6685 268533 170471 148371 186148 230224 121355 5805 -19703 108124 103146 287574 209804
6674 209804 199327 84488 165810 143634 1745 -79431 -59814 -45931 -89856 106119 268288
6663 268288 17636 20830 -60780 -51023 114686 31535 250009 338706 298305 186284 13769
6652 13769 -117473 29135 171197 151936 65073 14628 -16590 137679 129028 -7264 290142
6641 290142 331353 205257 243593 -41799 -7836 185332 118719 60935 7116 122905 134199
6630 134199 -55405 -10019 -15082 86665 -76282 -86695 -26883 -135553 -17048 56394 -12731
6619 -12731 119142 -59036 -123141 -181786 -237640 -861 10954 68236 46267 61439 -136577
6608 -136577 77582 217383 67620 9147 106238 139263 169367 366023 268840 272946 77507
6597 77507 -134500 -254631 -51407 49197 -85913 -30361 -71418 -163588 8761 -143653
6587 -143653 104993 220546 162748 114659 216471 193636 -131342 -218684 -255967 -245495 -260301
6576 -260301 -11919 -156528 -31282 -48774 -134133 -90977 -54446 19755 -50392 65700 70137
6565 70137 75833 39405 32598 -34204 -4891 103515 -7983 -81607 -65330 -31790 -55757 64104
6553 64104 193662 377543 355813 316773 154733 90780 192963 166942 285393 228682 81845
6542 81845 294738 315586 95389 137149 -14039 50811 63293 -76471 -92426 59909 71855
6531 71855 -110411 -126685 -60787 -120492 -46520 -186087 -63605 7167 11207 -47129 70663
6520 70663 184277 342801 257870 -8955 214627 104383 -51932 21923 156680 158217 185340
6509 185340 182149 49785 -455 -194101 -122755 -103065 -120067 -80078 -269938 -209439 -184325
6498 -184325 -144984 -60375 61975 -89910 -165181 -153535 -63209 56812 -23114 -93480 -80563
6487 -80563 -2282 138926 3089 140097 -95958 61897 203395 187411 280515 237416 314513
6476 314513 332593 255729 156186 215483 134697 -2266 -17037 101360 157442 194116 261712
6465 261712 26014 -2103 146979 37811 -30217 51145 -60093 -13513 141532 -22581
6455 -22581 -127177 -21869 63509 137790 262445 -41789 77955 102596 58057 21270 -1153
6444 -1153 -217491 -201969 42941 53257 117039 162426 157811 14224 36412 123101 -53603
6433 -53603 -38614 -96595 -42709 -5388 68135 145013 81678 251283 203290 236163 166210 53138
6421 53138 88348 105530 36543 147861 154273 226233 430059 559305 533133 517457 377334
6410 377334 182093 59725 50299 133147 88540 -109892 6809 9153 -111386 162186 231581
6399 231581 138100 147819 224776 255808 -20534 129390 302064 326706 377292 217538 36711
6388 36711 182122 158188 236511 224819 239731 475359 452481 211173 170533 242176 235804
6377 235804 136889 -91006 38499 -4838 45848 141165 91781 370574 514566 465701 391461
6366 391461 363087 240069 179856 188705 182721 184041 307602 585649 614264 534874 487683 518221
6354 518221 529283 675025 732169 841486 745838 738333 661757 718960 634922 418705 495359
6343 495359 506797 488840 577681 594047 616885 603869 685248 466923 464227 531804 612488 548774
6331 548774 493242 649102 419936 510588 622810 445438 590478 904802 1044436 1007155
6321 1007155 1187612 875094 632021 773354 821607 697881 581855 551181 369252 271668
6311 271668 345386 408823 662258 727463 689674 581252 646851 584314 686530 548087 666721
6300 666721 553633 575438 693130 540146 594771 413891 588285 602257 703113 556267
6290 556267 324324 234879 357229 459467 563727 620574 491669 375546 191533 152759
6280 152759 364270 323913 573665 553715 534505 397454 588315 616146 479736 569670 676256
6269 676256 600166 658435 441207 368291 456216 490009 567841 491118 722931 758766 657432
6258 657432 754525 719548 713140 693108 595768 644496 542731 478044 518690 454428 585527
6247 585527 559604 595648 748243 725382 700932 718100 955486 745914 600706 641140 696564
6236 696564 667467 723579 760966 571264 613574 700036 542572 679896 639258 740715 879956
6225 879956 714080 685476 813793 845917 705159 821053 816190 812026 1012794 1009489 871323
6214 871323 966461 1023649 1146719 1187153 1181612 1141712 1170404 1178784 1181117 1017261 912242 1060871
6202 1060871 1151001 1010304 1124126 1325286 1577088 1255919 1259091 1211932 1158727 1434508
6192 1434508 1256328 1314959 1419974 1410742 1283113 1279083 1456688 1488079 1707909 1721926 1700657
6181 1700657 1677092 1675879 1727700 1531480 1522770 1530581 1333201 1450291 1495540 1503463 1502954 1470063
6169 1470063 1381391 1432332 1424112 1312550 1507865 1542239 1580287 1591127 1622117 1530266 1653121
6158 1653121 1569267 1609404 1635012 1786689 1569392 1573753 1543218 1549982 1625323 1710491 1633568
6147 1633568 1736780 1670584 1694118 2014631 2075475 1946275 1848342 1791419 1788576 1732113 1697186
6136 1697186 1746182 1645287 1700038 1937668 1888775 1873798 1768033 2094206 2219825 2255186
6126 2255186 2213887 2284883 2290492 2170121 2303269 2563174 2681803 2521974 2684823 2679562 2658659
6115 2658659 2600062 2834938 2746517 2653099 2737779 2742638 3049888 3019758 3273188 3453558 3498279
6104 3498279 3580967 3437842 3408210 3575843 3719932 3701293 3642549 3815569 3867835 3847936 4027112
6093 4027112 4000537 4132089 4311354 4547324 4650151 4565583 4561500 4820330 4778016 4764981 4902841
6082 4902841 5195803 5502176 5691511 5537435 5901964 5985353 5963268 6059092 6421977 6559546
6072 6559546 6661073 6635998 6868857 6951669 7181598 7430440 7497365 7715480 7680610 7841619
6062 7841619 8172085 8368992 8381451 8525510 8764297 8940022 9047540 9442466 9711576 9804856
6052 9804856 10112216 10411835 10641403 10837326 11151069 11462395 11899605 12332327 12371855 12610942
6042 12610942 13118323 13434009 14091580 14667504 15146798 15541015 15954960 16674867 17343250
6033 17343250 17924861 18617706 19479747 20276914 21187624 22076375 23311972 24565655 25929558
6024 25929558 27313671 28729053 30239789 32265019 34684311 37356289 40645808 44735866
6016 44735866 49142063 53203744 56489173 58188604 58355009 57984809 57569658 57407639 57036030
6007 57036030 56531737 56279222 56075771 56328055 57247422 58024510 59344889 61244118 63520662
5998 63520662 66108894 68834210 71365918 74035325 76705020 79939475 83748280 88333549
5990 88333549 94312545 101330492 108054801 112790518 112737008 106926139 98702057 91786075
5982 91786075 86764476 82931292 80336675 77983065 75693575 73766697 71861100 69545163
5974 69545163 67116910 64580602 62211520 60417758 59049512 58092442 57609885 57136610 56402700
5965 56402700 55911459 55684880 55214786 54795871 53971649 52867576 50591876 46609669 41957894
5956 41957894 37976799 34825874 32154392 30224080 28742684 27498495 26555812 25816805
5948 25816805 25217708 24570743 23766162 22825234 22292671 21658544 20779687 20147994 19829599
5939 19829599 19432700 19196515 18984975 18742876 18435553 18186423 18207297 18077830 18018159 17632104
5929 17632104 17584666 17558440 17561178 17489434 17312402 17127461 17029223 16894515 16936347 16881385 16975567
5918 16975567 17267474 17410790 17590209 17751389 17966368 18159164 18436159 18727615 19100618
5909 19100618 19286317 19566264 19976635 20382949 20680133 21179090 21526083 21923780 22226990
5900 22226990 22653628 23255733 23901514 24582643 25600201 26546341 27461160 28474909 29351235
5891 29351235 30251100 31644055 33070844 34647110 36752440 39077315 41922081 45339063
5883 45339063 48991030 52776366 56271143 59105379 60755759 61169620 61192770 61379227 61747535
5874 61747535 62241426 63174946 64345513 65673166 67263287 69136454 71346143 74175095
5866 74175095 76821157 79707308 82175681 84553807 86827874 89388768 92131553 95206778
5858 95206778 98743434 103268041 108307794 112822948 115094064 113591224 108239178 100705511
5850 100705511 93837847 88083983 83572559 79875363 77145714 74979953 72715936 70711574
5842 70711574 68484977 66583585 65310786 64408836 63773172 63620317 63541382 63273120 63425254
5833 63425254 63482550 63538548 63382258 62940848 62497363 61553357 59241265 56002019 51688114
5824 51688114 47591533 44480245 42078893 40366381 39608788 39124292 38810259 37900426 35790898
5815 35790898 32807926 29793650 27451385 25829348 24625267 23402887 22595854 21743162
5807 21743162 20647104 19473415 18578853 17742852 17224860 16956909 16540918 15981841 15453125
5798 15453125 15170204 14965164 14797302 14607434 14406042 14184141 13786202 13499541 13003051
5789 13003051 12623825 12437645 12019231 11890219 11692766 11544578 11336649 10863558 10552151
5780 10552151 10405629 10190555 9928965 9549385 9406494 9257369 9057383 8945991 8752438
5771 8752438 8815435 8782355 8742925 8807079 8860226 8741130 8652619 8594931 8539802 8455660 8396395
5760 8396395 8351222 8155806 8033852 7802233 7569726 7513907 7443796 7383250 7113055 6726343
5750 6726343 6647937 6540605 6346646 6135487 5788393 5733101 5781716 5647586 5378301 5384780
5740 5384780 5496497 5430815 5362111 5339478 5376006 5393069 5421900 5422673 5465411 5453233 5475166 5345688
5728 5345688 5095708 4739444 4560600 4516329 4486138 4056284 3987051 3778686 3775121 3894178
5718 3894178 3728433 3940828 3817675 3805044 3640635 3433593 3343907 3365471 3440690 3367108
5708 3367108 3406182 3323825 3411869 3495350 3545608 3573185 3491283 3240332 2899490 3077226 3053265
5697 3053265 3118297 2994170 2810030 2616967 2553836 2527933 2812475 2959086 2636095 2339815
5687 2339815 2208641 2103220 2126599 2213320 2194838 2403884 2218073 2347607 2278922 2307743
5677 2307743 2255812 2220650 2249971 2140518 2156666 2335328 2609340 2680744 2464014 2320210
5667 2320210 2553776 2533238 2573589 2542974 2645821 2401098 2491824 2676911 2632937 2684993 2798960
5656 2798960 3061803 3243555 3198902 3179816 3348960 3240269 3338741 3413100 3412751 3512696 3559618
5645 3559618 3497736 3530828 3608609 3301499 3281303 3248932 3333208 3435641 3521196 3554383 3664976
5634 3664976 3810519 4011328 4089384 4136028 4067807 4012842 4149439 4208385 4510139 4689119
5624 4689119 4910470 4860720 4728007 4657548 4439039 4323090 4259556 4332130 4207584 4347567
5614 4347567 4279190 4204410 4364340 4294554 4472782 4654982 4599536 4617938 4451720 4363513 4331965
5603 4331965 4008276 3974097 4102054 3938207 3777692 3875110 3870556 3979964 3728924 3696891
5593 3696891 3744592 3611398 3632266 3663062 3665629 3801035 3811349 3871347 3900780 3980016 4028141
5582 4028141 4438299 4610685 4758763 5125559 5300757 5459478 5976617 6393123 7099550 7958382
5572 7958382 9071277 10525124 12156241 14382216 16175666 16977426 16070700 13359804 10634175
5563 10634175 8416921 7079350 6060410 5235330 4619597 4276328 3839106 3476422 3498169
5554 3498169 3302283 2971043 2826709 2844178 2669957 2669656 2900031 2759356 2600237 2567750
5544 2567750 2608040 2962911 2963912 2928116 3178978 3379177 3149411 3034299 2781997 2522352
5534 2522352 2299319 2309488 2135262 2051492 1912247 1835937 1768625 1853132 2011538 2027500 1866564
5523 1866564 1778490 1834033 1919115 1912745 1753520 1633956 1697599 1594958 1391071 1546970 1646991
5512 1646991 1538657 1457298 1262286 1174774 1227799 1092565 953376 1075606 1097686 1127959
5502 1127959 1225817 1174188 1143601 1144826 986361 1023887 975874 1142364 1256166 1117729 1106442
5491 1106442 1123366 1118838 895652 849495 788212 833847 928071 951443 835390 928032 907066
5480 907066 776426 627388 755252 913840 710079 734076 865267 990535 1048925 1120856
5470 1120856 946059 731849 790743 602865 404514 541261 800187 704640 708397 702279 777774
5459 777774 661529 713579 644933 671222 833111 707261 732559 728948 697763 672756 785133
5448 785133 703216 823124 863264 747779 642322 949656 844276 697735 693983 748386 723052
5437 723052 592644 524719 705563 765396 744843 723584 592565 572002 478668 653405 584398
5426 584398 392319 636561 488301 582587 703665 571269 642582 548920 647215 680698 819040
5415 819040 878435 700851 669643 623932 456271 622173 816667 607171 545366 574688 809731
5404 809731 809762 577691 671465 568764 718066 811631 613450 558262 794826 833224 656200
5393 656200 444757 573603 803153 874099 735464 872699 773134 753753 781525 860006 854479
5382 854479 735491 780343 1041456 1047363 1109509 1084102 865922 930587 1035519 1155774 894465
5371 894465 838248 936509 919545 870654 982644 1063288 958333 998609 867259 885850 767640
5360 767640 778216 765110 824247 747584 585115 847339 1043510 999051 799646 921139 1106861
5349 1106861 978089 900558 881023 883353 866335 865871 910880 850017 870045 902601 869162 850873
5337 850873 802446 904662 990504 850666 751015 826112 942286 845180 905948 856134 990700
5326 990700 999615 910093 969726 1010134 911335 818401 750687 694746 732109 793754 862902 943779
5314 943779 805671 982891 907232 796378 615272 648068 679089 586591 733783 621831
5304 621831 789229 969036 782238 786738 998133 1126653 1151692 1052004 1267305 1254197 1237207
5293 1237207 1238822 1213551 1195639 967842 1273673 1236689 1287701 1362646 1341634 1461654 1404228
5282 1404228 1572936 1593074 1680400 1751898 1842853 1981970 1881704 2067443 2074824 2101190 2041847
5271 2041847 1778577 1947748 1832435 1771466 1868813 1930503 1940035 2024771 2277543 2244553 2229946
5260 2229946 2316937 2461017 2717319 3264709 3396775 3550361 3678110 3734403 4004072 4199118
5250 4199118 4316004 4355369 4196841 4196540 4336058 4292708 4072125 3772500 3723566 3440481 3337708
5239 3337708 3325427 3196315 3272994 2969303 3056861 3223883 3333487 3532139 3421014 3686228
5229 3686228 3972943 4063583 3498772 3271974 3379280 3401776 3273353 3013721 3126409 3272051
5219 3272051 3308516 3246023 2974988 3251813 3234701 2986570 3006954 2754944 2400959 2262481
5209 2262481 2363134 2385454 2375799 2484536 2474936 2419240 2578627 2389178 2467509 2451254 2332606
5198 2332606 2230723 2096796 2105964 1908851 1671609 1782036 1816921 1851622 1948778 2000200 1925783
5187 1925783 1621630 1541641 1691786 1598679 1435771 1484450 1348901 1455725 1413053 1087322
5177 1087322 995273 1206373 1247648 1273774 1336404 1278315 1133826 1288546 1227277 1316249 1416657
5166 1416657 1275906 1342773 1152412 1287119 1537939 1550164 1643086 1489213 1454255 1425682
5156 1425682 1555323 1566479 1374432 1412472 1546264 1577242 1377162 1231453 1046488 1225497
5146 1225497 1289446 1229905 1424876 1327164 1535251 1341079 1315303 1390527 1455456 1504214 1571614
5135 1571614 1615690 1653568 1788703 1748917 1545181 1746281 1959667 2216757 2521972 2696941
5125 2696941 2830643 3221930 3467421 3669581 3456903 2887347 2608730 2215629 1854344 1819064
5115 1819064 1684418 1568965 1637275 1476248 1523183 1528907 1550296 1460883 1636863 1477826 1558811
5104 1558811 1461813 1404132 1504959 1508390 1525132 1609655 1788184 1667444 1656868 1618763 1352393
5093 1352393 1465820 1323186 1368877 1348525 1385905 1421472 1682671 1729129 1509586 1568792 1635595
5082 1635595 1648898 1505949 1614281 1785281 1611909 1687290 1795325 1890780 2130927 2264754
5072 2264754 2491695 2347748 2338104 2414677 2840745 2863337 3019168 3679384 3824092 4150321
5062 4150321 4634847 5380007 6025522 6839103 7240966 6883661 5971298 5073210 4487572 4132544
5052 4132544 3622535 3388505 3152802 2947708 2815711 2519740 2494093 2406888 2342894 2207047
5042 2207047 2267308 2300573 2349438 2441183 2609042 2717225 2845409 3009201 2704842 2903874
5032 2903874 3000374 3179126 3295817 3697282 3767232 3785928 3597140 3266027 3139805 2703759
5022 2703759 2509372 2254674 2043189 2163997 2070904 1859812 1830642 1871056 1810723 1672153
5012 1672153 1612955 1477015 1471223 1526066 1611352 1736046 1751029 1687029 1699524 1665316 1620495
5001 1620495 1651324 1769255 1631722 1684293 1688127 1698516 1610678 1537325 1517687 1553054 1510701
4990 1510701 1732473 1874369 1759434 1793927 1811268 1779687 1835118 1738339 1849539 1953811
4980 1953811 1970417 1854129 1963738 2094405 2141491 1986336 1986112 2091066 2066697 1891838 2065509
4969 2065509 2010467 2079159 2094167 2154786 2102861 2187910 2284683 2377255 2174635 2229332 2388180
4958 2388180 2351216 2307152 2313984 2700009 3073630 3182108 3069454 3042231 2821193 2991942
4948 2991942 3038185 2784750 2650120 2568007 2637814 2575492 2745462 2866429 3083382 3075731 3024748
4937 3024748 3012613 3001095 2926969 2911101 3021212 3141656 3230490 3066656 3264798 3542961
4927 3542961 3516734 3504881 3591776 3548367 3759085 3828241 3991245 4249220 4125617 4058571 4304417
4916 4304417 4556553 4698913 4921318 5243644 5127580 5148693 5478706 5481616 5500586 5693784
4906 5693784 6098793 6298300 6358838 6627605 6812015 6800153 6930656 7258682 7633982 7702835
4896 7702835 7951862 8335451 8457697 8762505 8857905 9100867 9465792 9501490 9564176 9719826
4886 9719826 9862894 9972129 9909226 10069708 10147705 10257649 10417681 10439614 10570014 10793125
4876 10793125 10896181 11198058 11550527 11796987 12122831 12262823 12459789 12799797 12878302 13178862
4866 13178862 13438630 13807891 14062252 14283368 14217251 14637083 15176130 15911659 16583832 17389134
4856 17389134 17943244 18790188 19682346 20580406 21542633 22823146 23956878 25165348 26994078
4847 26994078 28875136 30262483 31350167 31586934 31898882 32141167 32747876 33331533 34033402
4838 34033402 34582217 35444578 36661293 38236074 39768946 41305530 43005608 44975888
4830 44975888 47051221 50097592 53470802 57866255 62518871 67495197 72618318 78374912
4822 78374912 85484741 94529722 104744098 117053025 131488480 149583372 172710117
4815 172710117 201813906 236055686 276446165 327416358 390007362 445315314 471767447
4808 471767447 438404494 344861043 261523448 205508576 166287825 137957941 117682315
4801 117682315 102956594 91146469 81508608 73319396 66830954 61559427 57135930 53494820
4793 53494820 50711025 48719933 47017407 45577459 43769507 41545911 38740830 36047469
4785 36047469 33639639 31862920 30477672 29205871 28048255 26732687 25431770 24232582
4777 24232582 23077813 22107748 21129143 20140013 19257046 18053169 17355716 16692122 15871121
4768 15871121 15188012 14671724 14342859 13873792 13235964 12823577 12710397 12580402 12257446
4759 12257446 12031517 11673751 11731422 11674368 11566293 11612081 11489608 11208203 11002438 10527523
4749 10527523 10123653 9654598 9423992 8825672 8730775 8496273 8335905 8207351 8031070 7858117
4739 7858117 7601461 7550099 7216069 6929757 6677370 6589189 6447787 6170794 6079685 5981721
4729 5981721 5884068 5681898 5491666 5274310 5272931 5137229 5167246 5107172 4928864 4759737
4719 4759737 4574510 4348996 4618008 4327268 4180083 4331223 4191577 3920443 3937343 3718412
4709 3718412 3595739 3600780 3484544 3688228 3546113 3477658 3579421 3314115 3253753 3287200
4699 3287200 3547699 3448646 3348549 3387502 3309003 3373004 3495255 3408864 3414162 3371498 3172125
4688 3172125 3106420 3128534 3040258 3064423 2888234 2979761 2863678 2808562 2650783 2669583 2828329
4677 2828329 2789655 2767572 2751763 2472898 2540323 2675702 2325655 2466127 2474354 2427400 2415326
4666 2415326 2466493 2495465 2612005 2530122 2559621 2628082 2788579 2639537 2582060 2450710 2205941
4655 2205941 2196157 2209807 2142488 2312996 2391395 2269013 2194048 2049214 2031270 2241096 2097945
4644 2097945 1858988 1771257 1873021 1789311 1720818 1751706 1838413 1824829 1968088 2119871 2086617
4633 2086617 2262751 2117877 2075923 2331322 2677892 2663070 2615250 2238256 1791426 1757437
4623 1757437 1883603 1835584 1687846 1652043 1625649 1601479 1508804 1537259 1455013 1409955 1345380
4612 1345380 1258721 1411619 1495858 1561145 1783982 1626156 1797150 1727482 1638093 1722877 1708051
4601 1708051 1451288 1336412 1416378 1137429 1069743 1329808 1418051 1363478 1284862 1214152 1071845
4590 1071845 1056826 1079161 956253 1068592 1012498 1140381 1317775 1271575 1271914 1234482 1372436
4579 1372436 1437882 1311867 1080775 1106548 1207241 1186180 1095841 1025464 1108937 1073295 1132850
4568 1132850 1165469 1366557 1389119 1267359 1243885 1121170 1142223 1183534 1250557 1136596 1139775
4557 1139775 1134741 1217383 1318974 1389521 1401306 1363764 1322628 1308197 1377432 1313617 1336886
4546 1336886 1765225 1649844 1368759 1418381 1740309 1914810 1649487 1664125 1980937 2246936
4536 2246936 2162317 2321756 2831436 2958733 3132652 3464399 4095125 4566456 4948094 4768429
4526 4768429 4141123 3575219 3015399 2637553 2535374 2408171 1984074 1773646 1872825 1783968
4516 1783968 1766385 1755412 1739412 1771817 1746553 1834561 1770114 1771041 1726506 1728103 1895822 2111780
4504 2111780 2003646 2099447 2133471 2310950 2481405 2562588 2658468 2757469 3097915 3591401
4494 3591401 3886387 4065379 4240673 3963151 3359476 2962591 2898489 2765126 2762051 2871775
4484 2871775 2663016 2447632 2483435 2676376 2794943 2866185 2738868 2904070 3008803 3309877
4474 3309877 3824015 4065066 3932895 4172317 4491462 4723154 4949271 4838577 4473374 4236777
4464 4236777 4089906 4092534 4150361 4239653 4255442 3840089 3577262 3483968 3366744 3347032 3310956
4453 3310956 3155526 3063787 3127856 3162646 3391848 3738542 3782106 4021614 4261184 4647469
4443 4647469 5086905 5571271 5934832 5801255 5614438 5162693 4692776 4299900 4348414 4274978
4433 4274978 4348693 4183807 4178590 4028428 3729705 3595023 3113077 2850394 3014090 3033195
4423 3033195 2987723 2957735 2956936 3117684 3091879 2931166 2817155 2941887 2913753 2945064 2749607
4412 2749607 2826714 3077209 2988950 2815982 2689154 2751005 2686835 2750441 2807193 2665907 2745087
4401 2745087 2662739 2589054 2919068 2830791 2847550 2898936 2837412 2910280 2876579 2824190 2795351
4390 2795351 2712062 2468744 2572531 2556339 2510995 2574611 2695429 2639525 2799004 2762456 2696217
4379 2696217 2544974 2327773 2477540 2631908 2672833 2801640 2820214 2726589 2633797 2792276
4369 2792276 2817370 2803648 2892571 3080364 3169913 3361663 3212822 3398637 3415105 3293697
4359 3293697 3633813 3753964 3596208 3321990 3354132 3487328 3536169 3582733 3698981 3643169
4349 3643169 3583813 3746472 3790815 4063651 3941644 3982962 4076479 4251709 4392947 4525684
4339 4525684 4631926 4529699 4754165 4809323 4932160 4788276 4879600 5010426 5078486 5245638
4329 5245638 5298154 5349420 5343168 5325422 5256990 5245491 5427918 5463601 5276980 4990776 5029528
4318 5029528 5143169 5142916 5300458 5624220 5622704 5443426 5693752 6114096 6228018 6370381
4308 6370381 6513374 6469454 6532266 6544154 6522396 6549920 6624032 6819305 6709557 6754748 6876480
4297 6876480 6999158 7260713 7459361 7401654 7490784 7567624 7714835 7846283 7780002 7814803
4287 7814803 7899618 8167601 8441415 8560486 8524094 8821032 9243068 9467783 9582051 9754071
4277 9754071 10110273 10335915 10645303 10872218 11246667 11594886 11858146 12483534 12903998 13538753
4267 13538753 14369652 15060287 15446534 15385566 15094214 14932417 14853972 14705133 14525980 13927281
4257 13927281 13724374 13643344 13560953 13465287 13690553 13739501 13930972 14340870 14546355 14856790
4247 14856790 15057711 15092812 15067252 15127993 15149215 15341219 15446021 15200826 15001486 15190579
4237 15190579 15557758 15877682 16151117 16512035 16881589 17372266 17638410 17899760 18460912
4228 18460912 18972892 19921392 20478693 20872903 21500922 22116701 23166727 23823172 24452091
4219 24452091 25048137 25893584 26779009 27743890 28749871 29885942 31171717 32754334 33966289
4210 33966289 35548046 36990818 38266849 39587789 41093343 42985945 44912906 47175047
4202 47175047 49649424 52595624 56043392 60141132 64788894 69897919 75868207 82772992
4194 82772992 90955285 100131819 110799097 123383243 138627608 157033953 179671591
4187 179671591 207345473 240826133 282038407 331491714 384034497 427870674 443034711
4180 443034711 416225899 358403616 290582034 235112313 195665799 167097451 145727731
4173 145727731 128701234 114387728 102307662 92108865 83672723 76793150 71145567
4166 71145567 66435084 62282728 58421471 55224070 52101747 49579077 47327426 45222777
4158 45222777 43678437 41943160 40657855 39284697 38088898 37122665 36449200 35887516 35478490
4149 35478490 35473554 35636297 35852312 36457102 36939595 36445759 34666961 32010232 29288166
4140 29288166 26975254 24852807 23072701 21626883 20635314 19730818 18792362 18103107 17610620
4131 17610620 17177591 16732566 16278976 15969091 15592807 15262087 14924124 14702249 14308638
4122 14308638 14273093 14057223 13637787 13201399 12940676 12547850 12592228 12560973 12346889 12222488
4112 12222488 12364489 12467018 12366165 12165488 11880990 11907902 11855612 11533451 11539161 11258403
4102 11258403 10982073 10860694 10740871 10391049 10365832 10291803 10469261 10192769 9855063 9622600
4092 9622600 9169847 8718939 8616621 8603245 8340731 8049563 7876443 7885195 7643910 7383662
4082 7383662 7011288 6967540 6781326 6788977 6682532 6825833 6939396 7009813 6828347 6605997
4072 6605997 6576362 6544475 6457486 6579573 6654414 6688561 6449860 6295049 6333136 6136106 5950300
4061 5950300 5999402 6042536 6119360 6136553 6284978 6398055 6210086 6226870 6292641 6254654 6287710
4050 6287710 6355991 6519545 6575728 6599814 6573604 6637345 6459484 6405500 6570142 6706753 6812528
4039 6812528 6784081 6742129 6680217 6985210 6965261 6873619 6995758 6872027 7025650 7227807
4029 7227807 7232806 7425947 7406580 7516506 7541513 7624636 7651237 7921076 8239104 8501928 8894647
4018 8894647 9296370 9731140 10182712 10784096 11063775 11237723 10835690 10323085 9832914 9608875
4008 9608875 9423822 9449624 9428955 9562363 9664970 9728688 10020018 10166338 10067497 10099022
3998 10099022 10310800 10347898 10555336 11026328 11376368 11864599 12260170 13021258 13799851 14789404
3988 14789404 16114217 17644112 19009825 19783039 19648229 18473726 17468206 16693232 16416425
3979 16416425 16325863 16836574 17351180 18258863 18593909 18568746 18255562 17732811 17483497 17093231
3969 17093231 16843958 17029184 17193929 17476142 17966324 18407546 19138171 19695428 20801855
3960 20801855 21959512 23416345 24399186 24738719 24138980 23544582 23283290 23365752 23838836
3951 23838836 24290459 24757146 24696599 24276368 23619247 23230550 23080328 23239177 23683883 24259668
3941 24259668 24892302 25535417 26055525 26256585 26642292 27246906 27690193 28416126 29239318
3932 29239318 30358046 31411080 32283698 32709521 32295727 32037903 32051309 32180403 32649707
3923 32649707 33576724 34510325 35409933 36469314 37453832 38421398 39224002 40162026 40830193
3914 40830193 41411371 42253511 43576389 44713974 45673863 46950634 48274390 49824892 51547012
3905 51547012 53673889 55886802 58414774 61620457 64891164 67966521 70721552 73447112
3897 73447112 76230422 79769084 83525629 87464596 91770985 95711575 99384406 102826869
3889 102826869 105950500 109285083 113219335 118092068 123730685 129932318 137298705 145256798
3881 145256798 152257595 156700960 156859170 154056087 151547527 150385617 151258402 153293460
3873 153293460 155340135 157175014 158747547 160227943 161985824 164258476 166049698 166708581
3865 166708581 165436482 162835508 159530297 156505134 153888011 151659960 149575338 147539616
3857 147539616 146397459 146513468 147260630 147257969 144700871 138048101 128767379 119512738 112236738
3848 112236738 106595236 102076565 98530617 95074617 91972094 89178831 86038928 82801346
3840 82801346 79008452 74907706 71033469 67308582 64087443 61400192 59336571 57710635
3832 57710635 56037879 53670234 50926224 48528708 46288605 44646682 43461988 42252736
3824 42252736 41066892 39797975 38493366 37519402 36571691 35376320 34283940 33532789 32755306
3815 32755306 32002060 31054414 29627711 28138502 27044335 26196833 25743586 25122724 24392736
3806 24392736 24095985 23866165 23744444 23572112 23248325 22977196 22846702 22565062 22300545
3797 22300545 22364168 22474827 22209472 21965046 21680811 21126821 20529206 19829134 19212607 18765992
3787 18765992 18376638 17983755 17841868 17645576 17413319 17086680 17123107 17144159 16895162 17033609
3777 17033609 16955128 17005300 16742454 16455062 16307917 16326968 16056448 15906390 15758892 15422348
3767 15422348 15498357 15373514 15110962 15025162 15167736 15252986 15206218 15018040 15414297 15765416
3757 15765416 16143313 16696080 17258237 17904396 18611527 19669900 20998350 22462263 24071447
3748 24071447 25749800 27892234 29482939 30396007 30059144 28132357 25424146 22741316
3740 22741316 20199200 18569144 17429613 16409030 15762571 14975012 14251793 13793336 13153210
3731 13153210 12769928 12537308 12299661 12075585 11881730 11704877 11421967 11311269 11335154 11172540
3721 11172540 10991549 10861852 10687405 10598738 10427632 10468507 10382125 10202965 10088791 9915813
3711 9915813 9723817 9871705 9885601 9920893 9928622 9777487 9817012 9939156 9844461 9976927 9871357
3700 9871357 9717378 9675127 9730384 9770221 9527738 9523672 9516784 9400149 9421157 9552578 9474905
3689 9474905 9399256 9567799 9459624 9629371 9574068 9648314 9508794 9549832 9961767 10255264
3679 10255264 10260902 10246685 10436853 10530735 10537279 10692787 10931916 11121159 11309372 11276459 11417643
3668 11417643 11678876 11822480 11902852 12019693 12029559 11937967 11788510 11665970 11483485 11518647
3658 11518647 11350164 11214324 11516754 11604645 11407485 11404122 11306259 11312484 11123871 10997516
3648 10997516 10761584 10859904 10946784 10947576 10892705 10703758 10824072 11016496 11040590 11009921 11137100
3637 11137100 11234206 11402919 11299539 11319028 11250080 11070966 10753181 10608036 10424738 10337272
3627 10337272 10431050 10159333 10195693 10032037 9540629 9404201 9000699 8819189 8613408 8373329
3617 8373329 8407030 8330908 8046099 7998038 8034379 7949415 7863036 8011863 8003392 7975790 7822863
3606 7822863 7832485 7729233 7915024 7874688 7756633 7872692 7964526 7935970 7904425 7816492 7540135
3595 7540135 7396980 7134706 6991427 6929729 6769983 6694796 6495114 6438020 6526774 6336974
3585 6336974 6413341 6334233 5831900 5588139 5713725 5515373 5335072 5360946 5375281 5165394
3575 5165394 5338127 5396424 5266785 5237817 5152300 5312423 5306007 5244682 5477034 5141274 5043939
3564 5043939 4994854 4976384 4857034 4879510 4838255 4810789 4841360 4695853 4671397 4602115 4533488
3553 4533488 4195714 4182233 4229255 4087016 4064643 3948693 4036269 4003893 4047403 3974237 3860563
3542 3860563 3852160 3537249 3551712 3351804 3175171 3402909 3312366 3240993 3376273 3350636 3191234
3531 3191234 3228256 3316021 3318561 3441850 3497168 3294022 3237679 3058284 3006451 3037513 2921523
3520 2921523 2803204 2854292 2919962 2717648 2570017 2777390 2738261 2649070 2436970 2465431
3510 2465431 2519002 2411078 2423182 2404972 2412289 2282151 2111642 2068979 2041527 2064234 1990887
3499 1990887 2051610 2003824 1945307 1936397 1865426 1995949 2192370 2076071 2049395 1817665 1830230
3488 1830230 1885375 1720264 1908520 1804510 1832602 1785186 1669409 1643305 1894922 1840856
3478 1840856 1716623 1624267 1526697 1657667 1870725 1838034 1789100 1778065 1652144 1674148 1835302
3467 1835302 1691570 1728166 1637911 1748270 1730326 1636592 1735101 1645414 1637880 1575807 1528990
3456 1528990 1622818 1827022 1712738 1627986 1681112 1894271 1942715 1627139 1564195 1602575 1568250
3445 1568250 1563775 1759771 1727627 1807610 1815669 1776513 1923983 2003342 2007305 1926698 1725295
3434 1725295 1795362 1754905 1716417 1816989 1940436 1926625 1869261 1803116 1798092 1842529 1727601
3423 1727601 1728023 1685796 1706457 1655764 1679446 1640220 1684922 1673067 1620377 1733558 1846814
3412 1846814 2020537 1792009 1849453 1878841 1779005 2084716 2112731 2203896 2337329 2162385
3402 2162385 1852665 1769724 1838750 1621290 1662131 1688226 1851788 1689294 1459098 1570836
3392 1570836 1504674 1513909 1689602 1653045 1570079 1441282 1409002 1418057 1415722 1461725 1465192 1661514
3380 1661514 1599245 1450953 1521200 1296955 1419332 1696698 1958081 1939374 1871427 1818614
3370 1818614 1673393 1541811 1454421 1617170 1504063 1547103 1545855 1595081 1442290 1361202 1311681
3359 1311681 1302045 1575941 1628555 1593262 1548909 1419387 1409999 1279621 1296951 1340343 1450939
3348 1450939 1403513 1428975 1238337 1227901 1406663 1471967 1319391 1441943 1506015 1479841 1596812
3337 1596812 1762240 1701908 1511585 1496940 1424022 1384301 1491770 1713874 1569759 1525070
3327 1525070 1530284 1515058 1508423 1478329 1445624 1367407 1385312 1507279 1727008 1651244 1596145
3316 1596145 1625278 1594965 1831155 1654187 1732683 1894505 2021988 1988146 1703522 1747280
3306 1747280 1953591 2185691 2252533 2196253 2160868 2221651 1955080 1897763 1911854 1865879 1884493
3295 1884493 2043559 2138569 2194476 2200520 2238643 2169506 2303748 2505680 2492203 2324028 2462117
3284 2462117 2541260 2641421 2819558 2914786 3047838 3203823 3241236 3151272 3157238 3482409 3507789
3273 3507789 3633710 3788233 3918150 4018052 4273203 4604374 4805151 4970672 5291555 5636130
3263 5636130 5886001 6186319 6463997 6600868 6561493 6731160 6605090 6578531 6213778 5846983
3253 5846983 5567653 4993820 4809941 4707460 4356334 4392531 4046642 3851393 3675374 3535049
3243 3535049 3236293 3144505 3070609 2913622 2896395 2798020 2904945 2950216 2965962 2684626 2546268
3232 2546268 2528959 2649536 2552070 2435890 2660926 2859986 2961913 2396985 2370459 2477782
3222 2477782 2603253 2526733 2536451 2486677 2681271 2601588 2448273 2430490 2239286 2140206 2077790
3211 2077790 2128965 2068760 2009361 1921760 2125080 2138547 2149246 2076301 1984337 2094922 2056185
3200 2056185 2002037 1906540 1876319 1898343 2075719 2143443 2160425 2326569 2263828 2076254 2135488
3189 2135488 2046467 2068842 2098468 2164552 2183246 2237215 2139221 2101263 2145140 1970433 1900840
3178 1900840 1777838 1890043 1802429 1937220 1916876 1757524 1854922 2088540 2136510 1997274
3168 1997274 1969901 1872475 1844093 1998063 1810591 1717128 1780976 1800752 1821400 1951362 1924253
3157 1924253 1762505 1549273 1597024 1887484 1923748 1769416 1735096 1832491 1668668 1787269
3147 1787269 1750259 1634868 1731853 1791425 1814065 1859190 1818698 1635234 1423893 1500553 1552302
3136 1552302 1551768 1606560 1497463 1470797 1491799 1674847 1600251 1540137 1492341 1484324 1382783
3125 1382783 1326276 1276980 1247463 1344016 1393094 1453352 1361710 1391070 1554222 1381397 1314283
3114 1314283 1268130 1238789 1356449 1439004 1401352 1250169 1200962 1042309 1154860 1440806
3104 1440806 1022247 891877 970120 989655 1035301 1098142 1220059 1054686 955714 946942 912299
3093 912299 925269 983106 1029889 955392 960699 1139043 1050584 984179 916307 905210 1070285
3082 1070285 1114289 888018 960319 982097 934224 850565 820285 831272 747893 752461 561616
3071 561616 597510 892892 857041 687809 683640 604993 731493 645820 641753 497518 656617
3060 656617 688705 550446 660996 671145 484077 538895 614940 708640 642301 711233 800529
3049 800529 692334 705120 748736 683107 503227 556104 781266 632509 539553 746836 554196
3038 554196 293087 409986 605607 528768 404310 461705 593875 355677 319916 542908
3028 542908 517291 680674 632485 600540 618349 700073 775803 716664 642778 730419 737489 602438
3016 602438 727538 694717 378785 275498 382079 472353 550360 451002 442993 380091 534555
3005 534555 627780 718401 599290 613806 627237 588897 728869 637769 350415 555747 682795
2994 682795 620124 394515 527629 531233 561558 385317 510787 676304 597735 472714 323281
2983 323281 478660 555969 596257 683387 602947 468750 471404 602489 338719 348027 387517
2972 387517 352549 352930 433675 396699 351341 393260 592047 661135 501895 479574 687280
2961 687280 498413 533551 693948 623241 611623 577136 628961 530467 709637 516726 584690
2950 584690 726682 672718 631352 670239 648922 614834 574686 771443 831626 733874 783435
2939 783435 769741 817489 935204 849518 888548 970822 807301 701019 649026 570239 742210
2928 742210 765101 656577 607481 645995 698785 894250 806710 857497 857574 887739 785864 884293
2916 884293 1003313 825513 858100 825977 901844 856654 599408 570940 427447 637723 797386
2905 797386 755831 546187 458212 497104 409390 397630 433821 490140 507041 453566 524860
2894 524860 535327 703460 826270 698967 580639 668505 815620 576180 536892 451279
2884 451279 508088 501744 523024 607987 436051 394780 480505 28986 109283 292148 271326
2873 271326 284612 277716 447847 338410 285039 187763 257518 438650 432782 419006 381858
2862 381858 324883 397791 427660 314032 360747 422345 367292 321690 268114 365955 248423
2851 248423 57299 48210 34575 150575 126833 182233 286156 68096 37518 -153887 114927
2840 114927 234405 577 309235 302458 96033 -126841 21901 79648 68005 241126
2830 241126 139887 184167 245452 133437 38665 67235 136672 255459 121246 188835 35929
2819 35929 63645 59747 -32891 74036 54741 55925 135016 153608 -3077 212354 132608 187933
2807 187933 236088 143531 142554 356050 193710 -116638 -238633 -111929 86641 101041 221335
2796 221335 55352 -246576 -259797 15366 265757 221636 38351 77819 -101206 -75012
2786 -75012 -194152 -91690 181138 30590 -8048 28823 121269 -149072 -210754 -154057 -59100
2775 -59100 76696 -74927 -43235 -41297 -21336 8177 -39538 11038 -26120 181204 310497
2764 310497 195214 321187 376595 184616 -6901 63983 50213 -31602 113329 147259 203460
2753 203460 175540 255777 175582 68913 -456 15779 26004 -38821 -114016 757 22911
2742 22911 -105436 -38900 -157994 90270 177453 147021 199266 -23690 56085 -61258 13598
2731 13598 66410 60761 158921 -25565 52786 19695 62553 128204 14005 -227859 -109707
2720 -109707 105080 25464 61342 226974 280201 201824 207078 66214 52379 149801 71166
2709 71166 -43352 61821 149309 35278 -117602 -176557 -198485 29738 61666 170989 300302
2698 300302 410125 162657 104053 61117 -128113 8238 144365 30897 -123146 -121324
2688 -121324 111103 -128628 -239472 -230222 -86175 -37961 -174455 18890 -217482 -36083
2678 -36083 264406 135667 -19581 -150992 -113808 30621 265609 214997 48734 5071
2668 5071 -102436 -145695 -157442 -41206 24747 -12151 -201682 -56669 -16977 90982 161670
2657 161670 -43719 -100415 39373 162485 23647 -169560 38366 114167 39364 -115001
2647 -115001 -63248 49346 238266 142682 208347 117274 97268 146459 130054 242593 225499
2636 225499 174847 169695 162012 53446 5620 293859 47124 -8262 72120 109643 -40222
2625 -40222 -47824 -12691 -11706 -42724 -93202 -187972 -103985 -103300 -234864 -143033 -63305 -2634 -144118
2612 -144118 -10825 13200 -7651 -168015 -118519 16154 126077 25021 -33282 -5114 136783
2601 136783 156692 96488 -10921 -65862 171717 220744 -32419 -170631 -189259 -131670 -85616
2590 -85616 -306245 -228799 -129523 95086 165887 -3248 56458 46981 56912 -48412 142621
2579 142621 129095 -201181 -129550 -188229 -225174 -246840 -289902 -57918 104289 22197 114294
2568 114294 -45609 -258779 -159506 -43802 -16429 -17460 -41327 -30956 -78976 -147155 -21648
2557 -21648 -117734 135123 37049 77116 150467 166580 182578 127022 61709 -140447 -89886
2546 -89886 -31128 -2904 29759 -19987 168483 129981 124383 -80148 -67939 -55329 61495
2535 61495 142268 -1835 -103762 -93025 3489 -65702 77389 196438 -4950 218238 346100
2524 346100 359901 105082 -8632 26998 -161703 -130648 -56183 -117251 -98345 -87375 -188631
2513 -188631 -128881 -47060 205709 261713 197908 64317 63345 -57097 53628 246798 126095
2502 126095 -79223 -167480 -259915 46723 5747 -159370 20923 73711 101241 304389 278866
2491 278866 114362 73282 -55465 79242 53930 106408 61594 87183 242892 139719 -9838
2480 -9838 -108512 -233912 -63116 63195 -91542 -315324 -294349 -168795 -197937 -170738 -176213
2469 -176213 -58459 -50633 121887 202131 136047 356749 141468 116152 313661 236991 -123177
2458 -123177 -77151 110104 79427 62118 47973 14426 -38478 99946 63930 325878 192904
2447 192904 53516 63683 67628 59000 89330 -76407 69126 80158 125400 240566 227610
2436 227610 236592 304211 30824 -8305 -30940 -49872 65499 58690 196300 27029 25451
2425 25451 -69649 -45874 46219 19510 58981 99857 -21515 -83063 -88808 -134590 -51752 129165
2413 129165 53217 -39728 69971 7930 -56461 20546 12195 65361 3592 113767 103556
2402 103556 123326 -89031 -128372 201403 97838 44055 45205 39034 -22650 251421 513753
2391 513753 600091 480042 572598 546015 595007 826588 760955 584787 284419 309287 301528
2380 301528 187762 279524 146589 191682 136735 228146 181284 90116 159414 202802 64058
2369 64058 -93958 69176 127834 48757 139172 221065 136747 84584 139817 238614 193942
2358 193942 114849 143445 210969 122217 213557 163011 192889 173194 42542 50942 42889 32407
2346 32407 43288 137985 257282 143520 268019 243632 201408 139666 115115 271306 199542
2335 199542 212856 77473 15522 192560 235037 235182 96486 36552 168184 220487 192501
2324 192501 176477 110181 218311 80136 110088 193714 35639 56017 58434 132587 -105408
2313 -105408 100053 255481 237252 458358 310162 185152 262546 360358 452493 131806
2303 131806 -38034 172525 275928 362994 365808 394572 427608 459776 196204 63306 157534
2292 157534 277861 254442 259502 34955 143960 164611 190477 176511 64333 222130 297943
2281 297943 285598 410153 503197 402305 211189 -4 126702 336355 259748 434422
2271 434422 500296 456116 556972 418311 462856 620182 618229 536027 419572 476904 387187
2260 387187 383489 446363 493431 422573 361400 445984 337032 411560 573652 517689 544846
2249 544846 563280 643319 572643 775267 808725 500870 637958 634349 590091 671059 634322
2238 634322 464628 651148 853234 865346 736430 845736 990820 858291 599588 703691
2228 703691 736429 769079 920239 726342 884768 927863 865896 997326 1221443 1304576 1302360
2217 1302360 1287385 1013507 1137094 1368093 1498044 1677690 1439313 1308998 1522941 1534592
2207 1534592 1548268 1556086 1669737 1801401 1967311 1913941 2045033 1994656 1684177 1808020
2197 1808020 2096883 2152604 2165175 2261953 2008224 1833048 1950289 2063355 2141276 1961765
2187 1961765 2093961 2279284 2357774 2289669 2499642 2422175 2387901 2406452 2537108 2539079 2714596
2176 2714596 2777107 2753131 2880601 2883690 2987427 3136723 3289801 3393053 3340496 3184187
2166 3184187 3479305 3681398 3927007 3996090 4061199 4264143 4447295 4662775 4818082 4735251
2156 4735251 4853847 5258087 5396902 5486684 5899208 6263678 6404678 6703862 7107866 7364665
2146 7364665 7625414 7912573 8354483 8710030 9375236 9977006 10441931 11263655 12018816 13389694
2136 13389694 14643126 16114328 17294617 18455950 19737478 21490876 23673541 26193940
2128 26193940 29259610 33415432 38640771 45682040 53513036 63162102 76067671 91843246
2120 91843246 104584679 110068748 97917603 72823339 55258773 43899975 36368315
2113 36368315 30064304 25705487 22582085 20269239 18220540 16729835 15783118 15293861
2105 15293861 14667094 13835211 12930220 11861740 10814078 10004537 9330158 8567460 8016738
2096 8016738 7509377 7170550 7001046 6559022 6178744 5851763 5457747 5368847 5104318 4813606
2086 4813606 4552679 4604078 4592911 4460603 4296001 3798637 3501058 3466994 3192201 2893132
2076 2893132 2660847 2895697 2982774 2927230 2727596 2503387 2507244 2420524 2474412 2643404 2584899
2065 2584899 2331638 2170416 2049322 2098278 1970605 1861854 1965652 1857160 1805466 1980805
2055 1980805 1960442 1935865 1889872 1855653 1742217 1794634 1971523 1889510 1655746 1519287 1604701
2044 1604701 1494867 1333726 1347109 1181613 1100231 1218848 1089317 1101423 1065818 1061814 1208002
2033 1208002 1292935 1061412 911287 1084587 978814 879876 867360 903000 927344 997984 1127647
2022 1127647 996701 730737 646589 565554 646951 794583 716351 724556 798525 733308 712210
2011 712210 952864 771838 854359 876847 729395 634484 659125 647917 704234 737377 505421
2000 505421 480815 620830 565414 658011 725699 551550 613559 630109 614528 559343 400213
1989 400213 664569 624604 496711 419396 269594 391079 518324 524057 400533 389016 468676
1978 468676 502629 598374 750862 566059 326619 353384 423365 386457 500767 452611 285326
1967 285326 280237 431526 557137 406024 290942 120968 162063 69856 345109 217334
1957 217334 157204 297976 251304 231888 127293 161670 251213 219905 350861 194423 349469
1946 349469 385251 264279 73166 20681 -60360 87704 237743 204886 351322 318910 178692
1935 178692 117769 101539 37931 158294 119989 108906 21879 -15237 169522 390952 423789
1924 423789 346567 375431 184993 194779 185919 109993 394313 208582 135576 111238 137495
1913 137495 65137 142950 255894 223494 82309 101435 -75072 -15723 -228752 -123114 32801
1902 32801 107672 137594 174728 141818 209389 56628 -208520 -26107 131210 133321 327306
1891 327306 258591 68238 108181 124769 201934 232371 153385 251302 391904 400457 403143 272319
1879 272319 244732 -95505 -136863 -13111 93053 119137 173716 157220 40027 231207 246125
1868 246125 91282 123678 183265 -49678 168800 234867 272840 216645 102310 7137 66166
1857 66166 251303 267103 100680 116344 242467 537416 684834 685093 524099 370590 335492
1846 335492 166618 302324 319179 383997 368357 219972 287641 341006 92135 -169494 -98736
1835 -98736 5259 -66000 19656 -25547 329698 71080 66680 276948 157476 77472 183383
1824 183383 159950 227156 -700 -143832 -30424 -129468 130270 95077 9671 103777 339485
1813 339485 155111 272456 148941 -86812 18155 -336 -25177 -12397 -56986 -54864 16766
1802 16766 -165370 -44849 298610 357366 191709 33389 -192362 -122740 -46592 125176
1792 125176 169488 -59871 -66722 151514 72332 -92715 20548 -121723 -173844 38068 23019
1781 23019 -24628 31145 -80436 -116390 22850 69390 54128 63111 76048 151883 -33366
1770 -33366 -53976 254592 128057 -105410 -87652 92473 27326 36291 -121753 -63423 3736
1759 3736 64039 116301 129830 181583 5142 79194 76327 106502 189768 199627 305664 252166
1747 252166 130389 100471 95943 5939 -95056 -23858 -151740 -98512 74541 257101 163817
1736 163817 121629 139073 69704 37611 -11153 264967 92131 3585 -124981 -187067 -117881
1725 -117881 -73754 -74894 -24653 -54869 -52876 49632 -155114 -60747 42757 107980 106282 17101
1713 17101 45241 -66951 -162440 -92674 213762 218671 135679 -99532 -314824 -139526 -19071
1702 -19071 -44949 -153678 -124362 16802 16958 90548 -145242 -152702 -17998 36988 147776
1691 147776 -75419 -72100 -128995 78167 -143700 -123172 64781 29143 46655 80614 -37811
1680 -37811 44619 -91759 -207907 -178287 210618 173547 153585 340906 -93462 107697 41052
1669 41052 19163 52159 29346 -40377 -107027 -184561 -241063 -125073 66291 222577 95764
1658 95764 191056 226708 137139 -58489 4788 104477 -15506 106371 -2709 -145882 100583
1647 100583 123159 105612 103675 33392 37461 -26065 145871 176735 -53497 -3788 -63246 -111746
1635 -111746 -184206 -106811 69003 18786 160782 150127 228877 46074 -186655 -81423 111108
1624 111108 126142 -84300 -26876 143536 17878 -41655 29320 -150049 -50749 104495 6738
1613 6738 112634 -29360 -57708 -94767 -6841 143815 92686 149771 64040 -90562 -138641
1602 -138641 -98469 -200326 -250477 -185946 -188473 -89626 35768 64052 100971 95627 201207
1591 201207 44746 -3138 38792 -65559 6278 256119 -26806 -24982 102160 39248 56097
1580 56097 27274 106339 -5527 -110140 -93480 -247157 -114505 142205 217678 -155314 -253613
1569 -253613 -217645 -71158 -2653 -122029 -45362 -89483 -10555 -77214 -77900 87623 131846
1558 131846 -65562 -148662 111224 206281 27279 71298 360072 220130 24613 -69257
1548 -69257 -147550 -34384 -240989 -254788 109584 201686 6437 -109851 -180 -143018
1538 -143018 -267346 -118592 -70633 -119718 -245879 -153843 -181244 51699 -21008 4100 66494
1527 66494 -54456 -222653 -119397 -44039 58146 -71946 17364 40054 45279 -125207 -423394
1516 -423394 -322536 -76873 37819 -136781 -210131 -186670 -74629 -83519 -11793 14235 -27544
1505 -27544 -93162 -198976 -214477 -160898 -58209 -57985 -19973 10986 -7716 -94947 42555 -43383
1493 -43383 -287161 -127409 -16102 -41106 43826 -24776 -117768 104181 124403 195232 -67480
1482 -67480 -133674 -27877 -61506 -18789 34364 55146 -82285 103927 53010 17987 -116459
1471 -116459 -88881 -58017 -120768 -138207 -340406 -331442 -137023 -99646 57176 101818 235049
1460 235049 207852 -195703 16922 61796 -142234 -217645 34131 -15115 -6587 273462 108763
1449 108763 -63050 -6759 -71906 -241832 -223456 -91358 -42553 105758 4203 89898 181749
1438 181749 124434 25995 61373 71058 -66605 -114553 -92922 -153199 -33661 66187 22464
1427 22464 -92013 -119570 106794 21405 -14274 -7984 -83175 92091 142072 85737 -128545
1416 -128545 -172083 -113547 113222 12461 -112778 -46924 -80839 139004 78419 74085 -39587
1405 -39587 -84914 -150510 -107859 -35300 23667 66982 -132448 -102897 41308 219851 179331
1394 179331 80843 -82101 -88815 -111708 -49569 1101 10514 37600 -123193 -81841 -32849 -46485
1382 -46485 -5663 -48284 78312 19179 -54411 -194385 138822 100215 137611 75120 28816
1371 28816 -39577 -47908 -786 329404 323869 -15786 5934 -18153 56717 -100806 -184857 -59097
1359 -59097 177644 72699 1934 -95718 -38301 -34524 126402 135838 141658 -42961 -134440 45642
1347 45642 100095 38838 96244 81363 34311 -42164 66198 -45624 94405 256472 183037
1336 183037 48817 -208486 -345564 -220982 -146653 -132138 -159939 18797 4340 -136998
1326 -136998 -153597 -13285 157194 43252 -15359 122597 107754 -228718 -161601 -3712
1316 -3712 114976 32531 -95988 -56607 -94012 19758 59384 -11989 -155499 -172776 -162142
1305 -162142 42970 213017 100295 68911 -240285 -298873 1279 39463 141332 135821 141814
1294 141814 85370 24214 -35952 205846 14680 -74037 -135662 -173805 105032 210045 45800
1283 45800 -5352 10075 24093 116049 -24204 -22256 -37059 -3854 -53634 -88491 88661 25224
1271 25224 5994 177862 66397 -112141 -278250 -324163 -199237 -141443 -152894 -69728 -79150
1260 -79150 55258 208229 63490 45191 85089 41256 163358 102552 102516 98376 -78584 -156451
1248 -156451 -252161 -134643 3206 287243 270756 11799 -94416 -72359 73787 -73244
1238 -73244 -210276 -257352 -135171 -189915 89851 114631 5059 104756 114832 -55426 -304526
1227 -304526 -316487 -168374 -317877 -170061 -232084 -205974 48429 39826 -21020 127948 143755
1216 143755 -141930 -99537 -6305 30074 171491 108839 -60744 -308881 -257591 -243851 -132394
1205 -132394 84641 167594 30996 -189430 -126391 -124971 -83086 21563 -50682 22405 -37290
1194 -37290 31566 -1618 48532 -4809 -29088 10775 50545 50068 43399 266331 158984 135559
1182 135559 72545 182103 276501 72159 -21176 57251 -16421 -165544 -137123 -330426 -249444
1171 -249444 -157173 -379017 -66737 5410 21107 250093 85151 -55988 -1633 -78481 95084
1160 95084 -81372 -124721 -82393 -47826 -89251 -125597 -108676 89435 182037 209721 292674
1149 292674 69330 -74446 -37343 -18460 -65179 -135223 -94001 48890 -85049 -191861 -159292
1138 -159292 -184093 -191089 -347636 -205773 -142651 -101669 91218 34539 -42399 52625 112152
1127 112152 -133413 -117783 -27344 -6666 36215 -5328 -66413 -117627 -153574 -362625 -352106
1116 -352106 -216708 -123025 -51540 52149 15955 78448 49354 -206318 -210602 -6696 -58649
1105 -58649 85406 -82191 -90209 171801 30952 -155657 19394 7919 10034 17045 -12728
1094 -12728 -64166 -136869 125270 127676 160267 17246 -222165 -180053 -64383 -70100 15370
1083 15370 87189 84836 86320 86934 29903 93966 119726 40963 -49527 108062 65387 4548
1071 4548 9299 19359 94463 71826 39135 166816 89049 29894 37482 -10774 -40937 -179420
1059 -179420 -159661 92280 223306 214571 77963 178830 79428 32306 61494 -81194 -111167
1048 -111167 -46360 -111328 -106616 237449 92501 132099 193036 82610 -34731 -10668 64427
1037 64427 36473 -73877 64166 86729 -42764 -13927 674 166858 111961 -108108 -201480
1026 -201480 -144741 26557 58594 -251329 -100102 -47680 -122499 -107788 -85253 -44317 -241109
1015 -241109 -168846 -128681 -166527 -142200 -230897 -144955 56495 -12814 -114529 -25620 -38132
1004 -38132 -218877 -177155 -23251 -12655 9334 -5980 73737 94115 60941 18882 -102127
993 -102127 35955 82488 37928 173348 154009 -6687 -46289 -53600 -27513 46169 12368
982 12368 85501 185120 75585 -272 22090 -32329 -185298 -160224 -50604 -108532 -87484
971 -87484 -58882 19500 -149250 -150909 -194088 -176525 -226608 -333571 -407274 -39333 98367
960 98367 -36204 -126014 -331933 -437604 -378744 -182511 -139103 -237888 -78625 -1588 -26603
949 -26603 72313 -90818 -38229 -2297 -66878 -198744 -87065 3852 -77485 -138070 86107
938 86107 34487 2574 -57869 5376 88245 32432 16558 -7630 -130588 -38095 100145 33652
926 33652 -87653 40415 39613 42301 -3780 -160328 -165670 -126836 -91088 3761 -93336 -43202
914 -43202 -156565 -211289 -48691 -71064 -45547 -134756 -67594 7265 49892 256821 192758
903 192758 311257 225928 -151227 -195548 -66128 -280932 -450449 -95457 -17664 1323 -33286
892 -33286 60310 -52467 -181277 -26261 129102 -12844 -15285 -32273 -95172 6255 182501
881 182501 84597 -6983 -186905 -91634 194074 12078 -125694 -223060 -223420 -9681 -117667
870 -117667 -351991 -112275 -122919 -228756 -196445 26328 162895 106143 318512 249213 164145
859 164145 125467 72268 -81841 -105649 73301 119075 158595 73633 80709 -36891 -204727
848 -204727 -59439 16361 -12145 -37142 18907 -119990 -327180 -371489 -183694 27356 -87460
837 -87460 -52316 175631 54427 -51824 -112930 -13661 62693 64998 -56557 -146468 -208780
826 -208780 -84217 -88131 13171 -62420 -119431 51192 -66189 345 24171 219049 158093
815 158093 117938 -56484 31762 152686 104552 112894 115915 -33167 -52072 90665 160798
804 160798 38460 -51693 -28898 -78177 -216319 -290815 -296631 -130758 -2788 -178751 -71603
793 -71603 -10770 -168143 -184187 42789 -97502 -115272 -125138 34135 111562 54596 -53633
782 -53633 103967 229883 -21727 63892 14831 27396 50370 -36552 -121400 20653 -118102
771 -118102 -76863 17916 262811 322958 171029 175749 11946 -9044 143037 122882 68621
760 68621 -70856 139052 110791 -12499 82031 3153 -144726 -216332 -298213 -262035 -115006
749 -115006 17327 83698 -89576 -47268 20114 -15089 -8720 48095 -71845 -12882 20347
738 20347 -233074 -209596 -124554 -264894 -151805 -91946 48711 11885 -15239 88283 -26628
727 -26628 5997 103046 236165 255186 68954 105301 101666 35534 42850 31719 163872 295921
715 295921 127251 177257 145626 -90580 -126854 -11479 131615 75040 70497 109969 -818
704 -818 2717 -64934 -74325 -80591 -183012 -117540 -72105 -10104 205295 160062 39569 -202147
692 -202147 -134435 -185097 -148033 -102610 -153551 -132264 -51162 122463 45983 173949 210229
681 210229 -31371 -103031 -67350 -7075 -149226 -244684 -105073 -30694 33149 190597 73867
670 73867 -26437 168979 96257 71922 -87748 -263813 -244409 -146231 -156785 -42383 -33859
659 -33859 97105 142541 39167 5568 -24617 50466 -2915 -1985 9311 12642 87209 -128306
647 -128306 122778 131685 108139 -17765 -59720 82697 126532 145308 56562 23553 -183128
636 -183128 -26102 158445 160882 80325 188467 45497 -226668 -122770 42554 -23739 -31169
625 -31169 115402 -125031 -85893 -44860 247503 280083 173990 168751 144190 173370 35443
614 35443 -28521 50432 26633 -126609 -33312 -140334 -129632 -94161 -154444 -142676 -121027 -228425
602 -228425 -72000 37314 162257 76919 8071 -186646 -339354 -137728 67269 30064
592 30064 -6662 129876 166668 86728 3482 96965 17379 -28390 257261 279187 117665
581 117665 -72531 -10154 26925 -32133 36223 15632 -4660 -84469 46473 55150 -197338
570 -197338 -105260 66796 67741 161224 256407 204636 111048 62659 67421 53461 86547 -80704
558 -80704 31889 71269 -49025 -97497 -118234 -1759 69713 280623 283101 195142 124900
547 124900 109761 161612 -31575 -101838 -126768 -98765 80006 68243 100916 23952 -137754
536 -137754 -187696 -30543 -78177 -25110 42263 88572 129956 2959 89194 74700 53882
525 53882 286884 134803 155640 105849 -7779 56164 144854 -78928 -40851 27558 102438
514 102438 198176 43006 196304 -122961 -148345 -225274 -190360 -20920 -54676 61344 195724
503 195724 75989 41916 60674 -22133 -45081 -30048 68449 53385 245383 53288 33580
492 33580 70506 189830 98446 -215326 -274745 -164704 -264566 -275561 -253589 -115228 18559
481 18559 -131074 -14257 75281 -176659 -206124 -26775 -79610 -133063 26710 -38786 -135056
470 -135056 -184252 44151 53530 -23401 38662 -73498 55851 69035 122629 48884 88117
459 88117 -49822 -155541 2196 143939 -160891 34433 -9663 -65127 -281475 -243629 329
448 329 -32337 23767 -65525 -106537 -159550 -327613 -140595 -133630 41979 182092 34536 -234263
436 -234263 -77479 110394 82338 3733 -26594 -87952 -174383 -99674 -113484 -98136 -254326
425 -254326 -56441 -155822 -69185 -93756 -19015 -97248 -110464 -130636 -135010 9109 77687 87273
413 87273 73039 64552 63424 -5377 -92447 -100920 -111096 -271123 -174519 -338156 -189730 -39706
401 -39706 48426 106108 -2092 163466 26898 13135 25550 -32383 -37342 237862 192581
390 192581 -19434 -196247 -108825 -59632 54742 92360 179616 176583 81330 -47517 -41242
379 -41242 103328 91072 -108063 -145385 -92029 -312082 -150569 -117829 -85325 -1048 -164036
368 -164036 -335875 -345618 -191120 -184070 -43131 -93426 -24809 177992 82643 -202794 -285422
357 -285422 -301890 -354997 -294441 -213258 -233015 -149431 2536 -121328 -82758 87088 15709
346 15709 -38804 -16371 -8775 36389 -119025 -149670 -116973 -164300 -129492 43282 -36474 9836
334 9836 -154886 -175986 -88410 -147932 73966 195613 225623 108457 143537 -19451 -137677
323 -137677 -7562 -14072 44097 -93872 -43334 -191583 -172953 -216201 -157355 -127750 -8206
312 -8206 80159 -38982 20476 153318 -95799 -118638 -92351 -214427 21997 -133799 -213878
301 -213878 -142593 -81821 -19871 26027 -48963 104758 52750 -55216 -264454 -175742 74488
290 74488 17944 96174 -118118 -399138 -248757 -14091 -188222 -33524 79665 284435
280 284435 394925 167773 -127019 -54507 -129083 -495397 -369683 -170325 -152225 -65064 222189
269 222189 192785 103774 -16378 7862 137676 -89658 27915 -43956 5630 -100102 -143012
258 -143012 -3557 -315498 -323815 -151515 -191157 -223886 -78914 -89894 116884 285215 107340
247 107340 99123 85995 -75980 50345 52086 -44784 -34353 -318154 -295335 -178511 -275337
236 -275337 -33803 -112025 -176852 33600 -5847 -145212 -81403 -149544 -98731 -185315 -73993
225 -73993 -257533 -152470 -42879 -60616 27014 58640 -167656 61489 -83893 68325 -97277
214 -97277 -154666 -56039 -135796 -237517 -77458 46640 -57016 -36328 -285192 -297462 -218655
203 -218655 -122653 -45587 62713 68432 -1014 -89672 -45744 -6015 -39189 -58184 55730 226492
191 226492 213783 -98063 12983 -19070 60660 -5988 -97237 -100644 22060 166167 -86915
180 -86915 -56782 29439 5772 5763 -176398 -99282 -138287 -90921 -39859 -242987 -340687 -136015
168 -136015 -23540 -23324 -193540 -8285 106228 -109305 -213003 -90012 -150987 -62502 -194060
157 -194060 -326143 -96597 61316 71596 19769 -70858 3751 62115 -43963 -147786 42671
146 42671 -166194 -207500 -328334 -224874 -176414 -101761 -143886 -169947 -157438 -221309 -211386 -62572
134 -62572 -116254 -269143 -323233 -213736 21324 24034 33858 -169298 -27677 -111678 61647
123 61647 -12464 -30969 120054 -5834 -71464 -13241 15859 -88928 -161412 -171359 -47114
112 -47114 9434 -18424 60364 -17707 -20991 -49273 -95369 -149092 -147938 -60666 -11893 -6085 -73399
99 -73399 -193763 -85204 -118016 -137299 -184416 -201552 -118209 -199041 -137500 -143173 -86825 37481
87 37481 -36951 -33151 144515 116756 -9262 -19249 -89194 -172636 -100307 -81794 -44757 7175
75 7175 -51825 -12212 -193025 -205689 -71160 -83643 -89609 62304 -20532 -22993 70803 116352
63 116352 -40381 -255751 -225398 -48010 -110997 -254673 -188638 -33498 -17424 29972 -67594
52 -67594 -43831 -10012 -133795 99090 20152 -13734 -40532 -213468 -260325 -161834 -156139 -89635
40 -89635 -118673 -191717 -230145 -239102 -142996 -110850 -47706 -39655 8480 -82091 23390 113466
28 113466 -3605 -103827 -110828 -202017 -100669 -656 14416 -19355 -14162 -208158 14109
17 14109 -129280 -128332 -98613 -80578 29203 -31828 -58383 -114307 -50722 -87688 -91812 -40512
5 -40512 -28561 -70704 -75882 -292057 -246772
0 -246772
$$ Imaginary data points
##PAGE= N=2
##DATA TABLE= (X++(I..I)), XYDATA
16383 -1066591 -1134345 -1139730 -1152732 -1058801 -1012675 -1033405 -978898 -926866 -984482 -895161 -1013727
16372 -1013727 -1090747 -867242 -673202 -666327 -581631 -503963 -520044 -584126 -609783 -582353 -587620
16361 -587620 -516287 -563812 -583551 -446386 -479214 -365902 -355730 -427311 -337231 -405473 -447512
16350 -447512 -417886 -384125 -370914 -259471 -341476 -176568 -136219 -171512 -287267 -279040 -76177
16339 -76177 -108906 -126156 -56518 -80902 -132598 -102496 84053 80458 85475 -19712 17977 224003
16327 224003 224470 81416 122568 260088 122855 43583 228329 351003 418499 512179 444735
16316 444735 370718 363906 298237 402203 460102 551379 569076 622403 518512 477219 609113
16305 609113 629003 633531 591477 703351 883002 742750 817178 844402 658519 745357 800652
16294 800652 825064 882353 949060 985095 918877 942881 863715 856871 958167 858206 788729
16283 788729 792263 940091 1058869 1112828 1088229 1106372 1024374 1143493 1167819 1285371 1239652
16272 1239652 1173685 1173410 1278642 1167969 1028325 1075183 1188123 1165704 1199425 1203564 1304561
16261 1304561 1177592 1017958 1301709 1279365 1431634 1390664 1536685 1459112 1519527 1396531
16251 1396531 1360961 1341935 1247736 1269828 1514419 1342821 1482466 1715546 1717678 1592224
16241 1592224 1579727 1571718 1557217 1568735 1595560 1792345 1852300 1817279 1795773 1566688 1677942
16230 1677942 1991342 1800340 1677769 1581760 1734807 1751779 1831393 1780569 1902261 1950799
16220 1950799 1929269 1971573 1704773 1794694 2011654 1839113 1747002 1815455 1849954 1982934
16210 1982934 2005460 2066395 2224000 2093279 2091896 1937555 1934367 1872305 1869461 1950889 2061061
16199 2061061 1918058 1979139 1947638 1951979 2008711 1973785 2020954 2233564 2221793 2059376 2143244
16188 2143244 2216092 2190139 2125433 1906769 2140460 2176352 2188914 2255696 2240241 2149772 2184907
16177 2184907 2139375 2030100 2150845 2122605 2179105 2269386 2218995 2415465 2512655 2315348
16167 2315348 2247666 2296723 2393554 2271551 2149414 2202534 2249392 2288937 2219516 2159952 2179426
16156 2179426 2206014 2355536 2288658 2176585 2130814 2154666 2100672 2301209 2317575 2318537 2034339
16145 2034339 2252016 2309150 2281565 2156444 2349009 2220842 2078790 2316100 2346073 2261316
16135 2261316 2432810 2358280 2485986 2519121 2349451 2395564 2409966 2328165 2235935 2325144 2252439
16124 2252439 2363970 2292524 2362425 2444955 2372107 2447633 2634128 2514967 2558589 2372672
16114 2372672 2424466 2364038 2278432 2429790 2482753 2388546 2473949 2477335 2381695 2446473 2330641
16103 2330641 2534494 2484158 2546144 2608300 2502560 2534693 2478428 2556783 2503955 2517325 2431316
16092 2431316 2405996 2589241 2597115 2666829 2553284 2390056 2462087 2368426 2278115 2228758 2335490
16081 2335490 2593966 2571692 2485426 2411644 2199138 2386791 2283603 2177248 2448334 2264595
16071 2264595 2329534 2549005 2500232 2525156 2459121 2519205 2311798 2370160 2483011 2439195 2546773
16060 2546773 2559498 2456196 2495666 2523646 2398807 2470915 2515327 2370020 2257731 2343817
16050 2343817 2461566 2336014 2358183 2526727 2540073 2447230 2476875 2425602 2542423 2625363
16040 2625363 2431376 2524861 2527689 2431247 2271755 2431246 2483370 2536038 2478482 2557451 2515278
16029 2515278 2508229 2619798 2660104 2581320 2498365 2424587 2497085 2479738 2432972 2257503 2371509
16018 2371509 2480245 2471745 2563520 2420732 2491660 2538253 2692580 2687361 2555011 2625453 2791858
16007 2791858 2699703 2567592 2483301 2489747 2600365 2528759 2436557 2443977 2457795 2560307 2505771
15996 2505771 2609518 2720798 2652969 2663545 2741796 2509246 2315122 2395579 2539517 2404602
15986 2404602 2366945 2306124 2380693 2522052 2493136 2455859 2428755 2516701 2727800 2513752 2323181
15975 2323181 2383858 2398785 2494210 2668115 2788762 2533612 2490298 2511515 2492834 2468682 2631954
15964 2631954 2737666 2566821 2634539 2652288 2692283 2671431 2560113 2562896 2581447 2555057 2576040
15953 2576040 2595803 2452701 2465119 2531609 2514464 2439326 2525812 2511576 2405697 2400701 2556694
15942 2556694 2641230 2491947 2387055 2426440 2630934 2662836 2641815 2480548 2501678 2610631
15932 2610631 2542826 2581821 2611043 2684586 2619946 2644716 2568202 2596770 2525064 2420271 2335280
15921 2335280 2390502 2473636 2796984 2845672 2663365 2563450 2510921 2489297 2582741 2458204 2455097
15910 2455097 2674074 2548290 2466661 2570726 2779651 2544010 2297756 2213960 2473773 2625669
15900 2625669 2470476 2534401 2583189 2463752 2508052 2399790 2226319 2346826 2685578 2655227
15890 2655227 2269855 2391119 2305206 2280771 2458348 2290111 2371654 2596976 2496681 2385646
15880 2385646 2538762 2466158 2530249 2569840 2638893 2559204 2487427 2534678 2624063 2705790 2570697
15869 2570697 2381643 2465798 2581693 2514578 2387143 2372755 2399881 2542820 2683231 2525429
15859 2525429 2254886 2458525 2523309 2459736 2444024 2376010 2426676 2531503 2858019 2585920
15849 2585920 2576547 2323909 2235488 2517366 2522658 2535465 2630736 2521669 2634312 2535503 2487293
15838 2487293 2657261 2617093 2538009 2409515 2504373 2521358 2686017 2599266 2555340 2411395
15828 2411395 2316971 2366085 2455323 2495240 2561089 2591602 2719961 2677621 2576805 2583974 2728019
15817 2728019 2844168 2668952 2432566 2374299 2405297 2667197 2665219 2579424 2522424 2439213 2528975
15806 2528975 2352638 2429721 2632001 2643944 2595115 2479476 2345360 2404091 2549097 2731450
15796 2731450 2759516 2570280 2740061 2732998 2621797 2491263 2296649 2421026 2538367 2454043
$$ [...]
##END NTUPLES=NMR SPECTRUM
##END=
