##TITLE=1H_EC-3265(III-14)
 CDCl3
 8 sc, 
 9.02.2022
##JCAMPDX= 6.0         $$ Bruker NMR JCAMP-DX V2.0
##DATA TYPE= NMR SPECTRUM
##DATA CLASS= NTUPLES
##ORIGIN= UXNMR, Bruker Analytische Messtechnik GmbH
##OWNER= root
$$ XWIN-NMR		Version 3.5
$$ Wed Feb  9 10:49:24 2022 Russian Standard Time (UT+4h)  she@DPX200
##.OBSERVE FREQUENCY= 200.131346
##.OBSERVE NUCLEUS= ^1H
##.ACQUISITION MODE= SIMULTANEOUS
##.ACQUISITION SCHEME= undefined
##.AVERAGES= 8
##.DIGITISER RES= 18
##SPECTROMETER/DATA SYSTEM= spect
##.PULSE SEQUENCE= zg30
##.SOLVENT NAME= CDCl3
##.SHIFT REFERENCE= (INTERNAL, CDCl3, 0, 15.7215)
##AUDIT TRAIL= $$ (NUMBER, WHEN, WHO, WHERE, WHAT)
$$ ##TITLE= Audit trail, XWIN-NMR		Version 3.5
$$ ##JCAMPDX= 5.01
$$ ##ORIGIN= Bruker BioSpin GmbH
$$ ##OWNER= she
$$ F:/spectra/data/she/nmr/H-F/1/pdata/1/auditp.txt
$$ ##AUDIT TRAIL=  $$ (NUMBER, WHEN, WHO, WHERE, WHAT)
(   1,<2022-02-09 10:47:12.37 +0400>,<she>,<DPX200>,
      <created by zg, POWCHK disabled, PULCHK disabled
       configuration hash MD5:
       00 E9 B6 7A A2 85 ED C7 34 08 36 98 17 FE 4E 26
       data hash MD5: 16K
       AD 9F 26 17 9C 89 0A 18 80 D0 F3 B1 38 E1 2C 3C>)
(   2,<2022-02-09 10:47:22.98 +0400>,<she>,<DPX200>,
      <Start of raw data processing
       efp BC_mod = 2 LB = 0.24 FT_mod = 6 PKNL = 1 PHC0 = -15869.22 PHC1 = 10.00078 SI = 16K 
       data hash MD5: 16K
       FE 2A EB D9 10 C0 E9 26 F1 54 DD FB 6A E9 49 F8>)
(   3,<2022-02-09 10:47:45.51 +0400>,<she>,<DPX200>,
      <pk PHC0 = -0.5437293 PHC1 = 1.2 
       data hash MD5: 16K
       55 E5 77 3F 20 D9 63 F6 48 A5 54 5A 8F 07 56 9A>)
(   4,<2022-02-09 10:47:50.65 +0400>,<she>,<DPX200>,
      <abs ABSG = 5 
       data hash MD5: 16K
       E3 B3 CC 31 D7 3A 2A D1 90 E7 7E CA 91 4A C3 AB>)
(   5,<2022-02-09 10:48:01.15 +0400>,<she>,<DPX200>,
      <abs ABSG = 5 
       data hash MD5: 16K
       2E 5E B7 39 62 36 06 EF D1 87 FE 7A 9A 72 43 BD>)
$$ ##END=
$$ 
$$ hash MD5
$$ D2 81 6B 6B FE B5 E0 37 7B 9A 6A A1 31 9B EB CC
##$RELAX= 
##$RELAX= 
##$RELAX= 
##$RELAX= 
##$RELAX= 
##$RELAX= 
$$ Bruker specific parameters
$$ --------------------------
##$DU= <F:/spectra>
##$EXPNO= 1
##$NAME= <H-F>
##$PROCNO= 1
##$TYPE= <nmr>
##$USER= <she>
##$AMP= (0..31)
100 100 100 100 100 100 100 100 100 100 100 100 100 100 100 100 100 100 
100 100 100 100 100 100 100 100 100 100 100 100 100 100 
##$AQSEQ= 0
##$AQ_mod= 1
##$AUNM= <au_zg>
##$AUTOPOS= <>
##$BF1= 200.13
##$BF2= 200.13
##$BF3= 200.13
##$BF4= 200.13
##$BF5= 200.13
##$BF6= 200.13
##$BF7= 200.13
##$BF8= 200.13
##$BYTORDA= 1
##$CFDGTYP= 0
##$CFRGTYP= 5
##$CHEMSTR= <none>
##$CNST= (0..31)
1 1 145 1 1 1 1 1 1 1 1 1 1 1 1 1 1 1 1 1 1 1 1 1 1 1 1 1 1 1 1 1 
##$CPDPRG= <>
##$CPDPRG1= <>
##$CPDPRG2= <>
##$CPDPRG3= <>
##$CPDPRG4= <mlev>
##$CPDPRG5= <mlev>
##$CPDPRG6= <mlev>
##$CPDPRG7= <mlev>
##$CPDPRG8= <mlev>
##$CPDPRGB= <>
##$CPDPRGT= <>
##$D= (0..31)
0 1.2 0 0 0 0 0 0 0 0.06 0 0.03 0 0 0 0 0.0002 0 0 0 0 0 0 0 0 0 0 0 0 
0 0 0 
##$DATE= 1644389231
##$DBL= (0..7)
$$ [...]
##$SUBNAM2= <"">
##$SUBNAM3= <"">
##$SUBNAM4= <"">
##$SUBNAM5= <"">
##$SUBNAM6= <"">
##$SUBNAM7= <"">
##$SUBNAM8= <"">
##$SUBNAM9= <"">
##$SW= 18.0517287032376
##$SWIBOX= (0..15)
0 0 2 0 0 0 0 0 0 0 0 0 0 0 0 0 
##$SW_h= 3612.71676300578
##$TD= 16384
##$TD0= 1
##$TE= 0
##$TE2= 300
##$TE3= 300
##$TEG= 300
##$TL= (0..7)
0 120 120 120 120 120 120 120 
##$TP= (0..7)
150 150 150 150 150 150 150 150 
##$TP07= 0
##$TPNAME0= <>
##$TPNAME1= <>
##$TPNAME2= <>
##$TPNAME3= <>
##$TPNAME4= <>
##$TPNAME5= <>
##$TPNAME6= <>
##$TPNAME7= <>
##$TPOAL= (0..7)
0.5 0.5 0.5 0.5 0.5 0.5 0.5 0.5 
##$TPOFFS= (0..7)
0 0 0 0 0 0 0 0 
##$TUNHIN= 0
##$TUNHOUT= 0
##$TUNXOUT= 0
##$USERA1= <user>
##$USERA2= <user>
##$USERA3= <user>
##$USERA4= <user>
##$USERA5= <user>
##$V9= 5
##$VALIST= <valist>
##$VCLIST= <CCCCCCCCCCCCCCC>
##$VD= 0
##$VDLIST= <DDDDDDDDDDDDDDD>
##$VPLIST= <PPPPPPPPPPPPPPP>
##$VTLIST= <TTTTTTTTTTTTTTT>
##$WBST= 1024
##$WBSW= 4
##$XGAIN= (0..3)
0 0 0 0 
##$XL= 0
##$YL= 0
##$YMAX_a= 223068
##$YMIN_a= -371180
##$ZGOPTNS= <>
##$ZL1= 120
##$ZL2= 120
##$ZL3= 120
##$ZL4= 120
##$ABSF1= 15.73807
##$ABSF2= -2.31378
##$ABSG= 5
##$ABSL= 3
##$ALPHA= 0
##$AQORDER= 0
##$ASSFAC= 0
##$ASSFACI= 0
##$ASSFACX= 0
##$ASSWID= 0
##$AUNMP= <proc_1d>
##$AZFE= 0.1
##$AZFW= 0.1
##$BCFW= 0
##$BC_mod= 2
##$BYTORDP= 0
##$COROFFS= 0
##$CY= -3
##$DATMOD= 1
##$DC= 0
##$DFILT= <>
##$DTYPP= 0
##$F1P= 0
##$F2P= 0
##$FCOR= 1
##$FTSIZE= 16384
##$FT_mod= 6
##$GAMMA= 0
##$GB= 0
##$INTBC= 1
##$INTSCL= 0
##$ISEN= 128
##$LB= 0.24
##$LEV0= 0
##$LPBIN= 0
##$MAXI= 10000
##$MC2= 0
##$MEAN= 0
##$ME_mod= 0
##$MI= 1.114404
##$NCOEF= 0
##$NC_proc= -6
##$NLEV= 6
##$NOISF1= 3.799351
##$NOISF2= 2.8
##$NSP= 0
##$NTH_PI= 0
##$NZP= 0
##$OFFSET= 15.72155
##$PC= 1
##$PHC0= -15869.76
##$PHC1= 11.20078
##$PH_mod= 1
##$PKNL= yes
##$PPARMOD= 0
##$PSCAL= 0
##$PSIGN= 0
##$REVERSE= no
##$SF= 200.130006004571
##$SI= 16384
##$SIGF1= 3
##$SIGF2= 2
##$SINO= 5.538805
##$SIOLD= 16384
##$SREGLST= <1H.CDCl3>
##$SSB= 0
##$STSI= 16384
##$STSR= 0
##$SW_p= 3612.71676300578
##$SYMM= 0
##$S_DEV= 0
##$TDeff= 16384
##$TDoff= 0
##$TI= <>
##$TILT= no
##$TM1= 0
##$TM2= 0
##$TOPLEV= 0
##$USERP1= <user>
##$USERP2= <user>
##$USERP3= <user>
##$USERP4= <user>
##$USERP5= <user>
##$WDW= 1
##$XDIM= 16384
##$YMAX_p= 303026134
##$YMIN_p= -623711
$$ End of Bruker specific parameters
$$ ---------------------------------
##NTUPLES= NMR SPECTRUM
##VAR_NAME=  FREQUENCY,     SPECTRUM/REAL,   SPECTRUM/IMAG
##SYMBOL=    X,             R,               I
##VAR_TYPE=  INDEPENDENT,   DEPENDENT,       DEPENDENT
##VAR_FORM=  AFFN,          ASDF,            ASDF
##VAR_DIM=   16384,         16384,           16384
##UNITS=     HZ,            ARBITRARY UNITS, ARBITRARY UNITS
##FACTOR=    0.220516191357247, 1,           1
##FIRST=     3146.35389345817, 0,            0
##LAST=      -466.36286954761, 0,            0
##MIN=       -466.36286954761, -623711,      0
##MAX=       3146.35389345817, 303026134,    0
$$ Real data points
##PAGE= N=1
##DATA TABLE= (X++(R..R)), XYDATA
$$ [...]
7189A287532M6475J90924k811L4166L6960J467N1421P536M7277R777m7001Q7127
7177A750850M9315R3885R4812M2579k3175L7682N2342J48209j9180p5984J9833
7166B171168j3901R341K00121K8005K6823M1156k0486J04078K8693P7833K4303
7155B677134n6405J8442J01735P4072P5488Q9634m0806N5640J20613J26122R2088
7144C333757Q5244L0884Q1770R9865R8072J95418J96075J60977J28324J83516
7134D593902Q7501L38706K69404K03889K82151K14832L09713K98330K76012L42780
7124G217220L75837L49849K82698L34826L35875M06559N23625N79335N47533P38361
7114A1691718R28816R62143J258399J497293J676623K113354K483433K781799
$$ plain form
7189 1287532 1334007 1524931 1522120 1556286 1593246 1594713 1646134 1653670 1700947 1710724 1663723 1750850
7177 1750850 1800165 1894050 1988862 2031441 2008266 2045948 2098290 2246499 2227319 2151335 2171168
7166 2171168 2157267 2166608 2366729 2394734 2421557 2462713 2442227 2546305 2574998 2652831 2677134
7155 2677134 2620729 2639171 2740906 2814978 2890466 2980100 2939294 2994934 3115547 3241669 3333757
7144 3333757 3419001 3449885 3531655 3631520 3729592 3925010 4121085 4282062 4410386 4593902
7134 4593902 4681403 5020109 5289513 5493402 5775553 5990385 6300098 6598428 6874440 7217220
7124 7217220 7593057 7942906 8225604 8560430 8896305 9302864 9826489 10405824 10953357 11691718
7114 11691718 12620534 13582677 14841076 16338369 18014992 20128346 22611779 25393578
7106B5393578L199646M067504N027085O510653Q001501R573196J0339097R019377
7098H1131637N314173p56052o348210r687448j0564527r312902p320985n732815
7090C6722871m445852l729177l309125k781957k425952k145817j805999j298301
7082A4780691j031378j134754r32895o21644p63735o71860n61667m46683n02663
7073H113412m25908k36685l39725l54353k13652q4467k20408j93228j30292j60136
7063E754558j63782k75165j88893l15491l40047k13926j54142k02912j08039p9233
7053C712928q4074o4587k551j10429j16340m5958j21682J9757k9746O2780k4595
7042C195503l5849o408n0462K8552J98204J18297n1122R9881o9534k12939j81627
$$ plain form
7106 25393578 28593224 32660728 37687813 44198466 52199967 61773163 72112260 81131637
7098 81131637 86445810 85689758 79341548 69654100 59089573 49776671 42455686 36722871
7090 36722871 32277019 28547842 25238717 22456760 20030808 17884991 16078992 14780691
7082 14780691 13749313 12614559 11681664 11060020 10296285 9624425 9062758 8616075 8113412
7073 8113412 7687504 7450819 7111094 6756741 6543089 6458622 6238214 6044986 5914694 5754558
7063 5754558 5590776 5315611 5126718 4811227 4471180 4257254 4103112 3900200 3792161 3712928
7053 3712928 3628854 3564267 3561716 3451287 3334947 3288989 3167307 3187064 3157318 3220098 3195503
7042 3195503 3159654 3153246 3102784 3131336 3329540 3447837 3396715 3496596 3427062 3214123 3032496
7031C032496k36760l04162k05444q7660j59878j03590o3673j00069j23563p4242
7021A573455Q314p592K7432m3278q4894K8003Q3197q7831n1800j1223p0997K6611
7009A389397j15192j9338p0752j32261l3781k6254N9647q190r0709j02568K4572
6998H74571Q0699q3295p4135p1349p7603J18700o9919r847Q0745j21409J1492
6987F58650P4980p0193k4222J6670M396J4054j00912N8782J11208q524j28657
6976F06232L1577k7164m7715l4931r6455N4058M0684J6460N8943q3449o3637n7600
6964C97003L595q154r9206L5506J07595k9460J45472M1141j06362O8768R942j3361
6952E52479l0487m6354o7116K1706L3430L3024m7967m4350J42639j22554p7198
$$ plain form
7031 3032496 2795736 2491574 2286130 2198470 2038592 1935002 1871329 1771260 1647697 1573455
7021 1573455 1581769 1574177 1601609 1558331 1473437 1501440 1584637 1496806 1445006 1433783 1362786 1389397
7009 1389397 1274205 1254867 1184115 1051854 1018073 991819 1051466 1043276 952567 849999 874571
6998 874571 955270 871975 797840 726491 648888 767588 697669 687822 768567 647158 658650
6987 658650 733630 663437 639215 655885 660281 674335 573423 632205 743413 734889 606232
6976 606232 637809 610645 562930 527999 431544 485602 526286 542746 601689 518240 454603 397003
6964 397003 400598 392444 293238 328744 436339 406879 552351 593492 487130 555898 565840 552479
6952 552479 521992 475638 408522 430228 463658 496682 448715 404365 547004 424450 347252
6941C47252k2226N8053K4533K6919R5549o9205l1276L5853l8787n5200j32853
6930B38612j7071j2560R8285K807j06836j15538J32076N8929o6010k5015k3129
6919A64550k0062p1872N8858N4268J12791j58499n590k4226O0784Q7920j9505
6908B39417k7481m929P4119J8466r187R422j11043M8591l4941l9462O108n747
6896A63333M2701l3361k6774K1995N0520n5562m5928N2574r3839Q1428Q2401M0437
6884B79925j10645n371l2203L388M7355m8877J01875n7044J7509l982j02669L4020
6872A23281K5974p6053M4883M3833q9928M5091J922j18817m9844K03509P8254
6861B32105O7711q1714j59673Q6994m2695l9810K552J4392L3123L8469j46634
$$ plain form
6941 347252 325026 383079 407612 434531 530080 460875 429599 465452 426665 371465 238612
6930 238612 221541 208981 307266 310073 203237 87699 219775 278704 212694 187679 164550
6919 164550 144488 72616 131474 185742 298533 140034 134444 110218 171002 258922 239417
6908 239417 211936 207007 281126 299592 290405 299827 188784 237375 202434 162972 169080 163333
6896 163333 206034 172673 145899 167894 218414 162852 116924 169498 75659 157087 239488 279925
6884 279925 169280 163909 131706 135094 182449 133572 235447 178403 195912 191930 89261 123281
6872 123281 149255 73202 118085 161918 71990 117081 119003 186 -49658 153851 232105
6861 232105 299816 218102 58429 145423 102728 62918 65470 79862 112985 151454 4820
6850D820J9657j8788L5807L2414J4142N235k5529k8565l9114L2919r4764P3820
6838A2054R1063J8975p2575m1139N2934O6544n4616p1103q5883J6501J32088n1303
6826A3540N6974R269q1825l2171M1702k4359Q2094k9595m8890O8046J0255k5808
6814C9232p6594L7301L2769N0497k3475n346k2575m3739O6686J06496j7669m1431
6802A02152m7343R2356K3278m4390M224M7022j2017m5859m2317j5591K7305l8592
6790E0228J38376N7003j177n9026j179O970p2667k3580K582k2048o2603J0426
6778B3305M6789n6616L4113J7902j05068l3708L6457o5151J06044O8034M9671
6767A21772r28J2153K1826k7276M0825j29089j3946R2863O0596m373O1225o2118
$$ plain form
6850 4820 24477 5689 41496 73910 88052 93287 67758 39193 79 32998 -61766 12054
6838 12054 103117 122092 49517 8378 61312 127856 73240 2137 -83746 -67245 64843 13540
6826 13540 70514 79783 -2042 -34213 7489 -16870 65224 35629 -13261 54785 65040 39232
6814 39232 -37362 -61 32708 83205 59730 54384 31809 -11930 54756 161252 143583 102152
6802 102152 54809 147165 170443 126053 130277 177299 165282 119423 77106 61515 88820 50228
6790 50228 188604 245607 244430 185404 184225 191195 118528 94948 97530 75482 12879 23305
6778 23305 70094 13478 47591 65493 -39575 -73283 -36826 -101977 4067 72101 121772
6767 121772 120844 132997 154823 127547 168372 39283 25337 118200 178796 174423 235648 173530
6755A73530j32013m8107K1605k3472K1639L5417j8178K4751m1605N0881J14376
6744A78824m5818N324R221l1861o2810n2914M6744K2393M9617j6340K9069K8430
6732A59879j02929k01J43516o3608n7539j480O0526l4074l349L5068r340o3283
6720F3186L6035j1557r4182L3108n6204K5483N1098o3283M4672Q0472J6388L6897
6708A62113K7981L0356N0887M810L3475j6294K1678m4836O0241M9290M7605K5650
6696D52956n1521L6018l4634n997q0699j06345m4993R7600K5911p87j5570r8117
6684A73822r5064j6742j9884K1958K4106j6761N7754Q5110o438n8149J7139m3165
6672A23686j23420N5011L2082j1680L3526o8332J5881J26678p1434o5084M4904
$$ plain form
6755 173530 41517 -6590 15015 -8457 13182 48599 30421 55172 13567 64448 178824
6744 178824 133006 138330 147551 115690 52880 -34 46710 69103 118720 102380 131449 159879
6732 159879 56950 56749 200265 136657 79118 77638 138164 104090 100741 135809 126469 63186
6720 63186 99221 87664 -6518 26590 -29614 -4131 46967 -16316 28356 108828 125216 162113
6708 162113 190094 220450 271337 276147 309622 293328 315006 270170 330411 379701 427306 452956
6696 452956 401435 437453 402819 396822 316123 209778 164785 262385 288296 287509 271939 173822
6684 173822 78758 62016 42132 64090 88196 71435 129189 214299 207861 149712 166851 123686
6672 123686 266 55277 87359 75679 109205 40873 56754 183432 111998 46914 91818
6661I1818k0590m8358j6190N503P6559J17271n351j08924q4485K71K2695p541
6649B2678j8537P4492m028N0904l1256j2033R933l1534q525l3595J7248p0024
6637c4277J32753k1301j7844o174J6618M034J9445N1477l022q9550j01319J6457
6625c2703K4696J3667n295m5788Q3038R207j8194K0269O8609K2963j0597M7125
6613A76997o1782k8470k3073j11280L0597P5845q5818l3858J04536J18997k7830
6602A34861n6363L8735O4361p4881q8012n1758J1520J52879j816m6280J9850q3111
6590A9985L903j0559L1967P4463n1583o2109k4120J01871Q213r100j23042j2422
6578e2533J46582k9419j28693K327Q1163o3495j09166J73073J20000j09724r386
$$ plain form
6661 91818 71228 22870 6680 12183 88742 206013 200662 91738 7253 7524 30219 22678
6649 22678 4141 78633 74605 125509 94253 82220 92153 60619 52094 18499 35747 -34277
6637 -34277 98476 77175 59331 53157 69775 73809 93254 144731 141709 52159 -49160 -32703
6625 -32703 -8007 5660 365 -45423 37615 46822 28628 48897 117506 140469 129872 176997
6613 176997 115215 86745 63672 -47608 -17011 58834 -26984 -60842 43694 162691 134861
6602 134861 78498 117233 181594 106713 18701 -33057 -21537 131342 129526 83246 103096 19985
6590 19985 23888 13329 45296 119759 68176 6067 -18053 83818 92031 82931 -40111 -52533
6578 -52533 94049 64630 -64063 -61736 19427 -44068 -153234 19839 139839 30115 20729
6567B0729j3410J23463P329j15404N681N5091R799R285n458l4461P271m4208j4409
6554A1298j89j2097N1467N3273J7765p0562K7119P3592j04194m4811O4924P8607
6542A46192q0277l2577J13610k9774p1776j04264k9494J65375J02161j04171m0885
6531C4120J1062M0613p447O9706o5450J4550q4666O4277k6927K8453J17423o2265
6519A33449l2967K843J8691M9514K7781l5725L9610K8965j22595j28256M0111
6508B1421K0466k5962J9464R4754P4409o9327n4277O2481O3417j43213j5022m9011
6496d00J8891M3430O3019n9862K669k1578q7317O1084j0530R307K4549R3515l1198
6483A05579M9244l6855l9453j4630J3472M9452j9216P4439j0077o4774k0381J0723
$$ plain form
6567 20729 7319 130782 138111 22707 28388 83479 93278 102563 97105 62644 69915 25707 11298
6554 11298 11109 -988 50479 103752 121517 50955 78074 151666 47472 2661 67585 146192
6542 146192 65915 33338 146948 117174 45398 -58866 -88360 77015 179176 75005 34120
6531 34120 45182 85795 78348 148054 82604 97154 12488 76765 49838 78291 195714 133449
6519 133449 100482 103325 122016 171530 199311 163586 203196 232161 109566 -18690 21421
6508 21421 41887 15925 35389 130143 204552 135225 80948 143429 206846 63633 48611 -400
6496 -400 18491 61921 124940 65078 67747 46169 -41148 19936 9406 18713 43262 136777 105579
6483 105579 154823 117968 78515 63885 77357 126809 107593 182032 171955 107181 86800 97523
6471I7523m165o3987k3294M8121M5097N055J4140p8431N5731N3119j4444l3859
6459A00606k491M6521J11031j37112k0250j8364J5766Q4930l3193J022n2506r8582
6447b622O3998j4821p7967M5200O9379o201o254O5851m2158J26285r445o3830
6435A47415J8688m9658j5019n58M973j8307Q2596N5842p2360m4349N9610l2328
6423A36545P7593j81301J5497R8393j0831K2418l024o9643p9014K2064Q057Q1680
6411A18434q997L4388r941n3753l8046M8072P8384Q5530J81p9974N1089J5695
6399B41062j5284k3480K1775M5394J4175j35807R0510M36k2493K2456K586N4204
6387B95534l4622J15763L3669l6210j32615l3776r687J3841R5883j1232O7727
$$ plain form
6471 97523 93358 29371 6077 54198 99295 104350 118490 40059 95790 148909 134465 100606
6459 100606 98115 144636 255667 118555 98305 79941 95707 180637 147444 148466 95960 -2622
6447 -2622 61376 46555 -31412 13788 83167 76966 70712 136563 94405 220690 211245 147415
6435 147415 166103 116445 101426 100868 105841 87534 170130 225972 153612 109263 168873 136545
6423 136545 214138 32837 48334 146727 135896 158314 155290 85647 6633 28697 36754 118434
6411 118434 109437 143825 133884 80131 42085 90157 168541 254071 254252 174278 225367 241062
6399 241062 225778 202298 224073 269467 283642 147835 238345 238781 216288 238744 241330 295534
6387 295534 260912 376675 410344 374134 241519 207743 198056 211897 307780 296548 364275
6376C64275k5345o5464N4242l9729n8374N7634j6794K0324M4009O5373K3964N0659
6364D74774K3918o5271m5073o6340O4670M586p278L8269O1298p115q0332k8446
6352C67660M8027Q0804n0080j40090k4756N8427k4365k9739J22156n3187j3728
6341C41129P872K7360R9310M5776o9891p152O9023L4107J5154M1853n3209j1359
6329E39973m3088m8374J3263m9921M3804j9622l7892J02723J02437L5723j07899
6318E31127N1757m262m1032R3695J27024n7685j6766K931j10849l0081K02440
6307G48299q4082n7582O4036j8919j6226r0435j9385L610K7460n0667N956Q7885
6295E99950K652m2925K0622M2990m6545J3595j611k2634r131L3478J5343l0250
$$ plain form
6376 364275 338930 273466 327708 287979 229605 287239 270445 290769 334778 400151 424115 474774
6364 474774 498692 433421 388348 322008 386678 391264 383986 422255 483553 476438 396106 367660
6352 367660 415687 496491 446411 306321 281565 339992 315627 285888 408044 354857 341129
6341 341129 349001 376361 475671 521447 451556 444404 513427 547534 562688 604541 551332 539973
6329 539973 496885 448511 461774 411853 455657 436035 398143 500866 603303 639026 531127
6318 531127 582884 578622 537590 631285 758309 700624 683858 686789 575940 545859 748299
6307 748299 664217 606635 670671 651752 635526 545091 525706 529316 556776 506109 512065 599950
6295 599950 602602 559677 580299 623289 576744 590339 588728 566094 556963 590441 605784 575534
6283E75534j4045j4996p3373K5716L0180n3921m5677m3185m6616R8126J46395
6272E84138m4952o4211m0535p4873l937J6899L1213l1696M4028P0802j4775k3350
6260D48751N2772R6426l6445k2942r8453M1611L4242l4786q027l1587j2089J20236
6248E49709n9729M6769J14474j9840j14653N7041l068K4528j9L9103N1265k9193
6236F56387k1272l4417M0326j0204n854M5951q934O0709p1628j9009K2913K5714
6224F80682M3975q3324L1247j6083j5540k2440n0522R5656m7725J71785Q793J6025
6212H12529M0325r4643P2932N4072n2509K9193l8856L3311R0082N3368l1311k7426
6200I41067o9443Q1263P5399N651J2288Q038l4n3762O450M7343n603l199L8362
$$ plain form
6283 575534 561489 546493 473120 498836 529016 475095 429418 386233 339617 437743 584138
6272 584138 539186 474975 434440 359567 355630 372529 403742 372046 416074 486876 472101 448751
6260 448751 501523 597949 561504 538562 440109 481720 515962 481176 473149 441562 429473 549709
6248 549709 489980 536749 651223 631383 516730 573771 570703 595231 595212 634315 685580 656387
6236 656387 635115 600698 641024 630820 624966 670917 661983 722692 651064 632055 654968 680682
6224 680682 724657 641333 672580 656497 640957 618517 567995 663651 615926 787711 796504 812529
6212 812529 852854 758211 831143 885215 832706 861899 823043 856354 946436 999804 968493 941067
6200 941067 871624 952887 1028286 1033937 1046225 1054263 1054229 1000467 1006917 1054260 1048657 1045458 1083820
6187A083820P5311M0356o2772L7210J3879L0670j4458J44395p842M7327L7232
6176A425128m5529L9287J6060n5182P0400J4225M1365k1076n9756N5722O3161
6165A543805k1783N8817k0420p5941l5471P2873M3693Q7485j7914j0969n2076
6154A572099J3541k8503O9788Q2684n8870Q3242o0265l4082J01366N1462p964
6143A784498p594k5122J89313m5898q7337N3264K1495k955l6556k82r643P8917
6131A912100P2851Q795N1220K9494k9576m7755R2247J62338K957O1698J74302
6120B490671k7888j231P7793m1441R4628J9178K9394j6771J74521R2885p109l5500
6108B849130o1478J41913K16835O3365N5082M5544j5883l2335J19557J76850r837
$$ plain form
6187 1083820 1159131 1199487 1136715 1173925 1187804 1218474 1204016 1348411 1340569 1387896 1425128
6176 1425128 1379599 1418886 1434946 1379764 1450164 1464389 1505754 1484678 1424922 1480644 1543805
6165 1543805 1522022 1580839 1560419 1484478 1449007 1521880 1565573 1653058 1635144 1624175 1572099
6154 1572099 1585640 1557137 1626925 1709609 1650739 1733981 1673716 1639634 1741000 1792462 1784498
6143 1784498 1776904 1751782 1941095 1895197 1807860 1861124 1882619 1879664 1843108 1842826 1833183 1912100
6131 1912100 1984951 1993746 2044966 2074460 2044884 1997129 2089376 2251714 2254671 2316369 2490671
6120 2490671 2462783 2461552 2539345 2497904 2592532 2611710 2641104 2624333 2798854 2891739 2884630 2849130
6108 2849130 2787652 2929565 3146400 3209765 3264847 3310391 3294508 3262173 3381730 3558580 3548743
6097C548743M7358J20585R7484M5409P8707L020P7873Q4067Q3567J56205J07745
6086D450763J85261O9200O9538L3482J38909J66706R1501K22079J84055J85495
6076E796989P5125K44390J55473K18215L51859L65915L86441M41886N04144N34402
6066I074839P61348P76332R08013J345498J595156J871497J523223L79189r47363
6057A7287732j806915j697385j010780n30935l17375l92505l28940j83830r984
6048A1009083J02675J64532K56208K52580K48566L70173N07891N16494P21743
6039A4149945Q56729P78659J091325J358613J438731J594039K145156K549825
6031B5963022L422672M441913N408741M966683J919542k058473n693962n829901
$$ plain form
6097 3548743 3596101 3716686 3814170 3859579 3938286 3941306 4019179 4103246 4186813 4343018 4450763
6086 4450763 4636024 4705224 4774762 4808244 4947153 5113859 5205360 5427439 5611494 5796989
6076 5796989 5872114 6116504 6271977 6490192 6842051 7207966 7594407 8036293 8540437 9074839
6066 9074839 9836187 10612519 11520532 12866030 14461186 16332683 17855906 18235095 17287732
6057 17287732 15480817 13783432 12772652 12241717 11924342 11531837 11202897 11019067 11009083
6048 11009083 11111758 11276290 11532498 11785078 12033644 12403817 12911708 13428202 14149945
6039 14149945 15006674 15785333 16876658 18235271 19674002 21268041 23413197 25963022
6031 25963022 29385694 33827607 39236348 44203031 46122573 44064100 38370138 32540237
6023C2540237l725048k376324j511270j004778p17540l61306L290J67607L72767
6014B3387635N02900O23454Q16014J011475J434500J764861K015831K498931L049186
6005C7104787L480684L457763K887197K271050K017928K105691K683250L812481
5997E9820831M692702M769287K217688j692007n551812o525485m185845k293712
5989E1251647j173113k15474K33923M17777O52651P14260R70338J441525K032319
5980E6325853K783512L736343M437752M341914K621450k85539l231623m789495
5972F5940167l998784k653817j805496j180719n59831m01772l7987L56903L15710
5963E5974374n78852j976065l111852l411655k723566j948597j327468j026179
$$ plain form
6023 32540237 28815189 26438865 24927595 23922817 23205277 22843971 22847261 23014868 23387635
6014 23387635 23890535 24513989 25330003 26341478 27775978 29540839 31556670 34055601 37104787
6005 37104787 40585471 44043234 46930431 49201481 51219409 53325100 56008350 59820831
5997 59820831 64513533 69282820 71500508 69808501 64256689 57731204 53545359 51251647
5989 51251647 50078534 49863060 50096983 50514760 51167411 51881671 52852009 54293534 56325853
5980 56325853 59109365 62845708 67283460 71625374 74246824 73961285 70729662 65940167
5972 65940167 61941383 59287566 57482070 56301351 55741520 55339748 55301761 55658664 55974374
5963 55974374 55395522 53419457 50307605 46895950 44172384 42223787 40896319 39870140
5955C9870140q82476p67807n23654m07232k49074m03615r84342j785442k491523
5946C1374975k823931k468512k087575j583522j261936j069390p84591o34634
5938A8660884m97793m91041m91840m87660m38983m83825n62963m83491m39765
5929A4283523l10678k67572j05492j27389k16556j80171j83203o0152R958r6810
5919A2745458r7937j58317r9967q1171j39024M0836k3434p3689K4883M9201j41310
5908A2045529Q147J32158J51284J09327M8991J19913Q3856R2904J68775L68256
5898A3329140J48472M04700L21276K63669J16568K9827K12936J94204M28650M87916
5888A5937358L66326M27071O62826N75927N73417O76182P43733P57684Q45425
$$ plain form
5955 39870140 38987664 38219857 37696203 37288971 37039897 36636282 35651940 33866498 31374975
5946 31374975 28551044 26082532 23994957 22411435 21149499 20080109 19295518 18660884
5938 18660884 18163091 17672050 17180210 16692550 16253567 15769742 15206779 14723288 14283523
5929 14283523 13972845 13705273 13599781 13472392 13255836 13075665 12892462 12832310 12842268 12745458
5919 12745458 12647521 12489204 12389237 12308066 12169042 12209878 12186444 12112755 12137638 12186839 12045529
5908 12045529 12053676 12185834 12337118 12446445 12495436 12615349 12699205 12792109 12960884 13329140
5898 13329140 13477612 13882312 14203588 14467257 14583825 14613652 14826588 15020792 15449442 15937358
5888 15937358 16303684 16730755 17393581 17969508 18542925 19219107 19962840 20720524 21565949
5879B1565949R49713J140945J447253J832826J863978K233015K427023K631689
5871C6092391J947851J360690P61302J95712J47743K40636L88450P12998P92335
5862D2640108Q12357R15720J116969J302457J640480J647040J666181J585303
5854E3326615J499268J445541J440918J838429J914864K386445K797300L358492
5846G0007872L534284K639359O80472j970750l969970m469809l907899l028666
5838E9514893k083623j632362j446698j483102j676042j602451j510548j094303
5830D6985764q74079p80828q84100o88239n34974l65115r4175K7674N6484j16706
5820D2731706k30609m69841r43275j718166k429549k704821k524636k188329j802162
$$ plain form
5879 21565949 22515662 23656607 25103860 26936686 28800664 31033679 33460702 36092391
5871 36092391 38040242 39400932 40162234 40357946 40505689 40746325 41134775 41847773 42640108
5862 42640108 43452465 44368185 45485154 46787611 48428091 50075131 51741312 53326615
5854 53326615 54825883 56271424 57712342 59550771 61465635 63852080 66649380 70007872
5846 70007872 73542156 76181515 76861987 74891237 70921267 66451458 62543559 59514893
5838 59514893 57431270 55798908 54352210 52869108 51193066 49590615 48080067 46985764
5830 46985764 46111685 45330857 44446757 43758518 43223544 42858429 42764254 42791928 42848412 42731706
5820 42731706 42501097 42031256 41087981 39369815 36940266 34235445 31710809 29522480 27720318
5811B7720318j475749j332245j112715j069723r36227r27405q23339p91962p55998
5802A8494955q07609q08301p41340o50334p25401o78978p03840n03753m45801
5793A2429598m32428l07084j12371q7739k59115j69947j32417l7905j75526j55506
5783A0559560p8753K1703l2006M7278Q6424l5318n9809j77017k73506m43564m54790
5772I160202k76316k86143l21478k00667j93137k53443k13696r5509l6363R183
5762G292633R9670m8868J0568N1936j39836N7776K2214j20514j25593Q23O8924
5751G169733o0137K872q5990L1586K5230l03721k59185k73780k30885j81992j81588
5740E652143j54283j59234l06705j70657q3614r4065K4168j12706p8773M7973
$$ plain form
5811 27720318 26244569 24912324 23799609 22729886 21793659 20866254 20042915 19250953 18494955
5802 18494955 17687346 16879045 16137705 15487371 14761970 14082992 13379152 12875399 12429598
5793 12429598 11997170 11690086 11577715 11489976 11230861 11060914 10928497 10890592 10715066 10559560
5783 10559560 10480807 10502510 10470504 10517782 10604206 10568888 10509079 10332062 10058556 9614992 9160202
5772 9160202 8883886 8597743 8276265 8075598 7882461 7629018 7415322 7319813 7283450 7292633
5762 7292633 7392303 7343435 7354003 7405939 7266103 7323879 7346093 7225579 7099986 7100809 7169733
5751 7169733 7109596 7112468 7026478 7058064 7083294 6779573 6520388 6246608 6015723 5833731 5652143
5740 5652143 5497860 5338626 5031921 4861264 4777650 4683585 4707753 4595047 4516274 4564247
5730D564247K6760J065Q3518o067m4326j08644l6841r2709j36383j38460j84967
5719C927193j67458j63275m4519j4767j61483q4900m3424q8228j37464j5811p7568
5708B928296n4161l4006p8835m5252k5750o6522L0378L8864j15598J70989P7171
5697B825574q3843k1428m4927j4663j22500j7015j74070M3830J51427p1030j68418
5686B302937n0226m1659p6652o964n9476r7787K3887k8929m1152j1380n2764N0425
5674A910260o1904J8226r0599n0720j9809O3343o2893P1066l4000k1268M7730
5663A769432m9344N2570o2416O650K8867M2928J04518K204J67123L8436N2843
5652B153811R1319R509o9509q596J32315L3537l5618K0890N8068L1851r6847r2960
$$ plain form
5730 4564247 4591007 4592072 4675590 4669523 4625197 4516553 4479712 4387003 4250620 4112160 3927193
5719 3927193 3759735 3596460 3551941 3537174 3375691 3290791 3247367 3159139 3021675 3005864 2928296
5708 2928296 2874135 2840129 2761294 2716042 2690292 2623770 2654148 2693012 2577414 2748403 2825574
5697 2825574 2741731 2720303 2675376 2660713 2538213 2521198 2347128 2390958 2542385 2471355 2302937
5686 2302937 2252711 2211052 2134400 2127436 2067960 1970173 1994060 1965131 1923979 1912599 1859835 1910260
5674 1910260 1848356 1866582 1775983 1725263 1705454 1768797 1705904 1776970 1742970 1721702 1769432
5663 1769432 1720088 1772658 1710242 1716892 1745759 1788687 1893205 1895409 2062532 2100968 2153811
5652 2153811 2245130 2254639 2185130 2176534 2308849 2342386 2306768 2327658 2385726 2417577 2320730 2227770
5640B227770J10904M2832n0061j7804O8607j3382J3776Q6398R3846p0358k6946
5629B465582M2386J8430l3887Q7777M1326J57993J40216J44050J81506R8053L3419
5618C376851o2151n3868m9065l7951r3165l4903l9324m2367m6580k7290k0788
5607B869399l6051Q2698L6484o5293l0372j2896l9885r1295K879r8575o3834k4071
5595B529188j52210j8092J28346O368j93795j5724o2163j10425o6415j30433L46
5584A914991P3686o5945j25365J2923m5922J1628k6683n4631p124r7498q0738
5573A509322J5587l5300j9739j02306n4276K9631O1014J3643r9186J7137q8385
5562A247142q1706Q9724N8221j2945N9519K0358p4730q5999L0096j05957o5106
$$ plain form
5640 2227770 2338674 2381506 2331445 2313641 2382248 2368866 2382642 2469040 2562886 2492528 2465582
5629 2465582 2507968 2526398 2492511 2580288 2621614 2779607 2919823 3063873 3245379 3343432 3376851
5618 3376851 3314700 3260832 3211767 3173816 3080651 3045748 3006424 2964057 2917477 2890187 2869399
5607 2869399 2833348 2916046 2952530 2887237 2856865 2843969 2804084 2712789 2715668 2617093 2553259 2529188
5595 2529188 2376978 2358886 2487232 2493600 2299805 2284081 2221918 2111493 2045078 1914645 1914991
5584 1914991 1988677 1922732 1797367 1810290 1764368 1775996 1749313 1694682 1687558 1590060 1509322
5573 1509322 1524909 1489609 1469870 1367564 1313288 1342919 1403933 1417576 1318390 1335527 1247142
5562 1247142 1165436 1255160 1313381 1300436 1359955 1380313 1305583 1219584 1249680 1143723 1078617
5551A078617J6485O0380m8427j24235Q963m2946N2876o8261J2202j2535L4401
5540I67520Q0711M7438K1573o0746J4140K4880j51474o272Q5496M8054l6321p6282
5528I58717P555J4264j41695k0911M6859l8082K5865j0562p3660M9088K56054
5517A073492J0711q0091l4162j3878l709P4797j7080k0533q8004Q8527M4579j14192
5505I20457l9634m4836l6429K5504K2974m0879K7127k4833N959o4088k873J7608
5493G66057l0256Q0568n1840m1480l4762O5927J7177K6572R9879J2426J7980r3323
5481H34925o0771j6910l9504o1495J5255L0738N2806j07064J00330r710K8270
5470G66870k8479p1959O6839L7806l8050k0630K8602k9838K9003j1057L3089n2292
$$ plain form
5551 1078617 1095102 1155482 1107055 982820 991783 948837 1001713 933452 945654 933119 967520
5540 967520 1048231 1095669 1117242 1056496 1070636 1095516 944042 937770 1023266 1071320 1034999 958717
5528 958717 966272 980536 838841 817930 864789 826707 852572 842010 768350 817438 1073492
5517 1073492 1084203 1004112 969950 956072 952363 1027160 1010080 989547 901543 990070 1034649 920457
5505 920457 880823 835987 799558 825062 848036 807157 834284 809451 815410 751322 748449 766057
5493 766057 735801 816369 764529 723049 688287 754214 771391 797963 897842 910268 928248 834925
5481 834925 774154 757244 717740 656245 671500 702238 755044 647980 748310 738600 766870
5470 766870 738391 666432 733271 771077 733027 712397 740999 711161 740164 729107 762196 709904
5458G09904N7658O6903K8406l5212L6737J07141m2815K4116j39484P2895R7225
5447I83474n3180M829J8805J00658j14904N1921N0856J04456k3046L3825k6503
5436A131191n7631k4609L9481P5449J79973R4537j7764P2932M1790o5560M0755
5425A510544o1566j28096M6067o1782Q3714k2879l1733l36n3279p8935J9998P9846
5413A301563M4275N5592K7732O9974J29829k4987j3315N3078O1108J0582K8383
5402A743814L0338j5602J33745J73731o3859R9427L15665J83781K30304L07339
5392C138683L26812J77604J17483j02040m7016O952j24594l9655o4899Q4712O0504
5381C534546o1849Q107K6853l2465P8880O0331J03498R4569R7572K12976J78531
$$ plain form
5458 709904 767562 834465 862871 827659 864396 971537 928722 952838 813354 886249 983474
5447 983474 930294 935123 953928 1054586 939682 991603 1042459 1146915 1123869 1157694 1131191
5436 1131191 1073560 1048951 1088432 1163881 1343854 1438391 1420627 1493559 1535349 1469789 1510544
5425 1510544 1448978 1320882 1366949 1305167 1388881 1366002 1334269 1333933 1280654 1201719 1221717 1301563
5413 1301563 1345838 1401430 1429162 1499136 1628965 1603978 1590663 1643741 1704849 1715431 1743814
5402 1743814 1774152 1758550 1892295 2066026 2002167 2101594 2417259 2601040 2831344 3138683
5392 3138683 3465495 3643099 3760582 3658542 3611526 3618478 3493884 3454229 3389330 3474042 3534546
5381 3534546 3472697 3480804 3507657 3475192 3554072 3614403 3717901 3812470 3910042 4123018 4301549
5370D301549K18921J69962K64568K41133L82276L86418L40523J36004j08821k22254
5360F110279l74812l44412m05931j80686j39127n1241j46231l8620n1934j62059
5350D215226j24093k22944l294q6978k0029O8668K3314O750j125r5689o0610j4257
5338C684939R856j5052p1496j36212k04680l84995l07734j10734j43859j21123
5328B198910j33912j94138r4915m920j47984J13128K8415J1744M487j23574r8718
5317A558523L2140J4750o9644N991N6294j08222m6732N0190n068j37055q8779
5306A262388Q942j9155M5958J53379j385q5654r774l8249m5117j09872R3825m5779
5294A209507J2828J14020o7546J01590l1036l3054J53736M5617j66887m2858K1378
$$ plain form
5370 4301549 4520470 4690432 4955000 5196133 5578409 5964827 6305350 6441354 6332533 6110279
5360 6110279 5735467 5391055 4985124 4804438 4665311 4614070 4467839 4429219 4377285 4215226
5350 4215226 4091133 3868189 3864895 3777917 3757888 3826556 3849870 3856620 3855495 3759806 3699196 3684939
5338 3684939 3694795 3679743 3608247 3472035 3267355 2882360 2574626 2463892 2320033 2198910
5328 2198910 2064998 1870860 1775945 1771025 1623041 1736169 1764584 1776328 1780815 1657241 1558523
5317 1558523 1590663 1605413 1535769 1541760 1598054 1489832 1443100 1493290 1488222 1351167 1262388
5306 1262388 1271330 1252175 1298133 1451512 1450127 1364473 1354699 1316450 1271333 1161461 1255286 1209507
5294 1209507 1222335 1336355 1268809 1370399 1339363 1306309 1460045 1505662 1338775 1295917 1317295
5283A317295L0780M9323o0383K08022M1459m5131L5944J27455Q2049Q180J23936
5272A918929l210R8323O5417O4724J31940Q2289J41152J09711J0934l0517j10894
5261B478798M482J3357J06906K4363r8088m9450J7604R1974R3130J46044M0355
5250B869475P5271m806l2380O3451J15056O6453K36396J35821L6651J06050K16361
5239C883799K29947R7903M8357N7816K4681p5766q3479j46243j53949O7225n1132
5228C899159q1234j04231o5768q3678j11729K6114J39508L5919K5778M1937m9574
5217C672201r1488N7625p2342j58683l4797k2376r696m09n3249n7293N370K0937
5205C255800n1984J6178j07390j53354q3990j03574N0559m8083l5932m7064n2505
$$ plain form
5283 1317295 1348075 1397398 1337015 1545037 1586496 1541365 1577309 1704764 1786813 1794993 1918929
5272 1918929 1915719 2014042 2079459 2144183 2276123 2358412 2499564 2609275 2620209 2589692 2478798
5261 2478798 2483280 2496637 2603543 2627906 2529818 2480368 2497972 2589946 2683076 2829120 2869475
5250 2869475 2944746 2939940 2907560 2971011 3086067 3152520 3388916 3524737 3561388 3667438 3883799
5239 3883799 4113746 4211649 4260006 4317822 4342503 4266737 4183258 4037015 3883066 3950291 3899159
5228 3899159 3817925 3713694 3647926 3564248 3452519 3478633 3618141 3654060 3679838 3721775 3672201
5217 3672201 3580713 3638338 3565996 3407313 3372516 3350140 3340444 3340035 3286786 3229493 3234863 3255800
5205 3255800 3203816 3219994 3112604 2959250 2875260 2771686 2822245 2774162 2738230 2691166 2638661
5194B638661j15817j06525j1742K1187o1702q6394j6042m416r3544q5526j0693
5183B067447J51706j57712j53193l528j27208J1979M8035o8897q5735k38m9510
5172A633146m8206J24955K6390l8720l1117k0886K2706j0983l3205O7167P5851
5161A767098J01867q8626M9053P9924K5399j03424R4516N7917L0295P5794N8556
5150B148369J7222k6353k3892P0278J9896P6671J68199N2272J03487m5586l7955
5139B522608k85716j76397l7902m5513N2119n8376q6319k7532J29202J18500p0686
5128B033988k2906Q3575Q4616J8913k9002l9300O0481R8131J59492o34J38051
5117B585405J31020m3745m361J82656J72676K66308j0884r0142j56805k71867
$$ plain form
5194 2638661 2522844 2416319 2404577 2425764 2364062 2277668 2261626 2257210 2163666 2078140 2067447
5183 2067447 2219153 2061441 1908248 1904720 1777512 1789491 1837526 1768629 1682894 1682656 1633146
5172 1633146 1584940 1709895 1736285 1697565 1666448 1645562 1668268 1657285 1624080 1691247 1767098
5161 1767098 1868965 1780339 1829392 1909316 1934715 1831291 1925807 1983724 2014019 2089813 2148369
5150 2148369 2165591 2139238 2115346 2185624 2205520 2282191 2450390 2502662 2606149 2560563 2522608
5139 2522608 2236892 2060495 2022593 1977080 2029199 1970823 1884504 1856972 1986174 2104674 2033988
5128 2033988 2011082 2094657 2179273 2198186 2169184 2129884 2190365 2288496 2447988 2447354 2585405
5117 2585405 2716425 2672680 2668319 2850975 3023651 3289959 3279075 3188933 3032128 2760261
5107B760261l11379j02395m3248p8116m1977l9181J23124J5334O0525J12324k6500
5096B428772J75048l897j29916N9812o5496j04081K5472J31592m2335n7939M1570
5085B458602J3229m2026j11893n2676m3664L0173J9208m1715L1306J03721O6242
5074B430507R8954J26509k093N8249J60090J00613P2356K48117J63939M3962J15046
5063C616249K09722J79029J72099J66716K53445M12555M55319M06767O36140Q81592
5053G389633R66812J335053J541662J279221M95748p23126j547456j713422j298917
5044G725208j049594p30039n93502m55713k83755k94555k14817k58926j53924
5035C690383n306o4134k7542m7782M7311j2482j0553k8423j09295L3642J7342
$$ plain form
5107 2760261 2448882 2346487 2303239 2225123 2183146 2143965 2267089 2282423 2342948 2455272 2428772
5096 2428772 2603820 2599923 2470007 2529819 2464323 2360242 2385714 2517306 2474971 2417032 2458602
5085 2458602 2471831 2429805 2317912 2265236 2221572 2251745 2270953 2229238 2260544 2364265 2430507
5074 2430507 2529461 2655970 2653877 2712126 2872216 2972829 3045185 3293302 3457241 3501203 3616249
5063 3616249 3825971 4005000 4177099 4343815 4597260 5009815 5465134 5871901 6508041 7389633
5053 7389633 8356445 9691498 11233160 12512381 13008129 12285003 10737547 9024125 7725208
5044 7725208 6675614 5945575 5352073 4896360 4612605 4318050 4103233 3844307 3690383
5035 3690383 3685077 3620943 3593401 3545619 3592930 3580448 3569895 3541472 3432177 3465819 3483161
5024C483161l3046J26032K27546L54609K00075J07154k080k74524m43699l55188
5014C390040k78827j98109j27788m2240r1393o4860k5143q9129q7783j47080l661
5003B234027l2911J3222j6409j15702l5073K9776Q5509N4939Q768o8386j78452
4992A979308M782Q5786o2450k951P6543P0876N1503L0121R726J10178P098j07572
4980B252948L6067m3038q8497Q676O9056L3794J0273K4180J2026L354P15n5096
4968B264458N8825n507j840j53593M2737Q2131j9198M0603L7987Q0438J16577
4957B543618L3518N9386J21945J57643o5235R0027J38096K6864J15002O4516N5851
4946C341231J54912Q0240J82398J51529O8697K41680J24339J12598L64060K05887
$$ plain form
5024 3483161 3450115 3576147 3803693 4158302 4358377 4465531 4463451 4188927 3745228 3390040
5014 3390040 3111213 2913104 2785316 2743076 2651683 2586823 2561680 2472551 2384768 2237688 2234027
5003 2234027 2201116 2214338 2197929 2082227 2047154 2076930 2162439 2217378 2226146 2157760 1979308
4992 1979308 1984090 2069876 2007426 2004475 2081018 2151894 2203397 2233518 2243244 2353422 2360520 2252948
4980 2252948 2289015 2245977 2157480 2166156 2235212 2269006 2279279 2303459 2315485 2318839 2319554 2264458
4968 2264458 2323283 2317776 2315936 2162343 2205080 2287211 2268013 2308616 2346603 2427041 2543618
4957 2543618 2577136 2636522 2758467 2916110 2850875 2940902 3078998 3105862 3220864 3285380 3341231
4946 3341231 3496143 3576383 3758781 3910310 3979007 4220687 4345026 4457624 4821684 5027571
4936E027571j87967l48723l49264k01420l3791J8542J6706o4132K6029J9984M8637
4925C972172K02888M4165j6639N1798J15034P1691k3502L3570J12354Q3190L1675
4914D678396k7884J30684J65734Q5638O6168J25863Q3360K00681N7002P3783J94919
4903E834344J37423J90818M1162J56803J56699K5518J47682O0198J04489K51764
4893G106900K11806K2858J61446K02276K33913J81858J42350J05577P6463J75777
4883H621224K58247J22327K14136K50612K26609J71545K24419J13479K15206K79786
4873A0697590K94191K90487L15039K96805L33205L62764K55731L79849M20024
4864A3645685L88984N64467M41393L59228N00052N96910N19139M51171O73069
$$ plain form
4936 5027571 4839604 4490881 4141617 3940197 3906406 3924948 3941654 3877522 3903551 3923535 3972172
4925 3972172 4175060 4219225 4202586 4254384 4369418 4441109 4417607 4451177 4563531 4646721 4678396
4914 4678396 4650512 4781196 4946930 5032568 5098736 5224599 5307959 5508640 5565642 5639425 5834344
4903 5834344 5971767 6162585 6203747 6360550 6517249 6542767 6690449 6750647 6855136 7106900
4893 7106900 7318706 7341564 7503010 7705286 7939199 8121057 8263407 8368984 8445447 8621224
4883 8621224 8879471 9001798 9215934 9466546 9693155 9864700 10089119 10202598 10417804 10697590
4873 10697590 10991781 11282268 11597307 11894112 12227317 12590081 12845812 13225661 13645685
4864 13645685 14034669 14599136 15040529 15399757 15899809 16496719 17015858 17467029 18140098
4855A8140098O06513O40455P73526P42044P79178P08490R00104J109626J083213
4846B5483247J399187J536698J830356K306297K896087L546217M114599M496693
4838D7609381N170691O077245P349777Q761859J0281287J3295194J7725030K2868789
4830A39139253K2237578R602270q464044k7128675k9067815j8627534j1830587
4823G5860446p971873n763622m170434l068599j964002j110098j41523O03597
4815E2273892J102464J267455J511615K005227L313623M666735N606318O646051
4807G8393380P967415R669919J2446072J5436009J8951355K4526274L1962512
4800A99352936M0347883L7691510J4601432j7754599m9182364n2716684l6088146
$$ plain form
4855 18140098 18746611 19387066 20160592 20902636 21681814 22390304 23290408 24400034 25483247
4846 25483247 26882434 28419132 30249488 32555785 35451872 38998089 43112688 47609381
4838 47609381 52780072 58857317 66207094 74968953 85250240 98545434 116270464 139139253
4830 139139253 161376831 170979101 162515057 135386382 106318567 87691033 75860446
4823 75860446 67888573 62124951 57954517 54885918 52921916 51811818 51670295 52273892
4815 52273892 53376356 54643811 56155426 58160653 61474276 66141011 71747329 78393380
4807 78393380 86360795 96030714 108476786 123912795 142864150 167390424 199352936
4800 199352936 239700819 277392329 291993761 274239162 225056798 172340114 136251968
4793A36251968k4665547j7414808j3092756j0356762q222132o470170n035096
4786E0994697l937361l426764k805157k423788j925655j649963j303673j272171
4778C2250165j330426j720711j953076j731665j337479j267436q94908q63470
4770B1150994q84466r30215p07197p70441p17399o95031o12396n94519p40097
4761A4499233o57139n52971m13967m93409l69501k79112k69350k73845k59495
4752A0930444k67548k96063j64493j57033j54796r8413k1216M947j61216j10414
4742I504199l65339l76742k33577k89890k42348k62292l64372j64872j20931k68309
4732F815527k38522j98618j31593k27650j69810j71792n8181J5321k24901j56457
$$ plain form
4793 136251968 111586421 94171613 81078857 70722095 62499963 56029793 50994697
4786 50994697 47057336 43630572 40825415 38401627 36475972 34826009 33522336 32250165
4778 32250165 30919739 29199028 27245952 25514287 24176808 22909372 22014464 21150994
4770 21150994 20266528 19336313 18629116 17858675 17141276 16446245 15833849 15239330 14499233
4761 14499233 13842094 13289123 12875156 12381747 12012246 11733134 11463784 11189939 10930444
4752 10930444 10662896 10366833 10202340 10045307 9890511 9792098 9770882 9775829 9614613 9504199
4742 9504199 9138860 8762118 8528541 8238651 7996303 7734011 7369639 7204767 7083836 6815527
4732 6815527 6577005 6378387 6246794 6019144 5849334 5677542 5619361 5634682 5409781 5253324
4722E253324k9967q1628k8561l4171n6728k1044o7931r5103j40271j91557j27375
4711D378988j48511j59031j35835n7924j10623j41033l8595l4904m2674o3153
4701C446705j7917r1521n9799J139m2262O5158m7664m9213j99k9390O708m2526
4689C139219k4837m5118j17365J1585o8487M6353l5268M6440O5190r634j1138
4678B996940n8324J08735O7816K5988M9102J01946J48239L11632J25728J17584
4668C995386n7282j33134k22780k66227j78355k18447O1516n1720m263J2772j5468
4657B921998L1353m8345o0987j7507j66605j26150k962n6052K5896O2100m2860
4646B519879j52589J8974P8877M2706j4832J19046k6663j38746J16055Q556m2916
$$ plain form
4722 5253324 5223357 5141729 5113168 5078997 5022269 5001225 4933294 4838191 4697920 4506363 4378988
4711 4378988 4230477 4071446 3935611 3877687 3767064 3626031 3587436 3552532 3509858 3446705
4701 3446705 3428788 3337267 3277468 3278607 3236345 3301503 3253839 3204626 3204427 3175037 3181745 3139219
4689 3139219 3114382 3069264 2951899 2963484 2894997 2941350 2906082 2952522 3017712 3008078 2996940
4678 2996940 2938616 3047351 3115167 3141155 3190257 3292203 3440442 3752074 3877802 3995386
4668 3995386 3938104 3804970 3582190 3315963 3137608 2919161 2980677 2928957 2924694 2937466 2921998
4657 2921998 2953351 2905006 2844019 2826512 2659907 2533757 2530795 2474743 2500639 2562739 2519879
4646 2519879 2367290 2386264 2465141 2507847 2493015 2612061 2585398 2446652 2562707 2571263 2528347
4635B528347j2339n6212k3444l0590P8865J652O3892J04633J07252K25905n8q3138
4623B904765j70338j65499k33279j29575q3794p7862M0762l7553J02975m0961
4613B109641o0881o6219P1083n3344r595j960k0161j5708n0795l5186k3068J9747
4601A863554K536J11480K13501J790p3964j93333O5723M6689m8863K6460j6402
4590A999171L9303Q8780j10476n9381N2708P2241N6911k4047P1935L0459j11553
4579B106051j18646O5103j2643R6947j6229K5216j8947r51l2053p85r428p5095
4567B008540j6466P9638P01q456j9049J12029k9508q1369Q3185R2361O1860O6894
4555B350360N8008J30677J5773L5183J15490P5289J46990q515J11768J40992l9124
$$ plain form
4635 2528347 2516008 2459796 2436352 2405762 2484627 2486279 2550171 2654804 2762056 2987961 2987903 2904765
4623 2904765 2734427 2568928 2335649 2206074 2122280 2044418 2085180 2047627 2150602 2109641
4613 2109641 2048760 1982541 2053624 2000280 1990685 1988725 1968564 1952856 1902061 1866875 1843807 1863554
4601 1863554 1866090 1977570 2191071 2192861 2118897 1925564 1991287 2037976 1989113 2015573 1999171
4590 1999171 2038474 2127254 2016778 1957397 2010105 2082346 2139257 2115210 2187145 2217604 2106051
4579 2106051 1987405 2052508 2039865 2136812 2120583 2145799 2126852 2125901 2093848 2093063 2083635 2008540
4567 2008540 1992074 2071712 2072413 2063957 2044908 2156937 2127429 2046060 2129245 2221606 2283466 2350360
4555 2350360 2408368 2539045 2554818 2590001 2705491 2780780 2927770 2919255 3031023 3172015 3132891
4544C132891L5797J21719J62886k2089K7744K00445Q0507J92255Q7101M6203K65373
4533D330832J92040K80207K70929M28534N11069N05214O09049O94552Q03841Q35203
4523I461470J214729J577812J710108K241086K880308L007092K551022J058030
4515B5701657j100038k996034l579104l114065k328070j773235j412092j018173
4507H380846p92624o53736m76002l28344l82219k56598k29455j44935o7906j80570
4497D868457j72500j46907j01927m6398q3477l5191N785K1257l4722M0440J10690
4486D425507R2298P5134K44586K19987K27545M2788k68182l32372k47608q7299
4476D392384j21787r46q7039J37010J02728k9255P4818J48040J43465J19045K76008
$$ plain form
4544 3132891 3168688 3290407 3453293 3431204 3458948 3659393 3739900 3932155 4019256 4065459 4330832
4533 4330832 4522872 4803079 5074008 5502542 6013611 6518825 7127874 7822426 8626267 9461470
4523 9461470 10676199 12254011 13964119 16205205 19085513 22092605 24643627 25701657
4515 25701657 24601619 21605585 18026481 14912416 12584346 10811111 9399019 8380846
4507 8380846 7588222 6934486 6458484 6130140 5747921 5491323 5261868 5116933 5049027 4868457
4497 4868457 4695957 4549050 4447123 4400725 4317248 4282057 4287842 4309099 4274377 4314817 4425507
4486 4425507 4517805 4592939 4837525 5057512 5285057 5327845 5059663 4727291 4479683 4392384
4476 4392384 4270597 4269651 4182612 4319622 4422350 4393095 4467913 4615953 4759418 4878463 5154471
4465E154471K55364L16821L86861M02497K25467k9765j9238N1578R2856N1381
4455F888293L28174K81025J22558K75363L15732J16008L53913M73258O64057Q50668
4445A0669049J008161J268563J486749J967863K418120K711895K505457J367476
4437B5403333o61642k558713l341786k867870k194325j537854j065449r53748
4429A0221946q32512p25963m44243m64825l24566k33457l09370l15143k51393
4420F320474l37986l52772k64052r9143k11152j54261j19945o4467K7851j52466
4410D592081r9002p8489m569j13993n1945k2471r4280P742j25057k2901m4604
4399C942512l0595K4023M0317N6599K4576J62218O3307K0056J57755J45595o9936
$$ plain form
4465 5154471 5409835 5726656 6113517 6516014 6741481 6711716 6692478 6744056 6836912 6888293
4455 6888293 7216467 7497492 7620050 7895413 8211145 8327153 8681066 9154324 9818381 10669049
4445 10669049 11677210 12945773 14432522 16400385 18818505 21530400 24035857 25403333
4437 25403333 24741691 22182978 18841192 15973322 13778997 12241143 11175694 10221946
4429 10221946 9389434 8663471 8219228 7754403 7429837 7196380 6887010 6571867 6320474
4420 6320474 5982488 5629716 5365664 5266521 5055369 4901108 4781163 4716696 4744547 4592081
4410 4592081 4493079 4414590 4410021 4296028 4244083 4221612 4127332 4135074 4010017 3987116 3942512
4399 3942512 3911917 3935940 3976257 4032856 4057432 4219650 4282957 4303013 4460768 4606363 4536427
4388D536427q2307j86008k04103j20857j02776j58524o3153k8104l095J10824
4378C698324R3106p1339j17144j40204o7788n3992P2823j06181p4581r578K9373
4367C252819m5628J8758Q503Q5941Q9209o9554O1122O1366L1334R0522o0959j4567
4355C508866L7813L6218l3523O3416O6382q3685o9773R992k3648j0326J7021P0523
4343C589276J37627m0979J4992J63682o7822K7675J33432M7837J11181K8816J14476
4332D260193O8850Q7620P4641r013M3920J62844Q6000K9038L1159R7836L6252
4321D969340J40442m4585Q3059r124o4156j47886J1405O8083J21570N6665M0854
4310E225667O9028O8239K02199J53378J16553J73695J12555O7508J88216M7157
$$ plain form
4388 4536427 4454120 4268112 4064009 3943152 3840376 3681852 3618699 3590595 3587500 3698324
4378 3698324 3791430 3720091 3602947 3462743 3394955 3340963 3413786 3307605 3233024 3223446 3252819
4367 3252819 3207191 3225949 3234452 3320393 3409602 3340048 3401170 3462536 3493870 3584392 3523433 3508866
4355 3508866 3546679 3582897 3549374 3612790 3679172 3595487 3525714 3535706 3512058 3501732 3518753 3589276
4343 3589276 3726903 3685924 3700916 3864598 3796776 3824451 3957883 4005720 4116901 4145717 4260193
4332 4260193 4329043 4416663 4491304 4482291 4526211 4689055 4775055 4804093 4835252 4933088 4969340
4321 4969340 5109782 5065197 5148256 5139132 5074976 4927090 4938495 5006578 5128148 5184813 5225667
4310 5225667 5294695 5362934 5565133 5718511 5835064 6008759 6121314 6188822 6377038 6424195
4300F424195K15777L0351N713Q9585J0277n9847J25022N6897J60331O2658J08344
4289G229303K42726R4074J45941K2413J41230J29955J91460K90880J45076J50716
4279H783774K14617K49814K28556L02879M03431L89547L21300O28457O78608P00131
4269A2901114R04414J006897J084211J409721J643577K039161K618104L173612
4261B6780811L364319J992468j51469k598654l812211l064830k100241j586361
4253A8823832j220286j148417p98725o41053n21962k85154j15188j35597o2039
4244A3895411o605P8405Q4054n602k02835j64137k56859j92027j02471r3593J2280
4233A3046021M813L1871J59774J22674J35507K26320J90984J76981K24409L09135
$$ plain form
4300 6424195 6639972 6670323 6676036 6765621 6775898 6716051 6841073 6897970 7058301 7120959 7229303
4289 7229303 7472029 7566103 7712044 7734457 7875687 8005642 8197102 8487982 8633058 8783774
4279 8783774 8998391 9248205 9476761 9779640 10183071 10572618 10893918 11522375 12200983 12901114
4269 12901114 13805528 14812425 15896636 17306357 18949934 20989095 23607199 26780811
4261 26780811 30145130 32137598 31986129 29387475 25575264 22510434 20410193 18823832
4253 18823832 17603546 16455129 15656404 15015351 14493389 14208235 14093047 13957450 13895411
4244 13895411 13888806 13967211 14051265 14045663 13842828 13678691 13421832 13229805 13127334 13033741 13046021
4233 13046021 13050834 13082705 13242479 13365153 13500660 13726980 13917964 14094945 14319354 14628489
4223A4628489K72937L37409L75914L97690M16832L63960K78306M14331L03685
4214A7789553K67043L61526N06749M24270N06347O25118O62814O36694Q18493
4205B2598607P85474R12442R57355R19849R52269J012216J143203J341819J272305
4196C1895539J411846J648026J679774K114388K355675K841230L102272L803872
4188E0852622M401483N283428O163438P016219Q126131R414428J1184226J3761562
4180A16203537J7131669K1675839K7532999L4610370L8394183L2651275J4826262
4173C03026134j2618410l4701935m2987821l7978803k6924057j9189999j5103765
4166A13521344j3096141j1929045r887815p957881o278938m974089m266595l691338
$$ plain form
4223 14628489 14901426 15238835 15614749 16012439 16429271 16793231 17071537 17485868 17789553
4214 17789553 18056596 18418122 18924871 19349141 19855488 20480606 21143420 21780114 22598607
4205 22598607 23384081 24296523 25253878 26173727 27125996 28138212 29281415 30623234 31895539
4196 31895539 33307385 34955411 36635185 38749573 41105248 43946478 47048750 50852622
4188 50852622 55254105 60537533 66700971 73717190 81843321 91257749 102441975 116203537
4180 116203537 133335206 155011045 182544044 217154414 255548597 288199872 303026134
4173 303026134 290407724 255705789 212717968 174739165 147815108 128625109 113521344
4166 113521344 100425203 88496158 78608343 70650462 64371524 59397435 55130840 51439502
4158E1439502l552399l089218k829708k546930k059301j683432j452906j161332
4150C3064276r31362r02812q97423p67647o06654n07146k71482j91258P3597L01289
4140B8363378M13855J64711m65509j459285k119706k140881j855832j370983j271600
4131A8258148r84679o56978q08316p44225o61515n08969m99307m20637l55150
4122A2618372l06413m06831l21241l08013k05857k21775n3309p3022j88432j88242
4112A0345237j61804m3592j03533m6125j55075j70313N666j37390j4818L8725
4102I556978j2005J7217j03021J3617j21494j74712j82622j05219j26255P6578
4092H839062O3004J29290M6907J03102P3089k27530m91978n02524n23110l46539
$$ plain form
4158 51439502 47887103 44797885 41968177 39421247 37361946 35678514 34225608 33064276
4150 33064276 32132914 31230102 30332679 29565032 28958378 28451232 28179750 27988492 28062089 28363378
4140 28363378 28777233 28941944 28476435 27017150 24897444 22756563 20900731 19529748 18258148
4131 18258148 17273469 16616491 15808175 15063950 14402435 13893466 13394159 12973522 12618372
4122 12618372 12311959 11905128 11583887 11275874 11070017 10848242 10794933 10721911 10533479 10345237
4112 10345237 10183433 10139841 10036308 9990183 9835108 9664795 9670461 9533071 9518253 9556978
4102 9556978 9544973 9562190 9459169 9472786 9351292 9176580 8993958 8888739 8762484 8839062
4092 8839062 8902066 9031356 9078263 9181365 9254454 9026924 8534946 8032422 7509312 7162773
4082G162773j61288j92650k42374n7079q8529N2777j3673j16912j56677j52013
4072F034355j15611j08948j24902j1596m0387l4590k4295L2230r8399o6141L989
4061E445705l5563J2123j12959N3204Q7355Q026n0737q3312k5966L7809j0211
4050E325474l9412O6195j4401o7616p9114J42322N9047r8050M1208J0819L0204
4039E376676J3586L4214K24909K9095o1240K1576L9824P1726J986J42007O0156
4028E954515O9721L7454N0082J80872K0593j2010M2330P1603P0418M6220J52936
4017F684734J64946K12778J45166K49817K32137K36317L72244M04600N13354K46044
4007I462137n241O41l63804m81641k01459j82549j26757K8594L5973J29164l6188
$$ plain form
4082 7162773 7001485 6808835 6566461 6509382 6420853 6473630 6459957 6343045 6186368 6034355
4072 6034355 5918744 5809796 5684894 5673298 5632911 5598321 5574026 5606256 5507857 5441716 5445705
4061 5445705 5410142 5422265 5309306 5362510 5449865 5457891 5407154 5323842 5297876 5335685 5325474
4050 5325474 5286062 5352257 5337856 5270240 5191126 5333448 5392495 5294445 5335653 5346472 5376676
4039 5376676 5390262 5424476 5649385 5678480 5617240 5638816 5678640 5750366 5752352 5894359 5954515
4028 5954515 6024236 6061690 6111772 6292644 6313237 6301227 6343557 6415160 6485578 6531798 6684734
4017 6684734 6849680 7062458 7207624 7457441 7689578 7925895 8298139 8702739 9216093 9462137
4007 9462137 9456896 9457537 9093733 8612092 8410633 8228084 8101327 8129921 8165894 8295058 8258870
3996H258870J26829Q3658n8290J25610J61463q5640K83778L88062L10600K63027
3986I857967K25340N14097O67762N11771R27350J183268J270794J187988P99517
3977A7145854J23224n55302p82532n34833n1222M48408M93190Q87896J375723
3968A8550406J243179O55887l98256j378838j323374q60432o21047l98451k55711
3959A5213363j28213o0497K80408K62480M67519Q61327Q84121J120099J003727
3950A9904334O41032K59903j39230J23932O85099J021454J360433J369798P07844
3941B5934599m45525j727615j904576j180254o96796n29776k27516O5315K01360
3932A9489216L90480L39687L83327M27777K70251N17223N82180P21133R57652
$$ plain form
3996 8258870 8385699 8469357 8411067 8536677 8698140 8612500 8896278 9284340 9594940 9857967
3986 9857967 10083307 10597404 11265166 11776937 12704287 13887555 15158349 16346337 17145854
3977 17145854 17269078 16713776 15931244 15396411 15345189 15793597 16286787 17174683 18550406
3968 18550406 19793585 20449472 20051216 18672378 17349004 16488572 15867525 15469074 15213363
3959 15213363 15085150 15024653 15305061 15567541 16035060 16896387 17780508 18900607 19904334
3950 19904334 20545366 20805269 20666039 20789971 21475070 22496524 23856957 25226755 25934599
3941 25934599 25489074 23761459 21856883 20676629 19979833 19450057 19222541 19287856 19489216
3932 19489216 19879696 20219383 20602710 21030487 21300738 21817961 22400141 23121274 24078926
3923B4078926J032115P02728J40146l42921m52998r9490K97237L69833L78654
3914B6104230L32573K84909J25704M14503N59219P03921O26794O35466N68882
3905C0356201O76406M81674O22280R10744J066239J074694J332480J269631J141617
3896C8931966J152496Q90631Q82711J121256J529364J707964J877690J605555
3888D9699633J720230J927904K200473K595408K697728K438810K300080J936236
3880F7516502J633024J566769J745840J907648K304123K857610L415353M432688
3872H7379557M978240N062618L938656J652844p22578k048154j710305m87180
3864I8043698M45906R15363R24953Q77005P77316R72697J295724J338900Q43285
$$ plain form
3923 24078926 25111041 25813769 25953915 25610994 25157996 25058506 25355743 25725576 26104230
3914 26104230 26436803 26721712 26847416 27261919 27821138 28525059 29151853 29787319 30356201
3905 30356201 31032607 31514281 32136561 33047305 34113544 35188238 36520718 37790349 38931966
3896 38931966 40084462 40975093 41857804 42979060 44508424 46216388 48094078 49699633
3888 49699633 51419863 53347767 55548240 58143648 60841376 63280186 65580266 67516502
3880 67516502 69149526 70716295 72462135 74369783 76673906 79531516 82946869 87379557
3872 87379557 92357797 97420415 101359071 103011915 102289337 100241183 98530878 98043698
3864 98043698 98489604 99404967 100329920 101206925 101984241 102956938 104252662 105591562 106434847
3855A06434847j92274j061247j832674j924554j709644j613066j443056j249288
3847I5409044r32677k38818O98159P44082k99276k257564m438075n174929m590367
3838G8919579l523301k608536k029802j804756j664438j378214j245374j291935
3830F3373223j609087k149354k650708l036848l182267k789341k232513j810293
3822D3912812j678926j794555j939198k100392j753218j358572j107480r17590
3814C1262881q03703p12479q39616r25521p88317p47504p34585p23643n25094
3805B4462419n21394n60193p20785q18108p24556o37263o33530m48686l40424
3796A9057480j42553j92684k25595j90424l2991j15267k02888j29982q8447j71041
$$ plain form
3855 106434847 106242573 105181326 103348652 101424098 99714454 98101388 96658332 95409044
3847 95409044 94476367 94237549 94935708 95679790 95380514 93122950 88684875 83509946 78919579
3838 78919579 75396278 72787742 70757940 68953184 67288746 65910532 64665158 63373223
3830 63373223 61764136 59614782 56964074 53927226 50744959 47955618 45723105 43912812
3822 43912812 42233886 40439331 38500133 36399741 34646523 33287951 32180471 31262881
3814 31262881 30459178 29746699 28907083 27981562 27193245 26445741 25711156 24987513 24462419
3805 24462419 23941025 23380832 22660047 21841939 21117383 20480120 19846590 19397904 19057480
3796 19057480 18914927 18722243 18496648 18306224 18273233 18157966 17955078 17825096 17736649 17565608
3786A7565608j35163j29446j94327j79584k40506l22725l34413m41692m69995
3777A5117757l46274k90810k70558j97891j84633j21241j09014p6139j02757k8355
3767A3390085Q0374p2990j56882j00579q5208k10230k49798j57111k07012l76071
3757A1854578k99028l05928j71198k49292k36786j72591j35284j93782j27662
3748I963027m49q2387k627Q1513n6179J6287o597k9963j8851m9806O7928M0146
3736I922042p0777k0853p9159l1268r9208j45206j54371k8706j93668p8344m992
3725I015490j52175k9742r1253j28610q6791k3542j9182J0245j5713q853J4311
3714H484185j07752p930p446r8328j08218m6942J44069r1614r1570j9455L9502
$$ plain form
3786 17565608 17430445 17300999 17106672 16927088 16686582 16363857 16029444 15587752 15117757
3777 15117757 14771483 14480673 14210115 14012224 13827591 13706350 13597336 13521197 13418440 13390085
3767 13390085 13470459 13397469 13240587 13140008 13054800 12844570 12594772 12437661 12230649 11854578
3757 11854578 11555550 11249622 11078424 10829132 10592346 10419755 10284471 10090689 9963027
3748 9963027 9962578 9880191 9877564 9959077 9902898 9919185 9912588 9882625 9863774 9813968 9881896 9922042
3736 9922042 9851265 9830412 9751253 9719985 9620777 9475571 9321200 9292494 9098826 9020482 9015490
3725 9015490 8863315 8833573 8742320 8613710 8526919 8503377 8484195 8494440 8478727 8469874 8484185
3714 8484185 8376433 8368503 8361057 8262729 8154511 8107569 8251638 8160024 8068454 8048999 8088501
3703H088501J06817Q7120M1352q8111r555J02043K42122R0817J22401L7612k2092
3692H799027M4396p9574m913m983K7988k9937p5181n9971P6142J16313K0352j03598
3680H726061l7563J0147J7255J58540P2029K5931R3367J12363J15935J33265J34878
3669I562208J59450K78983J66700J98875J66743J67492J93498M2929Q6805J51209
3659A1174892P5593N9518K1874q6253N3420P3726M7309p5457p9590l8340o7240
3648A1159452j07561m5437q8288j05016k10070j45947j43603q4760j6286Q0567
3638A0293051N1415P7688J20030P4106P3668J00347R2731J13593K05654J5447
3628A1217730M8149L0487k4329P3736j08845j62596r1001K5602j77151k47087
$$ plain form
3703 8088501 8195318 8282438 8323790 8235679 8226124 8328167 8570289 8661106 8783507 8821119 8799027
3692 8799027 8843423 8763849 8758936 8753953 8781941 8752004 8676823 8616852 8692994 8809307 8829659 8726061
3680 8726061 8688498 8698645 8715900 8874440 8946469 8972400 9065767 9178130 9294065 9427330 9562208
3669 9562208 9721658 10000641 10167341 10366216 10532959 10700451 10893949 10936878 11023683 11174892
3659 11174892 11250485 11310003 11331877 11245624 11299044 11372770 11420079 11344622 11265032 11226692 11159452
3648 11159452 11051891 11006454 10918166 10813150 10603080 10457133 10313530 10228770 10212484 10293051
3638 10293051 10344466 10422154 10542184 10616290 10689958 10790305 10883036 10996629 11202283 11217730
3628 11217730 11265879 11296366 11272037 11345773 11236928 11074332 10983331 11008933 10831782 10584695
3618A0584695j96228j63129k36667l07348j89839k38446k87163j40912m9097k15347
3608H560519o4405m9801r1713J3684j6865q5774J10561K9523O3816k6759Q331
3597H451117J03778p9310j33915K6021M2027J4286q3597l3453r4812j38983j09643
3586G963516j22900j73985k48016j67367j12090o4849q2347k46853j47825j37088
3576F460196p3372M4467m6980n3861O1459K8133m0432n7983M8919m1727j6171
3565F312648M122q6157K8929J0145j67868j06207o6785R1j18559q0238l972j51827
3553E574322j13066n3560J2474J9396o7871q7683K9160o4739M1625j02420j24328
3542E063310R451L2906n8052n9895j1173j1933n6803j41305m3737m2882J02125
$$ plain form
3618 10584695 10388467 10225338 9988671 9681323 9491484 9253038 8965875 8824963 8775866 8560519
3608 8560519 8496114 8446313 8354600 8368284 8351419 8265645 8376206 8405729 8469545 8442786 8451117
3597 8451117 8554895 8475585 8341670 8367691 8409718 8424004 8340407 8306954 8212142 8073159 7963516
3586 7963516 7840616 7666631 7418615 7251248 7139158 7074309 6991962 6745109 6597284 6460196
3576 6460196 6386824 6431291 6384311 6330450 6391909 6420042 6379610 6321627 6370546 6328819 6312648
3565 6312648 6316770 6230613 6259542 6269687 6101819 5995612 5928827 5928918 5810359 5730121 5726149 5574322
3553 5574322 5461256 5407696 5420170 5439566 5371695 5284012 5313172 5248433 5290058 5187638 5063310
3542 5063310 5072761 5105667 5047615 4987720 4976547 4964614 4907811 4766506 4722769 4679887 4782012
3531D782012J9065p1369m4798L9974q6145J9074J17886Q329p677o4210k9031N7080
3519D740190M4371n3107L2442p6013l4477R4105o2186o9583N9559m4846J3643
3508D644098k0255N3432q6886p7635n9150K473P5205o5268Q0843M98P935M1058
3496D596348p2106J7299o226K6725k4604M0791P672k6932M9570Q6847m6583J18393
3484D767194R3778j830J00065Q2973l1543m3187J28986M0810J7793P5871P8629
3473E309539j5259J18797N6937M2135N3093J6707J12275J08540J24712r126J25032
3462F043382O6998O8553Q1265J71581J61663k5758J10500K60263K11149J19722
3452G269318J99125K02930J94906J77603K03265J96427J70332J99299K26235K55604
$$ plain form
3531 4782012 4801077 4729708 4684910 4724884 4638739 4657813 4775699 4784028 4776351 4712141 4683110 4740190
3519 4740190 4784561 4731454 4763896 4687883 4653406 4747511 4685325 4615742 4675301 4630455 4644098
3508 4644098 4623843 4677275 4590389 4512754 4453604 4456077 4531282 4466014 4546857 4547355 4555290 4596348
3496 4596348 4524242 4541541 4535315 4562040 4537436 4578227 4585899 4558967 4608537 4695384 4648801 4767194
3484 4767194 4860972 4859142 4959207 5042180 5010637 4967450 5096436 5137246 5155039 5230910 5309539
3473 5309539 5294280 5413077 5470014 5512149 5565242 5581949 5694224 5802764 5927476 5918350 6043382
3462 6043382 6110380 6178933 6260198 6431779 6593442 6567684 6678184 6938447 7149596 7269318
3452 7269318 7468443 7671373 7866279 8043882 8247147 8443574 8613906 8813205 9039440 9295044
3442I295044L09414L67905M64768N15826N97133P77096R92037J012385J049613
3433A5381221J406782J683407K153478K799086L618276M775414N838849N007440
3425D2663953J502292l072593o599431o332323m021928k638072j677657j199863
3417A8624378j058413p40909m33331l31693k44517j4373J2491R1199L48505M37929
3407A6691266P73376Q83940J151512J549821J675884J861051K334590K948021
3399B9869461L755692M805523O449615Q490389J0920518J0466033M332600m448434
3391G4641397j2953240j3653654r062152o082845m179661l143525k351053j965824
3383B1249443j537277j154223r04602o84966o22398m66955k03337j25654n0215
$$ plain form
3442 9295044 9604458 9972363 10437131 10952957 11550090 12327186 13319223 14331608 15381221
3433 15381221 16788003 18471410 20624888 23423974 27042250 31817664 37656513 42663953
3425 42663953 44166245 41093652 34494221 28161898 24139970 21501898 19824241 18624378
3417 18624378 17565965 16825056 16391725 16060032 15815515 15801142 15813633 15904832 16253337 16691266
3407 16691266 17464642 18348582 19500094 21049915 22725799 24586850 26921440 29869461
3399 29869461 33625153 38430676 44880291 53370680 64291198 74757231 79089831 74641397
3391 74641397 61688157 48034503 38972351 32889506 28709845 25566320 23215267 21249443
3383 21249443 19712166 18557943 17653341 16968375 16345977 15879022 15675685 15550031 15499816
3374A5499816J5742L54061M19462M53489P34833Q13270J262632J584988K013949
3365B3152242K690818L770071M861133N163349K705948j278899n632330o952195
3357B8480137n124818l458517k326100j803054j327766j178125q24995n92504
3349A1844258n58334l79848n32897k48001k62000k95112l27296l17801j72709
3340H750260k35415k43552j23730j2075q3617L5007o0046p1160j03819m2998K7783
3329G836638o0571j28530k6650l52j23230q0298k4845j39118N6362L773q520o6603
3317G238056N887J30183l0073M0060M7541J3487M8620R5139J29177R2253J0600
3306G820930p9715P1093J28017Q1561J02914J34226J41331p4077O6255P4855J2092
$$ plain form
3374 15499816 15515558 15869619 16289081 16742570 17477403 18290673 19553305 21138293 23152242
3365 23152242 25843060 29613131 34474264 39637613 42343561 41064662 35432332 28480137
3357 28480137 23355319 19896802 17570702 15767648 14439882 13261757 12436762 11844258
3349 11844258 11285924 10906076 10373179 10125178 9863178 9568066 9240770 8922969 8750260
3340 8750260 8514845 8271293 8147563 8135488 8051871 8086878 8026832 7955672 7851853 7808855 7836638
3329 7836638 7776067 7647537 7620887 7620535 7497305 7417007 7392162 7253044 7309406 7313179 7304659 7238056
3317 7238056 7243943 7374126 7344053 7384113 7431654 7445141 7493761 7588900 7718077 7810330 7820930
3306 7820930 7741215 7812308 7940325 8021886 8124800 8259026 8400357 8326280 8392535 8467390 8479482
3295H479482L1063j4307J14257J61210K05048R7483J51826J96104K41654K45696
3285I909516K48512K34805K04657J89446J46992K50805K20953K04764K35621J24842
3275A1970913K68217L48860L33874M04473M15548M71507N95037P29637O60023
3266A6198089Q20885Q87910R55509J130864J076749J188195J197114J291038J301656
3257B6048009J216343J035243P69684K65922m2908m94784q98887j243827j613137
3248B5041658j783975j606036j496055j452819j209772j039273j050935o77898
3240A4724895o69681p85615n96476n61943n52399m58422m38323l71712m02651
3231I887673m53646j89829j89988k13139l24429k14838k12118j16065p8896j06743
$$ plain form
3295 8479482 8510545 8496238 8610495 8771705 8976753 9074236 9226062 9422166 9663820 9909516
3285 9909516 10158028 10392833 10597490 10786936 10933928 11184733 11405686 11610450 11846071 11970913
3275 11970913 12239130 12587990 12921864 13326337 13741885 14213392 14808429 15538066 16198089
3266 16198089 17018974 17906884 18862393 19993257 21070006 22258201 23455315 24746353 26048009
3257 26048009 27264352 28299595 29069279 29335201 29292293 28797509 27898622 26654795 25041658
3248 25041658 23257683 21651647 20155592 18702773 17493001 16453728 15402793 14724895
3240 14724895 14055214 13269599 12673123 12111180 11558781 11100359 10662036 10290324 9887673
3231 9887673 9434027 9244198 9054210 8841071 8516642 8301804 8089686 7973621 7894725 7787982
3221G787982j1k61466k20562l1768m6864j31028k5764p1175k2385j3205k6970
3210F936784J1139l5807J75011j8231p9522j37087k16496j40866q4913k00939
3200F209073j69448j41248j43304k47399l9098l2210j58824l2512K5680k355j33337
3189E135018j7354q7941L2031j29516O668J10267j09090N3905J1174k4493m0742
3178D939927L9266j00562O3884R8107j2530k69n2819n9071n554q210p4085r8204
3166D729880l4047j06839n5367j58460o8141l1403j73420j03239K2113j10123
3156C910954j2087L9632j5298r0882J39354p4288k6425L2604R2646L9469l3971
3145D001708j2630q0183j0799j49547O5069j1277j0321O3883j21886K7044J6839
$$ plain form
3221 7787982 7787971 7526505 7305943 7274175 7227311 7096283 7070519 6999344 6976959 6963754 6936784
3210 6936784 6947923 6912116 7087127 7068896 6989374 6852287 6635791 6494925 6410012 6209073
3200 6209073 6039625 5898377 5755073 5507674 5468576 5436366 5277542 5245030 5270710 5268355 5135018
3189 5135018 5117664 5029723 5061754 4932238 4938906 5049173 4940083 4993988 5005162 4980669 4939927
3178 4939927 4979193 4878631 4942515 5040622 5028092 5027823 4975004 4915933 4910379 4902169 4828084 4729880
3166 4729880 4695833 4588994 4533627 4375167 4307026 4275623 4102203 3998964 4021077 3910954
3156 3910954 3898867 3938499 3923201 3832319 3971673 3897385 3870960 3903564 3996210 4035679 4001708
3145 4001708 3989078 3908895 3898096 3748549 3813618 3802341 3792020 3855903 3734017 3761061 3777900
3134C777900j07757L8983p2432j8762p2761j6227j10922q7150m1913k2280O5359
3123C332038k5963K3396J2306j4374k9575o3641J17422n664O8920K0106Q9596
3112C524567o7300j57947m0880j41864q9414J08319k7953n1278K2864Q7441l501
3101C163054M9001r5795j77638j33809j20427r0961k1030m6041k828J2769m1753
3090B494542M6692k3495n8009m1699q978k1058J8539P4406O4439p706o5026n2186
3078B420461J15462k0987j13398o1675q0972J9317K7526o5227M6502n9753M6730
3067B273986q2405n0504r0418n0156L9763n9050j1323K6738j8483j40753P4870
3056A912265M5532p3884n0814p008m7060N5546O9159j48167L0361Q0504j5926
$$ plain form
3134 3777900 3670143 3709126 3636694 3617932 3545171 3528944 3418022 3330872 3288959 3266679 3332038
3123 3332038 3306075 3329471 3341777 3327403 3297828 3234187 3351609 3345945 3414865 3434971 3524567
3112 3524567 3457267 3299320 3258440 3116576 3027162 3135481 3107528 3056250 3079114 3166555 3163054
3101 3163054 3212055 3116260 2938622 2804813 2684386 2593425 2572395 2526354 2523526 2536295 2494542
3090 2494542 2541234 2517739 2459730 2418031 2409053 2387995 2406534 2480940 2545379 2537673 2472647 2420461
3078 2420461 2535923 2514936 2401538 2339863 2258891 2278208 2305734 2240507 2287009 2227256 2273986
3067 2273986 2191581 2141077 2050659 2000503 2040266 1981216 1969893 1996631 1978148 1837395 1912265
3056 1912265 1957797 1883913 1833099 1826091 1779031 1834577 1903736 1755569 1785930 1866434 1850508
3045A850508M4015k3837R250o4190l1182o436Q2209n2825j17432K7009n1881o1944
3033A603264J30175P7400n2803j8303N2075k9883P4916O4203p2950n7741L1436
3022A801789J36751J9144k7691Q4233K4439m0637N3704L3221j6955M530k9815
3011B042713o5888k3063N707M5442R6487j1175q5053R3883N4572N096M094j4864
2999B147951j19331Q380J51435J20457N2375P702q4270L0938K4235n350J05261
2988B439783J80644P3781N5077N5449L615K9121k6587J880R9006k2834O6025m5090
2976B909870j04723N4357o3742R38m1733L5818K7638p0006M9258M8224M2336r848
2964B878387P2284j1911n2870O503Q8700n0255O9211J24383K01832O0544J879
$$ plain form
3045 1850508 1894523 1870686 1879936 1815746 1784564 1778128 1860337 1807512 1690080 1717089 1665208 1603264
3033 1603264 1733439 1810839 1758036 1739733 1791808 1761925 1836841 1901044 1828094 1770353 1801789
3022 1801789 1938540 1957684 1929993 2014226 2038665 1998028 2051732 2084953 2067998 2072528 2042713
3011 2042713 1976825 1953762 1959469 2004911 2101398 2090223 2005170 2099053 2153625 2158721 2162815 2147951
2999 2147951 2028620 2037000 2188435 2308892 2361267 2368969 2284699 2315637 2339872 2334522 2439783
2988 2439783 2620427 2694208 2749285 2804734 2808349 2837470 2810883 2812763 2911769 2888935 2954960 2909870
2976 2909870 2805147 2859504 2795762 2796700 2754967 2790785 2818423 2748417 2797675 2845899 2888235 2878387
2964 2878387 2950671 2938760 2885890 2892393 2981093 2930838 3000049 3124432 3326264 3386808 3388687
2953C388687M6932J1993J53156L6535O2300J44724K5433N5981R8650Q7947J08251
2942D220589M1759L4834l1181J05311M3693p0037l6204J08937L7072l9419o8956
2931D346398o8780M2023J01969N836J10164j724m572K11611J65550Q0206J36556
2920E125237J64114J58161K49072J88075J11038K16697J76202K24637q5097j97429
2910F330707l21239m03431k38184k67012j53522j12717j02896j70587r6607k5284
2900D439228L2959j963l5918Q0156l6833M3989M1461p3474R6935j0361N9923J25723
2888D761825m2506l8791n0882K0569j61398l4174o8216j16805k64963j06646q2611
2877C815402o7476j37857j03530p4017j41103n3538r0627J12542j82807j02461
$$ plain form
2953 3388687 3435619 3447612 3600768 3637303 3699603 3844327 3869760 3925741 4024391 4112338 4220589
2942 4220589 4262348 4297182 4266001 4371312 4415005 4344968 4308764 4417701 4454773 4415354 4346398
2931 4346398 4277618 4319641 4421610 4427446 4537610 4535886 4531314 4742925 4908475 4988681 5125237
2920 5125237 5289351 5447512 5696584 5884659 5995697 6212394 6388596 6613233 6528136 6330707
2910 6330707 6009468 5606037 5367853 5100841 4947319 4834602 4731706 4561119 4464512 4439228
2900 4439228 4472187 4470224 4434306 4514462 4477629 4521618 4563079 4489605 4586540 4576179 4636102 4761825
2888 4761825 4719319 4680528 4629646 4650215 4488817 4454643 4386427 4269622 4004659 3898013 3815402
2877 3815402 3747926 3610069 3506539 3432522 3291419 3237881 3147254 3259796 3076989 2974528
2867B974528p921l4456m5547o8819r0307l8739r2901j04924q3456r5572o9050
2856B242836l8348m4854j16690p0289K5702m0431j07138n5583m2836k0608l5245
2845A696516j9210n9889j03441l9811P4575n6705p2064J16119j12269p5912J500
2834A349409j4447q0166O9195O9262q5745l5252m4082j63340R7946L590n9263
2823A107107J1714r3592j0909P8630o7741M0508J3100r3338n5322j01966Q250
2812H36441l7794k2647k1789Q6805m165l00M0938l6103r687l0469L8048o1181
2800G78097o7801m5475O0366O9649o9594n7350r3764O4144J8898q127n7057n1656
2788E40330K2677O6971l5723o7088L7917R2387l0935j1425j2232j656o1766l7680
$$ plain form
2867 2974528 2966607 2932151 2886604 2817785 2727478 2688739 2595838 2490914 2407458 2311886 2242836
2856 2242836 2204488 2159634 2042944 1972655 1998357 1957926 1850788 1795205 1752369 1731761 1696516
2845 1696516 1677306 1617417 1513976 1474165 1548740 1492035 1419971 1536090 1423821 1347909 1349409
2834 1349409 1334962 1254796 1323991 1393253 1307508 1272256 1228174 1064834 1162780 1166370 1107107
2823 1107107 1118821 1025229 1014320 1092950 1025209 1065717 1078817 985479 930157 828191 836441
2812 836441 798647 776000 754211 841016 836851 836551 877489 841386 831699 801230 839278 778097
2800 778097 710296 664821 725187 794836 725242 667892 574128 638272 657170 649043 591986 540330
2788 540330 563007 629978 594255 527167 565084 657471 626536 615111 602879 601223 539457 501777
2776E01777J3299l1717N4586M7865Q3384j08678q2320Q005l2884k8093O6647L706
2764D95577l8035J9663m7525l4669j2813j729k9811k1602O8137k649n373n5868
2752C33303j5082K8114q0610j391K5644M1664l5237M8192O0250m9603n4107m4912
2740B56225K492N3141l6065j9326P8985J5781r5990p4771O9470J9371M2534m8402
2728B63445j5782o010k5405k0496n302K1157l4856L914l3276R4212K180M6932
2716B90713j18020J575N4869j23406m7506P1883M7837l0572q2117K6292J5531
2705A07079J49865R0326p3184n9998j7088N7064j9241J7510K0102j7112m6814
2694B08509J1917q8106P0094J3581J37l2548j13803N6086O9967M407J2594M989
$$ plain form
2776 501777 515076 483359 537945 585810 669194 560516 478196 486201 453317 425224 491871 495577
2764 495577 457542 477205 429680 395011 382198 380469 350658 329056 397193 394544 389171 333303
2752 333303 318221 346335 265725 264334 289978 331642 296405 344597 404847 355244 301137 256225
2740 256225 258717 311858 275793 256467 335452 351233 255243 180472 249942 269313 311847 263445
2728 263445 247663 241653 216248 195752 190450 211607 176751 180665 147389 241601 243781 290713
2716 290713 172693 174268 229137 105731 58225 130108 177945 147373 65256 91548 107079
2705 107079 256944 347270 274086 214088 197000 254064 234823 252333 272435 255323 208509
2694 208509 220426 132320 202414 215995 216132 183584 69781 125867 195834 200241 212835 217824
2682B17824n9198l7943j3071O6890R0256m3984J2371m2271O0649n2957N7538l304
2670B52800Q087m3001j18090J05757n5614j1917J644m6180k9607R1558O2903Q3537
2658C01877j21394m9358J03019k4422Q179j3645m5629J3216J41813l0222m6737
2647B36697K2281m9947K1646L7551m7591M5075N7904K8649L0382j7992m5337n7065
2635B62253m0455R7881P705O2480l6360o1391k7866N5616n3994o9656P2273k4482
2623B44004n5146J30790K7331j44897n398k4484K6643j23100J30957J8888J2191
2612B37779k8260P086O8886l2822P27p423N2595K6490m7904P0721P4090k7349
2600C94616p4639l1412r062J6302k9028P0461J6086p0753m8090n9185Q7584j7591
$$ plain form
2682 217824 158626 120683 107612 174502 264758 220774 233145 190874 251523 198566 256104 252800
2670 252800 260887 217886 99796 205553 149939 138022 139666 93486 63879 155437 218340 301877
2658 301877 180483 131125 234144 209722 217901 204256 158627 171843 313656 283434 236697
2647 236697 258978 209031 230677 268228 220637 265712 323616 352265 382647 364655 319318 262253
2635 262253 221798 319679 327384 389864 353504 292113 264247 319863 265869 196213 268486 244004
2623 244004 188858 319648 346979 202082 196684 172200 198843 75743 206700 225588 237779
2612 237779 209519 216605 285491 252669 253396 245973 298568 325058 277154 347875 421965 394616
2600 394616 319977 288565 279503 295805 266777 337238 353324 282571 234481 175296 262880 245289
2588B45289m5677r1516J01193M0063n4191L6988O9898r5612k1466K3814N4910
2577B63693q3682l3109P7300j35493j1240P0115N0064j150p714m0600L1926m1231
2565A38879Q329P0265m1489j2525N6833N7533q4159j02751J09929L0317L6045
2554B67206o3431l784N2378j54268p9670N9919K5403j9618m9119q7262R9398L350
2542E0502L1499M0956K0968L999j32877P5989m2153M3637l328j7631o550M8429
2530A13440q512o4007o2458j281K4882K109K9828j0431k3000r5953K3722N7116
2518a4545l1451K8711L3077m6716J51155q0772j0316r9134R4479O1430n5137N3691
2506H4472o8530j143O4072K14m7503n1664L6003L3007l9429M1345j2618O8472
$$ plain form
2588 245289 199612 108096 209289 249352 195161 232149 302047 206435 184969 208783 263693
2577 263693 180011 146902 224202 88709 77469 147584 197648 196498 188784 148184 180110 138879
2565 138879 147208 217473 175984 163459 220292 277825 193666 90915 200844 231161 267206
2554 267206 203775 199991 252369 98101 18431 78350 103753 84135 35016 -52246 47152 50502
2542 50502 82001 122957 143925 147924 15047 91036 48883 92520 89192 71561 65011 113440
2530 113440 104928 40921 -21537 -22818 2064 4173 34001 23570 570 -95383 -71661 -14545
2518 -14545 -45996 -17285 15792 -30924 120231 39459 29143 -69991 24488 85918 30781 84472
2506 84472 15942 14799 78871 79085 31582 -20082 15921 48928 9499 50844 38226 106698
2494A06698J3162r7580J0453J1522M3390j2339J0654l6846q3931r797N5641M954
2482A5981j6485P961J4692P1794m8399R519n3934j7764n1722K6971N2467j9362
2470h281J2274r9110Q7256O0564j06740q1758O8454J4210m3925o9696k494J31608
2458c7638L2581n5247M7317O8145Q704m6469n9101K6983Q0676j13314j03533K67113
2446A16217m8593o8875n0489Q3440J3922p5069j4700j1090M6147k7234j8665m2505
2434i7494L6859J02718N8428K6842n0661n6663O4465m7496l0905K6354J5033L6003
2422H3483p6525N6418l9806r4089r182O0962k2903J15625J40975j23265J8036
2411A09729n1478o3078P664J08782n1031q2820Q5230p8464K6388J47060O3674
$$ plain form
2494 106698 119860 22280 32733 44255 87645 75306 85960 49114 -34817 -44614 11027 15981
2482 15981 -504 7457 22149 93943 45544 55063 1129 -16635 -68357 -41386 11081 -8281
2470 -8281 3993 -95117 -7861 52703 -54037 -135795 -67341 -53131 -97056 -166752 -169246 -37638
2458 -37638 -5057 -60304 -12987 55158 63862 17393 -41708 -14725 65951 -47363 -150896 116217
2446 116217 67624 -1251 -51740 31700 45622 -29447 -44147 -55237 -9090 -36324 -54989 -97494
2434 -97494 -60635 42083 100511 127353 76692 20029 84494 36998 6093 32447 47480 83483
2422 83483 6958 63376 23570 -70519 -79701 -18739 -41642 73983 214958 91693 109729
2411 109729 58251 -4827 2837 111619 60588 -22232 62998 -15466 10922 157982 221656
2400B21656j11512j04571N4113k8039k23L8319J3145o043m7507J7889K02752p7946
2388A72033m0824l2170l5039K2503P6137Q2881O2376k59j10895l4108p710N1902
2376B06827K6299j57965p956p2452R3920K7940n5496O5307j8939O5673j30868
2365D2290Q802K6154j13056Q891J1242O8332L5332j16822Q3493J2873l3577K0790
2353E4744K2210l8861j12122l4583Q2078j0987R0455J950k9545m4603K2930n7991
2341e4325L0263Q8573K133J8847q5104r444r950n4899J8025N2066J61943n0167
2329A07961j44243k2106M1420J07283l9469K5842q638k8327p4653N2571O4648
2318H2289r1142R9270N2122j39139O7088J02439n2210j1197j7620p4173J5116
$$ plain form
2400 221656 110144 5573 59686 31647 31424 69743 82888 76845 29338 47227 249979 172033
2388 172033 131209 99039 64000 86503 162640 245521 307897 307638 196743 162635 154925 206827
2376 206827 233126 75161 67205 -5247 88673 116613 61117 126424 107485 173158 42290
2365 42290 51092 77246 -35810 -26919 -15677 52655 87987 -28835 54658 67531 33954 54744
2353 54744 76954 38093 -74029 -108612 -26534 -37521 52934 54884 25339 -19264 3666 -54325
2341 -54325 -24062 64511 66644 85491 387 -9057 -19007 -73906 -55881 -3815 158128 107961
2329 107961 -36282 -58388 -16968 90315 50846 76688 68050 39723 -34930 17641 82289
2318 82289 -8853 90417 142539 3400 70488 172927 120717 109520 91900 17727 32843
2307C2843J1422k6277K5220O4538m2961L4041k4389M7523m8790K0181L9072J38510
2295B70933p374j08158Q1370p8365q578N3878j9650j03776L4902m7447J3885L9845
2283A21465L5034j9081q2139J02788Q785j23142r8950l79M6536M1615j1019m6745
2271b5232P1149K6423O8070Q8975q0739r9910J264m945R7244M9343J9628J6296
2259B27566l8338N0506n1146n6190J6522Q7009K8455j3898p5885r1287N0311J12176
2247B45801J3729Q6729M5559n9930m3077j4761o1792j9864J39417p5730m5355
2236B10726n345N5455l048l442K4853J1102l4356j01632R0930Q1105O0924K307
2224C89579O63j15977q745J42921k4777j08149L6749N0464p746Q7250M3402L5558
$$ plain form
2307 32843 44265 17988 43208 107746 64785 98826 74437 121960 73170 93351 132423 270933
2295 270933 263559 155401 236771 158406 149828 203706 184056 80280 115182 67735 81620 121465
2283 121465 156499 137418 55279 158067 166852 43710 -55240 -55619 -9083 32532 21513 -25232
2271 -25232 45917 72340 140410 229385 148646 48736 50000 45055 142299 191642 211270 227566
2259 227566 189228 239734 188588 132398 148920 235929 264384 250486 174601 83314 133625 245801
2247 245801 259530 346259 391818 331888 288811 274050 212258 192394 331811 256081 210726
2236 210726 205381 260836 257788 254346 279199 290301 255945 154313 245243 326348 387272 389579
2224 389579 390242 274265 265520 408441 383664 275515 312264 362728 354982 442232 485634 521192
2212E21192M69n0K4087m0475O5188J16227j1800L1325J9948m716M1910o1369k5469
2199F76467J8475N1895M3731n7265P5063L5420Q4679o0754J25163O1883m3518
2188A011239N0302K6703m596o9412j2693L7202L6846P8282M1291o5951P4495K6991
2176A230699j20175O1908M0635P1109J6259j334O1170K6693L3781P771J3579j8973
2164A423122L7904J8972J55815N0128M6639P3276N9348k0004R0008O7007k5484
2153A976731R8517Q0089K16400J27027P2932J75118J01074j904Q0194K64898K03572
2142C394648J23451J68205K24712J55480J66154K37725K58026K85510K99710L71679
2132E685300N72844N33043N23713N98616O54394O37659Q33220J079588J312222
$$ plain form
2212 521192 521661 521611 545698 505223 570411 686638 674838 706163 726111 721395 763305 701936 676467
2199 676467 694942 746837 790568 733303 808366 843786 928465 867711 992874 1054757 1011239
2188 1011239 1061541 1088244 1083648 1014236 1001543 1038745 1075591 1153873 1195164 1129213 1203708 1230699
2176 1230699 1110524 1172432 1213067 1284176 1300435 1299101 1360271 1386964 1420745 1428516 1442095 1423122
2164 1423122 1461026 1479998 1635813 1685941 1732580 1805856 1865204 1845200 1935208 2002215 1976731
2153 1976731 2075248 2155337 2371737 2498764 2571696 2746814 2847888 2845984 2926178 3191076 3394648
2142 3394648 3518099 3686304 3911016 4066496 4232650 4470375 4728401 5013911 5313621 5685300
2132 5685300 6258144 6791187 7314900 7913516 8567910 9205569 10038789 11118377 12430599
2123A2430599J572448J977167K446422L213227L797090N428875P192095Q833173
2115D6891096O110134L62871p001915j1589240q369017n150064l502084k699132
2107A5052649k116739j700555j298978r05540o84370m37326l36760l57082l57569
2098F857730o51987n95540n07942m09471l98503l64599k94929j06882k2586j92869
2088C312422j61796p7398j79022k05920q4858m0046j32726q8235r6574j31521
2078B114326q5072l7340r9536k13976j5842k5172m4372r545o6635R770j22012
2067A404594j06666J7417o5772r2997l2001r8570M045j01151m6364O185O0690
2056I49410l4600Q049M920q3730o4580m5026p860j36077J72324R766o2976O3994
$$ plain form
2123 12430599 14003047 15980214 18426636 21639863 25436953 30865828 38057923 46891096
2115 46891096 53001230 53364101 46362186 34772946 26403929 21253865 17751781 15052649
2107 15052649 12935910 11235355 9936377 9030837 8346467 7909141 7572381 7215299 6857730
2098 6857730 6205743 5610203 5102261 4692790 4294287 3929688 3634759 3527877 3505291 3312422
2088 3312422 3150626 3073228 2894206 2688286 2603428 2563382 2430656 2342421 2245847 2114326
2078 2114326 2029254 1991914 1892378 1678402 1662560 1637388 1593016 1583471 1516836 1526606 1404594
2067 1404594 1297928 1315345 1249573 1156576 1124575 1026005 1030050 928899 882535 888720 949410
2056 949410 914810 922859 927779 844049 779469 734443 726583 590506 762830 772596 709620 773614
2044G73614m1011L9533k287n4674r2642j0962R087j8932j1120o4659M8883J7024
2032E91854k0425L2764L3303m3104l7652Q8264r7268j15537p329M9921j15763
2021C59028o397J20110n958J627k5680j40059n7365O3717O0090L970j38760L8920
2009B73243o1776L5641m240L4442K6159l1355l2865J1218M0089O4094j1436N2808
1997C96022j50161r3690J23493K2631n1222K8478n9166k7751l5262l5326o9369
1986D8677L3006L0544l6113N5476k0545K1468M2106k0858L101q317n2579O0496
1974A56462Q16K6766J0936P1543j28152o865l5807n8895J19240L4889j0868l4161
1962A45904l4754M6600k2536J3532O301O1992M045K7199J3129n8857j31477R1667
$$ plain form
2044 773614 732603 772136 769849 715175 622533 611571 620658 601726 590606 525947 574830 591854
2032 591854 571429 604193 637496 594392 556740 645004 547736 432199 424870 474791 359028
2021 359028 352631 472741 466783 468410 442730 302671 245306 309023 369113 373083 234323 273243
2009 273243 211467 247108 242868 277310 303469 272114 239249 250467 290556 354650 343214 396022
1997 396022 245861 152171 275664 298295 247073 275551 216385 188634 153372 118046 48677
1986 48677 81683 112227 76114 131590 111045 132513 174619 153761 156862 148545 95966 156462
1974 156462 157278 184044 194980 266523 138371 131506 95699 36804 156044 190933 180065 145904
1962 145904 111150 157750 135214 148746 155047 217039 221084 248283 261412 202555 71078 162745
1950A62745n9518n3106L0713Q6558M9344j23533P138p8055n1424O8308O5778o1518
1938D3430P2952l7288K9603M0175o6448j6078p360m8960Q4490J06574m5718K1509
1926A76881L5692k4295L8197o8427j25508M7428k6316J23324j01501j03478P8760
1915E0757j0636Q3178o5558j3772m0700K7096j8093O8855m5735j6403l5517k7006
1903d3534J03842j1696m5843l7J907L7568J7880l5694K5483K9202m7756L8833
1891G0155K9063L6343p1436m8422L018k93l0294j2631J009j9048L9187N2485O3260
1878A12396p0744j0921J62628q5j30438L4498n4930q821J3036j17501o1316M1568
1866i0630R2324q26k4325M2594J8767L6863k1943R3756J3582p0856j7874Q966
$$ plain form
1950 162745 103227 50121 80834 167392 216736 93203 100341 22286 -29138 39170 104948 43430
1938 43430 116382 79094 108697 148872 82424 66346 58986 10026 94516 201090 155372 176881
1926 176881 212573 188278 226475 158048 32540 79968 53652 176976 75475 -28003 50757
1915 50757 40121 123299 57741 43969 3269 30365 12272 81127 35392 18989 -16528 -43534
1903 -43534 60308 48612 2769 2732 4639 42207 60087 24393 49876 79078 31322 70155
1891 70155 99218 135561 64125 15703 18721 18428 -11866 -24497 -23488 -42536 -3349 49136 112396
1878 112396 41652 30731 193359 193274 62836 97334 42404 33583 46619 -70882 -132198 -90630
1866 -90630 1694 868 -23457 19137 37904 74767 52824 146580 160162 89306 71432 80398
1854H0398l8768O8002J60799q206j66848k2662J8004J20789N7970j57850j0034
1843A01594R385k7330k8948j9825Q8857q2197K9738m1570J4855n7716R149N066
1831A058k9229M6302o452k1652j7359o73Q404K781M7931L8836P6612m282r6373
1818D5904J7200l5850N6349r5821n882M2113K8561j7350j58o4619J144j2648K5496
1805a5561L5241o3455K8556j9112n3839j6539R6649j6501j4063l8452q8844Q1688
1793h4232N9042P5338J1140j00890J0689n4997J8661J3771J7978r23m440P0708
1781C1845l2318N7089m5598l4127Q2701Q733K4314K8558l2081p2523j08421J30074
1769C8246j04334K1162L6347L304m2026p2211R738Q3J6678L160l6095J0339M9975
$$ plain form
1854 80398 41630 109632 270431 262225 95377 72715 90719 211508 269478 111628 101594
1843 101594 110979 83649 54701 34876 123733 41536 71274 29704 44559 -13157 -4008 1058
1831 1058 -28171 18131 11679 -9973 -27332 -28005 -19601 -16820 31111 69947 146559 142277 45904
1818 45904 63104 27254 83603 -12218 -18100 24013 52574 35224 35066 -29553 -28409 -41057 -15561
1805 -15561 19680 -43775 -15219 -34331 -88170 -104709 -8060 -24561 -38624 -77076 -165920 -84232
1793 -84232 -25190 50148 61288 -39602 -28913 -83910 -65249 -51478 -33500 -34423 -38863 31845
1781 31845 -473 56616 11018 -23109 59592 68325 92639 121197 89116 16593 -91828 38246
1769 38246 -66088 -44926 -8579 -5275 -47301 -119512 -109774 -109691 -93013 -89853 -125948 -115609 -65634
1756f5634R4681N7884m0767r3729k8433J32431K1953k9816q1319p1402J14558
1745A0407j0189j03938J44926m1416m0019j8013J3010M279o3499J0242O6354m0070
1733f7926O7813K4149n2341k0793J8565n0221j9271L6820Q415N4345l4443M2912
1721H024j4275n8317P818K3529J31385m4161p9617K0540L6313L2409l0088p1822
1709c8262K6454k7262M179J04996J5940o694q3498P317N1709P3853p4155j72156
1697a17579O6204K9518q4404M8486L5657N2540M3175k6847l3836L8358K1441k3813
1685D8900l871l3207o2810Q1355N4208p953N1738k7244j53691l2838O0156P440
1673a7817J04634l6700L8250j0790j14128K4492K2882k4207j21819J28249Q537
$$ plain form
1756 -65634 29047 86931 46164 -47565 -75998 56433 78386 48570 -32749 -104151 10407
1745 10407 218 -103720 41206 -210 -40229 -58242 -45232 -40953 -104452 -94210 -27856 -67926
1733 -67926 -113 24036 -28305 -49098 -30533 -80754 -100025 -63205 -54790 -445 -34888 8024
1721 8024 -6251 -64568 -56750 -33221 98164 54003 -25614 -5074 31239 63648 33560 -38262
1709 -38262 -11808 -39070 -34891 70105 86045 79351 -4147 3170 54879 128732 54577 -117579
1697 -117579 -51375 -21857 -106261 -57775 -22118 30422 73597 46750 12914 51272 72713 48900
1685 48900 45029 11822 -50988 30367 84575 76622 128360 101116 -52575 -85413 -25257 -17817
1673 -17817 86817 50117 88367 77577 -36551 -12059 10823 -13384 -135203 -6954 1583
1662A583k5650J3578M77k1516p8116O0961M2108m7456Q205K3411L2423K0003l1985
1649a974P6305J5731n943n8650k9321M1755m5480r8795K7027O450k836M9471N424
1636b0836K0030n2980q7770N0928N1018j35389O2825J15354j165Q1433R650J2714
1624A05812q3864k0580N302N1121j06264k6729J7861L9351L3555J5478P7324l9802
1612F8565O0359r0202J08036j4344q3697k4359J2607K5180p8351l0622J19591
1601G2763K71j09374o3861J5458J035M6561M0331r0272O1106o7024K4093M7180
1589b1733n3530P409K4570P5307P9763r4129o8548O4746r4428j55797J55071P8523
1577b776n0323m2616J16972j33462L0846j2084M0600L4983j8400j3472j4993N4839
$$ plain form
1662 1583 -24067 -10489 -10012 -31528 -109644 -48683 -6575 -54031 -45826 -22415 10008 30011 -1974
1649 -1974 74331 90062 84119 25469 -3852 37903 -7577 -106372 -79345 -72895 -75731 -26260 -20836
1636 -20836 -806 -53786 -141556 -90628 -39610 -174999 -112174 3180 2015 83448 93098 105812
1624 105812 21948 1368 6670 57791 -48473 -75202 -57341 -17990 15565 31043 108367 68565
1612 68565 128924 38722 146758 132414 48717 24358 36965 62145 -16206 -46828 72763
1601 72763 73034 -36340 -100201 -84743 -83708 -37147 3184 -87088 -25982 -93006 -68913 -21733
1589 -21733 -75263 -67854 -43284 32023 111786 17657 -50891 13855 -80573 -236370 -81299 -2776
1577 -2776 -53099 -95715 21257 -112205 -81359 -93443 -52843 -17860 -36260 -49732 -64725 -9886
1565i886m9517N3047k2673p6809k5603n260K3339O6801O5414J7040L9148k6329
1553D8712p8534Q640q4298N1561M8828q4862j9917r588P6852k8173k2826L6529
1541e7076l8266M4580J1635O7071n1190j4859o6234J00386o4111p8108L8269M2845
1529f5058J04272j406j16823l6869J6625n8338j4784R2727K171N0755l6679J61193
1517I7786n6338j30299j830L435M0552k0600n8237Q4269O9249J8588q304l6348
1505A923j16191J06612J1295n0618Q3303r7565k4118M8574O6243j22811K2811
1494g0542R2125L5444j2500j7729l5939L1546L5928J5827j07567L2759n3568m4293
1482i8509k2098P3018M1961m0614Q2370j0809M5836L5640p5748m4318r5713J03221
$$ plain form
1565 -9886 -59403 -6356 -29029 -105838 -131441 -136701 -113362 -46561 18853 35893 75041 48712
1553 48712 -29822 -21182 -105480 -53919 -5091 -89953 -109870 -119458 -42606 -70779 -93605 -57076
1541 -57076 -95342 -50762 -39127 27944 -23246 -38105 -104339 -3953 -68064 -146172 -107903 -65058
1529 -65058 39214 37808 -79015 -115884 -99259 -157597 -172381 -79654 -77483 -26728 -63407 97786
1517 97786 41448 -88851 -90681 -87246 -46694 -67294 -125531 -41262 27987 46575 38271 1923
1505 1923 -114268 -7656 3639 -46979 36324 -61241 -85359 -36785 29458 -93353 -70542
1494 -70542 21583 57027 44527 26798 -9141 22405 58333 74160 -33407 -648 -54216 -98509
1482 -98509 -120607 -47589 -5628 -46242 36128 25319 71155 106795 31047 -13271 -108984 -5763
1470e763J9694p370O2070l5938j40711k7088J10313L5544k7739l1991O9492K4472
1458D4985l1878K4870m8920q5768N7213L6832L1572m4900l6146j2674K8079k3898
1446f0633J1102O9670o182q460O859j09803O9706O4096j07359K5686R3602o832
1434D1452o165L1926p9234k5170Q928K48p4722m0827P9566N5725j09530L5029
1422h2774m2534N1040R1402k737l9351p619M416j4357J8516J1982O9086j04603
1410d7533j8697l4330J16541l7610j16432K2160k3085R6001j8255m7771m0814
1399a49825L6487O7990J0559L4685R505m5373n0447R8071O2876k2964J7653p306
1387F1911o5542k0027L3762n9244k6622N3332m3954m6480K2041n2532L3174O5164
$$ plain form
1470 -5763 13931 6561 68631 32693 -108018 -135106 -24793 10751 -16988 -48979 20513 44985
1458 44985 13107 37977 -10943 -96711 -39498 -2666 28906 -15994 -52140 -64814 -36735 -60633
1446 -60633 -49531 20139 13957 5497 12356 -97447 -27741 36355 -71004 -45318 48284 41452
1434 41452 35287 67213 -12021 -37191 -28263 -28015 -102737 -143564 -63998 -8273 -117803 -82774
1422 -82774 -125308 -74268 17134 14397 -24954 -32573 -28157 -42514 -23998 -12016 57070 -47533
1410 -47533 -66230 -100560 15981 -21629 -138061 -115901 -138986 -42985 -61240 -109011 -149825
1399 -149825 -113338 -45348 -34789 -104 9401 -35972 -86419 11652 74528 51564 69217 61911
1387 61911 -3631 -23658 10104 -49140 -75762 -22430 -66384 -112864 -90823 -143355 -110181 -45017
1375d5017J8384o518N4069r4201k3885k7613J998O6192o832K4042J6826L0886
1363H331k1721j5528n8203O3171L6601m7639M3284J04869m4813P6055l1723j68629
1351e5945q912L1024M2677j2416n660R9440N2444j24718K4883J9995J8094K5576
1339A06482k4367q4605P7320k8767J0326o2984j20944J7421q077k4861p3841J64295
1327e2602O2407r563R1555p356l5456n1658R1819m009p6836K5730m295l7311k666
1314a0241m7908O3795J05898J1921J5354p6122j7749j07533m2561o267M7878l7952
1302a01487R7666l9657k0089J8267o8858K9254R9138L6471p8401J0423J08477
1291I1204p9341j1431q9885O2214M5926r1837P1634P0430j66514K6435L5135P0558
$$ plain form
1375 -45017 -26633 -33151 20918 -73283 -97168 -124781 -122783 -56591 -63423 -39381 -22555 8331
1363 8331 -13390 -28918 -87121 -23950 12651 -34988 8296 113165 68352 144407 112684 -55945
1351 -55945 -64857 -33833 8844 -3572 -9232 90208 142652 17934 42817 62812 80906 106482
1339 106482 82115 -2490 74830 46063 56389 -6595 -127539 -110118 -118195 -143056 -216897 -52602
1327 -52602 9805 242 91797 84441 48985 -2673 89146 85137 8301 34031 29736 -7575 -10241
1314 -10241 -58149 5646 111544 123465 138819 62697 44948 -62585 -105146 -111413 -63535 -101487
1302 -101487 -3821 -43478 -63567 -45300 -114158 -84904 14234 50705 -27696 -17273 91204
1291 91204 11863 432 -89453 -27239 18687 -73150 -1516 68914 -97600 -71165 -36030 34528
1279C4528L3109m5835j186k4352J2664m1861J771k5467j2585M6181L2933m3791
1267c3891j09322R3997M6410K3587l1388m1445j0106O1678J4726o3228N6256M0884
1255D8158J01541K2355o5653j40076o6401J2918O3431Q885N895R028q164l6265
1243d4348m566q6300J1659O02N9047Q412K9677j7357l1610k5528Q8013k4343p9035
1230a15677k02m655L8085N5456o6718O9853n0100K1800k3820j267O9434n8755
1218f6566N1306N3690j46599Q4155k949l5737O3627n7238m1895K4268M692R4325
1206B5079j8007j7901K7401k3988M9906k2446q6578k7135J04073m126r1135O7859
1194a6998k6599J8474j6248n9170J7827O4154j6232K6263M8395J2063N8274p1221
$$ plain form
1279 34528 67637 21802 20616 -3736 8928 -32933 -31162 -56629 -69214 -23033 9900 -33891
1267 -33891 -143213 -49216 -2806 20781 -10607 -52052 -62158 -480 14246 -48982 7274 48158
1255 48158 149699 172054 106401 -33675 -100076 -87158 -23727 -14842 -8947 81 -8083 -44348
1243 -44348 -48914 -135214 -123555 -122953 -63906 -55494 -25817 -43174 -74784 -100312 -12299 -36642 -115677
1230 -115677 -115879 -120534 -82449 -26993 -93711 -23858 -73958 -52158 -75978 -77245 -7811 -66566
1218 -66566 -15260 38430 -108169 -24014 -26963 -62700 927 -56311 -98206 -73938 -69246 25079
1206 25079 7072 -10829 16572 -7416 42490 20044 -66534 -93669 10404 6278 -84857 -16998
1194 -16998 -43597 -25123 -41371 -100541 -82714 -18560 -34792 -8529 39866 51929 110203 38982
1182C8982o158M6072q7439O3530K0773m2639m5592j1570q13n1124P9142p9929
1170g6765Q9212k8248J976L6966o6076R529L2066j28881L7225M7275l3666J19807
1158D0420r659q3612J44109m7893P6414p7019J9555o8214j1916R190N3903J3492
1146E8770j9860q6256K3477L9074l0627l5904j4310M5187l6319J1298O9580k5065
1134i55n2039O9249j5085k1050l1444j3762J05913k453J1854J9835r3384J16680
1122I3359q8993j4539O2681r6680j1084O385K4264J0133l7633O3722o4769K3529
1110b9625K1617J9915J3725P6242L2765q6676m6761j67949J06833M6595K8702
1099A5383J00393N3909k0602m2052k2835P0325n3056j34411K6876o921L9691j0585
$$ plain form
1182 38982 32824 78896 -8543 54987 75760 33121 -12471 -24041 -24854 -75978 3164 -76765
1170 -76765 12447 -15801 -13825 23141 -42935 -33406 -1340 -130221 -92996 -45721 -79387 40420
1158 40420 30761 -52851 91258 43365 119779 42760 62315 -5899 -17815 -8625 45278 58770
1146 58770 38910 -47346 -23869 15205 -15422 -51326 -65636 -20449 -56768 -45470 24110 -955
1134 -955 -52994 16255 1170 -19880 -51324 -65086 40827 38374 50228 70063 -23321 93359
1122 93359 4366 -10173 52508 -44172 -55256 -48871 -24607 -14474 -52107 11615 -53154 -29625
1110 -29625 -8008 11907 25632 101874 134639 47963 1202 -166747 -59914 -13319 15383
1099 15383 115776 169685 149083 107031 84196 154521 101465 -32946 -6070 -12991 26700 16115
1087A6115q8377J0533J3375j8815N1890k5480n1394Q2586O0694m7030M1900k4214
1075B1783L3870l5491J4995K1020j12438m162R2604n0658k6540k4429M6358j3869
1063c6957k6451J06136k0816q3934J32394M2473N1363p9915k3755J1173l2903
1052C8808l3055n6324l3688P7419J12596J2523r8921j5503J15661r5347j68459
1041a44290J21921N9984l0188j05452L4060J03053M619j31744m9274J17897Q0512
1030F1098Q4042k56876M7992q4973O9813J31698m5089q4913n688Q8995N660k5214
$$ plain form
1087 16115 -72262 -61729 -48354 -67169 -15279 -40759 -92153 -9567 51127 4097 45997 21783
1075 21783 55653 20162 35157 56177 -56261 -60423 32181 -18477 -45017 -69446 -23088 -36957
1063 -36957 -63408 42728 21912 -62022 70372 112845 164208 84293 60538 71711 38808
1052 38808 5753 -50571 -84259 -6840 105756 118279 19358 3855 119516 24169 -144290
1041 -144290 -22369 37615 7427 -98025 -63965 39088 43707 -88037 -137311 -19414 61098
1030 61098 145140 -111736 -63744 -148717 -78904 52794 7705 -77208 -82896 6099 11759 -13455
$$ [...]
##END NTUPLES=NMR SPECTRUM
##END=
