##TITLE=1H_EC-3265(III-13)
 CDCl3
 8 sc, 
 8.02.2022
##JCAMPDX= 6.0         $$ Bruker NMR JCAMP-DX V2.0
##DATA TYPE= NMR SPECTRUM
##DATA CLASS= NTUPLES
##ORIGIN= UXNMR, Bruker Analytische Messtechnik GmbH
##OWNER= root
$$ XWIN-NMR		Version 3.5
$$ Tue Feb  8 13:11:04 2022 Russian Standard Time (UT+4h)  she@DPX200
##.OBSERVE FREQUENCY= 200.131346
##.OBSERVE NUCLEUS= ^1H
##.ACQUISITION MODE= SIMULTANEOUS
##.ACQUISITION SCHEME= undefined
##.AVERAGES= 8
##.DIGITISER RES= 18
##SPECTROMETER/DATA SYSTEM= spect
##.PULSE SEQUENCE= zg30
##.SOLVENT NAME= CDCl3
##.SHIFT REFERENCE= (INTERNAL, CDCl3, 0, 15.7193)
##AUDIT TRAIL= $$ (NUMBER, WHEN, WHO, WHERE, WHAT)
$$ ##TITLE= Audit trail, XWIN-NMR		Version 3.5
$$ ##JCAMPDX= 5.01
$$ ##ORIGIN= Bruker BioSpin GmbH
$$ ##OWNER= she
$$ F:/spectra/data/she/nmr/H-F/1/pdata/1/auditp.txt
$$ ##AUDIT TRAIL=  $$ (NUMBER, WHEN, WHO, WHERE, WHAT)
(   1,<2022-02-08 13:08:56.43 +0400>,<she>,<DPX200>,
      <created by zg, POWCHK disabled, PULCHK disabled
       configuration hash MD5:
       00 E9 B6 7A A2 85 ED C7 34 08 36 98 17 FE 4E 26
       data hash MD5: 16K
       A8 FC 6E 21 A1 B4 6B 5F 0F AE 05 38 76 BB B9 96>)
(   2,<2022-02-08 13:09:02.73 +0400>,<she>,<DPX200>,
      <Start of raw data processing
       efp BC_mod = 2 LB = 0.24 FT_mod = 6 PKNL = 1 PHC0 = -15869.44 PHC1 = 11.40078 SI = 16K 
       data hash MD5: 16K
       93 46 9D 94 64 DA 07 D8 81 F7 49 38 38 E3 55 3C>)
(   3,<2022-02-08 13:09:30.45 +0400>,<she>,<DPX200>,
      <pk PHC0 = -1.480001 PHC1 = 2.4 
       data hash MD5: 16K
       4F 99 46 93 01 0F DD 2C 61 B4 2D 70 0E F2 37 6B>)
(   4,<2022-02-08 13:09:35.60 +0400>,<she>,<DPX200>,
      <abs ABSG = 5 
       data hash MD5: 16K
       4E C3 6F F1 44 D7 FC 22 31 19 39 C7 B6 EF 88 AB>)
$$ ##END=
$$ 
$$ hash MD5
$$ 59 F8 3B C2 45 DA 43 9C A3 46 00 A3 D8 89 35 49
##$RELAX= 
##$RELAX= 
##$RELAX= 
##$RELAX= 
##$RELAX= 
##$RELAX= 
$$ Bruker specific parameters
$$ --------------------------
##$DU= <F:/spectra>
##$EXPNO= 1
##$NAME= <H-F>
##$PROCNO= 1
##$TYPE= <nmr>
##$USER= <she>
##$AMP= (0..31)
100 100 100 100 100 100 100 100 100 100 100 100 100 100 100 100 100 100 
100 100 100 100 100 100 100 100 100 100 100 100 100 100 
##$AQSEQ= 0
##$AQ_mod= 1
##$AUNM= <au_zg>
##$AUTOPOS= <>
##$BF1= 200.13
##$BF2= 200.13
##$BF3= 200.13
##$BF4= 200.13
##$BF5= 200.13
##$BF6= 200.13
##$BF7= 200.13
##$BF8= 200.13
##$BYTORDA= 1
##$CFDGTYP= 0
##$CFRGTYP= 5
##$CHEMSTR= <none>
##$CNST= (0..31)
1 1 145 1 1 1 1 1 1 1 1 1 1 1 1 1 1 1 1 1 1 1 1 1 1 1 1 1 1 1 1 1 
##$CPDPRG= <>
##$CPDPRG1= <>
##$CPDPRG2= <>
##$CPDPRG3= <>
##$CPDPRG4= <mlev>
##$CPDPRG5= <mlev>
##$CPDPRG6= <mlev>
##$CPDPRG7= <mlev>
##$CPDPRG8= <mlev>
##$CPDPRGB= <>
##$CPDPRGT= <>
##$D= (0..31)
0 1.2 0 0 0 0 0 0 0 0.06 0 0.03 0 0 0 0 0.0002 0 0 0 0 0 0 0 0 0 0 0 0 
0 0 0 
##$DATE= 1644311335
##$DBL= (0..7)
120 120 120 120 120 120 120 120 
##$DBP= (0..7)
150 150 150 150 150 150 150 150 
##$DBP07= 0
##$DBPNAM0= <>
##$DBPNAM1= <>
##$DBPNAM2= <>
##$DBPNAM3= <>
##$DBPNAM4= <>
$$ [...]
##$SUBNAM2= <"">
##$SUBNAM3= <"">
##$SUBNAM4= <"">
##$SUBNAM5= <"">
##$SUBNAM6= <"">
##$SUBNAM7= <"">
##$SUBNAM8= <"">
##$SUBNAM9= <"">
##$SW= 18.0517287032376
##$SWIBOX= (0..15)
0 0 2 0 0 0 0 0 0 0 0 0 0 0 0 0 
##$SW_h= 3612.71676300578
##$TD= 16384
##$TD0= 1
##$TE= 0
##$TE2= 300
##$TE3= 300
##$TEG= 300
##$TL= (0..7)
0 120 120 120 120 120 120 120 
##$TP= (0..7)
150 150 150 150 150 150 150 150 
##$TP07= 0
##$TPNAME0= <>
##$TPNAME1= <>
##$TPNAME2= <>
##$TPNAME3= <>
##$TPNAME4= <>
##$TPNAME5= <>
##$TPNAME6= <>
##$TPNAME7= <>
##$TPOAL= (0..7)
0.5 0.5 0.5 0.5 0.5 0.5 0.5 0.5 
##$TPOFFS= (0..7)
0 0 0 0 0 0 0 0 
##$TUNHIN= 0
##$TUNHOUT= 0
##$TUNXOUT= 0
##$USERA1= <user>
##$USERA2= <user>
##$USERA3= <user>
##$USERA4= <user>
##$USERA5= <user>
##$V9= 5
##$VALIST= <valist>
##$VCLIST= <CCCCCCCCCCCCCCC>
##$VD= 0
##$VDLIST= <DDDDDDDDDDDDDDD>
##$VPLIST= <PPPPPPPPPPPPPPP>
##$VTLIST= <TTTTTTTTTTTTTTT>
##$WBST= 1024
##$WBSW= 4
##$XGAIN= (0..3)
0 0 0 0 
##$XL= 0
##$YL= 0
##$YMAX_a= 171651
##$YMIN_a= -272390
##$ZGOPTNS= <>
##$ZL1= 120
##$ZL2= 120
##$ZL3= 120
##$ZL4= 120
##$ABSF1= 15.72155
##$ABSF2= -2.330299
##$ABSG= 5
##$ABSL= 3
##$ALPHA= 0
##$AQORDER= 0
##$ASSFAC= 0
##$ASSFACI= 0
##$ASSFACX= 0
##$ASSWID= 0
##$AUNMP= <proc_1d>
##$AZFE= 0.1
##$AZFW= 0.1
##$BCFW= 0
##$BC_mod= 2
##$BYTORDP= 0
##$COROFFS= 0
##$CY= -3
##$DATMOD= 1
##$DC= 0
##$DFILT= <>
##$DTYPP= 0
##$F1P= 0
##$F2P= 0
##$FCOR= 1
##$FTSIZE= 16384
##$FT_mod= 6
##$GAMMA= 0
##$GB= 0
##$INTBC= 1
##$INTSCL= 0
##$ISEN= 128
##$LB= 0.24
##$LEV0= 0
##$LPBIN= 0
##$MAXI= 10000
##$MC2= 0
##$MEAN= 0
##$ME_mod= 0
##$MI= 1.114404
##$NCOEF= 0
##$NC_proc= -7
##$NLEV= 6
##$NOISF1= 3.799351
##$NOISF2= 2.8
##$NSP= 0
##$NTH_PI= 0
##$NZP= 0
##$OFFSET= 15.71934
##$PC= 1
##$PHC0= -15870.92
##$PHC1= 13.80078
##$PH_mod= 1
##$PKNL= yes
##$PPARMOD= 0
##$PSCAL= 0
##$PSIGN= 0
##$REVERSE= no
##$SF= 200.130006445635
##$SI= 16384
##$SIGF1= 3
##$SIGF2= 2
##$SINO= 5.538805
##$SIOLD= 16384
##$SREGLST= <1H.CDCl3>
##$SSB= 0
##$STSI= 16384
##$STSR= 0
##$SW_p= 3612.71676300578
##$SYMM= 0
##$S_DEV= 0
##$TDeff= 16384
##$TDoff= 0
##$TI= <>
##$TILT= no
##$TM1= 0
##$TM2= 0
##$TOPLEV= 0
##$USERP1= <user>
##$USERP2= <user>
##$USERP3= <user>
##$USERP4= <user>
##$USERP5= <user>
##$WDW= 1
##$XDIM= 16384
##$YMAX_p= 369893864
##$YMIN_p= -1106262
$$ End of Bruker specific parameters
$$ ---------------------------------
##NTUPLES= NMR SPECTRUM
##VAR_NAME=  FREQUENCY,     SPECTRUM/REAL,   SPECTRUM/IMAG
##SYMBOL=    X,             R,               I
##VAR_TYPE=  INDEPENDENT,   DEPENDENT,       DEPENDENT
##VAR_FORM=  AFFN,          ASDF,            ASDF
##VAR_DIM=   16384,         16384,           16384
##UNITS=     HZ,            ARBITRARY UNITS, ARBITRARY UNITS
##FACTOR=    0.220516191357247, 1,           1
##FIRST=     3145.91168044367, 0,            0
##LAST=      -466.805082562107, 0,           0
##MIN=       -466.805082562107, -1106262,    0
##MAX=       3145.91168044367, 369893864,    0
$$ Real data points
##PAGE= N=1
##DATA TABLE= (X++(R..R)), XYDATA
$$ [...]
7101A00395049j577091q213036j2474909j2747621j0342171o686544m075099k475543
7093D1803035k216880k331012k380157l152074l284869k845632k359883k116950
7085B1115578j757014j281459j217574j122146q44327j010789r13293p15437n08708
7076A1744831m2317k99010k13964m45430j83995l55651l44431l84510n00236l56540
7066H618747n22263k95018l59953j37702j48515R6608k19951r213R6883J40272
7056G259895J58139M98060K28240J32940J77176j46627k54536j98574k84231j94494
7046G375988p8388j30773n8012M49368R1062J8744L2982j80207n12568o62567
7036F345629o71718m43218l80710l62300j62096k80632l65140j88501k70940j53653
$$ plain form
7101 100395049 98817958 90604922 78130013 65382392 55040221 48353677 44278578 41803035
7093 41803035 39586155 37255143 34874986 31722912 28438043 25592411 23232528 21115578
7085 21115578 19358564 18077105 16859531 15737385 14893058 13882269 12968976 12253539 11744831
7076 11744831 11702514 11403504 11189540 10744110 10560115 10204464 9860033 9475523 8975287 8618747
7066 8618747 8096484 7801466 7441513 7303811 7155296 7251904 7031953 7022740 7119623 7259895
7056 7259895 7418034 7916094 8144334 8277274 8454450 8307823 8053287 7854713 7570482 7375988
7046 7375988 7297600 7166827 7108815 7558183 7649245 7667989 7700971 7520764 7008196 6345629
7036 6345629 5673911 5230693 4849983 4487683 4325587 4044955 3679815 3491314 3220374 3066721
7026C066721j69187L415j60919K7639P5037N3232p5617j42317m6195k44674l04928
7015B082207J36326l4818k21896O9191k06910M6071M5561j35231j59947R1778
7005A712332j67291n2947j3095m9969Q6967k3204q5328J67378p3376k55858M4529
6994A290138K10652l83551j00912O2667O272P3881L7472N3358j40980j02750R463
6983A015710k74661m6270J56491p1294j15132J21625R662J52881k54358m6238
6973F48416j1619J5170p4154q3133R1318N9759l06999j8315L328q053r7189K65042
6961D83571m098k37940l0195J84265J05210j95908K87369q0323j81757M3910J41321
6950E15425k5033j61905p3875n7003L4392K47779r484j01902J11031r7525M3939
$$ plain form
7026 3066721 2897534 2900949 2740030 2767669 2842706 2895938 2820321 2678004 2631809 2387135 2082207
7015 2082207 2218533 2183715 1961819 2031010 1824100 1870171 1915732 1780501 1620554 1712332
7005 1712332 1545041 1492094 1478999 1429030 1515997 1492793 1407465 1574843 1501467 1245609 1290138
6994 1290138 1500790 1117239 1016327 1078994 1085266 1159147 1196619 1249977 1108997 1006247 1015710
6983 1015710 741049 694779 851270 779976 664844 786469 796131 949012 694654 648416
6973 648416 636797 651967 577813 494680 585998 645757 338758 320443 323771 315718 218529 483571
6961 483571 479473 241533 211338 395603 500813 304905 592274 511951 330194 374104 515425
6950 515425 490392 328487 254612 197609 232001 479780 470296 368394 479425 381900 425839
6939D25839R6366j34545P237q5731j5388j2773J37894j24376K3867l2828J25073
6928D10635K47817r7377j00235j69687R9671J91556n3509p1921J27360o0078k70519
6917B53713K33519j06270j94726k00527K05618J01196k9252J08004j32650n9532
6907A79093L2667n2130j22640R8921j23612j1651J15923L7810j75136j86731J23888
6896h3598M9684J13451L23075j32585j03492Q1793N6008N2864j46194J29232k27801
6885A12437j11975J50540J151k0703K13200m4816j09402N712J550j3625M7216
6874B31285l3543L2070J88179R1436j78312k00999J05017J51410n4008l5160j24340
6863A73035P4260j74310M2309K465O5542j8531j03219k3279J08444K37103j44385
$$ plain form
6939 425839 522205 387660 394897 309166 293778 281005 418899 294523 318390 285562 410635
6928 410635 658452 561075 460840 291153 390824 582380 528871 456950 584310 524232 253713
6917 253713 487232 380962 186236 -14291 191327 292523 263271 371275 238625 179093
6907 179093 211760 159630 36990 135911 12299 648 116571 154381 -20755 -207486 -83598
6896 -83598 -33914 79537 402612 270027 166535 248328 304336 357200 211006 340238 112437
6885 112437 462 151002 152153 131450 344650 299834 190432 196144 197694 184069 231285
6874 231285 197742 229812 417991 509427 331115 130116 235133 386543 332535 297375 173035
6863 173035 247295 72985 115294 117759 183301 164770 61551 38272 146716 383819 239434
6852B39434k5695o3209O6492m9156j2645Q9462j34971K4059j07088j10924O7191
6841a7050J7880K83644n7402k92611M9166J06562j49195R6831Q0454j14024j07607
6830a03352J18778q2049J25692J86330P9983l8686j47739l9418q7596j5568J38477
6819A34852j18161o7808K27952n4153m5992j5949r0652k14891J58870j4426K76876
6808A76518O2023k94550K0589K25670J83058j20076m3449N574Q5109j79132j28978
6797g644J03716m9230P4274J22188j63250o4015q6424J08254M3760J49698J1671
6786B42998j41147j6198Q7826j09634p1005k2337J39441j7558L4846j60073j82189
6775b15030L28231J00621Q3899J14538l46606J97958l5315j49602j05146J38849
$$ plain form
6852 239434 213739 150530 217022 167866 155221 244683 109712 133771 26683 -84241 -17050
6841 -17050 830 284474 227072 -65539 -16373 90189 -59006 37825 118279 4255 -103352
6830 -103352 15426 -66623 59069 245399 325382 286696 138957 99539 11943 -3625 134852
6819 134852 16691 -51117 176835 122682 76690 60741 -29911 -244802 -85932 -100358 176518
6808 176518 238541 -56009 -35420 190250 373308 253232 209783 215357 300466 121334 -7644
6797 -7644 96072 46842 121116 243304 80054 16039 -70385 37869 81629 231327 242998
6786 242998 101851 85653 173479 63845 -7160 -29497 109944 92386 127232 -32841 -215030
6775 -215030 113201 213822 297721 412259 65653 263611 228296 78694 -26452 112397
6765A12397J58762m6108k74849J84215M071J7912p9775L4440Q6058r9648q830
6754H8645m1073j4218q8635L37310j16551j89647J10509j57285P690K68521M2497
6743B47763q1698j45897J65496l74666N7101J60356J68672L9286j79229Q583o4773
6732I94J16514j06679j87065j4388K69704K52925j72318k77646K557K03719J8734
6721A07051k7129m0924n5343K70312o4377k12764L58308o2425j17524m2781J9464
6710A31868J97938j27623J77818O0677l8472K8694P3742j6408o3742j43435J17232
6699C98289l767p0083J77315j99729J2608j15689K4573j21559l0692O9202N7435
6688A97903j06675K4220q489R7793r7314J80208m7202j67795r289Q5543J30013
$$ plain form
6765 112397 271159 225051 -49798 134417 138488 156400 76625 111065 197123 97475 88645
6754 88645 47572 33354 -55281 282029 165478 -24169 86340 -70945 -63255 205266 247763
6743 247763 166065 20168 185664 -189002 -131901 28455 197127 236413 57184 65767 994
6732 994 117508 10829 -176236 -190624 79080 332005 159687 -117959 -115402 88317 107051
6721 107051 79922 38998 -16345 253967 189590 -23174 335134 272709 155185 112404 131868
6710 131868 329806 202183 380001 440678 402206 430900 504642 488234 424492 281057 398289
6699 398289 394522 324439 501754 302025 314633 198944 223517 101958 71266 140468 197903
6688 197903 91228 115448 106959 204752 107438 287646 240444 72649 63360 148903 278916
6677B78916J64191j68978K7535j3172q661k61301q4185J28297K06454q711J35748
6666C96133j73224j76200J050l282N6516j98453J06788P1680n1834n0660J1373
6655a0113R3073j39713j99553Q4700K3792K43091j22668k37807N3772Q9813J89857
6644F8244k4287m0285j69562M2547J41656P0839j13081r435J32972j35265J51339
6633A15682K5807M6624r5040k9641j45114K36250j76420o5488m375J49766Q5531
6622A43582J28216k40988J83624j3944N8628q1920j24871J05070R8604j26849
6612A29152q2974M1385j4205L152m6822R9237J47878j09506k3274l4490l7699
6601G1834p0744n411P628j00152j561K3650K3610r4133J16982J57141K44633r7816
$$ plain form
6677 278916 443107 274129 301664 288492 279831 18530 -65655 62642 269096 260385 396133
6666 396133 222909 46709 47759 44477 100993 -97460 9328 81008 29174 -21486 -10113
6655 -10113 82960 -56753 -256306 -171606 -147814 95277 -27391 -265198 -211426 -121613 68244
6644 68244 43957 3672 -165890 -123343 18313 89152 -23929 -33364 99608 -35657 115682
6633 115682 141489 188113 93073 63432 -81682 154568 -21852 -87340 -91715 58051 143582
6622 143582 271798 30810 214434 200490 259118 177198 52327 157397 256001 129152
6612 129152 46178 87563 73358 76510 29688 128925 276803 167297 144023 109533 71834
6601 71834 1090 -4321 3307 -96845 -98406 -74756 -51146 -145279 -28297 128844 373477 275661
6589B75661j23457j56622l0055J01577J90706J5354q3554j22679r0214J03882
6579H0599J96664o1094k68309j0550o6822j58449n6445P7222J81099J69567L3604
6568A17086j97070j3272O9113j1919j83111j5711J40730K11232m4966r4485Q0637
6557E8264r4330J22119j70803j6232m6861K4497J70974P0708J4396j33779J66777
6546A65730M633L3740j53232q5889M4400l8702Q2341O5243j01878M3910J21401
6535A81697r3830o4478M0413k18635r97Q3581j3973P0813J06952J44564J0797
6524B46904j70532k46826l229J73387J63897j73137m9792J08662l2626j31676
6514a14968Q7158J73703n5276q5025k43110K20736N0663O0046j5034J27629k457
$$ plain form
6589 275661 152204 -4418 -34473 67104 257810 273164 189610 66931 -23283 80599
6579 80599 277263 216169 -52140 -62690 -129512 -287961 -344406 -267184 -86085 83482 117086
6568 117086 -79984 -93256 -24143 -36062 -219173 -234884 -94154 117078 72112 -22373 58264
6557 58264 -36066 86053 -84750 -100982 -147843 -123346 47628 118336 132732 -1047 165730
6546 165730 170363 204103 50871 -35018 9382 -29320 53021 118264 16386 60296 181697
6535 181697 87867 23389 63802 -154833 -155830 -72249 -86222 -15409 91543 236107 246904
6524 246904 76372 -170454 -173683 -296 163601 -9536 -59328 49334 16708 -114968
6514 -114968 -27810 145893 90617 5592 -237518 -16782 33881 93927 78893 206522 204065
6503B04065k41834J27649j6613q0771m466M1200n2927j96526O8309P1321j24229
6492b04822J37048P8141K5459J8155J33698q3982j77308J15849M1335K15485j62699
6481A36359R8831k3606j58310J8627r1794P3929J8541j55950J7887J79151N7886
6470A71551p873o9582O3947J2451n6520l1247L9169o8927L8226Q983p3424k6966
6458b12K19108O1284l41543R3873J13298l9287J36026J44488j08187j16302m7190
6447A15356m9559K7346R1184K9861N0322j92839j20612J05577j498P7371J63185
6436B95694R1745k3220p0020j20746P4541J00620j29017J2808P9838j40646N1224
6425B22821j45417q6703N6540K28522j8297n9070o1614n3293L540J21658k15169
$$ plain form
6503 204065 -37769 89880 73267 -7504 -11970 29230 -23697 -220223 -151914 -80593 -204822
6492 -204822 -67774 10367 35826 53981 187679 103697 -73611 42238 83573 299058 136359
6481 136359 235190 211584 53274 71901 -19893 54036 72577 -83373 -65486 113665 171551
6470 171551 163678 94096 158043 170494 113974 82727 121896 52969 91195 100178 26754 -212
6458 -212 218896 280180 -61363 32510 145808 106521 242547 387035 278848 162546 115356
6447 115356 65797 93143 184327 214188 264510 71671 -48941 56636 55138 132509 295694
6436 295694 387439 364219 294199 173453 247994 348614 219597 232405 312243 171597 222821
6425 222821 77404 -9299 47241 275763 257466 198396 136782 83489 87029 208687 -6482
6414f482K7268J10674n8877P9285L7572j02375n7180O8103J6842k3491K22919
6403C14258q9280M813j25569o36J41621Q510j1487j44149L74741l0720k70378
6392A71724j4758R6901j15641M5723N7114j48390N16M6245p6965J45196N6625
6381B64290J75736q4227K502j21363R7532L0606j96650J07866K3414q2504j32452
6370H4750N3324J37845j02981R5848N2720q4837r5670j20179J36378J47313K2199
6359C26710l2666J9569m5311J89092J61500o6657j0660l0547j64604N6903J1089
6348D14418q1373j1149J17834K20426o5126j75714p8415P8713J02411p0459O8712
6337E20278J31631j16052p4552J37996r7019J8396R806l199n5914J19998K28455
$$ plain form
6414 -6482 20786 131460 72583 151868 189440 87065 29885 97988 114830 91339 314258
6403 314258 224978 229791 104222 103586 245207 253717 242230 98081 472822 442102 171724
6392 171724 156966 253867 138226 183949 241063 92673 93189 139434 62469 207665 264290
6381 264290 440026 355799 358301 236938 334470 365076 168426 276292 299706 217202 84750
6370 84750 138074 275919 172938 268786 321506 236669 140999 20820 157198 304511 326710
6359 326710 294044 313613 268302 457394 618894 552237 541577 511030 346426 403329 414418
6348 414418 333045 321896 439730 660156 595030 419316 340901 419614 522025 451566 520278
6337 520278 651909 535857 461305 599301 502282 520678 530484 527285 471371 591369 819824
6326H19824m3197J15652P7703p5261j62196M8221R2337m0342j4891o7335Q9185
6315H39700Q8077j60260k77097j7967J32215J86959j42668j75590j15469J42167
6305E00067M0297k463N0394K33145J57369r1769j9978P7172k40799k66509K2246
6294D59172k3884j671N1036J02324j6776K21635k9330r9289p3441q5163j07604
6283C97009J86538P1869l9672n8938j52314Q4666J9667K30384n1540n4499k3062
6272F10108j55083Q0837J37732Q028J8610J0024n5676j04514l2837o3231K9944
6261D83942O8808m4581k22675P2804K18983l710J83325k46425o123r9434J04498
6250E09412N0382J7456P3124J44952R996j36743k51443L0234L763O6716K20681
$$ plain form
6326 819824 776627 892279 969982 894721 732525 780746 873083 832741 817850 750515 839700
6315 839700 927777 767517 490420 472453 604668 791627 648959 473369 357900 500067
6305 500067 540364 537901 588295 821440 978809 887040 867062 944234 703435 436926 459172
6294 459172 435288 433617 484653 586977 570201 791836 762506 663217 589776 504613 397009
6283 397009 583547 655416 615744 556806 404492 489158 508825 739209 687669 633170 610108
6272 610108 455025 535862 673594 681622 700232 710256 654580 550066 517229 453998 483942
6261 483942 552750 508169 285494 358298 577281 573571 756896 510471 504348 404914 509412
6250 509412 559794 577250 650374 795326 805322 668579 417136 447370 451133 517849 738530
6239G38530J5113j76804R0311N8606J43525n6471J30186Q1088k07772R1292j42563
6228G65041J50511N9442l31253M6229j08826o9532k7932K39141J26733r8338N4655
6217H05871R1074j09783j1001K16453p4724J2665j80757K59712r617J2059k6175
6206I85777J49493P6064N359K6434Q1754K16104k61132m1018J35152L4135j23038
6195A285084m0801K99737r8720l5574j0433r6286R0637K12195K44796j0679k34983
6184A604973p5563r448R0925o2517L9780o3198K40027K8706j26797j00254O6263
6173A632897j38165Q151K47278L4201L2695j9858m1267J51928m303J46691j58970
6162A891278l2340L645K7814N9951j65525O0292j22283m4891Q3205J35421j64215
$$ plain form
6239 738530 753643 576839 667150 725756 869281 812810 942996 1024084 816312 907604 765041
6228 765041 915552 974994 643741 689970 581144 511612 483680 722821 849554 751216 805871
6217 805871 896945 787162 776161 992614 917890 930555 749798 1009510 999893 1011952 985777
6206 985777 1135270 1211334 1216693 1243127 1324881 1540985 1279853 1238835 1373987 1408122 1285084
6195 1285084 1244283 1544020 1445300 1409726 1399293 1303007 1393644 1605839 1850635 1839956 1604973
6184 1604973 1529410 1519962 1610887 1548370 1588150 1524952 1764979 1793685 1666888 1566634 1632897
6173 1632897 1494732 1502883 1750161 1784362 1817057 1797199 1755932 1907860 1903557 2050248 1891278
6162 1891278 1858938 1862583 1890397 1950348 1784823 1845115 1722832 1677941 1761146 1896567 1732352
6151A732352J65149o9065L1821J25061j57157J00076k8897j74967n7325k3435
6141A643613L33025J17333M36L8196M0002N8708j0104o0637m676j3204K76364
6130B419056k7264L3883J69819p0476m5695q3738j6929j178P3225N4695k31143
6119B274255J31108J02284k8295J15523Q6816j66202N3457k0166Q805J02193J75860
6108B835638J26664n7176M6596j2497O9422k2784J27141M0072k18073K66481j00118
6097C101366J8031J57356L6810j36113M4395L12138R1774J04261j31883J13928
6087C712063P1406J02029r5032K34563J71093K03061J2444M0437J48955P58r0710
6076D511067Q0123K25246J81629l2159J48884J26839o064J47682K05154n437K02005
$$ plain form
6151 1732352 1897501 1828436 1860257 1985318 1828161 1928237 1899340 1724373 1667048 1643613
6141 1643613 1976638 2093971 2094407 2132603 2172605 2231313 2221209 2160572 2155896 2142692 2419056
6130 2419056 2391792 2425675 2595494 2525018 2479323 2395585 2378656 2377478 2450703 2505398 2274255
6119 2274255 2405363 2507647 2479352 2594875 2681691 2515489 2568946 2548780 2557585 2659778 2835638
6108 2835638 2962302 2905126 2951722 2939225 3008647 2985863 3113004 3153076 2935003 3201484 3101366
6097 3101366 3119397 3276753 3313563 3177450 3221845 3533983 3625757 3730018 3598135 3712063
6087 3712063 3783469 3885498 3790466 4025029 4196122 4399183 4411627 4452064 4601019 4601777 4511067
6076 4511067 4591190 4816436 4998065 4965906 5114790 5241629 5235565 5383247 5588401 5582964 5784969
6065E784969J36625J21365M5953R1175J32562J42676J95043j01178J07010J62293
6055F818493K92752Q120L94893M24062O4424J25579K63751J54749M02063J76401
6045I125287K30128N21045J83518K64450K90664L31840K93206L77824M79314L41046
6035A2438322N12433O69139N08236N25157M78755Q18134Q06155P63863Q91965
6026A8412159R08591J332119J515353J221274J301927J248277J088408J531293
6018B8559401J497040J566485K359514K574078L037095K965320K511143J335390
6010D6405466N31262J65896J1040J60014M4762L65687L01051O63578J065293J548189
6000E1262238J647165J543905J508995J961476K179819K314734K057437J895783
$$ plain form
6065 5784969 5921594 6042959 6088912 6180087 6312649 6455325 6650368 6549190 6656200 6818493
6055 6818493 7111245 7119365 7514258 7938320 8002744 8128323 8392074 8546823 8948886 9125287
6045 9125287 9355415 9876460 10059978 10324428 10615092 10946932 11240138 11617962 12097276 12438322
6035 12438322 12950755 13619894 14128130 14653287 15132042 15950176 16756331 17520194 18412159
6026 18412159 19320750 20652869 22168222 23389496 24691423 25939700 27028108 28559401
6018 28559401 30056441 31622926 33982440 36556518 39593613 42558933 45070076 46405466
6010 46405466 46936728 47102624 47113664 47273678 47318440 47684127 47985178 48648756 49714049 51262238
6000 51262238 52909403 54453308 55962303 57923779 60103598 62418332 64475769 66371552
5992F6371552J668720J341143J613006K318301L417270M427724M553788L330735
5984H9042239n2603l928213n763770m563776l354737j794070j209907q30367k91971
5975F7252825k76856j58595l05920n28365j335641j682856k203783j853600j139977
5966E7767232p93603r64255j234544j092468j286258j122950j176190j028354
5958D9068610j504416k333413k979592l290323l010584k417336j745035j392814
5950C0395097q25853n19584l81415l36545Q4373K64784J29011p790j72332n63171
5940B8066575j014859j073044o98289n35922l90516l36883n03324l47302j6594
5931B3149842j22754J56160r4890l09208j74465o3174k72132q8944j21606M9743
$$ plain form
5992 66371552 68040272 69381415 70994421 73312722 76729992 81157716 85711504 89042239
5984 89042239 88989636 85061423 79297653 74733877 71379140 69585070 68375163 67544796 67252825
5975 67252825 66975969 66817374 66511454 65983089 64647448 62964592 60760809 58907209 57767232
5966 57767232 56973629 56009374 54774830 53682362 52396104 51273154 50096964 49068610
5958 49068610 47564194 45230781 42251189 38960866 35950282 33532946 31787911 30395097
5950 30395097 29569244 29049660 28668245 28331700 28416073 28680857 28809868 28802078 28629746 28066575
5940 28066575 27051716 25978672 25280383 24744461 24353945 24017062 23513738 23166436 23149842
5931 23149842 23027088 23183248 23088358 22779150 22604685 22541511 22269379 22180435 22058829 22108572
5921B2108572J08553O7178J40743m9256p6251J09898K54723M61723K78427L45048
5911B3749358K65502J76209K93740L97994L68075O38203R31531Q69141P87848
5902B8477601O92213J67174l59147J83737M1878K02380Q80332N69790P95277P68841
5892C2420076N91119R61318Q06583O16748O48559O56274R81626J337689J795413
5883D0815405J840624K283112K839030L030659K851221J974279J217279M84160
5875E7335769l2968J0047J98797P04181R33025J053978J482487J465727J917004
5866F5068047K413320K493511K473602K333322J931558J480381J427518J690998
5858H1312257J417932J526474K057083K977030L578872L383413J654502j085591
$$ plain form
5921 22108572 22217125 22284303 22425046 22375790 22299539 22409437 22664160 23125883 23404310 23749358
5911 23749358 24014860 24191069 24484809 24882803 25250878 25889081 26820612 27689753 28477601
5902 28477601 29169814 29336988 28977841 29161578 29203456 29405836 30286168 30855958 31651235 32420076
5892 32420076 33011195 33972513 34779096 35395844 36044403 36700677 37682303 39019992 40815405
5883 40815405 42656029 44939141 47778171 50808830 53660051 55634330 56851609 57335769
5875 57335769 57302801 57312848 57511645 58215826 59148851 60202829 61685316 63151043 65068047
5866 65068047 67481367 69974878 72448480 74781802 76713360 78193741 79621259 81312257
5858 81312257 82730189 84256663 86313746 89290776 92869648 96253061 97907563 96821972
5850I6821972l949823n118659m971918m179049l348397k695743j975694j657376
5842F8925313j277285r88511r66270k74556j77821J03673P42193O25786J1950
5833F6724472k49274l81145r86119j310386j248645j167358r43396j214204j633602
5824E7590343k380719k997231k463038k099465j211284o92813l91132m40782p09420
5815D4204459j151401k504467k753596k474842j798550r88800o77589m77350k56814
5806C1121050k73835o14815q86507j103694j159169r95995j029484q68095q96823
5797B3292633n95883l07597p6086J32236m6796j10349r15m15543n93356n88169
5787B0690175m66022j67463l06335l16251j16869N8273J353N8444q8515j27729
$$ plain form
5850 96821972 92872149 87753490 82781572 78602523 75254126 72558383 70582689 68925313
5842 68925313 67648028 66659517 65693247 65418691 65240870 65344543 66086736 66712522 66724472
5833 66724472 66475198 66094053 65107934 63797548 62548903 61381545 60438149 59223945 57590343
5824 57590343 55209624 52212393 49749355 47649890 46438606 45745793 45354661 44913879 44204459
5815 44204459 43053058 40548591 37794995 35320153 33521603 32532803 31855214 31377864 31121050
5806 31121050 30847215 30232400 29345893 28242199 27083030 26087035 25057551 24189456 23292633
5797 23292633 22696750 22389153 22313067 22445303 22398507 22288158 22287243 21871700 21278344 20690175
5787 20690175 20224153 20056690 19750355 19434104 19317235 19375508 19376861 19435305 19346790 19219061
5777A9219061j624k48241K4744O5772K1584k06960o5097K68622M667M19494N78271
5766B0080293R20737Q33662R18250P04553M97045j228k60557m25800n36846r07500
5756B1822609n62184m29833k85308k93559l41971m70962o78804k61447l46665
5747A8151876o77403j90083k91000m64716j93935k71412P5510J18452K93374M28523
5737A6979186M42717M58923N66821Q30670P66341P50753N45606j19788k83162
5728B0938067j071660j451006j084882j262178j140166r71076r06418o26940n06271
5719A1917470l21261l37141n50112k35939j66830j80773k04203l28259q1385Q8906
5709I600473q4771J39439K85611J22635L91755K04702L24167M65812N3223k00893
$$ plain form
5777 19219061 19217437 18969196 18993940 19059712 19081296 18874336 18809239 19077861 19082528 19502022 20080293
5766 20080293 21001030 21834692 22752942 23457495 23954540 23953312 23692755 23266955 22730109 21822609
5756 21822609 21260425 20830592 20545284 20251725 19909754 19438792 18759988 18498541 18151876
5747 18151876 17474473 17284390 16993390 16528674 16334739 16063327 16138837 16257289 16550663 16979186
5737 16979186 17421903 17880826 18447647 19278317 20044658 20795411 21341017 21221229 20938067
5728 20938067 19866407 18415401 17330519 16068341 14928175 13957099 13050681 12423741 11917470
5719 11917470 11596209 11259068 10708956 10473017 10306187 10125414 9921211 9592952 9511567 9600473
5709 9600473 9515702 9655141 9940752 10063387 10455142 10659844 10984011 11449823 11503046 11302153
5699A1302153k98313o99047o20483o10141n45178k91902l59804k58526l70437
5690G248322j37574j39995j54922j39403j74346j79279j93436K41664k56864k04977
5680E909190j78122P079R5004J79616j10844j59262K23181j65376J51749R8089
5670F050304j1699k1712j8651O7921N700n358K62010K20256J8700K60579J07900
5659F935950J67078L68263L19520O7558N17032P70198N07618M63344L70444M71066
5649A0958071M43188J14102n3453j00374j7234j60262K5798j14896p7813L05912
5639A1323039J94923J91377J56102K22663M75217N12129M16811M64153M00497
5630A4356911M40817M38147P11844P50704R09199Q00558R20127O26507R2178j94290
$$ plain form
5699 11302153 11003840 10304793 9684310 9074169 8528991 8237089 7877285 7618759 7248322
5690 7248322 7110748 6970753 6815831 6676428 6502082 6322803 6129367 6371031 6114167 5909190
5680 5909190 5731068 5738147 5833151 6012767 5901923 5742661 5965842 5800466 5952215 6050304
5670 6050304 6038605 6016893 5998242 6066163 6071863 6066505 6328515 6548771 6567471 6828050 6935950
5659 6935950 7103028 7471291 7790811 7858369 8375401 9145599 9653217 10116561 10487005 10958071
5649 10958071 11401259 11515361 11461908 11361534 11344300 11184038 11209836 11094940 11017127 11323039
5639 11323039 11517962 11709339 11865441 12088104 12563321 13075450 13492261 13956414 14356911
5630 14356911 14797728 15235875 15947719 16698423 17607622 18408180 19328307 19954814 20046992 19852702
5620A9852702m14507n60777l49022m10746k27947k09590j09914n4372N9964J37383
5610A7713174Q5172J58101K03994J99509K46279j20064m51262n98763n97604l74336
5600A6464200k09763q2388l85614j41891n12274l48500m12186n30978n26260n40013
5590A2774333l42457j49694j78027j24345j88260j76303j05499j27538j69447
5581A1212763J91349R5803j90874q5103j35834R7145n1714P3097L27928L48149
5571A1882709N57005P47635J147341J370742J827904K313251J559855q3533k024948
5562A9297961l232592k692835j638792j367808q89818o17686n15388l63032n88173
5553G391837m16168k75216o9722n4880l78672L5608j34554m38852j37536J4816
$$ plain form
5620 19852702 19438195 18877418 18528396 18117650 17889703 17680113 17570199 17515827 17575791 17713174
5610 17713174 17798346 17956447 18160441 18359950 18606229 18486165 18034903 17436140 16838536 16464200
5600 16464200 16254437 16172049 15786435 15644544 15132270 14783770 14371584 13840606 13314346 12774333
5590 12774333 12431876 12282182 12104155 11979810 11791550 11615247 11509748 11382210 11212763
5581 11212763 11404112 11499915 11309041 11223938 11088104 11185249 11133535 11206632 11534560 11882709
5571 11882709 12439714 13187349 14334690 15705432 17533336 19846587 21406442 21322909 19297961
5562 19297961 16065369 13372534 11733742 10365934 9476116 8858430 8343042 7980010 7391837
5553 7391837 6975669 6700453 6630731 6575851 6197179 6232787 6098233 5659381 5521845 5536661
5543E536661J66356O9783j25178J8199M98258J83282N7220q6382k40424j50971
5533E926804n35496o73441j79048r1411j53810j12326k01458j43334j40389J79661
5523C875752m8551j09929l7695j06770Q6364m1865O6396k26873r8049R3589j04075
5512C348294k19152J34195R4411j99092k51604k27774M6143Q8172l524l14777
5502B495292Q6132L3897K66424n8764q4495m6370Q6857M0684O3750K0041Q8528
5491B991976l9260r5693O1042N1437J16285N4621J3521k24946m7507O5942o3116
5480B884302J02439L4004L571K21034j31466N9594m1004j04255R5854J04317l1637
5469C196753j4063R6411j86983k98365o595P9150n511k8506j16013J77711n1532
$$ plain form
5543 5536661 5703017 5772800 5647622 5665821 6164079 6347361 6404581 6318199 6077775 5926804
5533 5926804 5391308 4717867 4538819 4447408 4293598 4181272 3979814 3836480 3696091 3875752
5523 3875752 3827201 3717272 3679577 3572807 3659171 3617306 3683702 3456829 3358780 3452369 3348294
5512 3348294 3129142 3263337 3357748 3158656 2907052 2679278 2725421 2813593 2810069 2495292
5502 2495292 2581424 2615321 2881745 2822981 2738486 2692116 2778973 2819657 2883407 2903448 2991976
5491 2991976 2952716 2857023 2918065 2969502 3085787 3140408 3153929 2928983 2881476 2947418 2884302
5480 2884302 2986741 3020745 3024316 3245350 3113884 3173478 3132474 3028219 3124073 3228390 3196753
5469 3196753 3182690 3279101 3092118 2793753 2787158 2866308 2860797 2832291 2716278 2893989 2842457
5458B842457J75357J91336J8738K9886O4527J9654j83139l2442K78515K10241
5448C615130m22805J06803K73774J42281k7982K13135K65106j69313l06335k02481
5438C487313q5023j81362k24276p6499k7886j28921K33451p9678j87711L5971
5428B765379N5424J6979j26393Q3677q1033j08787K19358L52302r8314j15874
5418B962718J47595k4753j18262j40356l9178K41655k34719r2987o3514K7006
5408B665205M1368j46046l7165r5518R0310k09307j06630J00588j394J38636p3931
5397B366116l6443Q9962J966N618j99554k45378K7321Q3535J16003j9246Q6460
5386B276360J68810J53942j52031j27420l5178j03849J0332P7809P3499j46860
$$ plain form
5458 2842457 3017814 3209150 3227888 3257774 3322301 3341955 3158816 3126374 3404889 3615130
5448 3615130 3192325 3299128 3572902 3715183 3687201 3900336 4165442 3996129 3689794 3487313
5438 3487313 3402290 3220928 2996652 2920153 2892267 2763346 2996797 2917119 2729408 2765379
5428 2765379 2820803 2837782 2711389 2795066 2714033 2605246 2824604 3176906 3078592 2962718
5418 2962718 3110313 3085560 2967298 2826942 2787764 3029419 2794700 2701713 2638199 2665205
5408 2665205 2706573 2560527 2523362 2427844 2518154 2308847 2202217 2302805 2301411 2440047 2366116
5397 2366116 2329673 2419635 2421601 2427219 2227665 1982287 2009608 2093143 2209146 2189900 2276360
5386 2276360 2445170 2599112 2447081 2319661 2284483 2180634 2190966 2268775 2342274 2195414
5376B195414j18409J50469l7758K13252J68092j02594j62391o2382J02186n7614
5366B288265j15407L3792L2823K7484j34238j96635J19718J05314Q6734k75738
5356A972112J2880J32982n4597K756O4376J93180Q3971k19731p0169k191K4812
5345B140381J09663J75322p7933Q4976j59553k8591l2946r145K9863N7348m1433
5334B247952j03079J80891P7962j97986K6108L5239J51774k6899P4490J11600
5324B578052j26116L9342m3772j21790L68760k2960k23620N3723J5284P2209K3213
5313B612325l6083Q3948J74665n6593j2272p5273P3838M9505J13040j17545K6576
5302B836131K70461Q5347j28530J58060M2146N2906L11931j2902P5144J34272
$$ plain form
5376 2195414 2077005 2227474 2189716 2402968 2571060 2468466 2306075 2243693 2345879 2288265
5366 2288265 2172858 2206650 2239473 2266957 2132719 1936084 2055802 2161116 2247850 1972112
5356 1972112 1984992 2117974 2063377 2066133 2130509 2323689 2407660 2187929 2117760 2115569 2140381
5345 2140381 2250044 2425366 2347433 2432409 2272856 2244265 2211319 2202174 2232037 2289385 2247952
5334 2247952 2144873 2325764 2403726 2205740 2231848 2267087 2418861 2391962 2466452 2578052
5324 2578052 2451936 2491278 2447506 2325716 2694476 2671516 2447896 2501619 2516903 2589112 2612325
5313 2612325 2576242 2660190 2834855 2778262 2765990 2690717 2764555 2814060 2927100 2809555 2836131
5302 2836131 3106592 3191939 3063409 3221469 3263615 3316521 3628452 3615550 3690694 3824966
5292C824966j72882p6617K93249K00784K45313k9428J06733K07505J98404M62996
5282E261023J70896K31738M27653L65881M86074P46002M36769O28879M89374N89140
5272I833429M48175N985l18721l85666l49692p6916o4180J55575q2107M4801L67458
5261I578141L02924O46764N23412O67025Q50322R09959P06268O96459N12753K46359
5251A5640386L63526M10812N22352R95895O29949L22267M54943J75703k68947
5242A9246886q35860j187750r19646n97127n34039m41894k28893L10314L8499
5233A4850490J88098P45547N67312Q25201J014614Q05491O77895n5521m36402
5224A9182725j065507j285369q96556n63219k75527l16277j37578Q6571j73203
$$ plain form
5292 3824966 3652084 3575467 3868716 4069500 4314813 4285385 4392118 4599623 4798027 5261023
5282 5261023 5431919 5663657 6091310 6457191 6943265 7689267 8126036 8754915 9244289 9833429
5272 9833429 10281604 10287589 9968868 9583202 9233510 9156594 9092414 9247989 9165882 9210683 9578141
5261 9578141 9881065 10527829 11051241 11718266 12568588 13478547 14184815 14881274 15394027 15640386
5251 15640386 16003912 16414724 16937076 17932971 18562920 18885187 19340130 19515833 19246886
5242 19246886 18411026 17223276 16303630 15706503 15172464 14730570 14501677 14811991 14850490
5233 14850490 15038588 15784135 16351447 17176648 18191262 18996753 19674648 19619127 19182725
5224 19182725 18117218 16831849 15935293 15372074 15096547 14780270 14642692 14729263 14556060
5215A4556060m29125o54235o20646l82989n10581m08517r6266l73635P6794o4432
5205A1092428Q7193M05392K14923K29083O9949L20875k87033o74261q11834p94564
5195I852151o14404l83085l86389l75320k91639l40951k09355p881l8082j89624
5185G015421j15362N525j73084N5927j06023k8623O2170N0977k29785j12645J29802
5174F554300j87382j41086l0416J22m97990j47724P4406k3985l505n2489R4618
5163E638869J36216J9159l11200J6499K2331J26673j44289J13704j97769N316
5153E425509l4290k56515l5938M1495l0260P2828j65956l69421l2471j42453j56417
5142D316111m1460J69263q5788p1841R8678K78580K61591j97317o5551j90001
$$ plain form
5215 14556060 14126935 13472700 12852054 12469065 11958484 11549967 11453701 11080066 11156860 11092428
5205 11092428 11179621 11585013 11799936 12029019 12098968 12419843 12132810 11458549 10646715 9852151
5195 9852151 9237747 8854662 8468273 8092953 7801314 7460363 7251008 7243127 7205045 7015421
5185 7015421 6900059 6905584 6732500 6788427 6682404 6653781 6715951 6766928 6537143 6424498 6554300
5174 6554300 6366918 6225832 6195416 6195538 5697548 5549824 5624230 5600245 5596740 5544251 5638869
5163 5638869 5775085 5794244 5483044 5499543 5521874 5648547 5504258 5617962 5420193 5425509
5153 5425509 5391219 5134704 5098766 5140261 5110001 5182829 5016873 4647452 4614981 4472528 4316111
5142 4316111 4274651 4443914 4358126 4286285 4384963 4663543 4925134 4727817 4662266 4472265
5132D472265j48615j17437J01299P2619J0133J51382L9464K24492J14815K91433
5122E211850J2623j09561J21455j28901o62607l36253l5776j02533k97687r9196
5112C573414l9415q8425k69684k8888j99561j38645Q1294j7346N470J1171o9915
5101B819470J59757j55962J3953j39198j41576J36849J58779K59883j30827j11615
5091B869513O9136k60523l0551o076Q9747n27j42863l3077M066O3624l27308Q9591
5079B384752j95023O48j7998p704Q0283o4674K2089O4855j58317J14231J57078
5068B380220L3100J7111r5101K14132J12764K46524K861n269j4958J53938Q6926
5057C132248q9473J03978K2797K50K2292K6763J4286k28350j0659M5028p4155
$$ plain form
5132 4472265 4323650 4206213 4307512 4380131 4390264 4541646 4581110 4805602 4920417 5211850
5122 5211850 5224473 5114912 5236367 5107466 4444859 4108606 4072830 3970297 3672610 3573414
5112 3573414 3533999 3445574 3175890 3147002 2947441 2808796 2890090 2872744 2878214 2889385 2819470
5101 2819470 2979227 2823265 2837218 2698020 2556444 2693293 2852072 3111955 2981128 2869513
5091 2869513 2938649 2678126 2647575 2641499 2731246 2730719 2587856 2554779 2558845 2622469 2295161 2384752
5079 2384752 2189729 2190377 2172379 2164675 2244958 2180284 2202373 2267228 2108911 2223142 2380220
5068 2380220 2413320 2430431 2335330 2549462 2662226 2908750 2911611 2906342 2891384 3045322 3132248
5057 3132248 3042775 3146753 3169550 3169800 3192092 3218855 3233141 3004791 2994132 3039160 2965005
5046B965005p5426n712p2808j7537k0936k27421L178n4689J76487M425k76201
5035B398365o4576J47216m9448J81475k61743q8511R2066p889j09991m6683N1336
5024B241617K0919k45652K8115K60169M4448N3175j36367q3072j69787j31625
5014A881940j74982k746P3435Q8296r416j5449q030K14439J02337j26482l46811
5003A676531J37941K14230k33741p0809J2614R3296M6298k7003p2085R8607N2
4992A875931K29391J96594k20625k23415K02847q8212k5968J77773r5812J57067
4982B185571P2422m3319k5218K00006o5843j92248m5914K68796m1423L1109J03066
4971B447005j7146r9461m9396J09546m3318p6837l631J73782L13190N0430j65528
$$ plain form
5046 2965005 2889579 2883867 2811059 2793522 2772586 2545165 2548343 2493654 2670141 2674566 2398365
5035 2398365 2333789 2481005 2431557 2613032 2351289 2262778 2354844 2346955 2236964 2190281 2241617
5024 2241617 2262536 2016884 2044999 2305168 2349616 2402791 2266424 2183352 2013565 1881940
5014 1881940 1706958 1704212 1777647 1865943 1856527 1841078 1833048 2047487 2149824 2023342 1676531
5003 1676531 1814472 2028702 1794961 1724152 1736766 1830062 1876360 1849357 1777272 1875879 1875931
4992 1875931 2105322 2301916 2081291 1857876 2060723 1972511 1946543 2124316 2028504 2185571
4982 2185571 2257993 2214674 2189456 2389462 2323619 2131371 2085457 2354253 2312830 2343939 2447005
4971 2447005 2429859 2330398 2281002 2390548 2347230 2270393 2266762 2440544 2753734 2804164 2638636
4960B638636K095O6672J03638J30867J59807M3829N4605r0092n0168j3397P6629
4949C123121Q2895J24792J27332o4300n6689J0503J95198p6151k8533O4563K38229
4938C740960k6488P7647j0545P1959J8798j26523M5862J20175o0146j2684K52357
4927D091372J6798O3589L3268L4337R991K38006J07568m4255j10627r05K17219
4916D656361n3343j4837J78497p7800K96181K35219q0912R7225J01102L12769
4906E650462L45248K3881J53852N3863l8005p1815J36964K57894M35785J13724
4896G061853J86974P7869K67072K20131J13405m5042J82170K86437K55684L17633
4886H924186O3976J36626L72419K19997K93111K58655L02672O1296K42048J64069
$$ plain form
4960 2638636 2640731 2707403 2811041 2941908 3101715 3145544 3200149 3110057 3059889 3046492 3123121
4949 3123121 3206016 3330808 3458140 3393840 3337151 3347654 3542852 3466701 3438168 3502731 3740960
4938 3740960 3714472 3792119 3781574 3853533 3872331 3745808 3791670 3911845 3851699 3839015 4091372
4927 4091372 4108170 4171759 4205027 4239364 4249355 4487361 4594929 4550674 4440047 4439142 4656361
4916 4656361 4603018 4588181 4766678 4688878 4985059 5220278 5139366 5236591 5337693 5650462
4906 5650462 5995710 6019591 6173443 6227306 6189301 6117486 6254450 6512344 6948129 7061853
4896 7061853 7248827 7326696 7593768 7813899 7927304 7882262 8064432 8350869 8606553 8924186
4886 8924186 8988162 9124788 9497207 9717204 10010315 10268970 10571642 10632938 10874986 11039055
4876A1039055K56596K75954K10174R1397K14773L36726M23699M01007J07054K44012
4866A3600447M22081L68138N06185N24787L82444Q86834O33674P69815Q05341
4857A8899746J147318J239325J514333J630523K030913K258034K488685L000873
4849C4209750L742376M663476N747196O049604N387007K882306k563940o330678
4841E3787097n203678l442867j748530m91617J83252P00480J270671J895726K278939
4832D9229473K700576K454900K232791L096693L736613M976377O668471P901431
4824H2997325P677045O232999J146469k266856L44090M503837P813649J0757792
4816A19206350J4095351J7461477K0263469K2930377K5801867K7461439L2812421
$$ plain form
4876 11039055 11295651 11571605 11781779 11873176 12087949 12424675 12848374 13249381 13356435 13600447
4866 13600447 14022528 14390666 14896851 15421638 15804082 16690916 17324590 18094405 18899746
4857 18899746 20047064 21286389 22800722 24431245 26462158 28720192 31208877 34209750
4849 34209750 37952126 42615602 48362798 54412402 59799409 62681715 60117775 53787097
4841 53787097 48583419 45140552 43392022 42900405 43083657 43784137 45054808 46950534 49229473
4832 49229473 51930049 54384949 56617740 59714433 63451046 68427423 75095894 82997325
4824 82997325 90674370 96907369 98053838 95786982 96131072 100634909 108448558 119206350
4816 119206350 133301701 150763178 171026647 193957024 219758891 247220330 280032751
4809B80032751L7123823L1609934J0147758m1001449p0489432n5294919l6291675
4802A55836791k4349336j6572655j1909704r333416o903106n693974l822590k978156
4794G4273854j621125l54601O77002K000401L561222L980772L232954j034095
4786H4716384p217163r313356q014610o401769m621509l236956k370291k327795
4778D1212935k452186l350753k717627k187482j984407j544020j544845j120364
4770B4311251j053883j165036r84170n18264p16589o77616n50633o07318o29614
4761A7408128m42656k37262m77706l73041k99433m67548n08096l33987j90576
4752A4077823k25816k48793j95285m28182m60476k31620l47743k57462j59435
$$ plain form
4809 280032751 317156574 348766508 358914266 317912817 247423385 192128466 155836791
4802 155836791 131487455 114914800 103005096 93671680 86768574 81074600 77252010 74273854
4794 74273854 72652729 72298128 72975130 74975531 78536753 82517525 85750479 84716384
4786 84716384 77499221 68185865 60171255 53769486 49147977 45911021 43540730 41212935
4778 41212935 38760749 35409996 32692369 30504887 28520480 26976460 25431615 24311251
4770 24311251 23257368 22092332 21108162 20589898 19873309 19195693 18645060 18037742 17408128
4761 17408128 16965472 16728210 16250504 15877463 15578030 15110482 14602386 14268399 14077823
4752 14077823 13852007 13603214 13407929 12979747 12519271 12287651 11939908 11682446 11523011
4743A1523011j48447l48359m89296j52582k24184k43990j90227j46675k99763
4734I279488m25162j52393k39225k56562k6768j48694r9688k55315k43126k7677
4724G404878j29928k08680k6172k05132k11748k38345k5159k32081j36750J76272
4714F167155k50098m89871k21620j1610j63987k17755M8887L80742j81936k42730
4704D817177m1917j48780l8401K8450L509k38367j36272r5354j26130m7346m2568
4693C934001l51248j67620L8602j1657O2006K24343n3321j63783j53949k86429
4683C070945M8005J51989O0708m6032J25122k57354j41946j47708j2532j22090
4673B729107j65863J48916n4968k29814m634M3443N245r7647r3197j16126P2447
$$ plain form
4743 11523011 11374564 11026205 10536909 10384327 10160143 9916153 9725926 9579251 9279488
4734 9279488 8854326 8701933 8462708 8206146 8179378 8030684 7930996 7675681 7432555 7404878
4724 7404878 7274950 7066270 7040098 6834966 6623218 6384873 6359714 6127633 5990883 6167155
4714 6167155 5917057 5427186 5205566 5193956 5029969 4812214 4861101 5241843 5059907 4817177
4704 4817177 4775260 4626480 4588079 4616529 4620038 4381671 4245399 4150045 4023915 3976569 3934001
4693 3934001 3582753 3415133 3453735 3442078 3504084 3728427 3675106 3511323 3357374 3070945
4683 3070945 3118950 3270939 3331647 3285615 3410737 3153383 3011437 2863729 2851197 2729107
4673 2729107 2563244 2712160 2657192 2427378 2422744 2466187 2471432 2373785 2280588 2164462 2236909
4662B236909P8186K6718j8002j4267J89787Q8428P799j01057K9703J88001r0184
4651B622021L2351R4546L0327j55825O728q3783j21816R5353Q1825k0177J40536
4640B722086j56440J1514J30848J05715k74985l7277p2065l5308o4917J53415
4630B482586K2948k4925J13434k0180k02828Q4070k63284k24854K1494j70636
4620A817825K68626J43001R7028j52845J5769j03098J5853O2247j37262j66319
4610A860825K26175J0744N477r2625l8772L31697P4998K4485Q8288l5000l4184
4599B422108j70628j25944L4954Q9604Q0643O1245K7155j97714m32308O1335J72537
4588B022987J59539m9745j1644j29470K06449J99778o2713M727k47271k8854Q1698
$$ plain form
4662 2236909 2315095 2341813 2323811 2309544 2499331 2587759 2595558 2494501 2524204 2712205 2622021
4651 2622021 2654372 2748918 2779245 2623420 2630148 2546365 2424549 2519902 2601727 2581550 2722086
4640 2722086 2565646 2577160 2708008 2813723 2538738 2501461 2429396 2394088 2329171 2482586
4630 2482586 2505534 2480609 2594043 2573863 2371035 2455105 2191821 1966967 1988461 1817825
4620 1817825 2086451 2229452 2326480 2173635 2189404 2086306 2102159 2164406 2027144 1860825
4610 1860825 2087000 2097744 2103221 2010596 1971824 2303521 2378519 2403004 2491292 2456292 2422108
4599 2422108 2251480 2125536 2160490 2250094 2330737 2391982 2419137 2221423 1789115 1850450 2022987
4588 2022987 2182526 2132781 2121137 1991667 2198116 2397894 2335181 2339908 2092637 2063783 2145481
4577B145481j06400J69190j13421j58555j70882j07068k2983R3432j08833J11567
4567A731528o3816o2257J84595j21112P4115l5708j55117k5044j10209o9807R650
4556A356818J36947K66823K8146M2498M8417j05304p7188L7266J21967k209n0739
4545A803442j29118J7490K30198j94966n3130Q8133l7386J13345M1682q716Q2929
4534A953903Q224r961K62310l138J95973r4654j82597L9756O0968j85778j09207
4523A935799Q3203n1986J65999K7352l1807N7778K1175M3889P5085P6932M5955
4512B449374O4833J42207k97856J29426J43780K95765L6150p9966o3470J32981
4502B953224J57051j66499j64399L12791K42276J10231J05949J96653N19974K16424
$$ plain form
4577 2145481 2039081 2208271 2094850 1936295 1765413 1658345 1635362 1728794 1619961 1731528
4567 1731528 1667712 1605455 1790050 1668938 1743053 1707345 1552228 1527184 1416975 1347168 1356818
4556 1356818 1493765 1760588 1788734 1831232 1879649 1774345 1697157 1734423 1856390 1854181 1803442
4545 1803442 1674324 1691814 1922012 1727046 1673916 1762049 1724663 1838008 1879690 1870974 1953903
4534 1953903 1962127 1952166 2214476 2211338 2407311 2312657 2130060 2169816 2230784 2045006 1935799
4523 1935799 2019002 1967016 2133015 2160367 2128560 2186338 2207513 2251402 2326487 2403419 2449374
4512 2449374 2514207 2656414 2358558 2487984 2631764 2927529 2963679 2883713 2820243 2953224
4502 2953224 3110275 2943776 2779377 3092168 3334444 3444675 3550624 3747277 4267251 4483675
4492D483675J10419J99702j06263j15606n9963r4247J272R3376j3320L0022K1996
4481D551063P5087k7656J12025J20033p3367m8754l0887J50902L20880K08890
4471E358216K40584M84540P07843M86324M19201L70646M83696O01061O75773N21648
4461A0349532J9633j28876q53196q74718q92740o80931p68269m21946j53458l12782
4451E282249p1131j32269n8951m2480J41269j6237m5924Q6624K8937R3128K88720
4440E553935K43462J24951K27576M72519L74080M52691P16219Q56315O09457K17177
4430I848382p0755n21703o87068p63632m36787p53044m67651k48765k73434p4380
4420E551163k72419l4041k36027l23482P1982j41616J17898j79051k68740j11774
$$ plain form
4492 4483675 4594094 4793796 4687533 4571927 4511964 4417717 4418989 4512365 4499045 4529067 4551063
4481 4551063 4626150 4598494 4710519 4830552 4757185 4708431 4677544 4828446 5149326 5358216
4471 5358216 5598800 6083340 6791183 7277507 7696708 8067354 8551050 9152111 9827884 10349532
4461 10349532 10369165 10240289 9387093 8512375 7619635 6938704 6170435 5748489 5595031 5282249
4451 5282249 5211118 5078849 5019898 4977418 5118687 5102450 5056526 5143150 5172087 5265215 5553935
4440 5553935 5797397 5922348 6149924 6622443 6996523 7449214 8165433 9021748 9631205 9848382
4430 9848382 9777627 9255924 8568856 7805224 7368437 6615393 6147742 5898977 5625543 5551163
4420 5551163 5278744 5244703 5008676 4685194 4757176 4615560 4733458 4554407 4285667 4173893
4410D173893k95679J02313J29318N6775r2864j68907j0637K3882p4160q0787J45326
4399C908473N1551n8244q8627K16754j03670j02951N1146Q8131K0049J00035Q4829
4388D167476m6600n8664J10017K52876J2593j48027N5418L04687o9288K65136
4378D845624J6074J39643J94187O4642J64821K30194J45474K58156K01169J79212
4368F439196M26175J55539L41018O37386M99028N39007L65733K57636K39252p7459
4358I822511J79265k98565l87795k07635j58217M678k365l5189M119J68399K32259
4347I321465K35989J79905L18858K87011L20468N39345N36894M55238P43778M55681
4337A3394632M94638L39341K67155K84335L42166M59559O24512N74541P55279
$$ plain form
4410 4173893 3878214 3980527 4109845 4166620 4073756 3904849 3894212 3918094 3843934 3763147 3908473
4399 3908473 3960024 3901780 3813153 4029907 3926237 3823286 3874432 3962563 3982612 4082647 4167476
4388 4167476 4120876 4062212 4172229 4425105 4437698 4289671 4345089 4649776 4580488 4845624
4378 4845624 4861698 5001341 5195528 5260170 5424991 5655185 5800659 6058815 6259984 6439196
4368 6439196 6865371 7020910 7361928 7999314 8498342 9037349 9403082 9660718 9899970 9822511
4358 9822511 10001776 9703211 9315416 9107781 8949564 8954242 8951877 8916688 8920807 9089206 9321465
4347 9321465 9557454 9737359 10056217 10343228 10663696 11203041 11739935 12195173 12938951 13394632
4337 13394632 13889270 14228611 14495766 14780101 15122267 15581826 16206338 16780879 17536158
4328A7536158M02811L94561J8905j41050l01526l12323l28833m33749k33304m99087
4318A6102563P712j43433j89243P0903K58087J23064M27815J86004J85817L43458
4308A7372747M50649N44430P26028M15090K29218K22980K83374j58029j02011
4299A9984476J5830q1546J26684j98420j59073J4657j16915k21235k42703n13435
4289A8608320l00470m58089j80823l6382k91289M563K10439J99664n237K6372
4279A7777068R6473M5718J41742J99300l4935l8596k3960j99503l04272k49226
4269A7409809m1755o1019j44024k49137j84933l11193Q013m2367k4132q9350l5105
4258A6234807K0295l3015J36222K68863L72920K80929L71681L30268P34800O13048
$$ plain form
4328 17536158 17938969 18333530 18352435 18211385 17909859 17597536 17268703 16834954 16601650 16102563
4318 16102563 16110275 15966842 15777599 15848502 16106589 16229653 16657468 16843472 17029289 17372747
4308 17372747 17823396 18367826 19093854 19508944 19738162 19961142 20244516 20086487 19984476
4299 19984476 20000306 19918760 20045444 19847024 19687951 19702608 19585693 19364458 19121755 18608320
4289 18608320 18307850 17849761 17668938 17632556 17341267 17345830 17556269 17755933 17750696 17777068
4279 17777068 17873541 17919259 18061001 18260301 18225366 18186770 18162810 17963307 17659035 17409809
4269 17409809 17368054 17307035 17163011 16913874 16728941 16417748 16425761 16383394 16359262 16269912 16234807
4258 16234807 16255102 16222087 16358309 16627172 17000092 17281021 17652702 17982970 18717770 19330818
4248A9330818P34540M61743M55342J74881n80834r05759r17723q69870m84852
4239A7398286k43723K890k46441j98228J60609J01882K23691J06710K57171L89926
4229A7952773Q8878J00247L96007L85782N95952L83759N15363M55757O72586N73670
4219B2120774P27933R88753P27775P87540R95775N09819N95562J001286J008770
4210B9463987Q38299R76264R21625J085638J386502J502140J435952J460647J772168
4201D0843222J546095J344654J741022J948258K111353K888189L491779M414766
4193F0329338N358577N928053P018234Q969161J0387563J2877793J5241226J7797101
4185A43907046K1290391K6245102L3241583M0334255M3934306M0316999K0624182
$$ plain form
4248 19330818 20065358 20527101 20982443 21157324 20576490 19670731 18753008 17883138 17398286
4239 17398286 17154563 17157453 16911012 16712784 16873393 16975275 17198966 17305676 17562847 17952773
4229 17952773 18041651 18141898 18537905 18923687 19519639 19903398 20418761 20874518 21547104 22120774
4219 22120774 22848707 23837460 24565235 25352775 26348550 26858369 27453931 28455217 29463987
4210 29463987 30302286 31278550 32200175 33285813 34672315 36174455 37610407 39071054 40843222
4201 40843222 42389317 43733971 45474993 47423251 49534604 52422793 55914572 60329338
4193 60329338 65687915 71615968 78634202 87603363 97990926 110868719 126109945 143907046
4185 143907046 165197437 191442539 224684122 265018377 308952683 349269682 369893864
4178C69893864j1160218l9419158n1794174m5378625l3507526k4097222j7926233
4171A46610708j3500928j1304350j0169134q595971o863765n888625n287370n073541
4163G9927024m250389l682526l202613k490474j999168j212558n25192K23714
4155F2787818M19028R089o62435l40536M73804J264383J909997L077731M433591
4146G3372470N729090P493068Q224365P177995L129455m140255r033841r312737
4138H2639610q135389p231571o222289n453329m482852l708179l028969k262874
4130D2114158j933814j248862r98685j196105j205010j346360j204104o79605
4122C2301613n87039m92004n62349n87965j075603j257177r56754q07958n82852
$$ plain form
4178 369893864 358733646 319314488 267520314 222141689 188634163 164536941 146610708
4171 146610708 133109780 121805430 111636296 103040325 96176560 90287935 85000565 79927024
4163 79927024 75676635 71994109 68791496 66301022 64301854 63089296 62564104 62787818
4155 62787818 63206846 63215935 62553500 62212964 62686768 63951151 65861148 68938879 73372470
4146 73372470 79101560 86594628 94818993 101996988 105126443 100986188 91952347 82639610
4138 82639610 74504221 67272650 61050361 55597032 51114180 47406001 44377032 42114158
4130 42114158 40180344 38931482 37932797 36736692 35531682 34185322 32981218 32301613
4122 32301613 31714574 31222570 30660221 30072256 28996653 27739476 26782722 25974764 25391912
4113B5391912n61702j17036k2703j35152j85069l7042J11602J82792m36892r73508
4103B3217202j122209j182878j230020q46506n90252n38975o73938m12851l90494
4094A6229079j13895l84304n95990k15714m42893M1215k68459l47268l72518m34807
4084A3094446j84687j01455j18921k99077j86r242l92445j40742q6745l3596P919
4073A1735269j69131J2154n843j18966k25640j21040j72198j80437P5837k4477
4063A0805528m3988L0571P9814k21516p7152J03919L2964N5319j19380k9028j9636
4052A0597415j12145j20623K3286j15698J00065J57783j29741J5103l3213L56038
4042A0738270m2589o6066K88516N40544L0189K04163J25515K14760K84698J21264
$$ plain form
4113 25391912 24830210 24713174 24690471 24555319 24370250 24333208 24444810 24627602 24190710 23217202
4103 23217202 22094993 20912115 19682095 18835589 18245337 17706362 17032424 16619573 16229079
4094 16229079 16115184 15730880 15134890 14919176 14476283 14517498 14249039 13901771 13529253 13094446
4084 13094446 12909759 12808304 12689383 12390306 12390120 12380878 11988433 11847691 11760946 11727350 11735269
4073 11735269 11566138 11578292 11572449 11453483 11227843 11106803 10934605 10754168 10830005 10805528
4063 10805528 10761540 10792111 10871925 10650409 10573257 10677176 10710140 10765459 10646079 10617051 10597415
4052 10597415 10485270 10364647 10387933 10272235 10372300 10530083 10400342 10415445 10382232 10738270
4042 10738270 10695681 10629615 10918131 11458675 11488864 11693027 11818542 12033302 12318000 12439264
4032A2439264J58461L72143L63255R7966N79882O88627Q05356O88748O90914R11665
4022A7796281J559257J427642J585744K319283K535620K540125L383171M397108
4014C7544231M428143L402827Q71323l052444n412334m823433l237900k475786
4006B7244627j476642r86678q64684o49545k63244j47980j53169j62734j52174
3997B2387777N4992K96117M55052P71590R55006J051308J009648J392980J972525
3988C0346995K420535L059339M204264M479517L442144J240270l021579n352438
3980D0819047m681521l206901k317592j278255q72592n85438k14122J93214L62533
3971B8218373L97677M67413J86827J26186R0122P46513J084098J141275J516001
$$ plain form
4032 12439264 12597725 12969868 13333123 13431089 14010971 14699598 15504954 16193702 16884616 17796281
4022 17796281 19355538 20783180 22368924 24688207 27223827 29763952 33147123 37544231
4014 37544231 41972374 45375201 46246524 43194080 37781746 32958313 29720413 27244627
4006 27244627 25767985 24781307 23916623 23267078 23003834 22855854 22702685 22539951 22387777
3997 22387777 22442769 22738886 23193938 23965528 24920534 25971842 26981490 28374470 30346995
3988 30346995 32767530 35826869 40031133 44510650 47952794 49193064 46171485 40819047
3980 40819047 36137526 32930625 30613033 29334778 28462186 27876748 27662626 27855840 28218373
3971 28218373 28616050 29083463 29270290 29396476 29486598 30233111 31317209 32458484 33974485
3962C3974485K005735K210660K802300M183191M627977M034492K547379j923745
3954E4462474n891760o433881m683344k830215j878995j332687q66763n94508
3946B9950321k52481J12371J10320M85814M79425P80194J079935J201379J198080
3937C5145358J610997J675191K113274K553360L170020M410805N502911O062422
3929F2244338N692701K868111k371953o297733o328699n275008m205835k914965
3921D3410957k066349j235987q43372n04642j71566l3696R5113J34673l08887
3912C8476244o8091M13017K58962K24449K11434M61626P85492R76365R07748J087000
3902D3734246J438200J840358K100537K158587K230100J819948J764274J847848
$$ plain form
3962 33974485 35980220 38190880 40993180 45176371 49804348 53838840 56386219 54462474
3954 54462474 48570714 42136833 37453489 34623274 32744279 31411592 30544829 29950321
3946 29950321 29697840 29810211 29920531 30406345 30885770 31665964 32745899 33947278 35145358
3937 35145358 36756355 38431546 40544820 43098180 46268200 50679005 56181916 62244338
3929 62244338 67937039 70805150 68433197 62135464 55806765 50531757 46325922 43410957
3921 43410957 41344608 40108621 39265249 38760607 38589041 38555345 38650458 38785131 38476244
3912 38476244 38408153 38821170 39080132 39304581 39516015 39977641 40763133 41739498 42647246 43734246
3902 43734246 45172446 47012804 49113341 51271928 53502028 55321976 57086250 58934098
3894E8934098K287573K972003K759400L090411K936758K529393K432711K421064
3886H0363411K283952K517018L261007L958877M371073N245549N665116M998006
3878A12664009L396293Q04982j821879k198145o74575O71451J886949J771398
3870A16500483J482532J311617J298912J515622K017590J893705J006858l61889
3862A26665430j482898j816027j614196j485514j321627j338865r86344o94474
3854A15925485M61510P20979L21810j535378m215479n982379o395169n412556
3846I3888823l822467k955407k476482j891325j872240j834484j675310j998601
3838G5362507k231517k092783k352169k291687k061453j496913j171026j153660
$$ plain form
3894 58934098 61221671 64193674 66953074 70043485 72980243 75509636 77942347 80363411
3886 80363411 82647363 85164381 88425388 92384265 96755338 102000887 107666003 112664009
3878 112664009 116060302 116865284 115043405 112845260 112170685 112842136 114729085 116500483
3870 116500483 117983015 119294632 120593544 122109166 124126756 126020461 127027319 126665430
3862 126665430 125182532 123366505 121752309 120266795 118945168 117606303 116619959 115925485
3854 115925485 116386995 117107974 117429784 115894406 111678927 105696548 99301379 93888823
3846 93888823 90066356 87110949 84634467 82743142 80870902 79036418 77361108 75362507
3838 75362507 73130990 71038207 68686038 66394351 64332898 62835985 61664959 60511299
3830F0511299r15333j184749j707289j723190r52563q37782o66790m69680l07646
3821E1746277l29652l04875m31726n84853l33043k15271j50088m79144k86241
3812D8631384n88638r08255n23975p54648l95765p4418k38899k28806p8963r450
3802D4829567K39850K67602J30089L62462l0516O37785M16782M42582L34918J71377
3792D7802498m33227j12544j21838k73895j46855K05037j8657m1713P6905p9585
3782D6856126M7728k55128j73250k38640q4033k73404q2923m67221j94636M3637
3772D5178256l28658j39923k30833r9072j01591k02850j63574n62441o02602n17719
3762D2228993n80629l78430k10836k76618m81270k14565Q7964J91965j23388Q2798
$$ plain form
3830 60511299 59595966 58411217 56703928 54980738 54028175 53190393 52523603 52053923 51746277
3821 51746277 51416625 51111750 50680024 50095171 49762128 49546857 49396769 48917625 48631384
3812 48631384 48042746 47134491 46610516 45855868 45460103 45385685 45146786 44917980 44839017 44829567
3802 44829567 45069417 45337019 45467108 45829570 45799054 46436839 46853621 47296203 47631121 47802498
3792 47802498 47369271 47256727 47134889 46860994 46714139 46919176 46900519 46858806 46935711 46856126
3782 46856126 46903854 46648726 46475476 46236836 46152803 45879399 45796476 45329255 45134619 45178256
3772 45178256 44849598 44709675 44478842 44379770 44278179 44075329 43911755 43349314 42746712 42228993
3762 42228993 41648364 41269934 41059098 40782480 40301210 40086645 40174609 40366574 40243186 40325984
3752D0325984M14296M97502K74177O68950M99373M76037N54208K09755J41582
3743D4061864R6128j92412l15819l28693n99399m27079m39012m66532m84157k32315
3733D0672574k78839m81403n62086l49887l26173j4118k26510k82601k63126n5682
3723C7832149j08273L4056R689K8969L396k48707R3887p9212m7749n8260P0828
3712C7530773J24574n64J68369j69936L04842L15735M37850M11003K08082J64408
3702C9495136K37891L59978J10232K99896J23842J88008k11118r3624M7479l79740
3692D0177980k75960j25884m0334J03420J71600J47120L30136J93864L40073O88750
3682D1710765N26657N74625Q72045J203481J211605Q50266M96445N86766N52793
$$ plain form
3752 40325984 40740280 41237782 41511959 42180909 42680282 43156319 43710527 43920282 44061864
3743 44061864 44157992 43965580 43649761 43321068 42721669 42294590 41855578 41389046 40904889 40672574
3733 40672574 40393735 39912332 39350246 39000359 38674186 38660068 38433558 38150957 37887831 37832149
3723 37832149 37723876 37757932 37767621 37796590 37799986 37551279 37645166 37565954 37518205 37459945 37530773
3712 37530773 37655347 37654783 37823152 37653216 37958058 38273793 38711643 39122646 39330728 39495136
3702 39495136 39733027 40093005 40203237 40503133 40626975 40814983 40603865 40510241 40557720 40177980
3692 40177980 39902020 39776136 39735802 39839222 40010822 40157942 40488078 40681942 41022015 41710765
3682 41710765 42237422 42812047 43684092 44887573 46099178 46949444 47445889 48032655 48585448
3673D8585448P05526J022219R55957J080866J097293J159347P82144Q33914O29129
3664E6851843N22625m4896J5634p0905n30722o99686o74318m84931m17505k86573
3654E4180566o7322K58663L83627O51517R4643k77663o47633r26196p64994p05709
3644E2179499m3669L28979M11567L37972J79354N29688J80447J87559n8143j50124
3634E4083129j52943k8682l99606n15682o93509n90564q72479o89169p30513r71714
3624D8438268n99572m31126q26042j093615r65666j103298j254781q98323n50099
3615D0715746n32480m70689n71209k25271j73610k39071k14815j80091K8593j24212
3605C8012891k30407J3493k79663m39737k49070l05815m68672m51244o73398m79502
$$ plain form
3673 48585448 49290974 50313193 51269150 52350016 53447309 54606656 55388800 56222714 56851843
3664 56851843 57374468 57329572 57345206 57274301 56743579 56043893 55369575 54884644 54467139 54180566
3654 54180566 54113244 54371907 54755534 55407051 55501694 55224031 54576398 53650202 52885208 52179499
3644 52179499 52135830 52464809 52876376 53214348 53393702 53923390 54103837 54291396 54233253 54083129
3634 54083129 53930186 53901504 53501898 52986216 52292707 51702143 50829664 50140495 49409982 48438268
3624 48438268 47838696 47407570 46581528 45487913 44522247 43418949 42164168 41265845 40715746
3615 40715746 40183266 39712577 39141368 38916097 38742487 38503416 38288601 38108510 38137103 38012891
3605 38012891 37782484 37795977 37516314 37076577 36827507 36521692 36053020 35601776 34928378 34448876
3595C4448876m16192n90541n26641l30148n60827n30510k52039n31509m02691
3586C0307778l65642k56101m39222o46155n46465m80928k92007m98687m51260
3577B6331311j00377J95208k96578k47824r8558m03635l33155m050o2206j59942
3567B4820194k33729o8047l34069m00368o05507n41581m22406k58468k66947k37957
3557B1451115k79686j29485O2246l89550k24475l05826j15421k37130m00249m18128
3547A9013411k1552r2333k41532p08604m50725m67526m22754l56167l44550j54763
3537A5752905n71330l07059j45626j9367k75178j82111k4764N2587k17546j28280
3527A3934231r9395O9000n9863l30940j44882k87013l53585k58833k33254j72173
$$ plain form
3595 34448876 34032684 33442143 32915502 32585354 32024527 31494017 31241978 30710469 30307778
3586 30307778 29942136 29686035 29246813 28600658 28054193 27573265 27281258 26782571 26331311
3577 26331311 26230934 26426142 26129564 25881740 25783182 25379547 25046392 25042342 24980136 24820194
3567 24820194 24586465 24518418 24184349 23783981 23178474 22636893 22214487 21956019 21689072 21451115
3557 21451115 21171429 21041944 21104190 20714640 20490165 20184339 20068918 19831788 19431539 19013411
3547 19013411 18991859 18899526 18657994 17949390 17498665 17031139 16608385 16252218 15907668 15752905
3537 15752905 15181575 14874516 14728890 14709523 14434345 14252234 14227470 14280057 14062511 13934231
3527 13934231 13834836 13903836 13843973 13513033 13368151 13081138 12727553 12468720 12235466 12063293
3517A2063293J7067p7872l52503n54383k78226l62940k52094o6119k96130j27634
3507I712459l99971k99216j57081M7730r4478j18380k39869l54572J25362n1321
3497H170663Q3723j81557L7371k12407k01269j42738M9733j77754j97135l462
3487G225168j8570k21641j0352k81k37002j76059l24015q6303k04262O394P9429
3476F032506r4386j67504j73922j66360j46090N2732j14112j82629j1600n9721
3466D968914N3544O7805k18781k49716L3384P9485N7373k73558n4946J08882l1427
3455D540959K8814j38918j00327J5403j03990J62106p2721j60306k12713Q8093
3445D046400n9279M7920M6150n397j94488j79265j04019J44944L2762K6899k9594
$$ plain form
3517 12063293 12080360 12002488 11649985 11095602 10817376 10454436 10202342 10136223 9840093 9712459
3507 9712459 9312488 9013272 8856191 8903921 8809443 8691063 8451194 8096622 8221984 8170663
3497 8170663 8254386 8072829 8110200 7897793 7696524 7553786 7603519 7425765 7228630 7225168
3487 7225168 7206598 6984957 6974605 6974324 6737322 6561263 6237248 6150945 5946683 5953077 6032506
3476 6032506 5938120 5770616 5596694 5430334 5284244 5336976 5222864 5040235 5028635 4968914
3466 4968914 5022458 5090263 4871482 4621766 4655150 4734635 4792008 4518450 4463504 4572386 4540959
3455 4540959 4569773 4430855 4330528 4345931 4241941 4404047 4331326 4171020 3958307 4046400
3445 4046400 3987121 4035041 4081191 4075794 3881306 3702041 3598022 3742966 3775728 3802627 3773033
3434C773033j84262k01629q8315M9530o8632J06233r0382J02887J48147J06186
3424C652796j63329k38229j4880J53842k25206j02003k5846J93481j49792n9239
3414C021595p7035k36746J78399J1092n1124R2603K4616n7851J87237R9832Q1729
3403C274347o9203j96357q3219r1550J27667R1587k25161L2631J28971o2371K24220
3392C151562j46518k92742k24255J34662J26191J44821P100n2737m3189l2244
3382B772651J59078k11653k1919J78059j32330P0957J07592j15085k03262J8990
3372B623078K28129K507j22298j8787J35639j30507j53254o8374J79717J91023
3362B866873j46223N1514n1578j93965j62826J49110K43373J36281p1742j67856
$$ plain form
3434 3773033 3588771 3387142 3298827 3348357 3279725 3385958 3295576 3398463 3546610 3652796
3424 3652796 3489467 3251238 3236358 3390200 3164994 3062991 3037145 3230626 3080834 3021595
3414 3021595 2944560 2707814 2886213 2897305 2846181 2938784 2963400 2905549 3092786 3192618 3274347
3403 3274347 3205144 3008787 2925568 2834018 2961685 3053272 2828111 2860742 2989713 2927342 3151562
3392 3151562 3005044 2712302 2488047 2622709 2748900 2893721 2900821 2848084 2804895 2772651
3382 2772651 2931729 2720076 2698157 2876216 2743886 2814843 2922435 2807350 2604088 2623078
3372 2623078 2851207 2853714 2731416 2712629 2848268 2717761 2564507 2496133 2675850 2866873
3362 2866873 2720650 2772164 2720586 2526621 2363795 2512905 2756278 2892559 2820817 2652961
3352B652961K44223k5347J01474J9173N6591K22928j85467j88739k8234J69238
3342C038801l7000L1150J99613N8348J8168j10772N4242J09038M3660m7531r9809
3331C257908j88719P6747J59171J95085n3924K0512N2147K15317j76539j08675
3321C449030M7108J6654K42800L7134j38755J59436J9050j35877J45677J6799
3311C859056n9129K24050K12078n3307r032R3763L23199M3406l7428N3844j05445
3300D545055Q7476K01779J2223N9257r145K43082J29054Q7050J53906K18343N0751
3289E778831L8124M09899J44557j37577N5427J44954J84800P4889J39196J26472
3279F959572J74858L20955J84917J92930K04417J46641N80251L23082K34471O34055
$$ plain form
3352 2652961 2897184 2871837 2973311 2992484 3049075 3272003 3086536 2897797 2869563 3038801
3342 3038801 3001801 3032951 3232564 3290912 3309080 3198308 3252550 3361588 3405248 3357717 3257908
3331 3257908 3069189 3145936 3305107 3500192 3446268 3466780 3518927 3734244 3557705 3449030
3321 3449030 3496138 3512792 3755592 3792726 3653971 3813407 3832457 3696580 3842257 3859056
3311 3859056 3799927 4023977 4236055 4182748 4173716 4267479 4590678 4634084 4596656 4650500 4545055
3300 4545055 4632531 4834310 4846533 4905790 4896645 5139727 5268781 5355831 5509737 5728080 5778831
3289 5778831 5816955 6226854 6371411 6233834 6289261 6434215 6619015 6693904 6833100 6959572
3279 6959572 7134430 7455385 7640302 7833232 8037649 8184290 8764541 9087623 9322094 9956149
3269I956149L56186L94909O92905P03282O71329O84934Q95499J169130J128717
3260A6653040J089549R05675Q86507M88388n0725l69435o51717r69468j082297
3251A6899517r30551q82107j066397r81556n95996n50865m74975m33064m33729
3242A0550277m44050k75037j86952m80562q8411K545K7474q0394q2358J21546
3232I064078N2471o8717L68639N01629L44110M85111K44783K37853k58704j37683
3222A0833570k05411j56909O0324L8032J28847P2801j81607j41753k49475j01469
3212A0096950J1430q8003p4435j2033k17372l57810J3017l7129j85062M4073j39670
3201I053956J34646M79155J77783R7640K14023O1629J44154M15731K41044l2256
$$ plain form
3269 9956149 10312335 10707244 11400149 12103431 12774760 13459694 14355193 15524323 16653040
3260 16653040 17742589 18648264 19534771 20023159 19972434 19602999 18951282 17981814 16899517
3251 16899517 15968966 15086859 14020462 13038906 12442910 11892045 11417070 10984006 10550277
3242 10550277 10106227 9831190 9644238 9163676 9075265 9077810 9105284 9024890 8942532 9064078
3232 9064078 9116549 9047832 9416471 9918100 10262210 10747321 10992104 11229957 10971253 10833570
3222 10833570 10628159 10471250 10531574 10569606 10698453 10771254 10589647 10447894 10198419 10096950
3212 10096950 10108380 10020377 9945942 9933909 9716537 9358727 9371744 9334615 9149553 9193626 9053956
3201 9053956 9188602 9667757 9845540 9943180 10157203 10218832 10362986 10778717 11019761 10987505
3191A0987505n5921L9347J18757J02375k9624J26087j34264J84912R9456k66295
3181A1172335j33067k48996L0012m1954j22836j26221k90616J5192j33790r032
3171A0111027J14048k77589j32267J5169j15547J89083L3668o9922J3871q7139
3161I794402K273L111n6644j33460l02313J60044J22596l8741m4682M6917l70498
3150I183005K29838K28529K38o5063k1731M6478k12086o6048N3400R1926j83219
3139I285267j98037o8550R9473k17789j63835J9679k39326k62004n2383j99631
3129H002864l78560k7940J47936k88191j32585p3350O5462k06630j34973j13433
3119F860600j3781n591q409o3288L8120p5680k9133P7374j67239L9723J97694
$$ plain form
3191 10987505 10931584 10970931 11089688 11192063 11162439 11288526 11154262 11339174 11438630 11172335
3181 11172335 11039268 10790272 10820284 10778330 10655494 10529273 10238657 10253849 10120059 10111027
3171 10111027 10225075 9947486 9815219 9830388 9714841 9903924 9937592 9867670 9881541 9794402
3161 9794402 9796675 9799786 9743142 9609682 9307369 9467413 9590009 9551268 9506586 9553503 9183005
3150 9183005 9412843 9641372 9641610 9576547 9554816 9601294 9389208 9323160 9376560 9468486 9285267
3139 9285267 9087230 9018680 9118153 8900364 8736529 8756208 8516882 8254878 8202495 8002864
3129 8002864 7624304 7596364 7744300 7456109 7323524 7250174 7315636 7109006 6974033 6860600
3119 6860600 6846819 6841228 6832819 6769531 6807651 6731971 6702838 6780212 6612973 6652696 6850390
3108F850390m2456j35541l2396r4669n01867q9430L5825r3657j48314j09658k17155
3097E421072j74030M1355j14202k60433j49375O5888q7850N6123j68188j76291
3087D454069j240j36943k58103K9114Q1408J0599K697j06301K1294J23860l14325
3076C906129k72414J01810J32603n0168O5276j44673j88021M470p0538j02220
3066C382254j22968l967j00431k64282K3379j60781q8044m2437J16528j52143
3056B587108l9213L26436m2300j71059j66455L2180j46700J28047K0170N0686
3046B578900R1237j27366R2640m8505l89362k46857O1229M574L1968m0306o2197
3035A945955j5518R046j33708o7734J67814j42938m2377M4386j67223l7967K71020
$$ plain form
3108 6850390 6807934 6672393 6639997 6545328 6043461 5954031 5989856 5896199 5747885 5638227 5421072
3097 5421072 5247042 5288397 5174195 4913762 4764387 4830275 4742425 4798548 4630360 4454069
3087 4454069 4452829 4315886 4057783 4086897 4168305 4178904 4181601 4075300 4096594 4220454 3906129
3076 3906129 3633715 3735525 3868128 3817960 3883236 3738563 3550542 3555012 3484474 3382254
3066 3382254 3259286 3255319 3154888 2890606 2913985 2753204 2665160 2622723 2739251 2587108
3056 2587108 2547895 2874331 2832031 2660972 2494517 2526697 2379997 2508044 2528214 2578900
3046 2578900 2670137 2542771 2635411 2586906 2197544 1950687 2011916 2016490 2048458 2008152 1945955
3035 1945955 1930437 1939483 1805775 1738041 1905855 1762917 1720540 1764926 1597703 1559736 1830756
3024A830756n1789o2755r7308j85735N1814L8646o1338O9642K29837L8998J07266
3013A908034k07765l0027N5159k69333n6032N1129l0723j02525r9327J68808j72030
3002A215368K713o002p7040J34666j0316L4070m7712k67980J42338J59441L63
2991A279909j01920n0104l2164K2968o7358j17789R2394q7003j6961L0349Q3212
2980A035533J17353M4913j30660J97226j66664j07866r8162K84493l2724n3516
2970A089926k7372p2906r5535O039R2386l4362m895M0860j35181j85991K53943
2959I26912L8028l4970m5549P0886J06513R9989r3555R6178o2063K90018L5928
2948A428315k70862k735J60651J65271k8863j29121M1100J93199J43993l9163
$$ plain form
3024 1830756 1778967 1716212 1618904 1433169 1484983 1523629 1462291 1531933 1761770 1800768 1908034
3013 1908034 1700269 1670242 1725401 1456068 1400036 1451165 1420442 1317917 1218590 1387398 1215368
3002 1215368 1218081 1212079 1135039 1269705 1259389 1293459 1245747 977767 1120105 1279546 1279909
2991 1279909 1177989 1127885 1095721 1118689 1051331 933542 1025936 938933 921972 952321 1035533
2980 1035533 1152886 1197799 1067139 1264365 1097701 989835 891673 1176166 1143442 1089926
2970 1089926 1062554 989648 894113 900152 992538 958176 953281 994141 858960 672969 926912
2959 926912 964940 929970 884421 955307 1061820 1161809 1068254 1164432 1102369 1392387 1428315
2948 1428315 1157453 1154718 1315369 1480640 1451777 1322656 1363756 1556955 1700948 1661785
2938A661785j19103k28789m1109M1404J59383l2607q3220m7046n0874K18061k1341
2927A456544j73848K1739K36435N259R0918j17155L05637O8854n635L6063m5148
2916A879663R5033K06514j13917k30716j74532Q6214r218j81006m5190k23327
2906A289518K6467l3895j60096K4860L6692J8299O2422J1799P8351j5127j95389
2895A143901q0762j10679K13126Q5898L1537P693j23950P6408J14853k77188o0772
2884A020065Q4062K740J53429k26254M3826j591O6676l11186m8508N179J72832
2873I61270j2727j90896P8330l2687p3782o3732n4271k4222J34035O4095j7517
2862G67896j74870o0781J7776j00243J19845j09727m1798J58758r050n8268l301
$$ plain form
2938 1661785 1542682 1313893 1272784 1314188 1473571 1440964 1357744 1310698 1259824 1477885 1456544
2927 1456544 1282696 1304435 1540870 1546129 1637047 1519892 1825529 1894383 1888748 1924811 1879663
2916 1879663 1974696 2181210 2067293 1836577 1662045 1748259 1739041 1558035 1512845 1289518
2906 1289518 1315985 1282090 1121994 1146854 1183546 1201845 1264267 1276066 1354417 1339290 1143901
2895 1143901 1063139 952460 1165586 1251484 1283021 1290714 1166764 1243172 1358025 1080837 1020065
2884 1020065 1104127 1106867 1260296 1034042 1077868 1076277 1142953 831767 783259 788438 961270
2873 961270 948543 757647 835977 803290 729508 665776 611505 587283 721318 785413 767896
2862 767896 593026 532245 550021 449778 569623 459896 418098 576856 567806 509538 506237
2851E06237Q3998j27179n8959j9219J05771p6471j35550N3931O7657M9403j53017
2840B96602r9278Q4071r207K8169Q7695n4073j07174k1299K8719J5050J00987
2829C50262j98924K51709J67831j38876k30685p9445o7037K5615J68950j2661
2819B36739m3828p321R7619o1556Q0122J1821j12043J17176k76194L90L973k4896
2807B2002O9248L6037j55320Q0164J60253J32449k2962o4832l6204p3111J42996
2796B90720j1675K06804j04535j51739j49986j48386J35623o1229j6414J83865
2786A73048L1338N1859p7259J74006j01201j22648J02066p5632j30532R4419j33297
2775a3833J90980k06015j3154J95335Q8058j87859n8380J23238m1625K08095q4262
$$ plain form
2851 506237 590235 463056 404097 384878 490649 414178 278628 332559 400216 449619 296602
2840 296602 197324 281395 272188 300357 388052 333979 226805 205506 234225 249275 350262
2829 350262 151338 403047 570878 432002 201317 121872 54835 80450 249400 236739
2819 236739 192911 185590 283209 221653 301775 313596 201553 318729 42535 42925 46898 22002
2807 22002 91250 127287 -28033 52131 212384 344833 321871 257039 220835 147724 290720
2796 290720 279045 485849 381314 229575 79589 -68797 66826 5597 -10817 173048
2786 173048 204386 256245 178986 352992 251791 129143 231209 155577 25045 119464 -13833
2775 -13833 177147 -28868 -42022 153313 241371 53512 -4868 118370 76745 284840 200578
2764B00578k23517k819q5030K05051N4716L8138m4249n764o8203j00193j47793
2753a79085R2758J70830l0695l953j83267k504P0415K20377M9619M9681l6038
2742B18138o0466J66J4646l1315Q3866j483k22774K6252l624q365O3477r0730
2730a2212J16370l9560j94874J5923N0208j8653o5242p7494L30416n2259l3301
2719A9322o3874j22410J69470P0611j26722J9218J34714j3178o3555j13696K37045
2708A46945k6519K587J27638J45935j43158k07915R4256k14378K18135L1597j99810
2697b4687N9417K00494j06444j51500j1226l6359Q9105j05326L1725L1444j2189
2686c5546P8299J64454m0725l8370J4293n1891j79595L6499K44715J57315k22346
$$ plain form
2764 200578 -22939 -25758 -110788 94263 148979 187117 142868 137104 68901 -31292 -179085
2753 -179085 -86327 84503 53808 49855 -133412 -135916 -65501 154876 204495 254176 218138
2742 218138 157672 157838 172484 141169 225035 223552 778 27030 23406 15041 78518 -12212
2730 -12212 104158 64598 -130276 -114353 -64145 -82798 -148040 -225534 104882 52623 19322
2719 19322 -44552 -166962 2508 73119 -53603 -34385 100329 87151 23596 -90100 146945
2708 146945 120426 123013 250651 396586 253428 45513 139769 -74609 143526 175123 -24687
2697 -24687 34730 235224 128780 -22720 -33946 -70305 18800 -86526 -54801 -23357 -35546
2686 -35546 42753 207207 166482 128112 142405 90514 -89081 -52582 192133 349448 127102
2675A27102j35328J09746j7855q7488M1055K03933k05287o2188M6737p3662J9627
2664c3608n0225M0928J05709k0794j03897m1460M5262p7036K88527q284j41587
2653C535J04025o4247j28972J14002m2733p8666m7490K66750k6993Q3524j78932
2642C803P5053o2792j90846r6154j6373J09900J61941R7070J43138k89277k1252
2631h5789J35875j45267l3720r4748J75764o7155J12722o834K05829r602k21327
2620c4252r2938O1471j19843R4296L5573r3659J76040o3434R4907N2074j79368
2609f9133J97674k5421J57788k08529j13375J10347l3701R8520J76613j64417
2599A26366m8156p2146k32163L47519Q5210p9891M6913o1196k13787O104K07099
$$ plain form
2675 127102 -8226 101520 83665 -3823 37232 241165 35878 -26310 20427 -53235 -33608
2664 -33608 -83833 -42905 62804 42010 -61887 -103347 -58085 -135121 153406 145122 3535
2653 3535 107560 43313 -85659 28343 -14390 -93056 -140546 126204 99211 182735 3803
2642 3803 78856 16064 -174782 -270936 -287309 -177409 -15468 81602 224740 -64537 -85789
2631 -85789 50086 -95181 -128901 -223649 -47885 -115040 -2318 -9152 196677 187075 -34252
2620 -34252 -127190 -65719 -185562 -91266 -55693 -149352 26688 -36746 58161 110235 -69133
2609 -69133 128541 103120 260908 52379 -60996 49351 15650 114170 290783 126366
2599 126366 78210 6064 -226099 121420 206630 126739 173652 112456 -101331 -95227 111872
2588A11872k66980J30107J10298j80369k7984K08631J35039q3888j31728J04306
2578A09304j28703N5592l227p8620j92011J44879J08653R126K2941j87722J76244
2567C6456J0546J47476n2441k56415K8969J48610R130n9499j40276j02031k8509
2556b57984R2827R1063J6047l5068o5288J44437J21606r725j17999j6589K6865
2545i808k9480r9792O3388P8413j51315J51191P5025K04079j85115k24986p2688
2534b01088J0662L9761l4228K2460J4210J9264Q7018m6031j16757J46135j25855
2523a84449Q5837R6145P946L3166m9572P5721o360J32101O4521p4219j26241J64485
2511B19081j26237k16847o3655R2671J12462l5012p830M1688M9214K4137j8958
$$ plain form
2588 111872 -155108 -25001 85297 -95072 -123056 85575 220614 136726 4998 109304
2578 109304 -19399 36193 32966 -45654 -237665 -92786 15867 24993 47934 -139788 36456
2567 36456 47002 194478 142037 -114378 -85409 63201 72331 12832 -127444 -229475 -257984
2556 -257984 -165157 -74094 -58047 -93115 -158403 -13966 107640 97915 -20084 -36673 -9808
2545 -9808 -39288 -139080 -75692 2721 -148594 2597 77622 281701 96586 -128400 -201088
2534 -201088 -190426 -150665 -184893 -162433 -148223 -128959 -41941 -87972 -204729 -58594 -184449
2523 -184449 -98612 -2467 5479 38645 -10927 64794 58434 190535 255056 180837 54596 219081
2511 219081 92844 -124003 -187658 -94987 17475 -17537 -25367 16321 65535 89672 70714
2500G0714R788M3506m5936p5637N7153k2407k0407j0354k07231K0593J03336J77774
2488A00892L7633p6030P647K9447O4592o0760P8788q8225j4118M5204o1314O4567
2476A28323p3513j58151k0465J49818J52538j30085J01440Q5485k22249p0976
2466e7835K5415J70454j59039r6414p6703K73409j23200j11431M8539Q622m0961
2455a39144K4982K16027j45974K40175J15408j81076K2453L900m4960K459J72198
2444B86448Q335j29094O6528m0479j28967L661O6363N1977j62741j4146J85107
2433A92992q519j21343j57017k24560N8070J95440J19976R8710J1184J68141j29335
2422B03739j43662j54825J37082J34802J87423j93817k66601L7586J06035o4597
$$ plain form
2500 70714 80502 124008 78072 2435 59588 37181 16774 6420 -200811 -180218 -76882 100892
2488 100892 138525 62495 70142 99589 164181 103421 182209 93984 79866 125070 63756 128323
2476 128323 54810 -103341 -123806 26012 178550 48465 149905 235390 13141 -57835
2466 -57835 -32420 138034 -21005 -117419 -194122 79287 -43913 -155344 -106805 -98183 -139144
2455 -139144 -114162 101865 -44109 196066 311474 130398 152851 156751 111791 114250 286448
2444 286448 294783 165689 232217 191738 62771 66432 132795 184772 22031 7885 192992
2433 192992 184473 63130 -93887 -318447 -260377 -64937 55039 153749 164933 333074 203739
2422 203739 60077 -94748 42334 177136 364559 170742 -95859 -58273 47762 -16835
2412a6835P6615K17719m50336p298L06888N0194J64888j70332l1532m5810j3315
2401H0846k30693j14612K61716n2645j47609K34001J43651J79581r5804M7777
2391C06209p767j60713L25666J0881n2404r3822j5142Q0760n0321R5105k8220
2380D10232j46369j5096m4152j11538j95782J69635l2036J26186k36667j39729
2370b15316J06160J99010r4540L6053K50387j64403P0402k0168k15616j7446o1425
2359a26902K03783J83497k32379K19108P2409j84109m9454j46699P0046J37951
2349A47251J42426R4935j42011j30454K9386j4671L359k40010j21847L3537j40024
2338c38123J84848J46887J7567K72069O4q5338r6104J35356l643M199m5692j29887
$$ plain form
2412 -16835 59780 277499 -172837 -180135 126753 176947 341835 171503 139971 94161 80846
2401 80846 -149847 -264459 -2743 -55388 -202997 31004 174655 354236 258432 306209
2391 306209 298442 137729 463395 474276 421872 328050 312908 393668 343347 438452 410232
2380 410232 263863 248767 204615 93077 -102705 66930 34894 161080 -75587 -215316
2370 -215316 -109156 89854 -4686 31367 281754 117351 187753 167585 -48031 -65477 -126902
2359 -126902 76881 260378 27999 247107 319516 135407 85953 -60746 9300 147251
2349 147251 289677 384612 242601 112147 141533 126862 130221 -109789 -231636 -198099 -338123
2338 -338123 -153275 -6388 11179 283248 283312 197974 101870 237226 233583 237782 192090 62203
2326F2203P9343k3001N7703J62235j15083m897J15094q3815j6225K4156j39690
2315A18023j74219L9031J00671K52610m8776j54706J12923m7716k78677J96574
2305A15738J7438m191Q4584j40894J54231P0756j96039n2375R338O91k7803J6956
2293D8430L8223k00166J44084J52022j23997M6407j9937L3454j03251j31212p477
2282a23420J19866J46341J43270j48289R1123K1444R7887l7955k43656K38946
2272C05557l8701j58524p3046O9970J08036k2618p2140J50317o3784J20146r4366
2261B30847J33151R2356K7366R144j59691O5934R9585J2054p1825k3833K14744
2250F29832P1837j87406j65721O9466m3192J19704M0006L8641P4272p7942j6360
$$ plain form
2326 62203 141546 118545 176248 338483 223400 218503 333597 249782 233557 257713 118023
2315 118023 -56196 -17165 83506 336116 287340 132634 245557 197841 -80836 115738
2305 115738 133176 128985 213569 72675 226906 297662 101623 49248 58586 59277 31474 48430
2293 48430 86653 -113513 30571 182593 58596 105003 85066 118520 15269 -115943 -123420
2282 -123420 -3554 142787 286057 137768 228891 250335 348222 310267 66611 305557
2272 305557 266856 108332 35286 105256 213292 190674 118534 268851 205067 325213 230847
2261 230847 363998 456354 483720 492864 333173 399107 498692 510746 438921 415088 629832
2250 629832 701669 514263 348542 418008 374816 494520 534526 573167 647439 569497 553137
2239E53137J5751J66303r9349l4163j76825Q5946K5113j07441K01665j38527j647
2228D89963O3142j46691J00686j03277J85731P6211q1180o2590P1595j43472J8704
2217D68822O4461J06740J0486J09843j95638K13846L8190N6314J40087J52924
2207A166075j25047p2062J6089m0043K14306k9897j56244K50915R417L7048j50821
2196A119736j03976K48775j96515P8002O4360J08734p3884M8923K26013q5771
2186A434397K21718L4776p9682J11831j60378K12410q2711k673K25886l4719n9490
2175A821365N1951J08797j27789N5041K22322M0463K3592j16039J25743J39521
2165B344967J55206k376K93828J60500L4050n3413K39656J86908L66394M7435
$$ plain form
2239 553137 568888 735191 635842 601679 424854 510800 535913 428472 630137 491610 489963
2228 489963 553105 406414 507100 403823 589554 665765 584585 521995 593590 450118 468822
2217 468822 533283 640023 650509 760352 564714 778560 816750 873064 1013151 1166075
2207 1166075 1041028 968966 985055 945012 1159318 1129421 973177 1224092 1233509 1270557 1119736
2196 1119736 1015760 1264535 1068020 1146022 1210382 1319116 1245232 1294155 1520168 1434397
2186 1434397 1656115 1690891 1611209 1723040 1562662 1775072 1692361 1689688 1915574 1880855 1821365
2175 1821365 1873316 1982113 1854324 1909365 2131687 2172150 2195742 2079703 2205446 2344967
2165 2344967 2500173 2497797 2791625 2952125 2986175 2932762 3172418 3359326 3725720 3773155
2155C773155p436L89907k0559P6423J99756K21511J26638L81858L28481K41263
2145E710997N09575J97984K69177L01134L90051N93519L41803L51726M20817L88836
2135I475619J084837J153469J041977J029655Q01990J101949J782839K079371
2127A9551706K645228L583183M232072M779273N866462P613827J0506470J3093236
2119G1871457J2479263J0564476j144674j9304288j9785242j2048564p679336
2112C4953092n321094l899274l054982k271873j904179j760728j206676p29156
2104A4805130m82494p51429p14836j194668j071780r11718p21159p69879o05283
2095G581884o81928l68993l53772j82416r0865j01427k68258l69694m00950k20314
$$ plain form
2155 3773155 3765719 4155626 4135067 4211490 4411246 4632757 4759395 5141253 5469734 5710997
2145 5710997 6220572 6418556 6687733 6988867 7378918 7972437 8314240 8665966 9086783 9475619
2135 9475619 10560456 11713925 12755902 13785557 14587547 15689496 17472335 19551706
2127 19551706 22196934 25780117 30012189 34791462 40657924 48271751 58778221 71871457
2119 71871457 84350720 94915196 93770522 74466234 54680992 42632428 34953092
2112 34953092 29631998 25732724 22677742 20405869 18501690 16740962 15534286 14805130
2104 14805130 14322636 13571207 12856371 11661703 10589923 9678205 8957046 8187167 7581884
2095 7581884 6899956 6530963 6177191 5994775 5903910 5802483 5534225 5164531 4763581 4543267
2085D543267l11836k71362m903l19602j84013l5875Q959K95279k41021l28469
2075C150424j45978n4288j15614J4797r19q4397J42135j82518j25627L0112O4910
2064B693037n7019k60327K4424r631r5656k00582m6314J25896j58584m2715m0190
2053A932339j92117N0068p5043K00526j11745j97115O350j02116J30016O1023
2043A702186k77603j10948r2699K59072k52065m3702J65892j44600j54519M6475
2033A097489R4055R3881p0289j85105J9568K8434R462j6645j87424k3514o3013
2022G96899n5763n3013l9240n4413Q4385P5009j55454Q5917k8210N3696Q0716
2011G90529k6007j73935j41454J19712J67512M5670l6443j04831k58223M4175
$$ plain form
2085 4543267 4231431 3960069 3955166 3635564 3451551 3415676 3424635 3719914 3478893 3150424
2075 3150424 3004446 2950158 2834544 2849341 2848422 2764025 2906160 2723642 2598015 2628127 2693037
2064 2693037 2636018 2375691 2400115 2390484 2294828 2094246 2047932 2173828 2015244 1972529 1932339
2053 1932339 1740222 1790290 1715247 1915773 1804028 1606913 1613263 1511147 1641163 1702186
2043 1702186 1424583 1313635 1220936 1480008 1227943 1184241 1350133 1205533 1051014 1097489
2033 1097489 1191544 1285425 1215136 1030031 1049599 1078033 1087495 1070850 883426 859912 796899
2022 796899 741136 688123 648883 594470 678855 753864 598410 684327 656117 709813 790529
2011 790529 764522 590587 449133 568845 736357 782027 745584 640753 382530 426705
2001D26705J7896q6437r3661J04697J81748O4801q668j85580r697M693K09463
1990F25960j06646p9940Q2813R1427L8029j93253m9078J2007k75965K48880j69547
1979B24687r4074r7394K06927O9605k0375k468N7986N3264j53025P1137Q4162
1968D00432k17851m6474J28683J20570O725o7954j34819K3251L05626J49896j88776
1957D79309M7725m5113j83986r5152J04512M6096k03047n5790J61197J84382O7530
1946E07663l08262l3412L06624o6876p6598j05525K59776Q0035k61662p4458R3685
1935C20990o0599o2054K39778j0471k13120J8383l905k7333j389Q2622q1828N8711
1923B59785P4949j46031p8605J05441l3940o3975n4263J18276K6990k8991j97467
$$ plain form
2001 426705 444601 358164 264503 369200 550948 615749 607081 421501 411804 416497 625960
1990 625960 519314 439374 522187 613614 651643 458390 409312 421319 145354 394234 224687
1979 224687 130613 33219 240146 309751 289376 286908 344894 398158 245133 316270 400432
1968 400432 182581 136107 264790 385360 392085 324131 189312 212563 518189 668085 479309
1957 479309 527034 481921 297935 202783 307295 353391 150344 94554 255751 440133 507663
1946 507663 199401 165989 472613 405737 329139 223614 483390 563425 301763 227305 320990
1935 320990 260391 198337 438115 427644 214524 232907 229002 201669 200280 282902 201074 259785
1923 259785 334734 188703 110098 215539 181599 117624 63361 181637 208627 179636 -17831
1912a7831j81128J94774M4097J1314P7310j01585k4578N0769J11628n3451K244
1901A13563k1504j58244J96769L81K52043N0280m06555P8692O2364j6237K5282
1890A76834N1435R4900o7134k55482n503K56568M5417L9989J8472J1483j26030
1879B40949q8605o2106j01624R0510K6716j22358j83281K8911O8365J77242J92537
1868B67256j75203j75607o11K60540L4808k12793J11839k097k8128r039J29948
1857B00913K0809J02424r6192k5959J68723K23989m9613Q0292j43253m143Q5979
1846E63969j35146k12896r1028l2835O8742n9511O3182J09591l29542J51534Q3852
1835A79912j82816K32342K93294j57469p7830j5593j24536p0736m4046r3702K22741
$$ plain form
1912 -17831 -198959 -4185 39912 51226 128536 26951 2373 53142 164770 111319 113563
1901 113563 92059 -66185 130584 130965 383008 433288 26733 105425 167789 151552 176834
1890 176834 228269 323169 256035 553 -4950 251618 297035 337024 355496 366979 240949
1879 240949 152344 90238 -11386 79124 105840 -16518 -199799 -170888 -102523 74719 267256
1868 267256 92053 -83554 -84165 176375 211183 -1610 110229 108132 80004 70965 200913
1857 200913 221722 324146 227954 201995 370718 594707 545094 625386 482133 477990 563969
1846 563969 428823 215927 124899 92064 160806 101295 164477 274068 -55474 96060 179912
1835 179912 -2904 229438 522732 365263 287433 271840 147304 76568 32522 -61180 161561
1824A61561q1365K388k8549K1147J90666P899j67350j02630p6291M3176J21131
1813I1783o718m1066L5017P3065J00357j70166j44614J1283J32005j49881k65410
1802c34345K49637j6705K7003Q0379R8155o5057o0135J88273M9937J6459j65776
1791F7825R6777n9642m3188m9104J6243J7255J064J8351M2465J46315k12520j12448
1779g0607j4756L48441j29077k8044M3791k59676J11166J53614L864j63985j55019
1768a60288k6787M8224P9732J84231n5361j62587k0593M186k31029Q1322O8340
1757a90610J55475J81988k10818r771n656J17357q4546l0151J35551o7925p5451
1746h4557K2549J82734j85354M5077K15475j4607j68891R3111R633j80416j01224
$$ plain form
1824 161561 80196 82584 54035 75182 265848 273747 106397 3767 -72524 -29348 91783
1813 91783 85065 43999 79016 152081 252438 82272 -62342 -51059 80946 -68935 -334345
1802 -334345 -84708 -101413 -74410 5969 104124 39067 -21068 167205 217142 233601 67825
1791 67825 164602 104960 61772 12668 28911 46166 47230 65581 108046 254361 41841 -70607
1779 -70607 -85363 263078 134001 105957 149748 -109928 1238 154852 158716 -5269 -160288
1768 -160288 -187075 -138851 -59119 125112 69751 -92836 -113429 -109243 -340272 -258950 -190610
1757 -190610 -35135 146853 -63965 -73736 -79392 37965 -46581 -76732 58819 -9106 -84557
1746 -84557 -62008 120726 -64628 -19551 195924 181317 12426 105537 115170 -65246 -166470
1735a66470K84635P4091k42103J22075J8356j58632Q1575J31521Q7601O6232j56267
1724A42614k3673j69276P830O2215j06666k938Q4741j48411J67382P7287M4137
1713A35242j54115k3247K72868j24452o1405R0122N6544l3754j19997j50511J0296
1702a02409O5183j0336J39249J617Q5917j218l18795K59481n4166J1681Q9622
1691A65826k57340j27685J99630k152L0108k08120j8274K85950o0662J3616k21302
1680b00405J12128N1689k9433l2731L2805j589J28933P1145j23313l8765J1413
1669a8123J75105j40090n5563k271R0112R7714O0776k43999j48342K71800m5509
1658D1610n8832R4075o3352j50662R5442O9082Q8045r0366R0925j73922n5444
$$ plain form
1735 -166470 118165 192256 -49847 72228 90584 -68048 13527 145048 232649 298881 142614
1724 142614 118941 -50335 -42505 19710 -86956 -89894 -5153 -153564 13818 91105 135242
1713 135242 -18873 -42120 230748 106296 44891 135013 191557 157803 37806 -112705 -102409
1702 -102409 -37226 -47562 91687 93304 179221 178003 -140792 118689 64523 76204 165826
1691 165826 -91514 -219199 -19569 -21721 8387 -199733 -218007 67943 7281 20897 -200405
1680 -200405 -88277 -36588 -66021 -98752 -65947 -67536 61397 132542 9229 -29536 -18123
1669 -18123 156982 16892 -38671 -40942 49170 146884 207660 -36339 -184681 87119 41610
1658 41610 -17222 76853 13501 -137161 -41719 27363 115408 25042 115967 -57955 -113399
1647a13399P372M8757K0877j79724K22726O4903M9314N2633L2292k01228L6221
1636D0744m4129m4070N6396K1912q349k5135J31947j31482j85330J03160j9486
1625a03822M7821K87456j53312k41154L3752j21599J35413k7557k6453P6941q8882
1614a81396J27580J6043j27829k1945Q6042J19025J56055j00953R301q2328K5073
1603B4668P520j60974r1956P1346j64842m116J21740J83988k4265K27717J039
1592A91865n0240j20184N134q9603j170N7949k45674K1827K01945K07871j62506
1581A7214Q1402j67697J55046J87880k05698M3619j09769j73136N8568l6399n336
1570a54306o0037J23420r4914J88499j17158J4207K26850o7423j25256J05688
$$ plain form
1647 -113399 -106027 -57270 -36393 -216117 6609 71512 120826 173459 205751 4523 40744
1636 40744 -3385 -47455 8941 30853 22504 -2631 129316 -2166 -187496 -84336 -103822
1625 -103822 -56001 231455 78143 -163011 -129259 -250858 -115445 -143002 -169455 -92514 -181396
1614 -181396 -53816 -37773 -165602 -187547 -101505 17520 173575 72622 81923 -405 24668
1603 24668 32188 -128786 -220742 -149396 -314238 -318354 -196614 -12626 -36891 190826 191865
1592 191865 141625 21441 26575 -63028 -64198 -6249 -251923 -230096 -28151 179720 17214
1581 17214 98616 -69081 85965 273845 68147 111766 1997 -171139 -112571 -148970 -154306
1570 -154306 -214343 -90923 -185837 2662 -114496 -100289 126561 59138 -66118 39570
1560C9570j06478j80447M0610J04947M475Q9188Q3531p9572K7052O7687j3786
1549G6777q4596M3305O5844n0612j40811j76903J67335N3401J60196L554q2120
1538C5370j84108m8407J39816j44267Q5239l073n2750Q1774J76911r3495r3059
1527a00049J88388j60661j2986P0135q5926K23460J80209p9267l80639J83569
1517B6233l3119J101J10076M0048q6849M2460M1446m7632K5270k9827O7785n5818
1505A01174k11471J85948k2975K0700J29215r1098l627P1450o2974l6643k6524
1494E3175p8552Q398j22567k1923K97020l5681N7978k2835k6291p1052J6960J67313
1482B21943q0350j80888K5312j3293p8706j14060J14562J70041j97107k1704r6798
$$ plain form
1560 39570 -66908 -247355 -206745 -101798 -97323 -8135 75396 -4176 22876 90563 76777
1549 76777 -7819 35486 101330 50718 -90093 -266996 -99661 -46260 113936 117490 35370
1538 35370 -148738 -197145 -57329 -201596 -116357 -119430 -172180 -90406 86505 -6990 -100049
1527 -100049 88339 -72322 -85308 -15173 -101099 122361 302570 223303 -157336 26233
1517 26233 -6886 -5785 104291 144339 57490 99950 141396 93764 119034 89207 156992 101174
1505 101174 -110297 75651 52676 73376 202591 111493 107866 179316 116342 79699 53175
1494 53175 -25377 -16979 -139546 -161469 135551 99870 157848 135013 108722 37670 54630 221943
1482 221943 141593 -39295 -13983 -27276 -105982 -220042 -105480 64561 -132546 -154250 -251048
1471b51048J40976j34082n7416K47287K47657k29433k08070Q4395J16280k1332
1461f4786J01063J89490k99772j70612N5832O2280J66993j94649O242K4230o9293
1450a92982J1373J06819J48110Q6013j44592j35637J60254J10437j43832j00586
1440i4623l4594J30598O0962j50372Q4188R0281R92q6152J3428K01037q8741j20101
1428F903J3719J16539o4418r3614N8013j34808o3691J15055N9744j4319o4423
1417f5300j13610k2605J32282j9366m2411J10691J69602M9667j7566j39529l3161
1406H694j96786l3931K20277J65110j46059j2480J14232j82421J28001k03965
1396a39328R538p1810j5322L9575L6028L2071r7885Q379l4940O303J05279l6164
$$ plain form
1471 -251048 -110072 -244154 -301570 -54283 193374 -36059 -244129 -159734 -43454 -64786
1461 -64786 36277 225767 -74005 -244617 -188785 -126505 40488 -154161 -147919 -123689 -192982
1450 -192982 -181609 -74790 73320 159333 14741 -120896 39358 149795 5963 -94623
1440 -94623 -129217 1381 62343 -88029 -3841 86440 87432 1280 14708 215745 127004 6903
1428 6903 20622 137161 72743 -20871 37142 -97666 -161357 -46302 13442 -877 -65300
1417 -65300 -178910 -201515 -69233 -88599 -131010 -20319 149283 198950 181384 41855 8694
1406 8694 -188092 -222023 -1746 163364 17305 4825 119057 -63364 64637 -139328
1396 -139328 -129790 -201600 -216922 -177347 -141319 -109248 -207133 -198754 -233694 -227391 -122112 -158276
1384a58276m4860n1253J03282k7765J9877J87195J9106j98956m2561J36840j0526
1373f7897r964Q2824J45634q3945j69035o3949L03620n5556l8433k9185j12011
1362i7897k1056q5227J51177M0543J42256R284k69923P613N4953o8464o5974L6364
1350a66351M3009L1373J54232m8423k0639J41664k8531l35912J10080K28217M990
1339A13709N0862l8894k64440J50716q6638k26289J93785P9704r0857Q2712J90230
1328A54600N565q8121j91903r5241K06567l3872j78491J14777J3183q6031L16293
1317A37326J59332K5521p7005j97617J11434L5514O4441l23341j58167K21624
1307i38k5951Q3233K05664j88304o3169j3012r721J45435l2564k1211L8818J31554
$$ plain form
1384 -158276 -203136 -254389 -151107 -178872 -158995 28200 47306 -151650 -194211 -57371 -67897
1373 -67897 -77861 4963 150597 66652 -102383 -166332 137288 81732 43299 14114 -97897
1362 -97897 -118953 -204180 -53003 -12460 129796 139080 -130843 -123230 -68277 -136741 -202715 -166351
1350 -166351 -123342 -91969 62263 13840 -6799 134865 106334 -229578 -119498 108719 113709
1339 113709 164571 125677 -138763 11953 -74685 -300974 -107189 -27485 -118342 -35630 154600
1328 154600 160165 72044 -119859 -215100 -8533 -42405 -220896 -106119 -92936 -178967 137326
1317 137326 296658 322179 245174 47557 158991 194505 258946 -64395 -222562 -938
1307 -938 -26889 56344 262008 73704 10535 -2477 -12198 133237 100673 79462 118280 249834
1295B49834k5610j24697j08932Q343l241J7991N2306n7516m3231j05289N7119
1284h2923p2872J82778P32o1214l748J47990r7162m2644L8343J25616K9656j73071
1272h519j85956J07691l685L8245J42899j65074J49796k6019j50358R9057J69628
1261A67705j38419Q6106r2695r2835m5491K46738K53861k06082j93930N3045n4091
1250a6088J21574M2600o0500K6783M0180p5025j00360P7979K28215j19389o0499
1239A05470K47k383k3427p9187P8127j72471Q1849k02232P5835P5524N6928j15232
1227a20952O1273j27888J23534J6157n8754J30953j44717K7477J11087j18765
1217a00595p4786J18747O6184p9915o8515K18663J01758j20564p3193K54275n4597
$$ plain form
1295 249834 224224 99527 -9405 -1062 -4303 13688 65994 8478 -34753 -140042 -82923
1284 -82923 -155795 26983 27715 -33499 -37247 110743 13581 -29063 9280 134896 164552 -8519
1272 -8519 -194475 -86784 -90469 -52224 90675 -74399 75397 49378 -100980 -1923 167705
1261 167705 29286 115392 22697 -70138 -115629 131109 384970 178888 -15042 38003 -16088
1250 -16088 105486 148086 87586 114369 154549 79524 -20836 57143 285358 165969 105470
1239 105470 105717 103334 79907 720 78847 -93624 -11775 -214007 -138172 -62648 -5720 -120952
1227 -120952 -59679 -187567 -64033 -47876 -106630 24323 -120394 -92917 18170 -100595
1217 -100595 -175381 -56634 9550 -70365 -138880 79783 181541 60977 -12216 242059 187462
1206A87462j00388K7323k419j73788J4050r3995K86393l1535k56605J49673J14325
1195A20496j04343k31438P3601l4141J68832m5148R5738M2164k21862M6890J49494
$$ plain form
1206 187462 87074 114397 111978 -61810 -47760 -141755 144638 113103 -143502 6171 120496
1195 120496 16153 -215285 -141684 -175825 -6993 -52141 43597 85761 -136101 -89211 60283
$$ [...]
##END NTUPLES=NMR SPECTRUM
##END=
