##TITLE=1H_EC-3265(III-12)
 CDCl3
 8 sc, 
 8.02.2022
##JCAMPDX= 6.0         $$ Bruker NMR JCAMP-DX V2.0
##DATA TYPE= NMR SPECTRUM
##DATA CLASS= NTUPLES
##ORIGIN= UXNMR, Bruker Analytische Messtechnik GmbH
##OWNER= root
$$ XWIN-NMR		Version 3.5
$$ Tue Feb  8 12:47:43 2022 Russian Standard Time (UT+4h)  she@DPX200
##.OBSERVE FREQUENCY= 200.131346
##.OBSERVE NUCLEUS= ^1H
##.ACQUISITION MODE= SIMULTANEOUS
##.ACQUISITION SCHEME= undefined
##.AVERAGES= 8
##.DIGITISER RES= 18
##SPECTROMETER/DATA SYSTEM= spect
##.PULSE SEQUENCE= zg30
##.SOLVENT NAME= CDCl3
##.SHIFT REFERENCE= (INTERNAL, CDCl3, 0, 15.7215)
##AUDIT TRAIL= $$ (NUMBER, WHEN, WHO, WHERE, WHAT)
$$ ##TITLE= Audit trail, XWIN-NMR		Version 3.5
$$ ##JCAMPDX= 5.01
$$ ##ORIGIN= Bruker BioSpin GmbH
$$ ##OWNER= she
$$ F:/spectra/data/she/nmr/H-F/1/pdata/1/auditp.txt
$$ ##AUDIT TRAIL=  $$ (NUMBER, WHEN, WHO, WHERE, WHAT)
(   1,<2022-02-08 12:44:59.81 +0400>,<she>,<DPX200>,
      <created by zg, POWCHK disabled, PULCHK disabled
       configuration hash MD5:
       00 E9 B6 7A A2 85 ED C7 34 08 36 98 17 FE 4E 26
       data hash MD5: 16K
       C4 AB 8E A4 14 80 F8 50 67 C2 19 80 05 07 A8 19>)
(   2,<2022-02-08 12:45:03.93 +0400>,<she>,<DPX200>,
      <Start of raw data processing
       efp BC_mod = 2 LB = 0.24 FT_mod = 6 PKNL = 1 PHC0 = -15869.84 PHC1 = 11.20078 SI = 16K 
       data hash MD5: 16K
       6F EC 0B C9 D7 3C 0C 2C D2 02 93 6D 41 FA 86 55>)
(   3,<2022-02-08 12:45:28.07 +0400>,<she>,<DPX200>,
      <pk PHC0 = 0.3993909 PHC1 = 0.1999998 
       data hash MD5: 16K
       D1 3A 43 65 3D E5 9E F8 99 9C B5 B8 6A 01 74 4B>)
(   4,<2022-02-08 12:45:33.48 +0400>,<she>,<DPX200>,
      <abs ABSG = 5 
       data hash MD5: 16K
       54 E6 3C 8D F8 28 D3 D6 91 A2 7E ED FD 8F 82 E5>)
$$ ##END=
$$ 
$$ hash MD5
$$ 29 0F 97 3B 8C C3 B9 E9 08 59 F4 4B 53 4B 2F C4
##$RELAX= 
##$RELAX= 
##$RELAX= 
##$RELAX= 
##$RELAX= 
##$RELAX= 
$$ Bruker specific parameters
$$ --------------------------
##$DU= <F:/spectra>
##$EXPNO= 1
##$NAME= <H-F>
##$PROCNO= 1
##$TYPE= <nmr>
##$USER= <she>
##$AMP= (0..31)
100 100 100 100 100 100 100 100 100 100 100 100 100 100 100 100 100 100 
100 100 100 100 100 100 100 100 100 100 100 100 100 100 
##$AQSEQ= 0
##$AQ_mod= 1
##$AUNM= <au_zg>
##$AUTOPOS= <>
##$BF1= 200.13
##$BF2= 200.13
##$BF3= 200.13
##$BF4= 200.13
##$BF5= 200.13
##$BF6= 200.13
##$BF7= 200.13
##$BF8= 200.13
##$BYTORDA= 1
##$CFDGTYP= 0
##$CFRGTYP= 5
##$CHEMSTR= <none>
##$CNST= (0..31)
1 1 145 1 1 1 1 1 1 1 1 1 1 1 1 1 1 1 1 1 1 1 1 1 1 1 1 1 1 1 1 1 
##$CPDPRG= <>
##$CPDPRG1= <>
##$CPDPRG2= <>
##$CPDPRG3= <>
##$CPDPRG4= <mlev>
##$CPDPRG5= <mlev>
##$CPDPRG6= <mlev>
##$CPDPRG7= <mlev>
##$CPDPRG8= <mlev>
##$CPDPRGB= <>
##$CPDPRGT= <>
##$D= (0..31)
0 1.2 0 0 0 0 0 0 0 0.06 0 0.03 0 0 0 0 0.0002 0 0 0 0 0 0 0 0 0 0 0 0 
0 0 0 
##$DATE= 1644309899
##$DBL= (0..7)
120 120 120 120 120 120 120 120 
##$DBP= (0..7)
150 150 150 150 150 150 150 150 
##$DBP07= 0
##$DBPNAM0= <>
##$DBPNAM1= <>
##$DBPNAM2= <>
##$DBPNAM3= <>
$$ [...]
##$SUBNAM2= <"">
##$SUBNAM3= <"">
##$SUBNAM4= <"">
##$SUBNAM5= <"">
##$SUBNAM6= <"">
##$SUBNAM7= <"">
##$SUBNAM8= <"">
##$SUBNAM9= <"">
##$SW= 18.0517287032376
##$SWIBOX= (0..15)
0 0 2 0 0 0 0 0 0 0 0 0 0 0 0 0 
##$SW_h= 3612.71676300578
##$TD= 16384
##$TD0= 1
##$TE= 0
##$TE2= 300
##$TE3= 300
##$TEG= 300
##$TL= (0..7)
0 120 120 120 120 120 120 120 
##$TP= (0..7)
150 150 150 150 150 150 150 150 
##$TP07= 0
##$TPNAME0= <>
##$TPNAME1= <>
##$TPNAME2= <>
##$TPNAME3= <>
##$TPNAME4= <>
##$TPNAME5= <>
##$TPNAME6= <>
##$TPNAME7= <>
##$TPOAL= (0..7)
0.5 0.5 0.5 0.5 0.5 0.5 0.5 0.5 
##$TPOFFS= (0..7)
0 0 0 0 0 0 0 0 
##$TUNHIN= 0
##$TUNHOUT= 0
##$TUNXOUT= 0
##$USERA1= <user>
##$USERA2= <user>
##$USERA3= <user>
##$USERA4= <user>
##$USERA5= <user>
##$V9= 5
##$VALIST= <valist>
##$VCLIST= <CCCCCCCCCCCCCCC>
##$VD= 0
##$VDLIST= <DDDDDDDDDDDDDDD>
##$VPLIST= <PPPPPPPPPPPPPPP>
##$VTLIST= <TTTTTTTTTTTTTTT>
##$WBST= 1024
##$WBSW= 4
##$XGAIN= (0..3)
0 0 0 0 
##$XL= 0
##$YL= 0
##$YMAX_a= 241481
##$YMIN_a= -395898
##$ZGOPTNS= <>
##$ZL1= 120
##$ZL2= 120
##$ZL3= 120
##$ZL4= 120
##$ABSF1= 15.72815
##$ABSF2= -2.323699
##$ABSG= 5
##$ABSL= 3
##$ALPHA= 0
##$AQORDER= 0
##$ASSFAC= 0
##$ASSFACI= 0
##$ASSFACX= 0
##$ASSWID= 0
##$AUNMP= <proc_1d>
##$AZFE= 0.1
##$AZFW= 0.1
##$BCFW= 0
##$BC_mod= 2
##$BYTORDP= 0
##$COROFFS= 0
##$CY= -3
##$DATMOD= 1
##$DC= 0
##$DFILT= <>
##$DTYPP= 0
##$F1P= 0
##$F2P= 0
##$FCOR= 1
##$FTSIZE= 16384
##$FT_mod= 6
##$GAMMA= 0
##$GB= 0
##$INTBC= 1
##$INTSCL= 0
##$ISEN= 128
##$LB= 0.24
##$LEV0= 0
##$LPBIN= 0
##$MAXI= 10000
##$MC2= 0
##$MEAN= 0
##$ME_mod= 0
##$MI= 1.114404
##$NCOEF= 0
##$NC_proc= -6
##$NLEV= 6
##$NOISF1= 3.799351
##$NOISF2= 2.8
##$NSP= 0
##$NTH_PI= 0
##$NZP= 0
##$OFFSET= 15.72155
##$PC= 1
##$PHC0= -15869.44
##$PHC1= 11.40078
##$PH_mod= 1
##$PKNL= yes
##$PPARMOD= 0
##$PSCAL= 0
##$PSIGN= 0
##$REVERSE= no
##$SF= 200.130006004221
##$SI= 16384
##$SIGF1= 3
##$SIGF2= 2
##$SINO= 5.538805
##$SIOLD= 16384
##$SREGLST= <1H.CDCl3>
##$SSB= 0
##$STSI= 16384
##$STSR= 0
##$SW_p= 3612.71676300578
##$SYMM= 0
##$S_DEV= 0
##$TDeff= 16384
##$TDoff= 0
##$TI= <>
##$TILT= no
##$TM1= 0
##$TM2= 0
##$TOPLEV= 0
##$USERP1= <user>
##$USERP2= <user>
##$USERP3= <user>
##$USERP4= <user>
##$USERP5= <user>
##$WDW= 1
##$XDIM= 16384
##$YMAX_p= 427231389
##$YMIN_p= -1220187
$$ End of Bruker specific parameters
$$ ---------------------------------
##NTUPLES= NMR SPECTRUM
##VAR_NAME=  FREQUENCY,     SPECTRUM/REAL,   SPECTRUM/IMAG
##SYMBOL=    X,             R,               I
##VAR_TYPE=  INDEPENDENT,   DEPENDENT,       DEPENDENT
##VAR_FORM=  AFFN,          ASDF,            ASDF
##VAR_DIM=   16384,         16384,           16384
##UNITS=     HZ,            ARBITRARY UNITS, ARBITRARY UNITS
##FACTOR=    0.220516191357247, 1,           1
##FIRST=     3146.35389345267, 0,            0
##LAST=      -466.362869553113, 0,           0
##MIN=       -466.362869553113, -1220187,    0
##MAX=       3146.35389345267, 427231389,    0
$$ Real data points
##PAGE= N=1
##DATA TABLE= (X++(R..R)), XYDATA
$$ [...]
9449 792052 720901 832775 956746 963483 947133 854714 882561 854841 911574 871872 808530
9438 808530 813431 720066 736459 763070 821800 797005 823516 825519 730103 800312 864737 912888
9426 912888 839438 814029 1001116 1095602 1114056 1017164 1019744 1138821 1181815 1117668 1212744
9415 1212744 1257943 1169587 1182099 1149666 1141036 1073266 1117667 1073709 1001286 969540 1009440 985270
9403 985270 922824 897807 895515 739041 786027 779524 774428 776652 766289 779790 718542 802979
9391 802979 863466 862716 903013 866079 870503 875474 839606 1000308 924345 904118 904351 849019 876495
9378 876495 914686 983907 982643 977964 836020 817908 900893 991390 990896 927440 985342 919391
9366 919391 1028041 1101932 1174235 1146498 1067281 1084035 1171800 1183419 1316606 1314382 1219028
9355 1219028 1142909 1145085 1276125 1297831 1401651 1369517 1370998 1423368 1435497 1450545 1552562
9344 1552562 1562391 1585450 1700135 1658797 1671087 1718295 1748050 1779805 1763620 1860052 2146541
9333 2146541 2129150 2021844 2115244 2165027 2117177 2254213 2409566 2459360 2557830 2654819 2714792
9322 2714792 2780640 2798523 2837419 2867338 2901143 2954563 2943237 2859759 2761525 2609936 2480732
9311 2480732 2548372 2735217 2717514 2699911 2750493 2747275 2642647 2675046 2823187 2958202 2920961
9300 2920961 2893737 2875683 2909627 2979790 3011308 2999497 2974357 3023813 3035014 3074518 3104221
9289 3104221 3209348 3225418 3213984 3373020 3514973 3527232 3634987 3575082 3488818 3367718
9279 3367718 3359507 3240296 3150568 3068330 2902069 2867322 2776053 2726589 2729969 2724573 2747711 2683628
9267 2683628 2723040 2691405 2601036 2663888 2615817 2685265 2697847 2593821 2601777 2564696 2559516 2520712
9255 2520712 2614449 2657944 2662572 2656841 2691388 2703111 2685184 2731571 2682629 2717708 2795561 2869725
9243 2869725 2890076 2940570 3038466 3102150 3176078 3160733 3238009 3252670 3334086 3338851 3401238 3433516
9231 3433516 3383560 3432682 3400167 3243436 3139115 3082874 3147721 3113574 3085440 3107184 3157715
9220 3157715 3138983 3073777 3173357 3225410 3312940 3342942 3463095 3619412 3486846 3523072 3696386
9209 3696386 3766451 3825748 3811751 3952956 4002096 4026011 4040397 4294012 4444473 4466461 4461791
9198 4461791 4603133 4646347 4667382 4674047 4735967 4765695 4805893 4777477 4800752 4780201 4710933
9187 4710933 4573063 4455022 4516683 4516911 4508647 4474008 4541797 4650487 4731657 4707126 4873287
9176 4873287 4914683 4987932 5131460 5135303 5186397 5140079 5108865 5213172 5251678 5247177 5312412
9165 5312412 5404819 5326378 5278013 5364917 5427405 5436360 5442527 5527507 5626948 5590779 5650476 5702002
9153 5702002 5781691 5825828 5904797 6063391 6208311 6356590 6451834 6601339 6656372 6802435
9143 6802435 6919448 6983697 7085815 7147530 7313638 7506246 7634983 7821335 7955933 8098887
9133 8098887 8244617 8467072 8576808 8745233 9040974 9316515 9570743 9828394 10172008 10584600
9123 10584600 10860729 11282018 11848038 12173456 12621443 13115548 13630808 14100346 14702627
9114 14702627 15223144 15679245 16284236 16924282 17577631 18325450 19084263 19839711 20597718
9105 20597718 21438545 22334687 23484196 24936810 26524578 28358398 30532138 33104196
9097 33104196 36036555 39628894 43542801 47490504 51507359 55939087 61292557 67230543
9089 67230543 72303545 74961824 75467627 75779711 78053159 82375445 86264588 87017038 83387781
9080 83387781 76166326 67879296 60591855 55241943 52170770 50604101 49767416 48792428
9072 48792428 47355662 45460492 43470484 42233946 41633312 41596745 42169273 43159339 44677060
9063 44677060 46802141 49566702 53103924 57504086 62630153 67864894 72934603 77893362
9055 77893362 82385319 86126972 89387455 92637313 97278375 103103712 107636104 109246935
9047 109246935 107920716 105352052 102405591 97084879 88023044 76394338 64264878 54290499
9039 54290499 47304700 42436991 38890697 36340184 34459024 32998133 31576792 29991399
9031 29991399 28225442 26196197 24512690 23262243 22288790 21561192 20768215 20140736 19585134
9022 19585134 19023094 18652336 18216200 17731756 17194674 16865259 16492552 16149864 15969685
9013 15969685 15668479 15205334 14896975 14665011 14217883 13710499 13220037 12735566 12360676
9004 12360676 11942376 11501230 11293973 10906893 10646758 10374723 10038157 9672792 9477188
8995 9477188 9226367 9036242 8880822 8692467 8471799 8196820 8138618 8057773 8069036 8039840
8985 8039840 7995213 7888627 7881522 7835250 7777489 7750960 7688122 7559144 7604731 7585970 7590857
8974 7590857 7565656 7532377 7412245 7387927 7422911 7343759 7264085 7372871 7374212 7371674 7388177
8963 7388177 7322278 7312063 7258782 7291007 7281752 7323315 7291905 7198355 7125091 7119003 7126181 7074960
8951 7074960 7054048 6999860 7077050 7151750 7223699 7269399 7371990 7422051 7375642 7406015 7451388
8940 7451388 7524642 7671449 7813531 7919756 8068218 8215406 8281502 8367324 8481380 8588321
8930 8588321 8681363 8766599 8881534 8983015 9065551 9082543 9152906 9216021 9262694 9309380 9394345
8919 9394345 9566158 9859405 10012860 10190521 10318760 10526671 10598071 10626736 10619255 10715263
8909 10715263 10816212 10887218 10917215 11104997 11250686 11455996 11736826 12004692 12308584 12696318
8899 12696318 12906691 13277715 13643130 14018070 14385876 14833477 15338159 15763644 16281815
8890 16281815 16886072 17580655 18147690 18817494 19600282 20579251 21573005 22805556 24283588
8881 24283588 25832730 27651182 29964489 32472326 35040598 37480121 39789473 42369979
8873 42369979 45524715 49391679 53495152 56974961 59374635 60769812 61081904 59464204
8865 59464204 55591443 50616093 46226954 43553802 42395069 42189652 42436778 42324010 41670437
8856 41670437 40357561 38954170 38167516 38215409 38708629 39729777 41120010 43072370 45541873
8847 45541873 48364346 51540539 54732577 57823132 61055181 64609057 69346218 75321552
8839 75321552 81968431 89157314 96200379 102405086 107008746 108842556 107213198 101981634
8831 101981634 94073735 85936880 79565110 75604041 72710834 69079013 63945170 57997406
8823 57997406 52622899 48756287 45890363 43464542 41395119 39946657 39055563 38450672
8815 38450672 38218704 38242427 38631984 39435244 40512352 41876528 43588293 45898964 48582992
8806 48582992 51643844 54318476 56038515 57103874 58151845 60150816 63004820 66043078
8798 66043078 68420097 68783446 66309860 61195105 54307255 47412258 41159382 36556937
8790 36556937 33473803 31437196 29923643 28696197 27560383 26157717 24643210 23086222
8782 23086222 21785012 20843370 20061258 19349248 18823564 18353197 17842236 17385678 17071458
8773 17071458 16791942 16419998 16065063 15744056 15568446 15301111 15081514 14779765 14446004
8764 14446004 14246426 13988422 13804510 13772781 13599088 13457998 13528638 13592370 13699488 13751899
8754 13751899 13898264 14029037 14183307 14309116 14439986 14633084 14836131 15143363 15427165
8745 15427165 15587227 15963567 16354959 16653237 17284414 17839673 18267928 18676890 19200317
8736 19200317 19866427 20549072 21285318 22196079 23111828 24096509 25325707 26886329 28664290
8727 28664290 30712457 33249829 36141892 39551849 43624967 48846593 54918137 62853355
8719 62853355 72858040 85888344 100850145 112172058 113325135 103419752 87354620
8712 87354620 74606212 67548129 63746282 62372371 61286929 58935027 54726915 50184859
8704 50184859 46859127 44989825 42923363 40148501 36893319 33559563 31014042 29361568
8696 29361568 28225646 27358745 26814013 26529859 26597444 26873983 27229816 27736038 28514547
8687 28514547 29857279 31575875 33590239 35355368 36793268 37525491 38354666 40120097
8679 40120097 43036324 46859767 50772450 54096537 55822693 55155907 52144492 47337870
8671 47337870 41759844 36686287 32973327 30572320 29088088 28212265 27398141 26064263
8663 26064263 24399943 22514355 20910844 19674202 18759459 18002241 17431089 17129635 16869567
8654 16869567 16819944 16786837 16975735 17378480 17903307 18854965 19816001 20785743 21242397 21395227
8644 21395227 21557440 22056933 22747422 22706643 21870426 20365663 18790802 17860717 17103921
8635 17103921 16161208 14825380 13326567 11987970 11005653 10368461 9797522 9318060 8748055
8626 8748055 8306011 7921982 7507899 7106742 6714470 6384915 6143677 5969962 5735949 5478656
8616 5478656 5289765 5133913 4984076 4934680 4782705 4616872 4551076 4507815 4267489 4077395
8606 4077395 4002474 3994864 3958239 3743695 3744685 3680940 3551721 3529446 3463793 3304018 3222145
8595 3222145 3028511 2896737 2895638 2874919 2753176 2723481 2633536 2532897 2563833 2527524 2337595
8584 2337595 2248860 2123972 2038542 2058995 2096003 2046688 1907817 1709737 1678619 1732613 1734571
8573 1734571 1750671 1698689 1673370 1676624 1669807 1635139 1555642 1532128 1510507 1557820 1486212 1449157
8561 1449157 1506123 1393457 1347068 1304279 1275533 1293550 1208264 1113155 1110187 1001956 938782
8550 938782 970414 1035499 1101080 967498 851044 823870 881653 880393 939113 864535 780324
8539 780324 911852 891953 880514 828770 791073 799563 815583 849786 852127 834827 808478 790656
8527 790656 786347 711458 654978 631800 653078 599540 586590 564632 643730 644466 608392 535638
8515 535638 608862 656726 622613 619505 554759 460988 498359 586466 586456 593752 618077 641562 599511
8502 599511 711758 757391 728835 670786 610127 569456 561484 520247 450401 367382 444705 441344
8490 441344 400206 480886 445076 347983 367023 421220 491059 417783 410897 351556 387363 370936
8478 370936 433257 468092 440161 512732 441672 553149 503317 419243 494913 615008 638401
8467 638401 665038 619605 553557 654829 716289 705263 563039 466776 578336 545280 461845
8456 461845 508041 538445 428970 350645 273175 263116 197933 237649 267348 240429 231731 250641
8444 250641 302721 237256 274627 305440 269391 276799 221506 241230 261005 261794 274212 221118
8432 221118 280520 225468 298658 369971 236784 248453 292091 318784 326928 314168 268835 239043
8420 239043 210278 51491 29771 121267 110462 69608 125135 93805 99922 102809 115470 155295
8408 155295 83887 63641 33977 29531 -811 46415 36458 -11599 24551 -49843 42850 117386
8396 117386 105931 147653 118211 -3324 -24567 33554 90541 -12398 -147715 -84588 -108038
8385 -108038 -33778 -10867 -34556 -18324 -7779 -11796 98149 27950 12960 -28408 -45086 -27585
8373 -27585 -5207 27626 -15535 104452 128635 139565 -9802 -42067 -24985 -64107 -68857 62677
8361 62677 -28203 -75803 -87368 -121050 -60054 -81792 -33060 48375 116969 11018 -56531 -18930
8349 -18930 47836 155068 152677 160552 156621 8682 28209 72358 75455 54128 -7258 10475
8337 10475 -21553 -98314 -139716 -159720 -130946 -85245 -40346 -39894 -143153 27157 58319 -23297
8325 -23297 36647 -24326 21664 110576 118215 28675 -6958 8416 46721 58573 115272 115505
8313 115505 118743 42934 92353 60470 59690 163369 80080 73793 68164 -33902 -59496 98122
8301 98122 9138 14053 106791 116533 16000 45783 37967 -26040 84066 17512 -66470 -145868
8289 -145868 -217762 -187910 -77789 -27462 38975 15134 -20023 -62797 -49097 -75071 -12437
8278 -12437 18628 -47787 26229 55796 19218 -15358 -71918 -35795 -7339 -118859 -23337 90884
8266 90884 152824 33785 9719 -50065 -34234 16518 -74979 -67962 -42026 13965 -83570 -100325
8254 -100325 -41815 -70539 -85307 -92534 -75133 -36452 -48283 -109580 -100053 82398 186531 101936
8242 101936 58058 159607 265053 273644 331523 297097 158086 14038 30046 36428 8563
8231 8563 25749 -58395 -89868 -95842 -159850 -123689 -48835 -55813 -147466 -146179 -67504 -134706 -194897
8218 -194897 -126855 -129233 -97983 -144780 -120068 -82208 -124383 -179684 -178931 -168666 -74742 -86070
8206 -86070 -105967 -193092 -193503 -164522 -211661 -206290 -51141 -187240 -197255 -273265 -291979 -305420
8194 -305420 -467906 -712611 -1220187 -316507 -143942 -216791 -60004 -154105 -250643 -215431
8184 -215431 -184497 -217653 -50377 -70280 -131529 -165107 -243454 -256857 -192478 -113415 -148510
8173 -148510 -156510 -157137 -116954 -124884 -101238 -135365 -192868 -198358 -160491 -118477 -139164 -60881 -55467
8160 -55467 -137386 -178313 -119387 -163084 -226499 -164200 -133130 -78960 -78319 -119033 -114427 -111360 -81615
8147 -81615 -68903 -39491 -54759 -98067 -86501 -90874 -203842 -172782 -237938 -171697 -159111 -178383
8135 -178383 -216745 -76190 -81608 -112052 -69772 -60648 -150852 -121609 -144240 -119758 -225777 -281125
8123 -281125 -255779 -200557 -81679 -147502 -225509 -111714 -18686 -112928 -109010 -116379 -154046 -167284
8111 -167284 -238232 -323305 -142807 -35161 -92052 -58650 -117219 -177385 -70191 -91699 -117944
8100 -117944 -207843 -196063 -218303 -167720 -241523 -128069 -17966 -60027 -57108 -36997 -89295
8089 -89295 -118824 -36396 5494 -85372 -114150 -126970 -94808 -150220 -156267 -103387 -206471 -167657
8077 -167657 -205070 -214349 -209990 -235135 -177297 -102419 -138290 -136712 -198351 -212914 -183095 -184226
8065 -184226 -47459 -34052 7790 22410 47330 -24590 -122587 -106615 -81914 -229298 -278336
8054 -278336 -125460 -222702 -311646 -197976 -102711 -179630 -132104 -122915 -221004 -162319 -82112
8043 -82112 -75278 -197549 -240563 -189695 -160983 -103928 -29292 -39409 -158710 -51243 -141719
8032 -141719 -152300 -100465 37301 -85118 -105789 -127456 -153303 -184458 -218942 -93635 -62608
8021 -62608 -84886 -165894 -157499 -165909 -168170 -177588 -205513 -209164 -134065 -27621 -80457 -167017 -106901
8008 -106901 -53849 -113082 -98769 -136258 -99774 -31027 -70288 -168461 -195028 -153118 -140484 -199580
7996 -199580 -252116 -250434 -208012 -161285 -161138 -167141 -191196 -24664 -145816 -142225 -147053 -167195
7984 -167195 -133914 -47893 -103095 -135103 -215116 -162980 -208801 -113995 -32892 -82321 -115228 -143882
7972 -143882 -154732 -112028 33697 -32249 -109499 -145098 -188660 -165149 -98698 -127619 973
7961 973 -27998 -107599 -118369 -99650 -47507 -46088 -107971 -111684 -95408 -177067 -91850 -44685 -62337
7948 -62337 -61986 -103563 -115028 -1125 10544 9222 42512 -91755 -16007 15415 -72938 -57866
7936 -57866 -74566 -73241 -116883 -134315 -172430 -154162 -137107 -93664 -93266 -200740 -76261 -105007
7924 -105007 -161294 -154555 -143034 -123012 -62504 -177799 -197568 -78808 -121603 -61450 -32558
7913 -32558 -39662 -114231 -207923 -177543 -133126 -87472 -120402 -62717 30499 -110036 -184255 -134378
7901 -134378 -163389 -184683 -122996 -78920 -173630 -116682 -53539 -92760 -81476 -88027 -151792 -92286
7889 -92286 -161744 -157082 -126099 -110859 -43975 -92223 -64060 -90843 -100408 -113718 -189463 -113505
7877 -113505 -115079 -110017 -56802 -33902 -122408 -114684 -76446 -154605 -147288 -132318 -151161 -60068
7865 -60068 7382 -18379 19545 69991 77424 8032 -43718 -118713 -123732 -148313 -123909 -195765
7853 -195765 -148405 -112718 -172687 -164318 -161597 -140313 -182971 -151237 -104084 -95608 -142802 -202037
7841 -202037 -167979 -176629 -114079 -125520 -127618 -142607 -54707 -62665 -75788 -105496 -18822 -63806
7829 -63806 -113484 -56955 -94783 -69290 -107794 -52482 -41602 -162510 -250491 -239283 -110176
7818 -110176 -134720 -137062 -9780 -10413 -13173 -124303 -217190 -163857 -71244 -187821 -257011 -159921
7806 -159921 -65119 -146495 -168633 -120877 -68662 -85423 -31966 -66644 139958 92573 20512
7795 20512 -101240 -181889 -162857 -102085 30465 -24695 21311 4046 -88980 -76591 -24068
7784 -24068 -101547 -102259 -105777 -53851 -72076 -25594 -46180 -153637 -76052 -59239 -78779 -50502
7772 -50502 -97088 -44515 18534 85803 -31014 -54610 -18820 -86080 -77464 -82340 -58770 -131922
7760 -131922 -177602 -115122 -59126 -54962 -57488 -79396 -106187 -94037 -154068 -43356 -46033 -71242
7748 -71242 -73055 -130324 -95515 -158530 -195829 -165338 -223450 -147465 -112506 -49196 -7530 -102634
7736 -102634 -83198 32546 23775 54483 97006 -2359 -73606 -56630 -60150 -44787 -7599 -134308
7724 -134308 -156287 -182917 -152015 -135250 -90556 -405 -74411 -57194 -49473 -68079 -125947 -162141
7712 -162141 -172434 -116702 -74404 -63218 -165850 -145301 43128 31123 -53058 -100276 -99588 -92157
7700 -92157 -108112 -64113 28645 68076 -31894 -53851 -60281 -104796 -57346 -119428 -83050 -87259
7688 -87259 -138378 -138545 -40781 -48640 20612 805 -74309 -54221 -115327 -186058 -149448 -66253
7676 -66253 -20909 -28912 -19935 89355 152830 9579 -18508 -108571 -52929 -26202 -39531 35100
7664 35100 70806 162143 130113 160547 154767 165481 65798 39047 23124 -18365 -46319 41725
7652 41725 31582 -100855 5374 115562 13759 -143433 -180804 -86030 -119016 -134204 -77109
7641 -77109 -46166 -111528 6797 10389 -93152 -92947 -57484 -128675 -134208 -54142 -125586 2312
7629 2312 -65974 -69207 -107907 -42795 -75083 1392 44953 15928 19115 91363 114517 -23088
7617 -23088 -72286 -82176 -51963 -80020 77205 150859 64328 35200 79960 45991 30068 4926
7605 4926 89436 26144 -42276 3597 20168 -39451 47533 46231 -15769 -3289 88066 62924
7593 62924 1027 -19973 -22269 -38998 -119252 -65602 -119023 -122643 -113795 -35570 27982 -70619
7581 -70619 -160155 -39440 -56499 -175651 -69839 71908 55251 -23467 -61349 -74191 -64937
7570 -64937 -35884 -49029 -43847 -7360 -37622 51114 105603 -15478 -21979 17295 -10012 39120
7558 39120 52559 58321 2076 96228 77074 -11250 -32752 -84694 2372 11051 69074 -15916
7546 -15916 -59405 4014 11794 19898 75355 76570 213126 189026 45394 34064 25722 53111
7534 53111 100188 156453 103347 88267 31745 142125 125492 39255 66972 96441 100919 115172
7522 115172 153555 99182 130198 86144 112415 40163 178501 100713 145660 263137 165076
7511 165076 177631 168267 184619 151269 171259 170129 189795 360382 272146 250367 339230 346685
7499 346685 415033 364778 517266 612833 747933 862004 839242 657533 608479 574243 486773
7488 486773 374631 289969 317148 352974 350626 206564 84741 111681 141737 104649 198609
7477 198609 165923 193735 242825 151055 135423 158951 215454 191397 134909 74402 117616 103623
7465 103623 28447 37041 135756 58533 40532 52884 96848 120177 134285 99244 118004 129542
7453 129542 136356 205838 202497 187827 112318 87498 147779 113407 88059 -30301 18271 122582
7441 122582 151345 28883 49480 159366 133678 83549 23637 68816 109732 219816 193846
7430 193846 94681 75255 189129 282165 134365 129631 180285 166192 106926 90618 52007
7419 52007 -36250 95985 98605 97944 159467 226091 189618 154803 163770 123846 54401 106087
7407 106087 182919 193875 130182 84194 79361 139146 47029 65270 74640 153725 114338 91303
7395 91303 103184 92471 129239 125428 110751 70588 13091 47583 117737 134101 55458 172693
7383 172693 229790 163437 -8920 15177 97963 5470 101169 230085 168275 186768 191587
7372 191587 162295 80999 82760 113332 148443 191636 90228 194729 156936 142331 87458
7361 87458 149399 148639 129820 134482 195152 255097 150913 138472 140123 228653 235248 116730
7349 116730 64891 119881 167601 110912 29768 25171 179486 204255 203418 218727 77323 157781
7337 157781 297463 275915 242313 262894 235690 298178 266451 233238 305799 357469 490155
7326 490155 415503 371363 336580 321625 266531 261152 320409 357620 358291 393574 485966 406584
7314 406584 409193 505490 428069 297060 338922 394002 364797 415065 298477 330150 377903
7303 377903 380322 352965 435915 456030 498435 486481 476216 497975 451166 466731 485647 417424
7291 417424 348403 396535 461459 563288 619713 551836 474760 555780 537498 518968 477173
7280 477173 515713 568184 597246 603902 583487 478783 546065 496041 466019 629764 586085
7269 586085 541830 571076 611650 579519 558553 629521 696227 764981 733894 645180 664250 598941
7257 598941 702915 695805 744742 683307 638498 615212 674534 710497 773231 740280 723299 636942
7245 636942 657322 765906 723348 600387 698501 722731 788822 825135 705742 728075 698859
7234 698859 771818 821265 899520 792230 809724 814490 916952 942896 965594 960120 1044783 1141377
7222 1141377 1095410 1036861 1122998 1145225 1160435 1238650 1298690 1297124 1313114 1302338 1322570 1337787
7210 1337787 1340675 1457456 1495589 1498371 1473965 1499788 1536419 1482802 1521291 1557908 1611980 1634033
7198 1634033 1813738 1859510 1911224 2003170 2125116 2171176 2190976 2254143 2318796 2217855 2231095
7187 2231095 2256917 2257936 2302294 2273201 2262404 2302436 2306608 2370381 2415736 2442672 2467615 2550863
7175 2550863 2601267 2600535 2592252 2648282 2732329 2743149 2778596 2734583 2755228 2857834 2978746 2992255
7163 2992255 2963219 2938533 2931199 3037897 3050539 3062831 3275802 3383268 3503065 3503491 3521110
7152 3521110 3650476 3790602 3826135 3848452 3881519 4008767 4145729 4307883 4435790 4518746
7142 4518746 4697536 4936322 5165069 5334492 5551977 5898790 6175431 6371716 6701006 7078028
7132 7078028 7318363 7682428 7950457 8268905 8697051 9094076 9507666 9877739 10405360 10862505
7122 10862505 11223760 11747271 12322616 13109535 13890096 14662923 15597732 16619276 17822821
7113 17822821 19193235 20728867 22550093 24744449 27375769 30295543 33602954 37434070
7105 37434070 41927539 47314662 53887591 61926739 71909012 84122265 98175922 112296382
7097 112296382 122957399 126297289 120585435 106815935 89361192 72160100 58167600
7090 58167600 48050261 40717344 35350284 31004818 27491828 24626254 22336287 20418710
7082 20418710 18730801 17287195 16030111 14861467 13871006 13050778 12385787 11702981 11153427
7073 11153427 10639825 10257062 9832107 9495979 9261715 8934398 8638406 8433384 8092943
7064 8092943 7741834 7485496 7139025 6753868 6485620 6293965 6039053 5752980 5586645 5483419
7054 5483419 5488430 5438985 5215233 5254809 5156099 5128484 5042624 4927567 4893987 4814376 4696193
7043 4696193 4711553 4649902 4593768 4648298 4716186 4893535 4940846 5104709 5214513 5221355 5168227
7032 5168227 4863973 4424938 4026442 3688780 3477681 3195139 3049461 2908214 2770628 2707245
7022 2707245 2712514 2659813 2542375 2315747 2162450 2297069 2339246 2210095 2127816 2063191 1995544
7011 1995544 1947596 1897874 1786025 1792678 1689953 1654556 1589443 1476012 1481706 1442451 1408443
7000 1408443 1320451 1351159 1371760 1350072 1377864 1237113 1187938 1110078 1100322 1084582 1073688
6989 1073688 1054361 938751 959314 968912 1017427 958133 935239 952252 852431 897952 839833
6978 839833 770452 790270 743606 730581 736796 687001 620491 686768 675079 617077 577275 580961
6966 580961 593086 618566 687806 696532 658151 613986 536162 541146 639071 723520 603282 560143
6954 560143 612608 571017 532551 560840 634783 682388 627132 520606 580788 502652 485759
6943 485759 561919 494284 374012 380588 387939 411965 407396 295431 244200 327365 374585 296544
6931 296544 356707 370663 366794 361850 353885 243416 242091 241824 280927 264018 242579 312424 227466
6918 227466 243425 283562 359321 188703 172203 299047 264699 189538 137203 93058 233970
6907 233970 253881 178242 191405 194356 175595 245331 257447 130156 97643 58357 175121
6896 175121 191370 290408 168196 119503 216882 239619 244189 243886 180625 94002 126080 133683
6884 133683 69954 51246 39236 39177 -5467 5227 66266 146391 116035 203682 86680 52720
6872 52720 80999 96542 86775 105846 172207 23985 -125968 -22037 13806 82006 197647
6861 197647 122251 140847 144980 85832 61157 84434 67040 132978 185896 181925 163797 170200
6849 170200 156233 173367 157555 107769 42516 122635 175722 150707 58774 29613 93716 78322
6837 78322 125162 185918 144145 54909 182841 175616 31145 108838 127600 232151 179101
6826 179101 131104 127326 68677 83034 117622 133739 167748 128202 38428 52382 133114 209784
6814 209784 143279 163784 230236 156560 165042 162581 108906 106478 186092 147715 210542 119227
6802 119227 214261 201944 120021 43608 126994 208959 135345 129670 134765 182545 72375 175108
6790 175108 220173 247280 215407 179650 147003 130704 141301 124973 54290 86864 136677 207459
6778 207459 174819 85897 82681 78698 66131 11366 97 3950 -12993 -75021 70182 82191
6766 82191 103390 139687 129075 36695 40662 92831 92415 -31074 15006 43821 25647 100830
6754 100830 53133 113620 78207 28037 119188 128509 77480 32601 8552 198933 141935 73049
6742 73049 105702 162129 65634 -3661 40873 48730 157961 95747 139653 185473 160014 188745
6730 188745 125216 88833 99831 75376 74516 78339 29786 5193 103479 154333 153791 143314 182497
6717 182497 207047 186137 207748 184193 241642 211685 227654 197916 126884 166468 273796
6706 273796 235611 324573 250170 304308 376290 371596 431369 506667 604239 664057 670426 654748
6694 654748 636306 586893 455409 390941 309520 258952 275864 249987 197270 77798 92612
6683 92612 105036 54847 64772 108153 130085 129501 197512 138790 63518 119303 47213 -5267
6671 -5267 -65527 51356 25038 -32462 6033 134854 151801 50004 22716 107661 118672
6660 118672 111527 79526 42280 150432 81452 25584 85977 77242 59719 27799 72325 92900
6648 92900 26543 55296 37499 58885 -26598 -149230 -126108 -59156 -28061 -16698 -24604 62044
6636 62044 23728 36807 90187 91740 155214 73568 -45433 -30056 71487 117233 45178 -5514
6624 -5514 42965 -10829 -16563 -627 -20646 6673 86622 12210 -122335 18145 137291 164723
6612 164723 126888 -18887 -30658 34833 95896 124846 117761 -1799 56489 140815 58122
6601 58122 52804 128090 142823 99384 168185 115223 71386 118301 84743 45898 41820 39249
6589 39249 87214 164628 60383 64444 26579 5216 13903 12252 -16898 37571 152136 52467
6577 52467 75385 92113 56377 89462 107127 125750 113220 105239 5661 -104855 -14475 90953
6565 90953 7342 90484 155061 106539 116153 149179 86567 70672 17761 4383 -56798 -24861
6553 -24861 160469 202289 134129 127998 56706 16824 117310 87104 141393 129564 50788 43672
6541 43672 -2891 45922 90213 -4283 26700 55111 59478 108728 132517 167336 162936 161719
6529 161719 127873 112498 88953 52315 53822 78304 142882 72453 109042 134023 145294 82054
6517 82054 61396 119124 78824 123712 144397 120816 109997 19152 -12558 -36028 39015 35886
6505 35886 59135 54033 15816 8843 83653 120588 149985 80536 30724 146623 113726 243818
6493 243818 327709 233983 303270 237746 207638 164875 219786 173259 167424 116180 165015 168339
6481 168339 197030 245983 122116 252243 291188 245480 160924 133149 167528 217002 136667
6470 136667 160548 109632 226228 159907 243681 251237 205151 126228 92248 145801 169286 248141
6458 248141 197452 141088 174206 164827 119225 198738 272903 174223 209755 273944 221220 267312
6446 267312 217733 206765 262071 230293 190372 203866 132085 125418 193783 275580 289708 225109
6434 225109 168244 167005 196691 227502 206719 150343 87048 73433 16820 131411 153435 208884
6422 208884 328788 292686 218472 197591 238059 269705 183623 239998 238727 233496 163828 199037
6410 199037 354714 315865 212185 315025 322196 291933 293252 269964 246318 261278 297722
6399 297722 295130 206877 158189 239273 289772 318310 335511 300529 288884 353204 240933 335130
6387 335130 276168 191645 256867 248527 232395 193389 241935 256869 273075 334853 330357 333696
6375 333696 386021 373498 317449 287113 309055 383311 337333 369472 419090 394338 402999 451242
6363 451242 412353 372416 261182 304918 303726 401476 574222 486068 397435 276444 360928
6352 360928 508709 446072 493847 444907 415268 393241 484606 524889 565309 575488 666768
6341 666768 675796 641628 658474 756311 594265 579308 683935 776920 762294 658279 617056
6330 617056 692556 791403 753330 729028 627985 581889 697704 857012 932576 761233 740754
6319 740754 777843 773680 820837 833687 858361 792083 888868 940211 1057450 1073552 1075216 949757
6307 949757 916687 913309 952690 891312 882420 880427 843559 892684 896333 845040 909186 952034
6295 952034 928983 987378 1005570 833017 834300 796034 840505 807598 781670 856106 831337 770106
6283 770106 770657 797357 855951 735630 803882 703745 712445 685403 642979 711661 751445 686097
6271 686097 618697 654919 607028 600124 749881 826988 715952 663516 603408 554980 603765
6260 603765 705337 690335 731370 725116 718421 752050 704993 750836 697169 686521 755005 660894
6248 660894 687530 727867 777157 832508 885148 940435 937603 896500 974488 880466 796045 812430
6236 812430 818705 829831 917777 912996 906225 879490 941935 884520 940855 948921 896095 931707
6224 931707 969712 990411 1089479 1026671 1040107 921131 947996 1032708 979728 1043614 1081724
6213 1081724 1062741 1066530 1095902 1069408 1297181 1339159 1264619 1228818 1194099 1313070 1329379
6202 1329379 1283964 1224187 1294546 1420891 1360210 1387892 1474037 1488217 1519156 1526260 1464026
6191 1464026 1467604 1625993 1717271 1642104 1703597 1707983 1690708 1788558 1868396 1856469 1862411 1778829
6179 1778829 1843235 1948161 1943310 1985684 1966221 1937524 2046027 2000912 1918226 1996200 2113731
6168 2113731 2198101 2095949 2050163 2021379 1926365 1862392 2061966 2162649 2019425 1956206 2019746
6157 2019746 2026288 2022272 2009519 2006486 2117915 2178569 2069355 2081844 2160866 2142642 2086902 2113106
6145 2113106 2154466 2133447 2032615 2074371 2177010 2168251 2131167 2140450 2178069 2114270 2152423
6134 2152423 2265479 2236849 2166487 2191163 2189734 2180436 2141781 2166610 2230665 2411543 2333279
6123 2333279 2398674 2365350 2372945 2473351 2431364 2458088 2564725 2667749 2693714 2709961 2714848
6112 2714848 2675240 2707121 2735957 2686993 2856170 2943228 3034627 3022446 3104157 3197338 3172134
6101 3172134 3159175 3239011 3329511 3392692 3403013 3449491 3541619 3532089 3706969 3782486 3787345 3758466
6089 3758466 3854350 3931364 4118218 4201857 4301903 4329838 4345828 4450017 4552946 4637837 4622661
6078 4622661 4706990 4762137 4898679 5030776 5177622 5214726 5239185 5413412 5630158 5788699
6068 5788699 5977062 6048751 6141749 6169871 6183804 6339642 6424332 6614869 6767295 7027887
6058 7027887 7200925 7281636 7398335 7475039 7548570 7438015 7589947 7701790 7753236 7867603
6048 7867603 8035227 8174734 8359902 8478628 8568894 8797997 9047068 9317210 9633491 9899179
6038 9899179 10103562 10358699 10691338 11067470 11318169 11703347 12144984 12473425 12996400 13485391
6028 13485391 13886660 14421173 15059839 15586315 16015304 16375068 16824583 17326827 17897289
6019 17897289 18610167 19333227 19992849 20682037 21779644 22920724 24104823 25333416 26533468
6010 26533468 27893618 29320349 31011772 33137756 35695765 38596871 41995706 45942501
6002 45942501 49888230 53304332 55586804 56502591 56446870 56213866 56049425 56058135 55992018 55984275
5992 55984275 55908092 55919761 56278959 56839839 57900483 59520186 61493513 63768611 65987015
5983 65987015 68190355 70342139 72485000 74933589 77987807 82020986 87021157 93183824
5975 93183824 99813686 104965619 106382713 103186293 96504446 89354120 83780638 80013797
5967 80013797 77343281 75236627 73470960 71706374 69917574 67862889 65460806 63085867
5959 63085867 60817197 58854840 57387325 56202990 55199817 54473178 53797417 53196335 52607703
5950 52607703 52274863 52007691 51648858 50751638 48629433 45590422 41651015 37644430 34364645
5941 34364645 31731930 29901627 28414748 27313436 26485601 25748827 25149184 24554882 23989982
5932 23989982 23281040 22538861 21792591 21116855 20550734 19966117 19478045 19243791 18974533
5923 18974533 18776114 18566698 18393921 18211285 18007055 17884283 17679631 17621974 17568235 17463265
5913 17463265 17362628 17209307 17158936 17120666 17094950 17142026 17248625 17257386 17428699 17758841
5903 17758841 17890310 18046414 18240812 18453207 18640181 18944342 19362446 19637751 20082192
5894 20082192 20354042 20535253 20697248 20809072 21102418 21598772 22193312 22813089 23485940
5885 23485940 24160958 25001366 25983877 26946165 27978426 29028216 30123247 31234357 32449247
5876 32449247 34009562 35823373 37957898 40467053 43229904 46394303 49757432 52960050
5868 52960050 55550362 57135979 57937575 58027537 58137563 58496837 59154831 60049615 61180082
5859 61180082 62492123 64022217 65849605 67819716 70106122 72521330 75019577 77329125
5851 77329125 79531051 81747624 84163191 86678080 89420484 92462213 96027516 100312095
5843 100312095 104378067 106916768 106200590 101923200 95371230 88288611 82307785 77810485
5835 77810485 74448528 71942896 69817680 68046408 66422836 64742046 63127224 61720035
5827 61720035 60520969 59575221 58931282 58455468 58314856 58554559 58730782 58973648 59120039
5818 59120039 59121036 58841540 58074608 56388982 53786925 50267825 46406248 43321034 41001532
5809 41001532 39391301 37849814 36046378 33791763 31315153 28815028 26788044 25236287
5801 25236287 23975460 22842758 21872943 21061534 20273051 19479614 18713747 18095199 17488180
5792 17488180 16922213 16419610 15936249 15508150 15249431 15033947 14897722 14651930 14413448
5783 14413448 14177414 13748860 13298009 13009193 12687818 12264280 12045395 11709886 11353101
5774 11353101 11053078 10871274 10562972 10361514 10195178 10070662 9941561 9815727 9700411
5765 9700411 9612941 9505730 9412688 9423109 9549838 9649913 9610553 9495807 9369070 9285726
5755 9285726 9096939 8960457 8767272 8589935 8319146 8212330 7918412 7695727 7615998 7555962
5745 7555962 7371063 7098223 6858242 6747140 6626076 6432292 6328410 6262631 6099878 6045942
5735 6045942 5931102 5919275 5947021 5953695 6030540 6030303 6081156 6078932 6116688 6208611 6148814 6018824
5723 6018824 5846935 5573219 5349768 5099254 4868120 4688786 4407106 4327828 4274725 4073499
5713 4073499 3944321 3806643 3732849 3703916 3666580 3537591 3412628 3492312 3453677 3343487
5703 3343487 3392759 3425254 3408905 3464880 3576324 3550120 3580275 3565781 3594157 3589783 3446232
5692 3446232 3262459 3000222 2741462 2739197 2748979 2621413 2671160 2558985 2475944 2424078 2325446
5681 2325446 2285105 2335604 2426614 2333914 2292482 2275882 2207742 2222382 2209059 2236594 2202995
5670 2202995 2038017 1995306 2091668 2118363 2069158 2134118 2193527 2258746 2242538 2243732 2270019
5659 2270019 2368379 2373410 2376914 2409828 2497927 2505063 2605103 2621257 2769664 2975200 2969941 3019759
5647 3019759 3086641 3252817 3446708 3466867 3479362 3459618 3377022 3358466 3488672 3478338 3449640
5636 3449640 3513695 3504157 3554129 3640812 3641619 3804609 3916752 4097737 4162594 4193064 4199322 4308542
5624 4308542 4444180 4521053 4786410 4934217 5070102 5226332 5343882 5238641 5073714 4938589
5614 4938589 4810794 4634437 4633619 4630825 4600635 4596830 4558279 4498328 4571401 4596915 4726553 4620383
5602 4620383 4529841 4493197 4386891 4178567 4109735 3974291 3995965 4012787 3970882 4018791 4004729
5591 4004729 3986311 3840361 3630724 3513573 3352005 3363968 3275962 3346921 3256353 3228792 3207118
5580 3207118 3137350 3215708 3238519 3271841 3331494 3365892 3365319 3327333 3241460 3266539 3277312 3468018
5568 3468018 3455548 3702764 4015874 4068472 4377573 4854405 5144562 5695135 6393527 7049428
5558 7049428 7951959 9254226 10815727 12618354 13791891 13791306 12333099 10103547 7915025
5549 7915025 6321402 5187467 4576033 4086400 3632267 3392687 3152505 2941377 2930295
5540 2930295 2777244 2621164 2578539 2505771 2465094 2477741 2531270 2581696 2587465 2634578 2716649
5529 2716649 2946490 2993992 2993349 2872256 2692167 2399508 2141565 2093925 1934529 1844380 1848903
5518 1848903 1761233 1682403 1702577 1759286 1749564 1614303 1632815 1629996 1649766 1554813 1551066 1512910
5506 1512910 1338358 1250367 1252098 1141756 1148574 1106127 1076037 1068036 1170324 1022237 1045102
5495 1045102 1049898 1027569 950558 941254 945752 1012407 1020486 960028 950038 922950 910360 993217
5483 993217 1061211 1026246 988675 880879 877126 885885 836432 828013 925183 911913 878957 942931
5471 942931 920625 805575 741778 831567 839085 717989 674594 644163 728238 614262 651459
5460 651459 748814 674941 612880 522834 538746 557533 497683 516225 539897 565357 569509 609995
5448 609995 575157 521152 575873 554085 614486 563167 548932 548013 536372 565739 557690 597875
5436 597875 590060 590544 585509 532973 553029 640515 583711 610766 634951 577938 633280 626771 594161
5423 594161 595425 680019 630996 594492 632062 609285 665200 620229 598378 547773 566043 646150
5411 646150 566685 506539 504128 560755 622595 589523 644554 654373 689834 548573 588562 629632
5399 629632 534096 571185 558760 508070 587396 565155 513756 523062 477002 627696 728107
5388 728107 636948 574548 548302 599015 580624 559297 484885 505325 522028 480617 580801
5377 580801 674935 732480 744626 687200 671725 660230 645481 727323 654774 709807 664426 675338
5365 675338 682256 604862 675148 612836 615909 703996 743936 807531 681299 656480 714052 720353
5353 720353 677067 646559 745969 818429 854987 813197 833033 984540 824591 702295 662263
5342 662263 732926 818202 847722 851399 777162 760006 761497 845591 810850 829476 767893 717773
5330 717773 689582 747742 731173 730955 829191 815213 699285 806402 840883 738359 729627 718686
5318 718686 749094 817303 771481 807443 791599 699400 706326 772965 768177 739274 743269 772817
5306 772817 798285 821548 822908 823169 851823 875597 865984 824852 776023 782934 911241 931629
5294 931629 900301 832052 863179 953971 920541 938439 1056449 1039134 981453 1072143 1196654
5283 1196654 1202846 1218571 1193115 1259892 1338408 1418672 1415380 1491068 1527517 1572432 1727114 1840408
5271 1840408 1937183 2027428 2154323 2213790 2362062 2435320 2414257 2337373 2324683 2235012 2105365
5260 2105365 2096349 2153861 2212574 2273992 2483334 2501465 2571661 2607996 2738877 2800398 2976007
5249 2976007 3108170 3311417 3527393 3726049 3942767 4179910 4321877 4573176 4879555 5156004
5239 5156004 5278993 5247181 5055404 4709079 4438664 4233878 4004366 3749235 3644944 3608758
5229 3608758 3635825 3671070 3568244 3558847 3693366 3828827 3958546 4084407 4177261 4267157 4211107
5218 4211107 4115115 4057981 3987827 3921202 3729586 3634713 3512354 3501069 3394233 3217495 3130777
5207 3130777 3062396 3045712 2991857 2865886 2831991 2713055 2710916 2713051 2809133 2732325 2693355
5196 2693355 2804900 2863806 2770970 2756890 2816649 2735038 2522277 2451635 2297407 2226786 2159156
5185 2159156 2061942 2069296 1920483 1737210 1755489 1772976 1677714 1638875 1733591 1676135 1622216
5174 1622216 1652969 1659205 1646561 1613223 1530701 1528507 1598401 1540492 1584492 1533784 1600901 1584065
5162 1584065 1482744 1558836 1528826 1579716 1593259 1566839 1600237 1561034 1548552 1558394 1490517
5151 1490517 1473597 1518859 1579136 1527555 1490804 1456486 1528291 1441470 1366059 1415536 1422347 1464875
5139 1464875 1363008 1289202 1375568 1456913 1434380 1443766 1574001 1578755 1429005 1402708 1450199
5128 1450199 1407141 1496900 1539964 1513050 1580025 1584805 1684417 1601319 1747654 1819408 1799685
5117 1799685 1801395 1949421 2072542 2369969 2463813 2546803 2837307 3056990 3222890 3182336
5107 3182336 3002503 2650048 2237529 1959612 1802790 1613431 1569410 1426349 1269455 1271318
5097 1271318 1286514 1320739 1231928 1145404 1266817 1329864 1307813 1370953 1229016 1221938 1354434
5086 1354434 1313011 1288501 1314171 1331674 1366553 1284340 1250288 1285350 1321362 1286641 1266800
5075 1266800 1369275 1436191 1463471 1434221 1489223 1422786 1523122 1544059 1456148 1425474 1575934
5064 1575934 1700577 1640215 1728409 1746652 1855969 1911468 1919500 1973505 2076585 2272577 2382973
5053 2382973 2586669 2743414 2952134 3227074 3557929 3715060 3622226 3367042 3050048 2877151
5043 2877151 2743501 2494940 2445651 2378922 2201564 2171363 2144599 2257071 2196803 2207299 2172871
5032 2172871 2214282 2266477 2213410 2305776 2351627 2370829 2461183 2398623 2428299 2441794 2528023
5021 2528023 2731790 2777797 2788685 2850266 2843963 2823910 2725103 2560959 2378502 2393988 2299567
5010 2299567 2213986 2224618 2154204 2157104 2115699 2081059 2050951 2112725 2003484 2049781 2052085 2058814
4998 2058814 1986138 1959271 2094254 2052536 1996318 1974819 1883169 1916053 2011572 1999577 2080021
4987 2080021 2005509 2082328 2171802 2039715 2053739 2034019 1982436 2030348 2066114 2098996 2095168
4976 2095168 2081149 2152979 2200897 2243344 2199917 2240960 2334782 2344278 2316002 2394755 2564132
4965 2564132 2479040 2491840 2451059 2521123 2416223 2279468 2430739 2477398 2501862 2411371 2482312
4954 2482312 2462552 2425803 2543939 2542197 2483448 2479428 2547811 2765010 2737409 2706717 2717943
4943 2717943 2843406 2911521 2913489 2964235 3047378 3055683 3065153 3079025 3153584 3245226 3282571 3384800
4931 3384800 3423439 3431788 3376029 3304769 3391063 3505083 3462322 3484802 3503270 3696805 3894018
4920 3894018 4019964 4046524 4087964 4099225 4247247 4279090 4212249 4278235 4331487 4363972 4420533
4909 4420533 4541268 4554775 4645987 4613964 4633656 4730730 4875536 5054598 5160580 5207278 5456388
4898 5456388 5666624 5777530 5929753 6261379 6499011 6891203 7129414 7193388 7359231 7526873
4888 7526873 7617905 7537957 7602690 7642871 7678358 7808626 7858060 7906015 7960619 8028958 8040115
4877 8040115 8106588 8197177 8475208 8590727 8803894 8956392 9037344 9148952 9272798 9317533
4867 9317533 9292350 9346683 9572298 9843180 10018509 10249522 10499667 10711545 10889700 11058034
4857 11058034 11206899 11529723 11899854 12261963 12666721 12977968 13220779 13541743 13882910
4848 13882910 14275556 14581392 15105823 15771426 16529225 17286214 17929827 18818924 19907918
4839 19907918 21122275 22709540 24613032 26820270 29085279 30935687 31939254 32295670
4831 32295670 32377876 32818681 33719260 35186020 36691652 37689223 38010541 38126992 38297138
4822 38297138 39193419 40438026 41886726 43607693 45805133 48294816 51351699 54751816
4814 54751816 58916618 63321763 67747681 71751062 76122163 81664663 89355916 98497795
4806 98497795 109066219 121559935 136964578 155126217 177333431 202767715 233269826
4799 233269826 272200010 322601341 380953497 425901566 427231389 380843822 303919488
4792 303919488 228429524 178232008 144415725 121017777 103495016 90514973 80359612
4785 80359612 72346968 65672985 60597558 56432933 52786713 49673221 47311952 45591560
4777 45591560 44369687 42843351 40813622 38365818 36032366 34023436 32253157 30775361
4769 30775361 29413092 28241818 27209115 26032997 24917172 23719949 22538574 21368600
4761 21368600 20288794 19314430 18516111 17958993 17416761 16857382 16345725 15981074 15739765
4752 15739765 15535891 15137336 14835762 14650938 14323520 14041078 13869670 13702077 13443275
4743 13443275 13326916 12918669 12352562 11839052 11383878 10946221 10727806 10511948 10330881
4734 10330881 10229143 9902034 9642756 9333549 8945361 8707335 8492049 8355444 8322680 8261862
4724 8261862 8094683 7913608 7730461 7421016 7238841 7169927 7078298 6891061 6802958 6693536
4714 6693536 6557260 6434830 6315808 6148860 5983082 5862731 5790456 5549088 5265573 5022036
4704 5022036 4903048 4599799 4395803 4272993 4281518 4277483 4189990 4008266 4001693 3890199 3826881
4693 3826881 3773835 3760990 3771926 3751167 3707687 3641881 3499554 3399338 3237713 3207482 3139171
4682 3139171 2987962 2952576 2977777 2904794 2798054 2841475 2683129 2524648 2578593 2611308 2593007
4671 2593007 2514270 2557540 2494653 2551909 2582054 2623228 2687863 2553602 2512987 2546562 2549459
4660 2549459 2507382 2491813 2447888 2484337 2490987 2507199 2438903 2372322 2309996 2312279 2342099 2228617
4648 2228617 2078468 2026247 2117703 2184784 2112709 2003386 2007449 2022757 1968173 1905617 1990748
4637 1990748 1920833 1879527 1929365 1926526 1896622 1844782 1732524 1830503 1859950 1806601 1827936
4626 1827936 1876180 1904534 1964708 1900717 1780694 1679320 1656380 1618272 1520906 1522766 1595299
4615 1595299 1553025 1489457 1471131 1379118 1320151 1415783 1366410 1283259 1252346 1281114 1298173
4604 1298173 1273885 1367959 1365379 1380638 1265636 1176752 1236501 1221662 1202724 1273100 1258501
4593 1258501 1211402 1144819 1208874 1100872 1082324 1026130 1045592 1067439 1067802 1059829 1111429 1024278
4581 1024278 996342 1055161 1159749 1156025 1224421 1335764 1253166 1222823 1300253 1283270 1264106
4570 1264106 1212113 1121004 1193760 1143447 1157253 1227488 1178633 1105824 1126046 1118316 1124644 1169596
4558 1169596 1129936 1194245 1096692 1142023 1156437 1069477 1170655 1200037 1243240 1298596 1306679
4547 1306679 1310581 1314040 1287075 1226162 1278991 1299791 1211051 1199965 1138442 1146898 1326683 1349480
4535 1349480 1363756 1387376 1200181 1199794 1298422 1337029 1354516 1265815 1287458 1297558 1259861 1329071
4523 1329071 1394344 1379637 1308138 1484639 1680924 1788267 1861160 1939831 2103514 2080827 1936991
4512 1936991 1977278 1975832 1839999 1821926 1856011 1823355 1815283 1770612 1840869 1853913 1820189 1818107
4500 1818107 1752308 1786863 1742963 1704163 1747608 1858265 1870516 1994005 2001942 2105665 2214699
4489 2214699 2263521 2336235 2376970 2466019 2639367 2781295 2958148 3304093 3688443 3913443
4479 3913443 3996804 3872189 3555288 3132571 2945506 2829057 2682008 2636569 2636895 2636333 2656625
4468 2656625 2691598 2821201 3046502 3228805 3595803 3850676 4151781 4294076 4339031 4186367
4458 4186367 3904872 3780805 3794897 3729164 3756143 3865376 3911719 3764304 3560199 3338381
4448 3338381 3200968 3035062 2899901 2877934 2838691 2714603 2678737 2721841 2697167 2664979 2721748
4437 2721748 2688733 2697945 2667532 2570248 2672995 2629596 2666143 2784896 2857678 3043291 3197359
4426 3197359 3321347 3524543 3622572 3501241 3505009 3434104 3295715 3050154 2872357 2746940
4416 2746940 2828123 2763970 2756653 2680621 2716455 2847545 2768121 2693632 2618305 2679228 2667210
4405 2667210 2768829 2747582 2593992 2607963 2560783 2510484 2561458 2613616 2663902 2740780 2791113
4394 2791113 2767145 2821113 2800271 2697501 2778108 2874374 2733752 2748324 2746667 2740575 2742153 2838806
4382 2838806 2907282 2929920 2928048 2822566 2920152 2976189 2958264 3051740 2947596 2845620 2894741
4371 2894741 3016566 3039997 3082075 3161990 3162987 3168530 3182711 3268142 3387821 3492321 3555082
4360 3555082 3590519 3678088 3815537 3874655 3879848 3922779 3905888 3906158 3890578 4002374 4073235 4080463
4348 4080463 4146601 4047181 4033464 4105093 4267357 4329890 4442064 4533982 4596557 4724349 4868324
4337 4868324 4945141 5043329 5093822 5221258 5346656 5229961 5260288 5250917 5276866 5417826 5506112
4326 5506112 5512432 5734437 5838218 5975344 6042831 6134574 6106161 6039207 5992002 6018439 6065377
4315 6065377 5946903 5911421 5900819 6032147 6159893 6249163 6322778 6350000 6578160 6628687 6748243
4304 6748243 6929031 7100708 7257992 7446185 7671330 7800771 7881970 7873251 7854621 7873281
4294 7873281 7882489 7885483 7957412 7952741 8001488 8079188 8057302 8118883 8179487 8313578 8284509 8312381
4282 8312381 8355279 8361759 8439259 8495979 8706346 8853778 9081581 9385760 9626553 9813644
4272 9813644 9921440 10204874 10404539 10571764 10665047 10684408 10819138 10857541 10748663 10694491
4262 10694491 10894344 10988687 11144962 11335658 11511761 11692600 11835063 11966921 11917815 11791610
4252 11791610 11697854 11635753 11667739 11617844 11810187 11878588 12007131 12184625 12432963 12701012
4242 12701012 12886156 13079419 13108499 13027587 12781027 12644365 12736182 12767612 12900181 13092844
4232 13092844 13381458 13640155 13815759 13934826 14097086 14307147 14613001 14839822 15102341
4223 15102341 15577272 16051892 16504959 16981044 17579923 18254263 18942747 19795250 20613330
4214 20613330 21580394 22410529 23376901 24146072 25052849 26099326 27254124 28259493 29167470
4205 29167470 30251288 31474365 32735792 34159887 35841677 37571482 39236097 41076340
4197 41076340 43216848 45427214 47996174 50890333 54196589 57871227 62228337 67047861
4189 67047861 72412418 78657652 85918184 94253464 103876321 115019660 128287736 144016472
4181 144016472 163020244 185766812 213646506 248002311 290480283 338689763 382600028
4174 382600028 405825368 395609000 351915698 291762659 233975890 189573130 159037708
4167 159037708 136902520 120087863 106184988 94713786 85020236 77056338 70800667
4160 70800667 65670558 61168833 57163887 53681270 50631324 47944965 45808766 44206995
4152 44206995 42917545 41714563 40867228 39907428 39146363 38504402 38048688 37795298 37777117
4143 37777117 37893424 38376406 39177621 40008374 40040991 38738770 36303542 33295786 30415004
4134 30415004 28148310 26247316 24705046 23486267 22432998 21551059 20766198 20006940 19208592
4125 19208592 18747893 18296282 17768096 17418482 16926850 16403926 16024315 15770109 15564951
4116 15564951 15338545 15190138 14969625 14770116 14454254 14219393 13991216 13732366 13606528
4107 13606528 13545884 13603452 13633875 13590782 13604875 13477389 13136323 12803400 12504672 12249586
4097 12249586 11967149 11773470 11522400 11293650 11125421 10979347 10789689 10625996 10503441
4088 10503441 10496093 10488371 10115488 9739887 9340979 8851330 8523862 8362079 8030050 7864678
4078 7864678 7776234 7715104 7680385 7684535 7580214 7505113 7409019 7270456 7177694 7035714 7034706
4067 7034706 6968828 6950153 6821669 6631814 6618033 6581748 6433536 6375350 6351577 6328252 6351687
4056 6351687 6321502 6303923 6180464 6174223 6122763 6113966 6093223 6097275 6202050 6207959 6202411 6292338
4044 6292338 6343158 6407748 6503222 6573524 6561065 6624862 6637280 6650203 6625038 6607621 6561191
4033 6561191 6561164 6637656 6775889 6805758 6742007 6779902 6830330 7024888 7078205 7066613 7111753 7231418
4021 7231418 7314026 7522615 7649325 7650664 7745220 7928976 8156212 8314146 8597927 8908339
4011 8908339 9361892 9946820 10557118 11059678 11679700 11964782 11797971 11260587 10472381 9995035
4001 9995035 9642413 9379490 9304672 9388302 9415631 9415646 9385827 9445258 9493732 9602158 9773096
3990 9773096 10012234 10251071 10603631 10958372 11326503 11800071 12324732 13018330 14031958
3981 14031958 15147356 16475654 17927052 19021789 19149010 18356563 16866032 15477181
3973 15477181 14600132 14066311 13805804 13894906 14140997 14482281 14907719 15077441 15205123 15176106
3963 15176106 15120835 15055722 15102109 15257305 15533776 15813575 16217251 16584091 17028237 17871092
3953 17871092 18999873 20342323 21487939 22384203 22334357 21498066 20371520 19777128 19385262
3944 19385262 19313095 19455850 19560141 19531716 19277816 19026641 18918623 18998379 19181004 19531887
3934 19531887 19963833 20563798 21281008 21925646 22693519 23554673 24513154 25427211 26462841
3925 26462841 27540345 28663530 29870639 30496975 30629545 30094715 29358735 28816618 28476415
3916 28476415 28462178 28432151 28447969 28710749 29042945 29584473 30250181 31035459 32136300 33408788
3906 33408788 34684339 36037489 37176280 38142326 39019912 40014311 41273158 42559835 44029551
3897 44029551 45574665 47106979 48909792 50902698 53146399 55626588 58594743 62034778
3889 62034778 65910632 70006752 74076954 78020301 81988935 85891513 89653027 92812126
3881 92812126 95056700 96624563 98112738 99829070 101804930 103941471 106472432 109684320
3873 109684320 113462673 118005857 123617733 130014778 136975984 143484390 147565992 148249123
3865 148249123 146465456 143944151 142506302 142701971 144220331 146173505 147850024 149078983
3857 149078983 150424640 152039529 153862553 155463476 155996709 155053930 152915258 149943079
3849 149943079 146942783 144320177 141946556 139843540 137962122 136646646 136429650 136935417
3841 136935417 136869159 134502863 129129841 121402683 113160922 105913389 100240347 95736058
3833 95736058 91944256 88923499 86001906 83170362 80274932 77165090 73822242 70450810
3825 70450810 66957284 63629337 60561188 58017040 56106534 54552273 52920925 50849691
3817 50849691 48442934 46232035 44256571 42634684 41470074 40487540 39531590 38647409 37626067
3808 37626067 36544282 35464641 34399133 33483064 32786221 32088057 31395714 30420893 29373303
3799 29373303 28110859 27024062 26159184 25407567 24817976 24344202 24051779 23700180 23358405
3790 23358405 23174559 23139038 22984329 22688005 22509463 22311393 22086576 21969571 21862572 21706103
3780 21706103 21320070 20952705 20499937 19886308 19088630 18569152 18196200 17694968 17389567
3771 17389567 17162180 16954214 16763409 16634280 16579168 16446132 16318182 16174196 16027556 15927982
3761 15927982 15700553 15426283 15079572 14801439 14438170 14055646 13785409 13527039 13179927
3752 13179927 12955084 12657766 12509573 12545886 12437760 12343181 12379200 12345717 12342716 12406088 12359657
3741 12359657 12348044 12439588 12434345 12406536 12301826 12200538 12133081 12014263 11914170 11836361 11732704
3730 11732704 11548695 11390113 11191335 11145652 11025630 10892588 10658511 10521977 10518765 10596915
3720 10596915 10463074 10306116 10146179 10051171 9971902 9941715 9867882 9833077 9833309 9758712 9751249
3709 9751249 9657934 9643771 9643142 9606531 9611263 9548081 9540354 9567351 9532787 9503704 9567814 9605932
3697 9605932 9669817 9733565 9745934 9799401 9841268 9743927 9832830 9809914 9754364 9623440 9548581
3686 9548581 9571249 9448319 9491155 9467450 9492636 9491692 9541393 9538327 9646742 9628993 9751078
3675 9751078 10039254 10167562 10237471 10427896 10529453 10712910 10741293 10898991 11129084 11319744
3665 11319744 11611030 11882420 12034488 12138320 12323902 12506283 12657575 12631850 12613459 12555196
3655 12555196 12558468 12629147 12592980 12458404 12281724 12234100 12292542 12415225 12419582 12367981 12240368
3644 12240368 11914618 11661708 11458854 11387798 11191929 11130638 11152109 11306896 11440315 11469252
3634 11469252 11563233 11585668 11497152 11523583 11497732 11523995 11449518 11278258 11151611 11167499 11157972
3623 11157972 11079104 11006973 10702994 10584058 10469295 10304399 10110304 9910479 9698754 9452344
3613 9452344 9248570 8992442 8861838 8681885 8559499 8501210 8369892 8229317 8196827 8138597
3603 8138597 8122322 8141071 8003804 7971881 8020020 7994759 7986336 8014373 7903309 7722372 7705124
3592 7705124 7538484 7440823 7343383 7199961 7138005 7110022 7031446 6907513 6844029 6904119 6760879
3581 6760879 6602377 6500524 6277067 6199365 6102352 6086687 5937261 5813028 5771040 5740082
3571 5740082 5682294 5666765 5661685 5610151 5599058 5503623 5474022 5387117 5329390 5242443 5153345 5182960
3559 5182960 5166244 5113117 4946462 4845309 4710978 4718688 4789863 4723683 4659681 4644992 4584676
3548 4584676 4512771 4498423 4379217 4229424 4267609 4225448 4122846 4097053 4067877 3992557 3956081
3537 3956081 3836634 3697342 3589875 3529355 3388109 3302276 3268937 3185627 3127653 3210412 3142647
3526 3142647 3060620 2989517 2948347 3011909 3025318 2944209 2986419 2939184 2895008 2929048 2903564
3515 2903564 2716875 2712355 2652689 2587428 2606665 2433480 2484407 2504658 2398292 2271754 2190069
3504 2190069 2203601 2163392 2086167 1988937 1935219 1899096 1886284 1874499 1910225 1838501 1781561
3493 1781561 1851104 1745114 1766963 1665983 1719618 1745931 1695450 1678563 1653896 1677625 1653871
3482 1653871 1635832 1639001 1680750 1647028 1603907 1540879 1501501 1466686 1385000 1273002 1312785
3471 1312785 1467923 1340506 1323352 1249275 1216367 1274622 1241619 1277161 1251824 1219817 1285174
3460 1285174 1264733 1184299 1228230 1270202 1276794 1223936 1175799 1141801 1147375 1202130 1253726 1315477
3448 1315477 1356023 1301258 1281303 1275454 1185569 1239998 1282635 1236682 1226970 1242887 1296590 1356382
3436 1356382 1355678 1444010 1526321 1500026 1415574 1604256 1631675 1711418 1837328 1929474 2138268
3425 2138268 2432720 2637670 2658252 2496452 2348820 2060291 1887526 1847523 1713235 1562777
3415 1562777 1543373 1579993 1426402 1415278 1395815 1404224 1427511 1451919 1459171 1482100 1525199 1504009
3403 1504009 1570148 1612940 1723748 1902278 2046630 2186149 2348189 2483432 2761235 3039386
3393 3039386 3522975 4103226 4202717 3949653 3426821 2806884 2392044 2252711 2064455 1814746
3383 1814746 1584409 1582699 1604630 1525125 1293307 1309728 1339663 1316888 1269933 1242850 1258833
3372 1258833 1282537 1327716 1344528 1428242 1495908 1525486 1491720 1616759 1774192 1927123 2024072
3361 2024072 2135062 2403866 2500514 2501262 2302042 1987300 1684819 1419625 1332745 1267573 1117535
3350 1117535 1128563 1047038 1049462 1027817 1053850 1066844 990464 996590 1093452 1062759 1000075 963488
3338 963488 962868 895935 864448 864968 960174 974383 1045843 970879 927701 884428 1057478 1135788
3326 1135788 974582 1004482 917263 960090 1001072 1015864 978034 933089 868605 893939 1055561
3315 1055561 979479 952621 1130811 1022550 1123726 982178 1014128 958908 1037115 1038654 975798
3304 975798 982146 1133363 1154563 1110022 1144784 1150782 1088197 1134037 1207760 1297191 1475408 1469712
3292 1469712 1365583 1323326 1313719 1338765 1352784 1286361 1456468 1475461 1522327 1621340 1661062
3281 1661062 1686205 1685770 1712347 1706834 1758852 1794163 1817164 1845298 1917025 1965751 1925533 1959318
3269 1959318 2117638 2252900 2335437 2477637 2595090 2776952 3062904 3332954 3553335 3629633
3259 3629633 3752036 3835391 3872873 3905549 3980023 4122301 4073473 3953067 3757228 3545275
3249 3545275 3360668 3240181 3101306 2973273 2809763 2591554 2363020 2363650 2260272 2290142
3239 2290142 2143788 2015519 1927175 1857600 1830557 1852884 1798127 1741406 1728291 1714500 1700593
3228 1700593 1753243 1801754 1761133 1724434 1859930 1927024 1818806 1832190 1777326 1802190 1975065
3217 1975065 2010484 1957373 2008543 2051360 2025653 2008146 1996894 1987513 1973528 1905602 1856820 1776096
3205 1776096 1838037 1849603 1876461 1855402 1844095 1817912 1728223 1690480 1640081 1652526 1758892
3194 1758892 1734719 1737052 1723337 1652229 1667011 1670421 1707631 1813833 1797751 1827262 1854261 1893964
3182 1893964 1826670 1914075 1947958 1921279 2089876 2085961 2003420 1968421 1935714 1866889 1852857
3171 1852857 1812189 1923201 1893776 1860383 1832179 1713584 1808495 1901988 1922374 1779645 1807011
3160 1807011 1803607 1720776 1724497 1712169 1722208 1694676 1662977 1576498 1519848 1600680 1602278 1582743
3148 1582743 1582711 1637008 1695544 1756026 1521315 1536168 1633132 1619770 1599595 1571017 1563384 1543157
3136 1543157 1452444 1411802 1536442 1545843 1549345 1489882 1409917 1388061 1406805 1324694 1290430 1284248
3124 1284248 1377241 1448354 1482546 1423537 1311037 1218902 1134130 1186897 1136840 1074596 1082036
3113 1082036 1218717 1215548 1175852 1159786 1170011 1160868 1250032 1166561 1153109 1256650 1166420
3102 1166420 1169620 1168809 1102007 1056888 1007221 999871 1119101 1020581 1024531 887344 989606 1002871
3090 1002871 916194 874933 934351 838914 805619 706881 724993 742042 716709 743440 617288
3079 617288 672949 685227 660987 757727 791755 752289 748011 725177 773483 757184 669605 616267
3067 616267 592799 572100 564357 613285 607043 553678 550726 618359 551196 578934 544058 477219
3055 477219 446424 396852 375376 445219 473429 461498 553036 438768 298666 393555 362620
3044 362620 336815 383325 434724 486520 464168 419072 345128 436157 374597 369170 386436 419634
3032 419634 409898 416838 405169 379742 187358 235194 373551 339067 184662 233817 207918
3021 207918 245480 300050 338928 344387 352526 305228 169618 149084 276689 149897 106631
3010 106631 242907 206052 244543 224845 215656 215740 216940 250753 214781 126766 222387 188902
2998 188902 221612 251759 291197 338392 345128 264248 218715 130565 155845 191812 181445 158801
2986 158801 177422 217637 223098 241933 131488 224944 287667 226929 227158 176840 185371 268866
2974 268866 308438 217782 244309 245807 155392 107383 142238 66602 154911 284277 203652 182795
2962 182795 239944 239635 172325 153823 123619 148016 265023 246521 157436 219889 215754 207301
2950 207301 172322 181049 224448 238251 316982 386071 317742 356150 371918 474311 414967 342397
2938 342397 354272 316694 330811 346005 342407 306426 246225 247650 208082 245619 198382 223221
2926 223221 235780 265653 312091 402100 499205 434288 424702 321897 454248 409738 402789 466948
2914 466948 459935 478956 527704 496446 469861 373565 405668 408938 326700 232046 184785 228739
2902 228739 289608 318250 291481 178993 106476 100566 172492 265293 281490 258926 205214 165544
2890 165544 126241 207576 259166 320147 349342 241306 201286 154826 152707 197527 226604 260248
2878 260248 327025 234997 131958 184322 163823 245647 196151 301124 272043 174630 109153
2867 109153 169053 165364 57514 86799 28548 -79344 -30941 23958 -18697 47434 71938
2856 71938 61872 -9878 70884 127279 122814 106335 74004 127026 48173 -5934 134971 133118
2844 133118 50924 -7583 4608 111391 1474 104798 164395 20668 -60646 53294 -20501
2833 -20501 -21242 60223 111751 141456 64484 -76734 -86738 4142 36429 19146 23136 23883 5250
2820 5250 73445 24263 -383 5153 65816 50606 102382 61 97368 113039 50493 -8080
2808 -8080 -58546 -5397 51870 50724 82695 -17357 -90710 -94393 -105655 -119207 -29097 -28306 -93504
2795 -93504 -104668 -75152 -38212 -128642 -90935 -3897 16801 -57223 -72552 -36244 50456 30375
2783 30375 16031 -43927 -83801 -131919 -57033 -120224 -161967 -63153 -63968 -143715 -143726 -59363 -40944
2770 -40944 21326 66556 -21345 -148112 -77806 -33040 18946 54004 21593 -81030 19864
2759 19864 -45620 55108 -3936 -112994 -124923 -114716 -84584 -113427 -73707 -23843 -12710
2748 -12710 -49157 -56465 -43624 -76773 -107657 -54665 -68017 -49127 -55084 -121608 -139039 -88299
2736 -88299 -151575 -183779 -237520 -120698 -104265 -118516 -183387 -101756 -57421 -36767 -36309 4916
2724 4916 -15359 2014 -25445 -12935 -34150 -30071 -14069 -99069 -72545 -129008 -206861 -140559
2712 -140559 -47212 -33410 -33815 -57208 40564 48972 -40529 -1873 23400 59969 -63707 -143757
2700 -143757 -106613 -17863 -108178 -97355 -14557 -25519 -46702 -125503 -160634 -38218 103953
2689 103953 67108 33409 -28051 -115361 -100250 68175 -2939 24005 -18266 -119748 -115813
2678 -115813 -174737 -210283 -75222 34411 -27245 -111124 -71850 -28800 10308 -178404 -162711
2667 -162711 -185710 -188846 -137156 -39395 21416 -44140 -39568 -101159 -77790 -117261 -132710 -111473
2655 -111473 -84990 -56933 30885 -2099 -58371 -3989 -3143 -79117 -58597 -47309 -89280 -85317
2643 -85317 -28994 -59925 -66932 -128787 -103838 -28509 -52464 -109301 -122599 -110129 -111663 -141837
2631 -141837 -95592 -23193 -12365 -91809 -71224 -101721 -105081 -33490 27821 85009 8497 -1715
2619 -1715 -45314 68349 9290 26750 -6284 -12418 -45807 -137571 -220944 -190339 -111426 -24699
2607 -24699 44706 12660 23758 41796 -24061 -13357 34271 86330 15847 -68106 -44114 -101603
2595 -101603 -10886 32792 20835 -39542 -71977 -135481 -108509 -53671 -152254 -184676 -196654 -196209
2583 -196209 -90567 -46297 -71402 -84173 -109853 -80595 -55949 -44331 -123537 -151829 -197845
2572 -197845 -38879 -28625 -83481 -23591 -115208 -151343 -121586 -23880 -115721 -158337 -258936
2561 -258936 -160814 -142422 -62111 -64000 -84835 -8709 -104710 -47462 33789 12136 -73990 -208889
2549 -208889 -142870 -106669 -85126 4309 -34007 -57186 -69774 -74067 -422 -75406 -57529 -124778
2537 -124778 -114858 -81437 -113910 -35264 -17383 -85034 -94666 -83907 -56015 -118584 -212016 -146642
2525 -146642 -47278 -43801 1808 93204 69294 -18281 -43013 8584 15407 43470 -82159 -66384
2513 -66384 -137180 -106372 -58409 -104573 -129572 -179457 -166690 5528 11754 -32479 -44846 16294
2501 16294 -74975 -65237 -117416 -43116 -19023 -25981 -72952 -111890 -26617 -58052 -127172 -70796
2489 -70796 -78222 -129180 -97622 -104024 -165991 -261291 -160789 -125634 -26782 14723 4827 -40658
2477 -40658 -63278 -8169 -114712 -106995 -60292 -112557 -54349 -56952 -103325 -103729 -59760 -178746
2465 -178746 -135056 -87087 -36910 -71409 -71068 -67150 -52826 -22188 -24219 -55300 -18002 -72054
2453 -72054 -180850 -178166 -61507 37260 79020 44879 61939 60018 -6179 -27171 -8943 -14135
2441 -14135 8527 18564 -75571 -73716 -4381 119913 99276 122871 70484 -81894 -36260 -99223
2429 -99223 -98134 -35193 -198341 -138538 -118585 -118755 -102532 -59234 -54575 -55139 -13638 -48524 -83002
2416 -83002 -88789 -120872 -109320 -35675 -17677 -22941 -11206 12887 34527 113222 76140 140106
2404 140106 -28265 38022 166812 113026 116662 73460 78990 80167 100070 7667 36435 56014
2392 56014 73020 26581 24463 -16059 32491 161602 183861 203417 215989 242909 134527 145645
2380 145645 166646 161265 131131 132295 109889 110395 140289 72862 63004 51424 8882 84223 61047
2367 61047 63148 46533 5010 22682 97298 17729 62557 88541 14910 40550 76783 121584
2355 121584 86780 110965 102822 6760 14172 -35786 -16217 -7066 -56441 -28252 -23024 -72789
2343 -72789 -8030 84973 43782 1656 -47904 49451 25189 117298 21579 25779 -25793 -13879
2331 -13879 -16203 -44923 46238 114110 65325 -47705 -85153 -92666 -27578 10602 55385 106320
2319 106320 709 40154 42919 90759 -27684 -1025 96240 97153 98826 111243 -4184 102492
2307 102492 63548 114966 147011 128582 97170 59307 53188 81557 164364 80809 153493 97495
2295 97495 33033 99786 204480 197016 190267 90202 147226 61466 103392 156285 195196 301457
2283 301457 291891 254067 204700 231664 188652 160701 166987 170551 223147 220162 170221 110944
2271 110944 204061 158793 111741 58623 183216 126053 108025 78056 94711 167057 137894
2260 137894 43541 45686 102741 162999 136538 192473 256565 271720 289948 95087 60916 84896
2248 84896 88271 140831 194639 294832 274514 204385 183336 250838 307876 308195 374949 230341
2236 230341 335849 400386 365030 327736 349128 322297 260891 350353 282756 363012 347826
2225 347826 407610 374672 347436 359605 403135 451354 469616 475581 494652 528370 533266 540449
2213 540449 410083 438070 583781 626766 560412 594961 636010 610707 561565 530151 479613
2202 479613 571834 593434 635170 686988 585283 624757 663502 752101 662392 632792 729701
2191 729701 803286 699098 747981 823815 843721 808895 733712 645363 739954 796686 855519
2180 855519 895894 982647 998280 1013308 966882 872939 893821 874919 1014924 1030619 1001513
2169 1001513 972811 1050646 1178786 1186859 1168633 1337749 1393949 1380278 1386180 1350980 1351164 1571027
2157 1571027 1619462 1761560 1812303 1858806 1997695 1964191 2026984 2302368 2443715 2548294
2147 2548294 2592422 2745527 2892930 2977329 3067076 3237644 3388899 3634295 3831354 4103270
2137 4103270 4488107 4682640 4987505 5323278 5709043 6317141 6910385 7500848 8054252 8702567
2127 8702567 9315803 10294502 11390995 12903389 14697053 16891798 19449036 22707962 26932672
2118 26932672 32284900 38779555 44117531 44368567 38927323 30005918 22016722 17393815
2110 17393815 14288922 12053116 10257697 8993578 8077357 7309401 6758229 6422347 6061796
2101 6061796 5812279 5405815 4935868 4476168 3989727 3727542 3537303 3351021 3176173 2933167
2091 2933167 2744248 2739704 2662785 2577586 2622291 2527712 2397752 2185827 2001274 1898251 1820675
2080 1820675 1749542 1772347 1741419 1618874 1543099 1553310 1463905 1491174 1470465 1454863 1430276
2069 1430276 1442783 1377194 1278661 1142184 1159543 1142876 1022844 965274 952276 905154 963537
2058 963537 899915 804583 909083 897915 926427 917623 747509 799435 781192 834171 890354
2047 890354 792441 707934 687598 661840 627233 683795 637072 530666 529119 569708 587601 513672
2035 513672 589708 618210 536835 468146 608560 650742 441273 431927 441249 438670 435719 422033
2023 422033 348787 319925 320067 257448 337784 384360 348706 293708 329154 345071 290818 266715
2011 266715 234875 244246 201914 270815 302326 307473 327141 266483 169453 206403 242356 265908
1999 265908 202428 141385 191509 229386 274908 256269 204387 238671 135664 36370 126861
1988 126861 73243 152154 77098 67712 228314 255520 233590 222165 220333 95512 73783 125702
1976 125702 220930 238694 194409 62667 133286 106518 17283 84982 157665 181586 255803
1965 255803 253531 209380 70582 -28070 66713 96660 99855 77157 78778 131634 72364 80246
1953 80246 31046 43575 -15418 -35433 32950 26643 20269 1104 -11882 107715 89973 142377
1941 142377 115496 89318 88314 27738 620 -42273 -26804 -5877 19710 65413 67212 -58882
1929 -58882 48075 109436 42974 -12467 45329 125490 110053 31784 -19444 87437 97014 73156
1917 73156 109930 186161 36611 -117716 -25237 80553 161895 49976 30920 75012 11070
1906 11070 48816 67596 34212 -9594 -52984 -59528 7447 -33368 38864 35793 63916 147295
1894 147295 -382 -57741 -38067 7380 -10344 64086 93635 68089 89690 17935 -15207
1883 -15207 15441 41223 54557 -35686 2461 41878 78328 107927 100669 35589 30657 -36869
1871 -36869 -23425 53144 -8532 64844 26469 37545 37339 47884 76706 -21129 5779 -23654
1859 -23654 -37359 11436 83094 159860 73541 19795 88425 101858 33763 38463 195537 194144
1847 194144 226099 182284 136525 135655 151002 188747 168119 159139 100148 -13350 16557 18362
1835 18362 27520 -3529 95798 72913 75993 39383 115009 90008 31688 8768 -23074 -23251 -56112
1822 -56112 -13008 26953 66536 -3833 -64000 -20909 59343 47297 63636 12829 58227 58622
1810 58622 -16962 -56628 63988 121703 59570 71284 29258 32560 11648 20991 -21362 -77639
1798 -77639 -68355 -58998 -54227 -65064 -98603 -13054 67685 7879 33250 -43947 78211 7763
1786 7763 -59228 -57424 -5702 -126977 -57288 -60144 -18871 -66153 -149668 -50632 -1629 -57442
1774 -57442 -72553 -64158 -38362 -74363 -138167 -65126 -56395 -18735 20675 16143 -38939 -11309
1762 -11309 -67862 -15139 23707 -8274 -53074 -73147 -49294 2626 -51948 7622 2032 -46259
1750 -46259 -72326 -41068 -15403 -50254 36766 26474 -52025 -9571 -20026 -49106 19090 18380
1738 18380 -6604 6053 -81454 2818 -20225 -52884 -79719 -92806 -89759 -131085 -19466 66499
1726 66499 35922 -91060 -65910 12709 50273 57225 -12221 -11413 46446 -15188 -151394 -213198
1714 -213198 -135886 -50453 16789 79414 43275 -18420 -8676 -60974 -72706 -27522 -37130 -106525
1702 -106525 -53437 -9790 -61676 -75706 -97697 -166954 -124490 -87421 -172173 -174962 -78475 -13453
1690 -13453 -27921 -7856 11904 347 -86844 -118505 6922 -26376 -71822 -103075 -79151 -27399
1678 -27399 2743 -7981 -22468 33947 -31730 -56369 64798 43685 61365 -3848 -67454 -158403
1666 -158403 -154141 -50842 -25903 -17026 -84983 -45953 -48677 -96543 5154 56168 -13526 -50234
1654 -50234 48913 45686 -126871 -108460 -30763 -30834 -73214 -77419 -113198 3380 -59558 -70830
1642 -70830 33036 -136653 -140997 -36220 -11817 15404 7090 44769 65107 80260 -24777
1631 -24777 -67964 4465 -30185 -67611 -107861 -101304 -72923 -40341 -47622 -78867 -87095 -83039 75276
1618 75276 46064 -89271 -131826 -60751 68522 58166 30695 22348 26154 -43774 -124843 -151190
1606 -151190 -15320 54327 18234 110057 -11022 -38518 -74201 -102918 -61570 -126997 -147221
1595 -147221 -35563 -2959 -11147 -72346 -75610 -6657 55849 36725 64092 -19594 -54682 -100517
1583 -100517 -217994 -202559 -90662 -6208 -53044 -25324 29951 33491 -107107 5000 -5533
1572 -5533 -79990 -36857 -57457 -65456 58718 -61464 -68806 -106770 -28207 -113446 -143454 -13963
1560 -13963 -53077 -127127 -72422 -31860 -75081 -21283 -4418 -12436 14330 -14526 -44849 61559
1548 61559 14531 -49006 -29195 20703 -25334 -54289 -42978 -2599 18480 -105223 -105190 51871
1536 51871 25786 -41920 -124232 -64771 -48648 -42074 -176003 -119265 49454 73231 -70428
1525 -70428 -57806 -27872 -28162 60688 69904 10815 -14606 12819 56386 -4193 -108131 12187
1513 12187 105865 64435 21669 -1469 49987 104179 40666 -6565 19319 51947 2709 51369
1501 51369 19988 -19080 63626 34506 64954 15419 -47577 -96996 -122874 -110389 -71247 -12275
1489 -12275 -51663 12072 -62906 41415 75093 83643 36061 50904 14055 -6735 -37336 -23550
1477 -23550 35277 -42301 54529 150601 58834 48387 135526 151041 115010 108123 79255 42886
1465 42886 49640 -89191 -15216 2221 -57806 -53415 -19459 35506 -23655 -50749 -21874 56867
1453 56867 28092 -54274 -50469 -84660 -75503 -84873 -36204 -44331 -52647 53735 -4316 -52643 -94756
1440 -94756 3972 -3354 -54206 -81712 -5106 -12146 3961 45955 10109 7597 20333 77357
1428 77357 45720 65134 -36153 -125295 -120238 -119897 -149188 -198323 -59516 34955 44610 -48642
1416 -48642 -87595 -13193 15062 39574 66810 118984 43217 60596 -45223 -114761 -117626 -140466
1404 -140466 -168351 -129024 -42385 -2093 -14026 -81655 -107363 -77886 -55040 -101333 -52033 -7432
1392 -7432 -172 -36756 28417 46700 88210 79789 -7289 120818 110275 57410 -33014 -49185
1380 -49185 46977 38435 -60191 -16639 15585 108028 -19963 -16176 -15403 -60876 -103657 -73144
1368 -73144 -125095 -98233 -51164 -102951 -67237 -93319 -105757 -27661 -138306 -106214 35192
1357 35192 9090 -66278 3287 91746 77190 43435 -5672 -11384 32398 104671 34705 38256
1345 38256 -11762 -8283 2197 -60650 5729 47027 -49376 103830 54370 63970 10944 67722
1333 67722 26034 20575 -43480 -31073 -17425 -42649 -8802 -16842 -53060 -19433 -5471 -18505
1321 -18505 -65723 -35065 17814 -59557 -98392 -101120 -45209 -72603 -23254 18570 92196 23766
1309 23766 -48805 -50583 -57985 -28089 35 -37648 -6766 73270 44855 92420 37325 -58018
1297 -58018 35266 73520 18037 -7338 -90019 -133937 -3807 4012 -41043 -103844 6832 75980
1285 75980 109755 71421 16097 51542 28542 286 -87601 -150138 -116077 -96126 -129984 -109673
1273 -109673 -21597 -86307 -209482 -147875 -21608 7747 4715 -44147 -62005 -50521 -49919 -48923
1261 -48923 28831 56760 -49723 -25036 35275 96017 -79557 -49907 18859 5826 -39609
1250 -39609 -80608 27124 -36073 -83078 11840 -9493 -132338 -62801 14325 78852 17933
1239 17933 -79785 -27043 68582 98305 33206 -79853 -81019 -114028 -107532 -20796 8427 5840
1227 5840 8656 -95815 -138672 -73701 -109070 -125172 -99387 -8982 65222 72780 -23952 88207
1215 88207 -15299 -81941 13818 -54542 32182 37271 47936 34878 -8234 59151 139042 -5580
1203 -5580 -172285 -112965 -15176 3072 51382 52201 37263 -5779 5271 62119 -75646 -86436
1191 -86436 69614 108950 79029 -26327 -61002 -78127 -118456 -79874 -26486 21906 -35894
1180 -35894 -101949 -61437 -58591 -113684 4967 110112 129319 123297 91436 11196 -99682 -109695
1168 -109695 -57074 -34055 -53012 6437 -20267 -49847 9810 19425 45158 -47753 -119178 -136703
1156 -136703 -106741 -22344 -51702 -121237 -100500 -131701 -127486 4063 41280 91831 22 -22825
1144 -22825 -54595 -19719 -28326 -37077 -23398 78405 80642 44138 -26366 871 69782 25950
1132 25950 1407 -70749 25344 -123884 -54719 26193 -31764 -90930 -122168 -142780 -86954 -2743
1120 -2743 -20855 6057 33095 10857 42790 45524 -22974 -119270 -110039 -7275 34573 -36475
1108 -36475 -85136 2840 40144 -9310 -80895 -149692 -4708 -43472 -32539 51467 21422 -62133
1096 -62133 16039 -7893 -121197 -1877 -9611 -33585 1155 -22121 -20572 66359 20736 76904
1084 76904 68318 -252 -29578 -117636 -51666 -52137 41060 55863 4984 -54061 23735 101820
1072 101820 177621 77159 -58880 -9961 5963 56540 94505 66154 -14533 -73648 -81352
1061 -81352 17114 96678 85587 -55328 47528 -70638 -141861 -48607 -22889 -33993 -58636
1050 -58636 -123774 -21805 21831 -46064 11494 22746 -129685 -133042 -62529 -104736 -55738 27133
1038 27133 -514 -46711 24641 29504 -79254 -8645 -19389 19705 22231 -33388 -4869 -19489
1026 -19489 -26127 14856 43658 15283 -58376 -18502 59600 68521 -25611 -26092 -15927 -1279 50039
1013 50039 53889 -28746 37516 -14451 -16905 1012 -28824 41005 23403 29197 20619 5160 -61373
1000 -61373 -50407 -22588 7523 -36449 45215 24657 -22354 -18190 44016 -354 -74241 -84346
988 -84346 -87490 -93806 -71860 -37955 9201 -18803 -15595 136240 146131 70557 -27540 -3711 -9770
975 -9770 4912 10813 -18001 147074 119351 87048 93393 109903 74544 13774 -71711 -35662
963 -35662 -41892 -107255 -63927 61248 46852 -38787 6068 -40402 -49342 -113749 -124024 37669
951 37669 68464 68630 -36325 -24676 -46279 39580 40253 -23067 -13298 -117976 -68022 99003
939 99003 16050 -24331 13978 -8837 -56014 -4573 19099 -44441 -1458 -33677 -148115 -62420
927 -62420 -66524 -25004 -27148 -85775 1955 33520 139744 116279 62627 78401 107363 62468
915 62468 59145 23883 -36310 -119717 -82186 -8937 -38290 -58553 -25377 -63997 -37057 -70650
903 -70650 -4819 -13527 95058 122727 138352 25655 -13741 4469 14890 150733 64419 -1706
891 -1706 -20043 80928 125304 -4832 -76513 -78168 -6284 -18112 -9814 82066 28044 -18887
879 -18887 110434 -4115 -29793 50497 32607 103719 53795 70387 80071 152729 163980 70942
867 70942 -83057 -192105 -192055 -125395 -103588 -60247 -55086 -61831 -80200 -135442 -65023 -48316 62247
854 62247 173402 58450 63049 83099 41963 -4947 -45368 -2959 18141 50857 -4986 2444
842 2444 2861 -59342 50248 30721 7283 36763 -12696 81762 103133 61143 68739 124262 -577
829 -577 -50421 -38712 -90698 -45966 -47955 -29360 -27146 -10985 -100397 -50362 -32696 7727 -28714
816 -28714 -109064 -43969 -62031 -47073 -83339 -37340 -50469 -75170 -38232 -98140 -91547 -8441
804 -8441 36503 39900 -51627 -28604 61231 62622 48134 20468 77399 64408 88345 127752 73978
791 73978 36553 23473 68953 -12195 -73788 -43309 -29324 -1516 -81763 -51667 -82410 7243
779 7243 24260 -18039 44560 -27017 7952 -76054 -100465 -57209 -45958 -124916 -4997 82081
767 82081 -25394 -59433 -2545 -76694 -16890 33269 15288 -28300 -109021 -151346 -192588 -86093
755 -86093 -3788 29259 -46491 -17948 -25236 101610 42242 -21547 -15676 31658 90521 64688
743 64688 29167 -23918 94440 33579 -11386 -37661 37706 63388 18160 21878 -65543 -16193
731 -16193 86069 33340 -25645 -54198 -14758 -9645 -29559 54963 33360 148040 118491 79256
719 79256 127342 64254 23272 -60561 -49680 -55056 -69071 -15157 62031 37815 7876 111934
707 111934 -10744 -24593 -50168 -70048 -59453 -6529 -78671 -144325 44413 65160 -68190
696 -68190 -1021 74425 41714 94333 86940 56617 96819 114308 34503 97230 62014 59306
684 59306 31963 -49490 -52658 43593 82203 -51372 13470 -3686 53356 17883 -47973 -9060
672 -9060 -15285 -19930 -40208 -48459 -53040 -3550 141023 114983 66760 87592 139203 108006 146257
659 146257 123685 76187 78273 63409 67924 -30294 30387 37318 93144 140533 94988 127827
647 127827 90142 35454 19927 -24585 -29440 62997 69474 -85840 -69936 -78740 6191 116268
635 116268 111107 41231 -11699 -106837 -74528 -83723 -66421 -10888 35547 71920 164206 102887
623 102887 49719 -30986 92917 158476 15903 -20159 16197 48833 78138 -2537 66433
612 66433 97326 18424 -18810 -39146 52215 -43927 -6294 73524 103574 94891 41533 -116932
600 -116932 -160808 -115706 -13165 -2312 -10664 -36646 -11515 32169 28661 -26737 57929 131523
588 131523 -15982 -42089 -45579 -82868 -465 -48315 -67660 -43011 -15951 29532 58014 -23494
576 -23494 -114617 77953 45546 69379 24192 47957 101459 93286 17084 30991 25487 -6021
564 -6021 68213 96367 149742 57809 63608 37176 36707 100883 80964 -10830 -26672 -54699 -12183
551 -12183 78025 66745 74340 180985 177849 157868 52077 -50386 167196 155971 105375 106748
539 106748 115562 92581 40907 -33989 -63557 -16419 1232 11643 -13005 6495 -76102 -162278
527 -162278 -173391 -106844 -13266 5311 53563 126097 61765 -19045 -1203 -41493 -48875 7504
515 7504 -72822 23764 129424 79939 84128 92074 55865 34139 -72528 -18870 -8165 41488
503 41488 19935 -16019 -77581 -71133 30167 -25693 15439 47592 -17126 5631 -50831 -85395
491 -85395 17299 14627 46804 101631 -26394 16175 15904 28798 114497 160781 83183 63870
479 63870 57441 6721 1430 24687 116737 92584 102084 86885 31262 53645 62701 -22083 -166033
466 -166033 -29565 57280 81328 116223 30702 53118 39342 -26168 -88754 -43429 -114643 -84115
454 -84115 -65860 -117915 -52535 -79314 -100782 -25812 16919 -9950 5225 -59766 -78251 -57440
442 -57440 -50652 46420 81561 74337 127729 -16774 -97096 -33530 -47321 -71256 -105736 -115779
430 -115779 -45457 -95064 -78436 -111062 -64651 28967 46043 93605 8759 73430 75926 96395
418 96395 42554 -28813 -58121 -15649 38922 38990 2855 24687 -75550 -40067 -1080 59044
406 59044 55380 70575 48303 89276 10776 107282 64728 47149 116256 72733 1820 90075
394 90075 79153 77486 81443 53038 53171 72991 106206 129810 111766 99815 154551 49336 81704
381 81704 114710 62687 52257 65706 51646 118675 78504 77825 122251 138576 186364 154208
369 154208 141972 102243 71302 43074 45052 -50382 5027 89632 38770 67877 49453 68162
357 68162 49518 76177 54490 46689 24588 73626 88269 43810 28010 164851 79859 74203
345 74203 34276 57144 83890 29428 41111 66751 71404 126802 83062 19158 -18292 -4916
333 -4916 25394 103582 -1579 -19403 45266 26981 134349 80318 -41482 -16156 53017 98710
321 98710 156467 168354 235434 125550 54004 20796 79749 198708 90033 47084 1709
310 1709 87525 48659 9722 100071 136191 121863 132600 117915 -28518 40153 75883 -2057
298 -2057 3517 71305 51048 22743 -48303 12920 92975 17894 30123 59624 96039 13322
286 13322 -3303 119541 140362 22040 -200 -40403 -91649 -34697 55230 16259 61279 163760
274 163760 232454 193896 126284 23040 69133 123336 119240 114245 126982 146704 79044 116032
262 116032 101407 105819 79448 96086 192070 210384 175357 64105 60407 158838 142056 129808
250 129808 32609 -25340 15806 52850 33803 197492 293238 156167 93299 19657 67942
239 67942 53591 110669 81984 -7652 18211 42413 57119 69350 195454 53765 7411 -16566
227 -16566 -2053 -18218 36282 12489 51249 58968 79184 126301 -36112 56218 143002 117896
215 117896 115054 76069 87845 63332 45496 118933 141616 76891 53630 51736 36165 86170
203 86170 76416 -33435 -941 42953 11123 40395 84391 65984 135879 120862 126758 63980
191 63980 -9144 -20172 -3931 17091 55790 39033 76837 22294 44046 92243 36402 91669
179 91669 54873 46061 98616 121865 180203 153841 84382 31659 12129 40197 32878 54199
167 54199 74167 86747 119435 220943 250484 163996 114061 177207 77315 11296 108637 46982
155 46982 31471 9700 19194 57237 52478 78279 61098 136964 205005 132872 71279 81004 125019
142 125019 128652 22117 80297 126096 103277 49206 29863 -45165 46938 50724 17176 99935
130 99935 95513 41596 123532 174024 -12940 -13477 29891 79158 112280 134181 97224 68292
118 68292 157141 149129 161696 105157 82239 9845 2012 -6881 29824 93835 13640 43087 41977
105 41977 6726 50975 29311 7771 63074 23504 102317 160255 156537 145716 47797 106628
93 106628 62746 -2810 5339 56418 79822 36668 43343 100193 82363 171305 115045 38255
81 38255 79261 92139 78492 83789 70698 56281 8917 16778 -33230 -21414 13077 103290 85593
68 85593 -5912 40762 100793 62938 89107 167800 46488 6698 25845 131409 106326 85333
56 85333 125391 175876 87837 41761 63822 105682 147687 146632 128308 124002 45977 6160 -8442
43 -8442 47440 77519 145387 82274 67498 131410 68742 140896 137704 114488 84812 27854 48787
30 48787 84000 49660 24331 54513 65052 7079 52799 112986 148042 109281 126041 113552
18 113552 60609 94994 64737 65347 58495 -15304 -5292 51206 55392 58047 77342 83303 75232
5 75232 156206 132891 125746 31513 -16817
0 -16817
$$ Imaginary data points
##PAGE= N=2
##DATA TABLE= (X++(I..I)), XYDATA
16383 -919501 -909564 -909342 -849007 -851867 -908420 -939239 -877958 -788287 -793899 -694726 -650993 -647599 -669477
16370 -669477 -658127 -614712 -706332 -716600 -654507 -689784 -687707 -657556 -601694 -557408 -548207 -500547
16358 -500547 -445224 -351452 -316513 -376028 -387624 -297188 -266684 -251969 -282451 -368573 -338118
16347 -338118 -203706 -243672 -253231 -176303 -171051 -178640 -131014 -52911 -9297 -30462 -9040 5462
16335 5462 -14054 -3620 14036 110824 107212 37704 93819 170948 216588 253699 219512 199042
16323 199042 232998 261405 325693 278446 296821 378659 422060 329944 365220 370661 389094 484351
16311 484351 524672 518875 533252 523979 562856 599126 574478 579149 550842 598100 617316 583396
16299 583396 586410 585309 667872 671648 695279 712460 774820 849723 804240 761046 745183 851118
16287 851118 862006 879794 874300 836097 836423 793206 870571 935221 904975 898690 876214 929316
16275 929316 967264 1056053 1021003 1000225 1054223 1026802 1131231 1169289 1169003 1176282 1093571 1178961
16263 1178961 1192799 1215975 1243667 1236238 1256236 1243798 1199140 1339283 1326730 1310976 1405522
16252 1405522 1425959 1378282 1319714 1337672 1353512 1385546 1421204 1369678 1452298 1557947 1531848
16241 1531848 1462312 1443280 1535205 1549631 1533762 1510997 1496078 1442141 1444089 1532900 1602129
16230 1602129 1597165 1610211 1534598 1572332 1583360 1621561 1635038 1576038 1542992 1561050 1621502
16219 1621502 1702223 1723114 1765619 1792789 1649100 1666994 1762208 1781776 1734256 1649201 1717165
16208 1717165 1791746 1804593 1864640 1833493 1786504 1811546 1818662 1832285 1781207 1831845 1886027
16197 1886027 1842904 1883733 1877801 1872366 1914478 1893955 1944652 1927966 2012844 2000108 1979738 2004707
16185 2004707 1920529 1897235 1918156 1873278 1893054 1958465 2012697 1941143 1958365 2049784 2056521
16174 2056521 2140608 2026961 1967129 1854421 1925361 2125339 2099903 2089625 2078853 1995507 2035203
16163 2035203 2003419 2041452 1975102 2053321 2146838 2105624 2061869 2071843 2099137 2068806 2074830 2067755
16151 2067755 2011343 2032711 2101089 2142939 2068952 2027717 2166443 2195061 2070754 2007053 2089632
16140 2089632 2163269 2058151 1994182 2048352 2113285 2132400 2154025 2224651 2275444 2199195 2136172
16129 2136172 2162220 2156153 2169049 2102979 2079481 2156957 2193242 2250473 2279408 2312091 2314342 2216440
16117 2216440 2225250 2180969 2209904 2163901 2136940 2162050 2170879 2217664 2230472 2236817 2202501 2166939
16105 2166939 2197551 2189385 2229634 2295643 2332897 2284012 2199078 2311592 2289347 2224171 2187034
16094 2187034 2271214 2224278 2222010 2282529 2231832 2219037 2161249 2214783 2150249 2189807 2271417
16083 2271417 2297738 2310639 2268203 2222080 2208948 2257224 2299984 2243463 2266354 2282766 2238953
16072 2238953 2311297 2287993 2320250 2281602 2236207 2284308 2355733 2310365 2197234 2284324 2222182
16061 2222182 2233431 2265829 2291176 2293517 2367191 2340788 2260480 2294930 2327654 2401654 2387996
16050 2387996 2369574 2295075 2361547 2353525 2415388 2358861 2200797 2204455 2255371 2290746 2204998
16039 2204998 2238898 2253838 2226791 2220370 2369054 2333837 2338838 2387377 2354746 2362930 2360696 2310103
16027 2310103 2402100 2401052 2348014 2317322 2342522 2290737 2212037 2312332 2303169 2318564 2339116
16016 2339116 2315570 2236861 2292206 2260699 2265757 2308235 2244728 2271373 2391671 2349660 2515857
16005 2515857 2460806 2355275 2331310 2304134 2307862 2361382 2401012 2382241 2363866 2258327 2274576
15994 2274576 2281367 2373014 2406981 2408666 2282803 2284744 2303686 2299450 2290739 2392375 2359791 2354468
15982 2354468 2302878 2327215 2375428 2377457 2341287 2337191 2343345 2378469 2325120 2297499 2304334 2259404
15970 2259404 2323890 2341306 2259877 2194573 2283902 2330633 2371179 2294173 2365868 2244536 2256729
15959 2256729 2277658 2341546 2272236 2144760 2340093 2332344 2335518 2312145 2293405 2304453 2324695
15948 2324695 2297898 2291759 2397842 2353767 2365840 2306819 2263200 2233582 2369089 2311405 2323505
15937 2323505 2262781 2257256 2259096 2196058 2247650 2327869 2371514 2298439 2417144 2330906 2312356
15926 2312356 2399236 2327607 2351798 2409020 2362687 2208793 2201147 2199031 2163664 2200421 2273345
15915 2273345 2271818 2257061 2284671 2259413 2376151 2345527 2362214 2331808 2235331 2280797 2275726
15904 2275726 2306429 2340019 2386878 2385863 2427997 2419946 2342402 2398109 2339924 2246336 2302587 2305136
15892 2305136 2122078 2159077 2229788 2283142 2268942 2186065 2254990 2317253 2247522 2165776 2236400
15881 2236400 2306021 2292817 2312052 2338677 2317457 2401661 2382648 2304359 2293857 2344834 2386240
15870 2386240 2448902 2365281 2385827 2497378 2365854 2282917 2231561 2233926 2359211 2402044 2355764
15859 2355764 2383436 2415930 2390415 2466904 2461394 2504632 2413180 2354823 2374929 2369525 2464152 2371909
15847 2371909 2375967 2492889 2427509 2320731 2276988 2214871 2272172 2270825 2340544 2343826 2305829
15836 2305829 2292032 2264087 2309594 2439344 2383758 2410656 2317988 2244456 2283615 2357098 2340245
15825 2340245 2285222 2385068 2413613 2356452 2366491 2303970 2212535 2312603 2359012 2323350 2454881
15814 2454881 2472198 2486655 2451287 2425558 2422855 2297783 2247757 2298358 2220606 2248549 2317226
15803 2317226 2403440 2348447 2259882 2273039 2171039 2248366 2330129 2414256 2351069 2353265 2371673
15792 2371673 2424631 2521034 2540340 2549665 2469040 2382181 2374855 2418714 2353839 2383362 2408112 2443068
15780 2443068 2386283 2261835 2283258 2338283 2436730 2377240 2335689 2190703 2268021 2253515 2287993
15769 2287993 2427838 2436965 2348312 2338123 2345572 2329020 2270452 2385680 2355172 2322533 2394254
15758 2394254 2337742 2321345 2330456 2323160 2159192 2277007 2392489 2397724 2392218 2401462 2358907 2413328
15746 2413328 2347287 2387102 2459460 2370421 2307371 2305422 2314861 2371475 2339955 2342616 2494676 2497820
15734 2497820 2402942 2337401 2409296 2341706 2341736 2385649 2376674 2468859 2417777 2288226 2297079 2424825
15722 2424825 2446012 2428294 2420907 2345285 2272787 2362302 2383822 2359356 2458833 2410259 2470351
15711 2470351 2390958 2355034 2415470 2440603 2393414 2343281 2478275 2536737 2536687 2463187 2422004 2489041
15699 2489041 2369796 2401232 2402463 2502023 2460569 2480751 2475123 2422031 2413886 2343590 2385454 2430384
15687 2430384 2463673 2469742 2358110 2263994 2329813 2320875 2362148 2360538 2295922 2334828 2404833 2305127
15675 2305127 2338760 2421625 2461487 2437539 2353660 2351122 2436583 2546715 2448716 2399411 2413480
15664 2413480 2482444 2469222 2452437 2409536 2403076 2359717 2439732 2470595 2365877 2352165 2343663
15653 2343663 2330426 2307981 2445519 2452891 2502390 2514204 2613341 2494151 2384280 2394727 2525419
15642 2525419 2388919 2439796 2398496 2404569 2398341 2410709 2454607 2334537 2348713 2370853 2444190
15631 2444190 2403796 2364621 2466660 2406847 2394413 2452891 2327440 2392478 2420992 2447877 2416915
15620 2416915 2360818 2408707 2426804 2335464 2338201 2372170 2434609 2450131 2456249 2377155 2401570 2487627
15608 2487627 2478053 2536037 2465030 2439549 2375491 2371442 2423948 2409494 2429405 2501046 2513909 2499874
15596 2499874 2474825 2408909 2385132 2394598 2349877 2393192 2419156 2347903 2342957 2418794 2402036 2342324
15584 2342324 2480068 2468219 2430461 2362460 2411821 2350353 2318104 2408002 2470041 2408116 2420135
15573 2420135 2408213 2376182 2422032 2472896 2445189 2423953 2462775 2410258 2468289 2453110 2369149
15562 2369149 2381408 2363851 2423824 2493776 2448584 2464109 2390633 2429949 2350470 2265720 2299672
15551 2299672 2344164 2339462 2414388 2435074 2410675 2421246 2481872 2369066 2346948 2328376 2423719
15540 2423719 2540575 2480926 2404793 2445648 2459848 2514402 2391507 2388453 2539668 2533411 2506018
15529 2506018 2481513 2524400 2411098 2410518 2383747 2348994 2315928 2451403 2475765 2580717 2500424
15518 2500424 2478327 2467508 2484960 2496219 2382992 2410349 2499818 2532237 2492851 2441290 2424402
15507 2424402 2418225 2501011 2447445 2403366 2322310 2475658 2465375 2548233 2552999 2442430 2535003
15496 2535003 2465253 2407922 2471721 2448119 2412373 2468618 2495779 2433374 2517228 2518613 2302307
15485 2302307 2309962 2328395 2394728 2417014 2431023 2434017 2419539 2334607 2385864 2463990 2483397 2523211
15473 2523211 2540192 2462124 2444357 2375669 2409721 2390498 2459444 2529565 2443169 2407207 2382332
15462 2382332 2350736 2456844 2480618 2487549 2426263 2425820 2492460 2589378 2526188 2465549 2366401 2375410
15450 2375410 2524869 2429686 2445428 2471242 2513435 2571105 2508318 2512696 2604346 2598057 2481496
15439 2481496 2545418 2544193 2540850 2527619 2425950 2392554 2445909 2436244 2443985 2460306 2479850 2447371
15427 2447371 2344446 2399196 2384460 2413298 2439235 2476583 2496300 2504116 2433203 2475856 2493908
15416 2493908 2545740 2575255 2497165 2428318 2383765 2379078 2405091 2431066 2378742 2362314 2445374
15405 2445374 2469256 2479884 2405807 2402536 2378990 2454963 2482509 2449204 2408009 2364174 2414715
15394 2414715 2380686 2329581 2377200 2443980 2486542 2553233 2508968 2410828 2464765 2616345 2585195
15383 2585195 2538862 2557569 2550190 2494563 2425209 2391655 2465079 2439716 2356688 2463434 2541140
15372 2541140 2465129 2357799 2424463 2382606 2388306 2480188 2455320 2559297 2600482 2443860 2452385
15361 2452385 2401851 2336342 2400752 2382254 2451481 2500947 2540414 2439656 2495919 2490175 2477300
15350 2477300 2494963 2451488 2502221 2476724 2399676 2445226 2474990 2429692 2462040 2484312 2457842
15339 2457842 2517059 2630317 2618527 2504431 2473771 2426464 2500178 2509242 2451569 2461663 2483112
15328 2483112 2479587 2511751 2515794 2457025 2489843 2568145 2535083 2428604 2481651 2490495 2526790 2605235
15316 2605235 2495799 2469053 2534769 2540660 2518719 2555379 2555000 2535019 2536398 2547181 2477068 2450579
15304 2450579 2463769 2451334 2476613 2544867 2621890 2598572 2646564 2599076 2510248 2533356 2536915
15293 2536915 2535723 2569308 2641004 2623788 2552432 2660152 2592827 2506836 2497082 2565866 2597287
15282 2597287 2638258 2675632 2671881 2622884 2521864 2528643 2497639 2438498 2539289 2611071 2667582
15271 2667582 2526837 2540236 2512480 2633759 2614236 2509882 2511532 2477146 2463816 2396860 2437876
15260 2437876 2412624 2462205 2509270 2566418 2556454 2558580 2476676 2432617 2473618 2520274 2523991 2512404
15248 2512404 2484715 2513218 2566846 2567259 2445117 2481042 2594062 2489173 2522632 2531695 2397146
15237 2397146 2439431 2517754 2453821 2526487 2572230 2579689 2581852 2452683 2473219 2459351 2447397
15226 2447397 2511880 2557532 2531659 2612244 2610055 2568882 2649346 2521598 2444427 2567205 2550258
15215 2550258 2564023 2486030 2471998 2545741 2566761 2602310 2585197 2525939 2498821 2553891 2606380
15204 2606380 2585704 2486107 2479806 2519376 2619541 2733046 2680877 2589487 2473561 2455697 2447171
15193 2447171 2545738 2594404 2611672 2669290 2638274 2569436 2510282 2582319 2572239 2552367 2494485
15182 2494485 2574545 2604629 2537422 2622152 2651903 2654936 2617484 2585328 2570464 2588129 2588051 2597433
15170 2597433 2618612 2527271 2454122 2355756 2413073 2478681 2536829 2551248 2533416 2452410 2555607
15159 2555607 2556148 2501004 2545910 2519326 2497207 2454719 2542808 2633250 2590580 2612908 2588042 2590060
15147 2590060 2646329 2616328 2597289 2562847 2492063 2415840 2480636 2550430 2578311 2552569 2544443
15136 2544443 2556168 2565993 2513740 2523553 2496847 2445747 2557546 2462192 2456976 2508829 2477786 2504657
15124 2504657 2544043 2498823 2530287 2468147 2474699 2484400 2434720 2505903 2537824 2553858 2465311 2506454
15112 2506454 2496889 2522044 2509477 2543412 2551046 2541969 2600876 2519190 2562498 2625093 2527461 2580909
15100 2580909 2638038 2624131 2602018 2611562 2527820 2506384 2585609 2563955 2528519 2583828 2542196
15089 2542196 2505840 2526088 2485543 2467980 2583586 2497864 2507340 2540359 2447994 2396086 2479865
15078 2479865 2507031 2528914 2594337 2498366 2607742 2608272 2704169 2719316 2679769 2630678 2657934
15067 2657934 2620921 2453508 2530467 2547290 2532162 2603506 2634866 2648552 2802396 2669154 2588007
15056 2588007 2552304 2499454 2541200 2498430 2559409 2565522 2539108 2474018 2475395 2491899 2486778 2507355
15044 2507355 2420230 2480373 2503490 2516338 2578848 2620009 2569459 2539761 2537538 2562534 2574203
15033 2574203 2545809 2595234 2529361 2466183 2575641 2476999 2465649 2562694 2475567 2551018 2613632
15022 2613632 2579528 2526605 2574498 2544643 2503870 2560695 2531954 2493528 2499362 2464465 2457647 2569888
$$ [...]
##END NTUPLES=NMR SPECTRUM
##END=
