##TITLE=1H_EC-3265(III-11)
 CDCl3
 8 sc, 
 8.02.2022
##JCAMPDX= 6.0         $$ Bruker NMR JCAMP-DX V2.0
##DATA TYPE= NMR SPECTRUM
##DATA CLASS= NTUPLES
##ORIGIN= UXNMR, Bruker Analytische Messtechnik GmbH
##OWNER= root
$$ XWIN-NMR		Version 3.5
$$ Tue Feb  8 12:38:36 2022 Russian Standard Time (UT+4h)  she@DPX200
##.OBSERVE FREQUENCY= 200.131346
##.OBSERVE NUCLEUS= ^1H
##.ACQUISITION MODE= SIMULTANEOUS
##.ACQUISITION SCHEME= undefined
##.AVERAGES= 8
##.DIGITISER RES= 18
##SPECTROMETER/DATA SYSTEM= spect
##.PULSE SEQUENCE= zg30
##.SOLVENT NAME= CDCl3
##.SHIFT REFERENCE= (INTERNAL, CDCl3, 0, 15.7282)
##AUDIT TRAIL= $$ (NUMBER, WHEN, WHO, WHERE, WHAT)
$$ ##TITLE= Audit trail, XWIN-NMR		Version 3.5
$$ ##JCAMPDX= 5.01
$$ ##ORIGIN= Bruker BioSpin GmbH
$$ ##OWNER= she
$$ F:/spectra/data/she/nmr/H-F/1/pdata/1/auditp.txt
$$ ##AUDIT TRAIL=  $$ (NUMBER, WHEN, WHO, WHERE, WHAT)
(   1,<2022-02-08 12:35:51.87 +0400>,<she>,<DPX200>,
      <created by zg, POWCHK disabled, PULCHK disabled
       configuration hash MD5:
       00 E9 B6 7A A2 85 ED C7 34 08 36 98 17 FE 4E 26
       data hash MD5: 16K
       36 9B F1 6A B9 22 04 7C D6 59 04 76 15 FA 51 CD>)
(   2,<2022-02-08 12:36:12.18 +0400>,<she>,<DPX200>,
      <Start of raw data processing
       efp BC_mod = 2 LB = 0.24 FT_mod = 6 PKNL = 1 PHC0 = -15867.93 PHC1 = 10.00078 SI = 16K 
       data hash MD5: 16K
       80 00 1A 91 F7 A0 9A F0 1F 72 1A 21 7F E0 64 1B>)
(   3,<2022-02-08 12:36:30.43 +0400>,<she>,<DPX200>,
      <pk PHC0 = -1.914003 PHC1 = 1.2 
       data hash MD5: 16K
       65 32 16 45 27 7A A2 41 BA 89 56 20 9B B8 97 47>)
(   4,<2022-02-08 12:36:34.75 +0400>,<she>,<DPX200>,
      <abs ABSG = 5 
       data hash MD5: 16K
       4B 6D A0 3D 2E E7 07 06 3B 0E 06 8E 18 D1 D9 9A>)
$$ ##END=
$$ 
$$ hash MD5
$$ A1 9B A7 2C 6B 14 66 78 AB FF 03 B9 A0 E6 CF 01
##$RELAX= 
##$RELAX= 
##$RELAX= 
##$RELAX= 
##$RELAX= 
##$RELAX= 
$$ Bruker specific parameters
$$ --------------------------
##$DU= <F:/spectra>
##$EXPNO= 1
##$NAME= <H-F>
##$PROCNO= 1
##$TYPE= <nmr>
##$USER= <she>
##$AMP= (0..31)
100 100 100 100 100 100 100 100 100 100 100 100 100 100 100 100 100 100 
100 100 100 100 100 100 100 100 100 100 100 100 100 100 
##$AQSEQ= 0
##$AQ_mod= 1
##$AUNM= <au_zg>
##$AUTOPOS= <>
##$BF1= 200.13
##$BF2= 200.13
##$BF3= 200.13
##$BF4= 200.13
##$BF5= 200.13
##$BF6= 200.13
##$BF7= 200.13
##$BF8= 200.13
##$BYTORDA= 1
##$CFDGTYP= 0
##$CFRGTYP= 5
##$CHEMSTR= <none>
##$CNST= (0..31)
1 1 145 1 1 1 1 1 1 1 1 1 1 1 1 1 1 1 1 1 1 1 1 1 1 1 1 1 1 1 1 1 
##$CPDPRG= <>
##$CPDPRG1= <>
##$CPDPRG2= <>
##$CPDPRG3= <>
##$CPDPRG4= <mlev>
##$CPDPRG5= <mlev>
##$CPDPRG6= <mlev>
##$CPDPRG7= <mlev>
##$CPDPRG8= <mlev>
##$CPDPRGB= <>
##$CPDPRGT= <>
##$D= (0..31)
0 1.2 0 0 0 0 0 0 0 0.06 0 0.03 0 0 0 0 0.0002 0 0 0 0 0 0 0 0 0 0 0 0 
0 0 0 
##$DATE= 1644309351
##$DBL= (0..7)
120 120 120 120 120 120 120 120 
##$DBP= (0..7)
150 150 150 150 150 150 150 150 
##$DBP07= 0
##$DBPNAM0= <>
##$DBPNAM1= <>
##$DBPNAM2= <>
##$DBPNAM3= <>
##$DBPNAM4= <>
$$ [...]
##$SUBNAM2= <"">
##$SUBNAM3= <"">
##$SUBNAM4= <"">
##$SUBNAM5= <"">
##$SUBNAM6= <"">
##$SUBNAM7= <"">
##$SUBNAM8= <"">
##$SUBNAM9= <"">
##$SW= 18.0517287032376
##$SWIBOX= (0..15)
0 0 2 0 0 0 0 0 0 0 0 0 0 0 0 0 
##$SW_h= 3612.71676300578
##$TD= 16384
##$TD0= 1
##$TE= 0
##$TE2= 300
##$TE3= 300
##$TEG= 300
##$TL= (0..7)
0 120 120 120 120 120 120 120 
##$TP= (0..7)
150 150 150 150 150 150 150 150 
##$TP07= 0
##$TPNAME0= <>
##$TPNAME1= <>
##$TPNAME2= <>
##$TPNAME3= <>
##$TPNAME4= <>
##$TPNAME5= <>
##$TPNAME6= <>
##$TPNAME7= <>
##$TPOAL= (0..7)
0.5 0.5 0.5 0.5 0.5 0.5 0.5 0.5 
##$TPOFFS= (0..7)
0 0 0 0 0 0 0 0 
##$TUNHIN= 0
##$TUNHOUT= 0
##$TUNXOUT= 0
##$USERA1= <user>
##$USERA2= <user>
##$USERA3= <user>
##$USERA4= <user>
##$USERA5= <user>
##$V9= 5
##$VALIST= <valist>
##$VCLIST= <CCCCCCCCCCCCCCC>
##$VD= 0
##$VDLIST= <DDDDDDDDDDDDDDD>
##$VPLIST= <PPPPPPPPPPPPPPP>
##$VTLIST= <TTTTTTTTTTTTTTT>
##$WBST= 1024
##$WBSW= 4
##$XGAIN= (0..3)
0 0 0 0 
##$XL= 0
##$YL= 0
##$YMAX_a= 347918
##$YMIN_a= -566615
##$ZGOPTNS= <>
##$ZL1= 120
##$ZL2= 120
##$ZL3= 120
##$ZL4= 120
##$ABSF1= 15.71494
##$ABSF2= -2.336909
##$ABSG= 5
##$ABSL= 3
##$ALPHA= 0
##$AQORDER= 0
##$ASSFAC= 0
##$ASSFACI= 0
##$ASSFACX= 0
##$ASSWID= 0
##$AUNMP= <proc_1d>
##$AZFE= 0.1
##$AZFW= 0.1
##$BCFW= 0
##$BC_mod= 2
##$BYTORDP= 0
##$COROFFS= 0
##$CY= -3
##$DATMOD= 1
##$DC= 0
##$DFILT= <>
##$DTYPP= 0
##$F1P= 0
##$F2P= 0
##$FCOR= 1
##$FTSIZE= 16384
##$FT_mod= 6
##$GAMMA= 0
##$GB= 0
##$INTBC= 1
##$INTSCL= 0
##$ISEN= 128
##$LB= 0.24
##$LEV0= 0
##$LPBIN= 0
##$MAXI= 10000
##$MC2= 0
##$MEAN= 0
##$ME_mod= 0
##$MI= 1.114404
##$NCOEF= 0
##$NC_proc= -6
##$NLEV= 6
##$NOISF1= 3.799351
##$NOISF2= 2.8
##$NSP= 0
##$NTH_PI= 0
##$NZP= 0
##$OFFSET= 15.72816
##$PC= 1
##$PHC0= -15869.84
##$PHC1= 11.20078
##$PH_mod= 1
##$PKNL= yes
##$PPARMOD= 0
##$PSCAL= 0
##$PSIGN= 0
##$REVERSE= no
##$SF= 200.130004682899
##$SI= 16384
##$SIGF1= 3
##$SIGF2= 2
##$SINO= 5.538805
##$SIOLD= 16384
##$SREGLST= <1H.CDCl3>
##$SSB= 0
##$STSI= 16384
##$STSR= 0
##$SW_p= 3612.71676300578
##$SYMM= 0
##$S_DEV= 0
##$TDeff= 16384
##$TDoff= 0
##$TI= <>
##$TILT= no
##$TM1= 0
##$TM2= 0
##$TOPLEV= 0
##$USERP1= <user>
##$USERP2= <user>
##$USERP3= <user>
##$USERP4= <user>
##$USERP5= <user>
##$WDW= 1
##$XDIM= 16384
##$YMAX_p= 434231123
##$YMIN_p= -444585
$$ End of Bruker specific parameters
$$ ---------------------------------
##NTUPLES= NMR SPECTRUM
##VAR_NAME=  FREQUENCY,     SPECTRUM/REAL,   SPECTRUM/IMAG
##SYMBOL=    X,             R,               I
##VAR_TYPE=  INDEPENDENT,   DEPENDENT,       DEPENDENT
##VAR_FORM=  AFFN,          ASDF,            ASDF
##VAR_DIM=   16384,         16384,           16384
##UNITS=     HZ,            ARBITRARY UNITS, ARBITRARY UNITS
##FACTOR=    0.220516191357247, 1,           1
##FIRST=     3147.67671533696, 0,            0
##LAST=      -465.040047668817, 0,           0
##MIN=       -465.040047668817, -444585,     0
##MAX=       3147.67671533696, 434231123,    0
$$ Real data points
##PAGE= N=1
##DATA TABLE= (X++(R..R)), XYDATA
$$ [...]
7833a26823N2157j5915N0084m6338r4652J08429K6503m5506M901l0150k2929l8391
7821a78630O939J2545M3913L5374J2018l2596m1771J6152P4901J02677k3390l359
7809B4773k3171j45460Q0378P7112k0750m6171J7861o8598j09748n6437j74374
7798d44585P4447K80675r4428m562q8480L4606P5149j06835L5309N9192O9585
7787a09927P660J004L0469L3289j16474L6537K7924l8165m811L7052J8910O788
7775f9744J9575j46241P3031Q2632O7691o0629o4825L3567N4162Q0540n1498j60657
7763a42396O4223M5852k2852M6737l8511p7230L3809Q088M0016N197k3790m6829
7751a07686k9265p8995q584Q1793K660m3054O179N3576o1141J5281M6116o53k1885
$$ plain form
7833 -126823 -74666 -90581 -40497 -86835 -181487 -73058 -46555 -92061 -87160 -117310 -140239 -178630
7821 -178630 -171691 -159146 -115233 -79859 -67841 -100437 -142208 -126056 -51155 51522 28132 24773
7809 24773 1602 -143858 -63480 13632 -7118 -53289 -35428 -104026 -213774 -270211 -444585
7798 -444585 -370138 -89463 -183891 -188453 -276933 -242327 -167178 -274013 -238704 -179512 -109927
7787 -109927 -102267 -101263 -70794 -37505 -153979 -117442 -89518 -127683 -132494 -95442 -76532 -69744
7775 -69744 -50169 -196410 -123379 -40747 26944 -33685 -98510 -64943 -10781 69759 18261 -142396
7763 -142396 -78173 -32321 -55173 -8436 -46947 -124177 -90368 -82280 -42264 -37067 -60857 -107686
7751 -107686 -136951 -215946 -224530 -142737 -140077 -183131 -176952 -123376 -184517 -169236 -123120 -123773 -145658
7738a45658N9754M1189j1500o8145k287K1105q3635K0453K7821o0276J04155l8534
7726a35558m9260J70045M7198J4317j7197j56079l3335P6895O0745k8185k1295
7715g1709R5164m0860O1312p5405j58389O9987N8357L0565L3900j3970L214k8013
7703c5847L4118N2091l3099O1271o7083q3523p8946J25171N838j20355M9412L6795
7691e4157j7663J02253k0325o6313o365O4001m4310l6211K6520k962l3064M6955
7679d1641J8916o4413N8471k7183j3923J07571O923l0071K4485K9309o344m0397
7667B1703L723l6645J51324m806k9903R368M124J65484p4673L2241O8010q1085
7655B28865j14611m095p533n3588J8585L5230o8243J4473K5442r0396J46859M0701
$$ plain form
7738 -145658 -85904 -44715 -56215 -124360 -126647 -105542 -189177 -168724 -140903 -201179 -97024 -135558
7726 -135558 -184818 -14773 32425 46742 29545 -126534 -159869 -82974 -22229 -50414 -71709
7715 -71709 23455 -17405 43907 -31498 -189887 -119900 -61543 -30978 2922 -11048 -7834 -35847
7703 -35847 -1729 50362 17263 78534 11451 -72072 -151018 -25847 -20009 -140364 -90952 -54157
7691 -54157 -71820 30433 10108 -56205 -62570 1431 -42879 -79090 -52570 -55532 -88596 -41641
7679 -41641 -22725 -87138 -28667 -55850 -69773 37798 44721 14650 39135 68444 62100 21703
7667 21703 25426 -11219 140105 135299 105396 114764 118888 284372 209699 241940 309950 228865
7655 228865 114254 110159 102626 49038 67623 102853 34610 49083 74525 -15871 130988 171689
7643A71689j10227r4541j5555k6093L005J052N1910q0574R6227P0254L412q5031
7631a4472p8023J22659o0357K5023k9158P9642o49r2052M1999J0551l3656K170
7619b6323l5261k5032j4568O3273r4335O6083J2504K2508p8158N406M2136j303
7607f3070L2122m3862O0858j1798l7435n7129q772O1577M4607J4946j7356j05452
7595a30764M1488J9873J5269n7260M3205P1952k080n4310J692P9407r1078p7032
7583a39638M2173L1179N2177L4025J65846j09113j79073J4270N6585J21717J841
7572I1989j01301K736P061n879P1422m8153M2385M3975j06671L5838m7436m7188
7560f1222L0032M8399m5285J11887j0036q7122R428J7715P1155r4581J05410P3818
$$ plain form
7643 171689 61462 -33079 -48634 -74727 -71722 -70670 -18760 -99334 -3107 67147 70559 -14472
7631 -14472 -92495 30164 -30193 -5170 -34328 45314 44665 -47387 -5388 5163 -28493 -26323
7619 -26323 -61584 -86616 -101184 -37911 -132246 -66163 -53659 -31151 -109309 -103903 -61767 -63070
7607 -63070 -30948 -74810 -13952 -25750 -63185 -120314 -129086 -67509 -22902 -7956 -25312 -130764
7595 -130764 -89276 -69403 -54134 -111394 -68189 3763 1683 -52627 -50935 28472 -62606 -139638
7583 -139638 -97465 -66286 -14109 19916 185762 76649 -102424 -88154 -31569 90148 91989
7572 91989 -9312 -6576 485 -5394 66028 17875 60260 104235 -2436 33402 -14034 -61222
7560 -61222 -31190 17209 -28076 83811 73775 -13347 -3919 13796 84951 -9630 95780 169598
7548A69598L2308j4302j29504N7288k0872k6150l5007J4885l1302m2625L7496
7537A1813r372P6285l5596P7157q4957p3926J1779k5950J10828n1174k0357L7979
7525B4509J39718p6203l9399R4923P3069l978j02536P7526l3717q1482M3235k0531
7513I5134L4295K7727L2577k9981o6466K8507Q4727J987l7851n7665l7501J14982
7501A90472l5919P8176O1260m5494j16666J10239N0117k5932N1691O7945N3767
7490D39656O7302N5827M8645J29691J0791r5261j08970O892l4122j12557j27913
7479B79981k9779L9889M0570k9213o7651m7869L2563j39518l8050K05273J9880
7468B66076j4752J1113m5830k4853P458k4809Q1815k2706j12267L373m8661J04902
$$ plain form
7548 169598 201906 187604 58100 115388 94516 68366 33359 48244 16942 -25683 11813
7537 11813 2441 78726 43130 120287 35330 -38596 -26817 -52767 58061 6887 -13470 24509
7525 24509 164227 88024 48625 143548 216617 212639 110103 187629 153912 72430 115665 95134
7513 95134 129429 157156 189733 159752 93286 121793 206520 208507 170656 112991 75490 190472
7501 190472 154553 232729 293989 248495 131829 242068 292185 266253 317944 385889 439656
7490 439656 506958 562785 611430 741121 751912 656651 547681 554573 520451 407894 279981
7479 279981 250202 290091 330661 301448 233797 185928 218491 78973 40923 246196 266076
7468 266076 251324 262437 216607 191754 199212 174403 256218 233512 121245 124618 75957 180859
7456A80859O383m0299K7412k5946K0766Q615O2740n5699l1863K1580l7425P00
7444A37823R5234j02333r872M1880j7684k3714o3773l345J02915L2408M5708P5895
7432C11142n9590r4892j6016R2625o1309l2467L5964l7538k4908L7014M0120m0388
7420A49757O3391L4089k7273q5098M9073N0605l077j505J0811M1205o285k6943
7408B48750K1124R7174q4552k6309l4173q2167q126M8586o5840m0762j6951l7983
7396A8771P148P4067P1298L7038K6904o7512L6055M6498l5442P7131N093j28593
7384A68456q4076m1656L0908R782J33548K5048l2810l0206P342P3237k7716p8977
7372A52880N055Q1537M7658N2536m3123m9914N075J1940M1790K2986M6912j1299
$$ plain form
7456 180859 187242 146943 174355 148409 169175 177790 240530 184831 152968 174548 137123 137823
7444 137823 233057 130724 120852 162732 145048 121334 57561 54216 157131 189539 235247 311142
7432 311142 251552 156660 140644 233269 171960 139493 175457 137919 113011 150025 190145 149757
7420 149757 213148 247237 219964 134866 183939 234544 231467 229962 240773 281978 275693 248750
7408 248750 269874 367048 282496 256187 222014 139847 131721 180307 114467 73705 56754 18771
7396 18771 25919 99986 171284 208322 235226 167714 203769 250267 214825 291956 297049 168456
7384 168456 84380 42724 73632 83414 216962 242010 209200 178994 186336 259573 231857 152880
7372 152880 157935 239472 287130 339666 296543 246629 251704 263644 305434 328420 375332 364033
7360C64033o6930O8505o2386k0022N6486R8767l8020p4277l2778m0968L129P1279
7348C26818J8413M6178k716K6849l0139j26190R477J38165m8636n7643n204k0330
7336B75042P3946l9408N3515O3689L9573K7770K8826k4709n1001n5101k4597J08974
7324D76519M4993o9712O7605P6702j13716P455k9355l94M8947j6209k0548q3118
7312C89169P6281L0515p962K6312j1056N3387L7133o8787j9748l3434j8764O6344
7300E19390O8019k7760O6124o3850l9871j13422L5452J47507L7205K9041l8287
7289F19548l467q6820O74k994q4972Q8952K9155M1806P5524o6484q460o0312K1272
7276E63422P8704L7859p6483M8811Q1943J2880L9629K1974r170N0049O4879K0828
$$ plain form
7360 364033 297103 365608 303222 283200 339686 438453 400433 326156 293378 252410 255539 326818
7348 326818 345231 391409 388693 415542 385403 259213 268690 406855 358219 300576 295372 275042
7336 275042 348988 309580 363095 426784 466357 494127 522953 498244 447243 392142 367545 476519
7324 476519 521512 451800 519405 596107 482391 489846 460491 460097 509044 492835 472287 389169
7312 389169 465450 495965 488003 514315 503259 556646 593779 524992 505244 471810 453046 519390
7300 519390 587409 559649 625773 561923 522052 408630 444082 591589 628794 657835 619548
7289 619548 616081 529261 529935 526941 441969 530921 560076 601882 677406 610922 602462 542150 563422
7276 563422 642126 679985 603502 652313 734256 747136 786765 808739 799569 849618 914497 935325
7264I35325L6532p7655q3452K6983L3857O7530k1935N0578O1914O548q2936l8868
7252I14421N8278Q9485K1193m665m0618K8069n7665L5939M5443q7791N529J35086
7240A142704j11228p945J49198m7620o0781L7525J8072m8358N6064J00792P7172
7229A305595l8254l4108J8195J20490K7328N4350r7190Q5634O4732m4584K2751
7218A484939n8256l4517K7230Q0889J11485P8624j132J7578L027M3681J26955
7207A880503l2717J6659L703Q2475N6079P0865K4169J23810l6209N4482k3918
7196B219901Q166J34769N1161m1581K3294K1323R4843J20458J3471O6709M7082
7185B759596l2383N462P1084n3983R1575J56732p930r0135N9078o2425n5067R0315
$$ plain form
7264 935325 971857 894202 810750 837733 871590 939120 917185 967763 1029677 1036225 953289 914421
7252 914421 972699 1062184 1083377 1078712 1038094 1066163 1008498 1044437 1089880 1002089 1007618 1142704
7240 1142704 1031476 1023531 1172729 1125109 1064328 1101853 1119925 1071567 1127631 1228423 1305595
7229 1305595 1267341 1233233 1251428 1371918 1399246 1453596 1356406 1442040 1506772 1462188 1484939
7218 1484939 1426683 1392166 1419396 1500285 1611770 1690394 1689262 1706840 1709867 1753548 1880503
7207 1880503 1847786 1864445 1868148 1950623 2006702 2077567 2101736 2225546 2189337 2243819 2219901
7196 2219901 2228067 2362836 2413997 2372416 2395710 2417033 2511876 2632334 2645805 2712514 2759596
7185 2759596 2727213 2732675 2803759 2749776 2841351 2998083 2990153 2900018 2959096 2896671 2841604 2931919
7173B931919L7532K081J11568K5392n6769k6030K5420r5778m4690J28139R1586
7162C130370J36698q8828J7460K18716R2652P7494N4154J92056K2353N6470P021
7151C916616N0134k4198J62873J18798Q2589J28181J38603K21506K35014J23981
7141E154097R4500J49037J29593J21788J65104K10250L24281K85227K14185K00330
7131G048392K05578K90450L34889L05363K88232L49083L58769K05678L19129L67915
7121A0073478L17438L33597M29732M04295L80723N49806O28020O71579O74666
7112A4463334O44726P75316R07523J005166J043898J303742J497394J717386K032441
7103B5390926K295102K985972L543751L954245M522391N248323O087505P204466
$$ plain form
7173 2931919 2969451 2971532 3083100 3108492 3051723 3025693 3051113 2955335 2910645 3038784 3130370
7162 3130370 3267068 3178240 3195700 3414416 3507068 3584562 3638716 3830772 3853125 3909595 3916616
7151 3916616 3966750 3942552 4105425 4224223 4306812 4434993 4573596 4795102 5030116 5154097
7141 5154097 5248597 5397634 5527227 5649015 5814119 6024369 6348650 6633877 6848062 7048392
7131 7048392 7253970 7544420 7879309 8184672 8472904 8821987 9180756 9386434 9705563 10073478
7121 10073478 10390916 10724513 11154245 11558540 11939263 12489069 13117089 13788668 14463334
7112 14463334 15108060 15883376 16790899 17796065 18839963 20143705 21641099 23358485 25390926
7103 25390926 27686028 30672000 34215751 38169996 42692387 47940710 54028215 61232681
7095F1232681Q385440J0109369J1985206J3509147J2691397R241565K525692n444007
7087A24236490j2049128j5605615j5651954j3302883j0737605q310793o663506
7080D1915006n372921m569269l739875k869733k373190j941469j576861j393143
7072A8078545j224732j088136j063002r09634q00799o25066o08461m20644m18940
7063A0919131l19797m53626l21576l73887l09189k44465k76656l34026k71995
7054H013914l07232l73286l19805k72822l56945k96031k35971q0755k57118r5636
7044E418313m7122k23360j55659K8309n1981p9319L5208O74j49869M6604J09952
7033D931750l8938J7808J30028K36328N6899L0307n47j04942k91094l81830l63255
$$ plain form
7095 61232681 69618121 79727490 91712696 105221843 117913240 127154805 129680497 124236490
7087 124236490 112187362 96581747 80929793 67626910 56889305 48578512 41915006
7080 41915006 36542085 31972816 28232941 25363208 22990018 21048549 19471688 18078545
7072 18078545 16853813 15765677 14702675 13793041 12992242 12367176 11758715 11338071 10919131
7063 10919131 10599334 10145708 9824132 9450245 9141056 8896591 8619935 8285909 8013914
7054 8013914 7706682 7333396 7013591 6740769 6383824 6087793 5851822 5771067 5513949 5418313
7044 5418313 5371191 5147831 4992172 5020481 4968500 4889181 4924389 4925063 4775194 4821798 4931750
7033 4931750 4892812 4910620 5040648 5276976 5333875 5364182 5363635 5258693 4967599 4585769 4222514
7022D222514l03881l58795j92153j91304j60591j02609m8140K5363j32781J6150
7012B773773k12692j26540q945j97471p9493n4968j4091q1497n9850k593k06756
7001A728877K5434K3100j13144J9525J5937n6619r6395J30285r2153j11217j7063
6990A456567m3314j61515r96J3364p5046K3045o2066j10812l7015J09558l4612
6979A077158J9703R3886J3248o0008o2232n4399K5042j16123q4087P3466J0516
6968I36170m0520p6650n0654J85634M2764l0612M1130j75822m9172M2645k2037
6957H02876j47219M5716K3937O089O7458n4179n584N5675o6623J3251k2926j36365
6945E82106q2964L9915l5567J9164O6077p0080K009K5772r2385P7111n2268k63
$$ plain form
7022 4222514 3918633 3559838 3367685 3176381 3015790 2913181 2865041 2890404 2757623 2773773
7012 2773773 2561081 2434541 2425596 2228125 2148632 2093664 2079573 1998076 1938226 1935633 1728877
7001 1728877 1754311 1777411 1664267 1683792 1699729 1643110 1546715 1677000 1584847 1473630 1456567
6990 1456567 1413253 1251738 1250742 1264106 1189060 1212105 1150039 1039227 1002212 1111770 1077158
6979 1077158 1096861 1190747 1203995 1143987 1081755 1027356 1052398 936275 852188 925654 936170
6968 936170 895650 819000 768346 953980 996744 966132 1007262 831440 782268 824913 802876
6957 802876 655657 701373 725310 731399 798857 744678 739094 794769 728146 741397 718471 582106
6945 582106 499142 539057 503490 522654 588731 518651 520660 546432 454047 531158 478890 478627
6933D78627l9837L2224m5612q1803l4184j6206Q9003J390M1346k049o317j52233
6921B64349N4042m5763q3229N6055K0379M5698l514L2011j3538m4075Q4960p430
6909C59945m0170L9829n7729J3389m8392N910k3816k886O4935n88j29561M3235
6897B24101P9719m381j0218l8924j8389K7857N4964j237o5246l4102K2358q4400
6885A52102l2877J0085N9627r6351l1493M9217K5752J5291p1326l3248J0549j193
6873E6135J19009o737n1851o7966N2995N4662j1620j1326N7930J9685q0412K6359
6861A56863J4297q5382j6983J5290J36920j05483L3313j5918K8752R0202J866
6850B53737k4400L5067l8434k711j39905n634R2420p6847J5277P837n7520j7329
$$ plain form
6933 478627 438790 471014 425402 343599 309415 293209 382212 383602 424948 422899 416582 264349
6921 264349 318391 272628 189399 245454 265833 311531 308017 340028 326490 282415 367375 359945
6909 359945 319775 359604 301875 315264 266872 272782 248966 246080 311015 310427 180866 224101
6897 224101 303820 299439 289221 250297 231908 259765 314729 313492 248246 214144 236502 152102
6885 152102 119225 129310 188937 92586 61093 110310 136062 151353 80027 46779 57328 56135
6873 56135 175144 168407 116556 48590 101585 156247 144627 133301 191231 210916 130504 156863
6861 156863 171160 85778 68795 84085 221005 115522 148835 132917 161669 251871 253737
6850 253737 229337 264404 225970 223259 83354 77720 170140 93293 108570 116407 58887 41558
6838D1558J0716Q2507L7407r5211N2315n3414j26495L9320J21542N8123n5273
6827A13095j26282M0203K7152Q5749m3613o8215P342o504K9533N3654r094K0538
6815A23558m4896N5550j4222L0397r3931M0202N8456r726l3670n4690L7270K3722
6803A18020k7343l5106M5350J03107K4017k3034n4225M484K5440N7253q1803o5718
6791I0442j1295R9807m0649o5393j040J39683O3274r5414M5879n5971J7310N2591
6779B39224q345m0487M3753o4020j3474j4419o5634l7489J2095m7302J23015K2653
6767A49570J7244p7870p9622K1736J03749l5889j2631L4701r4120P2306J29286
6756B28460M285q245q9636k1873O765q4979m5080K561K9722O3637L3748K78J36079
$$ plain form
6838 41558 52274 134781 172188 76977 129292 75878 -50617 -11297 110245 168368 113095
6827 113095 -13187 27016 54168 139917 96304 28089 35431 28927 58460 112114 103020 123558
6815 123558 78662 134212 119990 150387 56456 96658 155114 145388 111718 57028 94298 118020
6803 118020 90677 55571 100921 204028 228045 205011 150786 155270 180710 237963 156160 90442
6791 90442 79147 178954 138305 72912 71872 211555 274829 179415 225294 169323 186633 239224
6779 239224 230879 190392 234145 170125 156651 142232 76598 39109 51204 3902 126917 149570
6767 149570 166814 88944 9322 31058 134807 98918 86287 120988 26868 99174 228460
6756 228460 232745 224500 134864 112991 119756 34777 -10303 -7742 21980 85617 119365 119643 255722
6743B55722m0860k5822m9412r5004Q584Q008O341J4990n898o268L8991J05076
6731B14448o8596N6226m9975n2801K2007J29803L3076L3202p1000j1607m4824
6720A89959m6612O3221k5291k4080j8946P8905P8445j05321j10269J73353j0194
6709B43170l2378j1180O0936L7546O376l6500R5360q1087O4101L132k8304L1210
6697C52382l876K8626m4974J37389R0955N4224J00726L6037J11356j8561j72478
6686F71806q1285n6008m0848k3601j02455j9391k2188o0303m5936J4261k5618
6675B08434R411J5418j6453O7930m2937p2640l5567r997k3548J9307j2978l5073
6663G1307O8041Q347j3866Q4971q7567K2937L9450l2024J5064p7551R9566J20511
$$ plain form
6743 255722 214862 189040 139628 44624 53208 61216 67557 82547 76649 70381 109372 214448
6731 214448 145852 202078 152103 99302 121309 251112 284188 317390 246390 234783 189959
6720 189959 143347 206568 181277 157197 138251 217156 295601 190280 80011 253364 243170
6709 243170 210792 199612 260548 298094 304470 267970 363330 282243 346344 349476 321172 352382
6697 352382 348506 377132 332158 469547 560502 614726 715452 751489 862845 844284 671806
6686 671806 590521 534513 493665 470064 367609 348218 326030 265727 219791 234052 208434
6675 208434 217845 233263 216810 284740 241803 169163 133596 123599 100051 119358 106380 71307
6663 71307 139348 147695 133829 218800 131233 154170 193620 161596 176660 99109 198675 319186
6651C19186q2099j11373m7392O6388m0075Q6494N1815r6936N939L0900l6403m9269
6639I7175n0386O2140l000N1217J068N2280j28307j5045J2854j1883l027L9L9288
6626A04413j45833Q140O5535N9291J3762q257L0152m4965j23498J7818j6745P3845
6614C3658M8467m2597k8809P3274l4096L280m9876l8294P9521J27275j2279o199
6602A53325k5593n3076r473J02244N3024r2049J03140r7187p4710O3753N9412
6591A82810j559K4091M9390n7211j26889o5285j1262l0882J13647J39847l9067
6580A77630q1459L7720j0363M4118P8330n4362K1189n7360j3779M5733k2531J4286
6568A79152j2702J16511n0773j06805M9890J2419j8290K0793j9998m5096l2773
$$ plain form
6651 319186 237087 125714 78322 144710 104635 191129 242944 146008 151947 182847 146444 97175
6639 97175 46789 108929 105929 157146 158214 210494 82187 67142 79996 68113 65086 65125 104413
6626 104413 -41420 -33280 32255 91546 105308 97051 127203 82238 -41260 -23442 -40187 33658
6614 33658 82125 39528 10719 83993 49897 53177 3301 -34993 44528 171803 159524 153325
6602 153325 127732 74656 65183 167427 220451 128402 231542 134355 59645 123398 182810
6591 182810 181251 205342 254732 197521 70632 5347 -5915 -36797 76850 216697 177630
6580 177630 96171 133891 123528 167646 245976 191614 212803 155443 141664 187397 164866 179152
6568 179152 166450 282961 232188 125383 175273 187692 169402 190195 170197 125101 92328
6557I2328l994K1638K9639L8809m4183l927K4070K826m5837J1671l0291m908Q7996
6544A75837r14l409k9312M4168m0503j3328J1733n673L5812P8693j49098N4258
6532A58264J7208m3283l9547J9845K3164O910L8501o4341J18313j8125L1562M8071
6520B96542m2996l7990m5496j7505N5863N2997O2949l4367M5742q2734n3333k1032
6508A78640k826L4646k8830K4582J14765j1849q1202K9955k4131k06r656l8713
6496A85175o1484N5091J20766l9278k0377L5703M1039k4969m6498K1668J4099
6485B80935m5770N7582m2769l9253O7503J4000n8992m4044L8936J8042K3079L2722
6473C01971J06787l0429q9999k1952L3071J04943j9570R760j8510k5074p6544
$$ plain form
6557 92328 88334 109972 139611 178420 134237 130310 154380 157206 111369 123040 92749 87841 175837
6544 175837 174923 171514 142202 186370 145867 132539 144272 138599 174411 253104 104006 158264
6532 158264 175472 132189 92642 112487 135651 142561 181062 116721 235034 216909 248471 296542
6520 296542 253546 215556 170060 152555 208418 261415 324364 289997 335739 253005 199672 178640
6508 178640 175814 210460 181630 206212 320977 309128 227926 257881 233750 233544 223888 185175
6496 185175 123691 178782 299548 260270 239893 275596 316635 291666 245168 266836 280935
6485 280935 235165 292747 249978 210725 278228 292228 233236 189192 228128 246170 269249 301971
6473 301971 408758 378329 288330 266378 299449 404392 384822 394582 376072 350998 274454
6462B74454p1484Q7593k1959O0303N5961l3229k6938J69N7096K7311J4273k7857
6450C95693k166M2575J7706k3505l0741q1632J20886N685l4607k2779o7523j0474
6438C09118q1191m8591O4249O2836M2596M0010j3947q9311Q9522L7330Q569m778
6426D16412r800k7119j8022p0411M2782N587k0912J65945J3377j7746m8240j17633
6414C14220p225J26515L7257N7149n6268k4917o0886O5034M1428K4918j0424j4637
6402D92164n9733M2887O0315j8610M7138P0382m6592r247j5509k8130l1569k2754
6390D80742M0928P644J29012N6156o3982J06289j6129r1894O4583k983q1887j70276
6378D58203K3585J4953l8068J78406M7864m3122m5571n1826P1358M0899n2344
$$ plain form
6462 274454 202970 290563 268604 328907 384868 351639 324701 324870 381966 409277 423550 395693
6450 395693 393527 436102 453808 430303 399562 317930 438816 444501 409894 387115 319592 309118
6438 309118 227927 179336 243585 306421 349017 389027 375080 285769 375291 412621 421190 416412
6426 416412 406612 379493 361471 291060 333842 339429 318517 484462 497839 480093 431853 314220
6414 314220 306995 433510 470767 527916 471648 446731 385845 450879 492307 517225 506801 492164
6402 492164 432431 475318 535633 517023 564161 634543 587951 578704 563195 535065 503496 480742
6390 480742 521670 529314 658326 714482 650500 756789 740660 648766 713349 710366 628479 458203
6378 458203 481788 496741 458673 637079 684943 641821 596250 544424 615782 656681 604337
6367F04337M9798j22819J05404J25122p3805r573r808j1906M8093R3124J6764
6356H14731J0251O1805p4799L1068l8263L7346J03624R4627n2887l3849N3823
6345A007477l2601k2663p9671m656q666o3633m6370R7758q492O3783k3656O0655
6333I39265k43j30539K012L8232O3300P5569o923J16599P9254P8727l6184p5745
6321A143324m241R6397K6747L4299n3805O605k0853o1836Q5815j01076K6876P8785
6309A257037l3543j2628P7599J4749k4087l6527J0680Q2679m9333J53072L3804
6298A473502n290m509j4967m3029O67k6509m0221J22639L7801k3308L5863K3046
6286A535685k36526N713o5269n6625J03098K0977Q9325m8055n8009J08477r8047
$$ plain form
6367 604337 654135 531316 636720 761842 688037 678464 668656 656750 704843 797967 814731
6356 814731 824982 886787 811988 843056 804793 842139 945763 1040390 987503 953654 1007477
6345 1007477 974876 952213 872542 867886 859220 795587 749217 846975 838483 902266 878610 939265
6333 939265 939022 808483 810495 848727 912027 987596 980673 1097272 1176526 1255253 1219069 1143324
6321 1143324 1139083 1235480 1262227 1296526 1242721 1249326 1228473 1166637 1252452 1151376 1178252 1257037
6309 1257037 1223494 1210866 1288465 1303214 1279127 1242600 1253280 1335959 1286626 1439698 1473502
6298 1473502 1468212 1463703 1448736 1405707 1406374 1379865 1339644 1462283 1500084 1476776 1512639 1535685
6286 1535685 1299159 1304872 1239603 1182978 1286076 1307053 1396378 1348323 1290314 1398791 1300744
6275A300744j1748k4781l0735J11373m4132J14073L283o3642j1839p9830r0593
6264A172173O2239P8829L8996j7565m3388n1761k2110L2124p0515n1674R7630
6253A224978Q0012r471M2121p1761l6588Q5424Q4423M2310m5401m5884l738L6100
6241A382525M5986j9651k3970q8703o2525N3658J01151J0783l872L3263J7362
6230A446007j3671M0258K1366Q1766l4808j7628M415J43888J9387r1389o2811
6219A536780O6400J4252J6280M2575l2009m531k3935Q4343O7978R6605L4098N2608
6207A951444r6147L923K946q6862Q9828O5378K0054n811P2581O2525q3860N3704
6195B049703o011K6851L1915R8111R451N2028j1695K2357P8313k9559O3870R0097
$$ plain form
6275 1300744 1288996 1264215 1233480 1344853 1300721 1414794 1418077 1354435 1342596 1262766 1172173
6264 1172173 1234412 1313241 1352237 1334672 1291284 1239523 1217413 1249537 1179022 1127348 1224978
6253 1224978 1304990 1295519 1337640 1265879 1229291 1314715 1399138 1441448 1396047 1350163 1346425 1382525
6241 1382525 1428511 1408860 1384890 1296187 1233662 1287320 1388471 1399254 1395382 1428645 1446007
6230 1446007 1432336 1472594 1493960 1575726 1540918 1523290 1527705 1671593 1690980 1599591 1536780
6219 1536780 1603180 1617432 1633712 1676287 1644278 1639747 1615812 1700155 1768133 1864738 1898836 1951444
6207 1951444 1855297 1859220 1862166 1775304 1865132 1930510 1950564 1944753 2017334 2079859 1995999 2049703
6195 2049703 2043692 2070543 2102458 2200569 2210020 2262048 2250353 2272710 2351023 2321464 2385334 2475431
6183B475431J366L7756q6651k1752J11887P152J19502K5017K0471N9552J2928
6172B762659K8641q7310J68586L6848q28J31150m32J2575N303P9782J15969L7033
6160C289976o4743O6848J05507o186j9100j0868L70P0055n7363j2212J0705J01056
6148C474045L738J1971l1471o604J36455j539n474K0278r632J8655P2886P6643
6136C759951k876L7992K4064P2347K1653l3533n4420J19931P9804O1224p7626
6125D008511K1009J60835N0605J21268N4103P1013l5847M8925L625Q8666N3546
6114D646259O9806R3912N840Q9715O4J56145R8183O2663k6722L6311J36516P4888
6102E443580Q539K3285J88044j4153M4710J64317L9408m1677L2761N8508M857
$$ plain form
6183 2475431 2476797 2514553 2427902 2406150 2518037 2525189 2644691 2669708 2690179 2749731 2762659
6172 2762659 2791300 2703990 2872576 2909424 2908596 3039746 3039314 3051889 3057192 3136974 3252943 3289976
6160 3289976 3225233 3292081 3397588 3391402 3372302 3361434 3361804 3431859 3374496 3362284 3372989 3474045
6148 3474045 3477783 3489754 3458283 3451679 3588134 3586595 3581121 3601399 3591767 3610422 3683308 3759951
6136 3759951 3757075 3795067 3819131 3891478 3913131 3879598 3825178 3945109 4024913 4086137 4008511
6125 4008511 4029520 4190355 4240960 4362228 4416331 4487344 4451497 4500422 4504047 4592713 4646259
6114 4646259 4716065 4809977 4815817 4905532 4905596 5061741 5159924 5222587 5195865 5232176 5368692 5443580
6102 5443580 5452119 5475404 5663448 5649295 5694005 5858322 5897730 5856053 5888814 5947322 5952179
6091E952179J83362J85824K6489N2206J56646J69801J43247J41679R3177P7041
6081G181651N2425J59338J46874Q4702J38174k169J76836K30811J71732Q5086
6071H425460J45398K54458J38971K51259J77562O0639J90271K49823J19770K10084
6061A0223695K58692K36737K39337L20841M88381M25522N71570O23283O49153
6052A4037211O68075P30913R90562R00224J272665J494814J755814J675660Q52397
6043B4378335k34773j215023j840258j653143j126666n80992l78685k11091L737
6034A7141441N6042J32957K21219K92484M85252N68394O15090P11936O86497Q21899
6024B1733211J094766J337592J610361J723592J796476K090596K476058K703371
$$ plain form
6091 5952179 6135541 6321365 6347854 6400060 6556706 6726507 6869754 7011433 7104610 7181651
6081 7181651 7234076 7393414 7540288 7624990 7763164 7760995 7937831 8168642 8340374 8425460
6071 8425460 8570858 8825316 8964287 9215546 9393108 9453747 9644018 9893841 10013611 10223695
6061 10223695 10482387 10719124 10958461 11279302 11767683 12193205 12764775 13388058 14037211
6052 14037211 14705286 15436199 16426761 17326985 18599650 20094464 21850278 23525938 24378335
6043 24378335 24143562 22928539 21088281 19435138 18308472 17727480 17348795 17137704 17141441
6034 17141441 17197483 17330440 17551659 17844143 18329395 18897789 19512879 20224815 20911312 21733211
6024 21733211 22827977 24165569 25775930 27499522 29295998 31386594 33862652 36566023
6016C6566023L160001M012799N157159N279055L521438M77928l122825n386380
6008D9665198n497455l701423k348198j242777n81599j01248K38820O43387Q95591
5999C7970296J032604J246412J485768J984130K252341K623138L164551L903524
5991E5662764M413990M768033M472097L888466L080485K221412K246680K462453
5983H3216380L093936M244947M734794L305659M88422k725854n307065n621837
5975H5429382l824137j779200l45753M18391R46535J270640J582698K161150K613415
5966H8473121L219173M194053N231563N849583N038959K298716j214626m598691
5958A08491851o133898n659955m215511k989412k013098j378954j178477j020235
$$ plain form
6016 36566023 39726024 43738823 48895982 54175037 57696475 58174403 55051578 49665198
6008 49665198 44167743 40466320 38118122 36875345 36293746 36192498 36431318 37074705 37970296
5999 37970296 39002900 40249312 41735080 43719210 45971551 48594689 51759240 55662764
5991 55662764 60076754 64844787 69316884 73205350 76285835 78507247 80753927 83216380
5983 83216380 86310316 90555263 95290057 98595716 99084138 96358284 91051219 85429382
5975 85429382 81605245 79826045 79480292 79898683 80845218 82115858 83698556 85859706 88473121
5966 88473121 91692294 95886347 101117910 106967493 112006452 114305168 113090542 108491851
5958 108491851 102357953 96697998 92482487 89493075 87479977 86101023 84922546 83902311
5950H3902311q74210p48406j225738k137668k924840l578005l635451k937184
5942F5840809k123772j793128j426069j082035r30710p46119p20688j097682j827999
5933E4092607k749715l639746l882850l615403k901376k210527j786308j298751
5925C2007931j069480p82730q09324q29027p83866q10999p66131p02802n59514
5916B4894058o76480n54640l97292l35337l88860m67952k69568k03507k44636
5907B1355786l04622j56804j65557k7848M5753k31831j22653Q8484J11922l6526
5897B0556104R5289J17785Q8751J66337J87280J47490K97582L35627J66292K86971
5887B2445508N75732M35437L50433L44446L20934K18343K09967L13602L62870
$$ plain form
5950 83902311 83028101 82279695 81053957 78916289 75991449 72413444 68777993 65840809
5942 65840809 63717037 61923909 60497840 59415805 58485095 57738976 57018288 55920606 54092607
5933 54092607 51342892 47703146 43820296 40204893 37303517 35092990 33306682 32007931
5925 32007931 30938451 30155721 29346397 28517370 27733504 26922505 26156374 25453572 24894058
5916 24894058 24217578 23662938 23265646 22930309 22541449 22073497 21803929 21600422 21355786
5907 21355786 21051164 20894360 20728803 20700955 20746708 20514877 20392224 20480708 20592630 20556104
5897 20556104 20651393 20769178 20857929 21024266 21211546 21359036 21656618 21992245 22158537 22445508
5887 22445508 23021240 23456677 23807110 24151556 24472490 24690833 24900800 25214402 25577272
5878B5577272N24789O36022P29063P70910R03818R47939J036523J086964J230478
5869C3443778J379505J442516J418505J549659J705979J939373K237961K409848
5861D7527124K942792L225951L220714K957368K427347J687889J003367M37550
5853F5430102O19936P79851Q68989J273680J434891J445934J706538J705718J909883
5844G7175522K285908K590201K479237K659754K557931K554572K563740K659695
5836I7526560K857309K835918L347959L781931L402851J672822r51914l718861
5828A10754575n793665o340537n496360m309505l226254k544612k207351k152737
5820G8683554k249851k343070k196430k166479j837545j267408q95241o11368
$$ plain form
5878 25577272 26102061 26738083 27467146 28238056 29141874 30089813 31126336 32213300 33443778
5869 33443778 34823283 36265799 37684304 39233963 40939942 42879315 45117276 47527124
5861 47527124 50469916 53695867 56916581 59873949 62301296 63989185 64992552 65430102
5853 65430102 66050038 66829889 67698878 68972558 70407449 71853383 73559921 75265639 77175522
5844 77175522 79461430 82051631 84530868 87190622 89748553 92303125 94866865 97526560
5836 97526560 100383869 103219787 106567746 110349677 113752528 115425350 114473436 110754575
5828 110754575 104960910 98620373 93124013 88814508 85588254 83043642 80836291 78683554
5820 78683554 76433703 74090633 71894203 69727724 67890179 66622771 65727530 65116162
5812F5116162k76647j28767p6652j01532l00126m35359p37668j328642k133867
5803E9596902l065146l729076m106906l749636l276410k661477k238779j808587
5795C4960885j621357j436493j413507j367756j357650j193959j272951j262253
5787B4034959j024509r26016q05135o60253o78337n88096m96333l30678l38665
5778A8186937k47429k10807k00649j21782j18309k32704j55810J764j21026q2517
5768A6697668j89567k69867m11474m62898m76676n45987n31803l92719l01326
5759A3115351l45392l15898j35003l8228n8229K349m0964J3437J16285P3457m207
5748A2382958k6878j93j28248k20278j36227R152k23604q6490q7261r5111k11002
$$ plain form
5812 65116162 64839515 64710748 64634096 64532564 64232438 63797079 63059411 61730769 59596902
5803 59596902 56531756 52802680 48695774 44946138 41669728 39008251 36769472 34960885
5795 34960885 33339528 31903035 30489528 29121772 27764122 26570163 25297212 24034959
5787 24034959 23010450 22084434 21279299 20619046 19940709 19352613 18856280 18525602 18186937
5778 18186937 17939508 17728701 17528052 17406270 17287961 17055257 16899447 16901211 16780185 16697668
5768 16697668 16508101 16238234 15826760 15363862 14887186 14341199 13809396 13416677 13115351
5759 13115351 12769959 12454061 12319058 12280830 12222601 12224950 12183986 12197423 12313708 12387165 12382958
5748 12382958 12356080 12355887 12227639 12007361 11871134 11880286 11656682 11570192 11482931 11387820 11176818
5737A1176818k21562l87129m43762l67600l65234k62567k36998l03304k97290
5728H291372q0082j44604j35451m2457O5343k3498l406N6925K9675J32044k9781
5717H116080q5845M7685o2263l18212l14531m04050k93958k32603j27984j94660
5707F129659k89172k07387k25669n1123r2030Q689j16720j37447p2147j03008
5697D843645n5888j12908L3729n1663K66N4848J3524L8881K663L4631m406j33597
5685D663725r6628j15477l10258r5881j02371j44782p9395r6472N532j01482p3883
5674C452628j15687m146j2971n9447J3189M8656j18883j3743j36343Q08r3496
5663B960565o8535J4553P2416m3964l2532p7727O5881J44590p2076N4841j9250
$$ plain form
5737 11176818 10955256 10568127 10124365 9756765 9391531 9128964 8891966 8588662 8291372
5728 8291372 8211290 8066686 7931235 7888778 7954121 7930623 7927217 7984142 8013817 8145861 8116080
5717 8116080 8030235 8077920 8015657 7697445 7382914 6978864 6684906 6452303 6324319 6129659
5707 6129659 5840487 5633100 5407431 5356308 5264278 5272967 5156247 5018800 4946653 4843645
5697 4843645 4787757 4674849 4708578 4656915 4657181 4712029 4725553 4764434 4767097 4801728 4797322 4663725
5685 4663725 4567097 4451620 4141362 4045481 3943110 3798328 3718933 3622461 3627993 3526511 3452628
5674 3452628 3336941 3332795 3319824 3260377 3273566 3322222 3203339 3189596 3053253 3054061 2960565
5663 2960565 2892030 2906583 2978999 2935035 2902503 2824776 2890657 3035247 2963171 3018012 2998762
5652B998762L0169M270Q3047O9465J41974N6003M0444J28968J44614O1725P4036
5641C833477K35173K06602j9156M3098K0132J15187j4544k3935k5410j61934o4144
5630D144546K4165J46085N446m1403P1390J55019J43901P7721J39566J09699J34323
5619E110458J18808K18620J40427P9901L5326K04062J89377J04290m0819L5581
5609F196031r5250j17405q8665p2657q9218k8670N300o1684n4715p3889j63350
5598E355828K3017M5975p8260p8351j86201j78494k30574m5913k7413j934l0793
5587D566887j49458j46195o7911j54029j07875r7132j46803j92407M6074n8320
5577C492831j37571n4401N800J6706q6760p2834j5407j18886k5618Q177j45922
$$ plain form
5652 2998762 3028931 3033201 3116248 3185713 3327687 3383690 3424134 3553102 3697716 3759441 3833477
5641 3833477 4068650 4275252 4256096 4299194 4319326 4434513 4419969 4396034 4370624 4208690 4144546
5630 4144546 4168711 4314796 4320242 4278839 4350229 4505248 4649149 4726870 4866436 4976135 5110458
5619 5110458 5229266 5447886 5588313 5668214 5703540 5907602 6096979 6201269 6160450 6196031
5609 6196031 6100781 5983376 5894711 5822054 5732836 5704166 5709466 5647782 5593067 5519178 5355828
5598 5355828 5378845 5424820 5346560 5268209 5082008 4903514 4672940 4627027 4599614 4597680 4566887
5587 4566887 4417429 4271234 4203323 4049294 3941419 3844287 3697484 3505077 3551151 3492831
5577 3492831 3355260 3300859 3306659 3323365 3236605 3163771 3148364 3029478 3003860 3012037 2866115
5566B866115j46163p5133q1695l2716j01626j25845k1042J06225r355j18881j53008
5555B106876j56424n543J9255j9687j6148Q1440R7045j07602k9617j0202n1125
5544A908268J25981m5444j08058Q3787J59000j04466j04045k5102q8079n9350
5534A742492o392p5834M287Q4863l6664p0259J13086K417n5727K6098k4238p7159
5522A626970j4037l452p9352L1425L274l5690K2961k6942m4444n0198q2828P1824
5510A419511J40279j4611m9029j9792O2688n9245K9098J1883M3133N4501j7913
5499A600503N1450L8838j75697M8579o2441m2457q2417N689L0813l2079J2600
5488A393381L5389m5806k0072J7158K3310L4555n4968L6575j25197J3416O0042
$$ plain form
5566 2866115 2719952 2644819 2563124 2530408 2428782 2302937 2281895 2388120 2378765 2259884 2106876
5555 2106876 1950452 1944909 1964164 1944477 1928329 2009769 2106814 1999212 1969595 1959393 1908268
5544 1908268 2034249 1988805 1880747 1964534 2123534 2019068 1915023 1889921 1801842 1742492
5534 1742492 1736100 1660266 1664553 1749416 1712752 1642493 1755579 1757996 1702269 1728367 1704129 1626970
5522 1626970 1612933 1609481 1530129 1561554 1564828 1529138 1552099 1525157 1480713 1430515 1347687 1419511
5510 1419511 1559790 1545179 1496150 1476358 1539046 1479801 1508899 1520782 1563915 1618416 1600503
5499 1600503 1651953 1690791 1515094 1563673 1501232 1458775 1376358 1382047 1412860 1380781 1393381
5488 1393381 1428770 1382964 1362892 1380050 1403360 1437915 1382947 1419522 1294325 1307741 1367783
5477A367783M6828j9030m4956l4423J0801q1227Q8664N4892q6718j29502R906
5466A183018R1227J8741q5773j73j24731q363J46228J2992j24636j2456M2802
5455A138876N4829r605K2995N0565L0166N3422n8651R449j33173j4973J11787
5444A255687M9111M9814L9935J9789j8612M6721p5488J7980j32176R4918P4695
5433A422374K7690J4736k9921m7629M6423R957J10454O2421n2917M6899j5834
5422A594653N6989J28282J45924P4045P093R9472N8133K07655J70552K43331K73923
5411C060052O1356n9315j28678k08659k92215k21364m9372o187m4007J26556N0682
5400B288849k4884j08424N6470J28682R1103K2591K5753L6006j6480N3358O4794
$$ plain form
5477 1367783 1414611 1395581 1350625 1316202 1327003 1245776 1334440 1389332 1302614 1173112 1183018
5466 1183018 1274245 1292986 1207213 1207040 1082309 1073946 1220174 1233166 1108530 1096074 1138876
5455 1138876 1193705 1184100 1207095 1257660 1287826 1341248 1282597 1292046 1158873 1143900 1255687
5444 1255687 1304798 1354612 1394547 1414336 1395724 1442445 1366957 1384937 1252761 1347679 1422374
5433 1422374 1450064 1464800 1434879 1387250 1433673 1443630 1554084 1616505 1563588 1610487 1594653
5422 1594653 1651642 1779924 1925848 1999893 2006986 2106458 2164591 2372246 2542798 2786129 3060052
5411 3060052 3121408 3062093 2933415 2724756 2432541 2211177 2161805 2155618 2111611 2238167 2288849
5400 2288849 2263965 2155541 2212011 2340693 2431796 2454387 2480140 2516146 2499666 2553024 2617818
5389B617818J36539J18524k4588J77402K53709J61710P6330K67891K29625L08230
5379D323190J64112P7398k8374M8260j40982j3715n0023j09329l1944P3690J11947
5368D424230M0077j1590l1761O0926J15237J36751J21255J41830J23890J83378
5358E304223K11463K45804J82449L45974M15930K21531K68321J03489n1518k97113
5348F950553m06631l92593k58457j04771k11306j36711l9647j01509k34822j24602
5338D939504r0625r6405j9000l7275q6473k8341k1159j27540q2827K6476m4171
5327D332164k3149J03298q9526j41524j56533j71987k45299l28381k12724l07031
5317B759308m0821j08619j41604O2522O196J196q9511J759k1051l5393L4353M0846
$$ plain form
5389 2617818 2754357 2872881 2848293 3025695 3279404 3441114 3517444 3785335 4014960 4323190
5379 4323190 4487302 4564700 4536326 4584586 4443604 4429889 4379866 4270537 4238593 4312283 4424230
5368 4424230 4464307 4452717 4420956 4481882 4597119 4733870 4855125 4996955 5120845 5304223
5358 5304223 5515686 5761490 5943939 6289913 6705843 6927374 7195695 7299184 7247666 6950553
5348 6950553 6543922 6151329 5892872 5788101 5576795 5440084 5400437 5298928 5064106 4939504
5338 4939504 4848879 4752474 4733474 4696199 4609726 4581385 4560226 4432686 4349859 4376335 4332164
5327 4332164 4309015 4412313 4322787 4181263 4024730 3852743 3607444 3279063 3066339 2759308
5317 2759308 2718487 2609868 2468264 2530786 2536982 2538178 2448667 2450426 2429375 2393982 2428335 2469181
5305B469181n4758j6425k7901j37521r0552k6880o259n1351K9381k8025O052O4537
5293B129479r9m2624K6957o4350N1993L2001k7373N301N0464k5443L4387L4316
5281B205009J05494j650m3439k6415J44525P3208m2438P7622O546L0569L6240
5270B565271M7025P6057J32637m4138Q9853J30636J68199J53702J04567J17011
5260C540820J64897K13252J31621K26568J8694l9562J21800j53194n0198m2687
5250D132011j5988J10484R300O4576J25150L4140q762N0473J06106J23432J32454
5239D863376J88898K08421K42689J76845J46523O1023J06916K12345L04910J67171
5229F679117K51596P9232O2971n2923k74972j29030j85957r6804J7219j66682
$$ plain form
5305 2469181 2414423 2397998 2370097 2232576 2142024 2115144 2108885 2057534 2086915 2058890 2064942 2129479
5293 2129479 2129380 2086756 2113713 2049363 2101356 2133357 2105984 2111285 2161749 2136306 2170693 2205009
5281 2205009 2310503 2308853 2265414 2238999 2383524 2456732 2414294 2491916 2498462 2529031 2565271
5270 2565271 2612296 2688353 2820990 2776852 2866705 2997341 3165540 3319242 3423809 3540820
5260 3540820 3705717 3918969 4050590 4277158 4295852 4256290 4378090 4224896 4174698 4132011
5250 4132011 4116023 4226507 4235807 4300383 4425533 4459673 4450911 4501384 4607490 4730922 4863376
5239 4863376 5052274 5260695 5503384 5680229 5826752 5887775 5994691 6207036 6511946 6679117
5229 6679117 6930713 7009945 7072916 7019993 6745021 6615991 6430034 6333230 6350449 6183767
5219F183767R8511Q6715k4821K4022j47715K537N8472J73130K10993m0748j05385
5208F519478j14568j93902j03091j24283p9872j02520n1713j18133j59813n8138
5198E413445n1393j65129j6902n2360m4491L1832j74075j5968j08882m3223j26783
5187D646071j37090M5141l4335l4537j9149k0311j77777j56271m3382j16266j42050
5176C810044l2925j00443r5623j9001j12969j48863k0700j00153L0149N0663j55200
5165C104979m9669K1054k875Q2376j03376p6037N7478Q9187J164O666o9297M3587
5153C105237r2093J140J22478M8324J16501j9859l6323J7253L9049K2457J37767
5142C461931q2400p1035p8524J2456Q9392p1198r7548k1182L8467J7976J3016
$$ plain form
5219 6183767 6282278 6368993 6344172 6368194 6220479 6223016 6281488 6454618 6665611 6624863 6519478
5208 6519478 6404910 6211008 6107917 5983634 5903762 5801242 5749529 5631396 5471583 5413445
5198 5413445 5362052 5196923 5180021 5127661 5083170 5115002 4940927 4924959 4816077 4772854 4646071
5187 4646071 4508981 4554122 4519787 4485250 4466101 4445790 4268013 4111742 4068360 3952094 3810044
5176 3810044 3777119 3676676 3581053 3562052 3449083 3300220 3279520 3179367 3209516 3260179 3104979
5165 3104979 3055310 3076364 3073489 3155865 3052489 2976452 3033930 3123117 3124281 3130947 3061650 3105237
5153 3105237 3013144 3014284 3136762 3185086 3301587 3281728 3245405 3262658 3301707 3324164 3461931
5142 3461931 3379531 3308496 3229972 3242428 3331820 3260622 3163074 3141892 3180359 3198335 3211351
5131C211351R0112K2918J37120K9383J77477J40011p2411J096l6256j15423n5198
5120C530180K8843q7418m3390P3139M6343j4886Q1931J02959N5447p4748r019
5109C689381l8693J7675R3769m5690o5218L2620J17767J13030J01698J39632K37520
5098D393491K56271K06219O8527j88485k20664l12238k11345j45592j47448k2520
5088C676216q6715L4599j0775Q3597P4481J19861J59456j04315m4794P3035O379
5077C981025k7713L0476n1409q9499k9026p9786m9155K9200m5626j04461L8794
5066C602820O1588j0948O2356Q5806P9162R1121J16778Q0075J23632J29273Q8383
5055D510046J63007K51272K68167L04236L06069L54245K96917M17921N06462L43837
$$ plain form
5131 3211351 3301463 3324381 3461501 3490884 3668361 3808372 3735961 3737057 3700801 3585378 3530180
5120 3530180 3559023 3471605 3428215 3501354 3547697 3532811 3614742 3717701 3773148 3698400 3689381
5109 3689381 3650688 3668363 3762132 3716442 3651224 3683844 3801611 3914641 4016339 4155971 4393491
5098 4393491 4649762 4855981 4924508 4736023 4515359 4203121 3991776 3846184 3698736 3676216
5088 3676216 3589501 3624100 3613325 3696922 3771403 3891264 4050720 3946405 3901611 3974646 3981025
5077 3981025 3953312 3983788 3932379 3842880 3813854 3734068 3684913 3714113 3668487 3564026 3602820
5066 3602820 3664408 3653460 3715816 3801622 3880784 3971905 4088683 4168758 4292390 4421663 4510046
5055 4510046 4673053 4924325 5192492 5496728 5802797 6157042 6453959 6871880 7378342 7722179
5045G722179N28359O84128P45426Q64438R98999J598108J385687Q51070L1080
5036A5409474p94819j705050j930298j476949j119178q47271o33733l78646m04915
5027F118615k88784k14380j37190l4240O0627q9381l0611M0002m4331L5905k4709
5016E391523O5186O2729J4487N7525K37459J40077J32664K38636R9203j977j17482
5005F320030l35600m14616l90221k28588q1485q6480j77205p4981K1196p8378
4995D473672P094q9884j43672l1671j31356l332J43376m4619o4720j08298N5338
4984D061928L4782O9487j07973m5031Q7719J01756q8300M7162P4398L9743l8210
4973D237461Q3325Q5057p999J14885O4172m8759Q467m3107P7858P3709J35397
$$ plain form
5045 7722179 8250538 8934666 9680092 10544530 11543529 13141637 14527324 15378394 15409474
5036 15409474 14614655 12909605 10979307 9502358 8383180 7535909 6902176 6523530 6118615
5027 6118615 5829831 5615451 5478261 5444021 5504648 5415267 5384656 5424658 5380327 5416232 5391523
5016 5391523 5456709 5519438 5533925 5591450 5828909 5968986 6101650 6340286 6439489 6437512 6320030
5005 6320030 5984430 5569814 5179593 4951005 4869520 4783040 4605835 4530854 4552050 4473672
4995 4473672 4480766 4390882 4247210 4215539 4084183 4080851 4224227 4179608 4114888 4006590 4061928
4984 4061928 4096710 4166197 4058224 4013193 4100912 4202668 4114368 4161530 4235928 4275671 4237461
4973 4237461 4320786 4405843 4397844 4512729 4576901 4528142 4536609 4493502 4571360 4645069 4780466
4962D780466P5743j01498k7637L9423L1066J24575M3127K4689j762J39039J15004
4951E242235J32291l9780l1946P3143P892L8883J43735m5968M3186Q6889J76469
4940E827029N0804r643J18632P5154K11727J15817J65419J02469N2243J30776
4930F840427R4683N4240n3069M7758K44744K55221J97689J31322J46228J24252
4920H083495K88792K66177L48406K99211L53103R5326j80909k49394k33024k76602
4910H794581j82247p7859J06136L9873J20369J79229J35901J43052Q8927P9487
4900I427449O7108N9071j1498Q2393J71057J21482L41898J06113J54852K65102
4890A0785027J68833N7605J12555J09377K40404M0109Q4352J78180J24507J67544
$$ plain form
4962 4780466 4856209 4754711 4727074 4766497 4797563 4922138 4965265 4989954 4988192 5127231 5242235
4951 5242235 5374526 5334746 5302800 5375943 5383835 5422718 5566453 5520485 5563671 5650560 5827029
4940 5827029 5877833 5868190 5986822 6061976 6273703 6389520 6554939 6657408 6709651 6840427
4930 6840427 6935110 6989350 6936281 6984039 7228783 7484004 7681693 7813015 7959243 8083495
4920 8083495 8372287 8638464 8986870 9286081 9639184 9734510 9553601 9304207 9071183 8794581
4910 8794581 8612334 8534475 8640611 8680484 8800853 8980082 9115983 9259035 9347962 9427449
4900 9427449 9494557 9553628 9542130 9624523 9795580 9917062 10258960 10365073 10519925 10785027
4890 10785027 10953860 11011465 11124020 11233397 11473801 11513910 11598262 11776442 11900949 12068493
4880A2068493K50187J65283J92590J03317J42123K98826K16907R4998J09719N7147
4870A3699590K41455K22194N9950K64990J68014K52670L00544J46406K00239J88053
4860A5744105K07816L36766L99774M19396N18557N07764N72827N06023N12463
4851A9725491N35938M80821N50452O97013O86308O74318M74065P45948O66071
4842B5236425O81816Q36222Q46028J082301J291329J263461J351165J451576J598838
4833C5639161J638442J787579K070215K412565K714111L152695L775873M441995
4825E7632636N481543O224069O746766P017118P146407P237289Q539370R721015
4817A15746213J2119394J6126302K2153379K1294254J1943910k008696j8101921
$$ plain form
4880 12068493 12318680 12483963 12676553 12779870 12921993 13220819 13437726 13532724 13642443 13699590
4870 13699590 13941045 14163239 14223189 14488179 14656193 14908863 15209407 15355813 15556052 15744105
4860 15744105 15951921 16288687 16688461 17107857 17626414 18134178 18707005 19213028 19725491
4851 19725491 20261429 20742250 21292702 21989715 22676023 23350341 23824406 24570354 25236425
4842 25236425 25918241 26754463 27600491 28682792 29974121 31237582 32588747 34040323 35639161
4833 35639161 37277603 39065182 41135397 43547962 46262073 49414768 53190641 57632636
4825 57632636 63114179 69338248 76085014 83102132 90248539 97485828 106025198 115746213
4817 115746213 127865607 143991909 166145288 187439542 199383452 197374756 179272835
4810A79272835k7915426k5794609j7404258j0822432o330748m255353k104021
4803H4645988o59000R87177J776149K334257K701290L224082M191969O344926
4795A05546838Q644881J1095014J3411971J5467832J7228462J9611471K2554098
4788B13560567K5581816L1477101M2192428N2431521M2075799J5702445k0721439
4781D02300238n5916467p1456237o0903114m3099503k9752939k1180917j6429514
4774A03561547j2445398r600304p401564n934170m602194l720801k722184k232042
4766E4902890j747602j684180j688207k266644k735077k990825k549077k216926
4758C7024352j793390j441376j461723j434049j365606j427071j197950j211558
$$ plain form
4810 179272835 151357409 125562800 108158542 97336110 91005362 86750009 84645988
4803 84645988 83986988 84974165 86750314 89084571 91785861 95009943 99201912 105546838
4795 105546838 114191719 125286733 138698704 154166536 171394998 191006469 213560567
4788 213560567 239142383 270619484 312811912 365243433 407319232 423021677 402300238
4781 402300238 346383771 274927534 214024420 170924917 141171978 119991061 103561547
4774 103561547 91116149 81515845 74114281 68180111 63577917 59857116 57134932 54902890
4766 54902890 53155288 51471108 49782901 47516257 44781180 41790355 39241278 37024352
4758 37024352 35230962 33789586 32327863 30893814 29528208 28101137 26903187 25691629
4750B5691629j198848r49298q10551o55975o62758p55635o15662p23890n67556
4741A8751456o67191n21874k64935l27788l28558k42609k58797j54107k98551
4732A5687046m18016m66049l44501m75905m19063l33272j36160k97862l60588
4723A2435630l96663l93277m50718j59032k16597k78005k11364k50785j17747
4714I961442o8758k07369q8515j12233j66292j32184k25930k49143k18543j48780
4704H343695j28998j56283l17157k40896j67304j75242j45356j33931r0650j28241
4694F659637j71263j42769p2126J0410j40330r7896O6653m5613j21987j23033
4684E821683r0801n6929j44556r1144o4504N4915k690j5013o6635j13030k2661
$$ plain form
4750 25691629 24492781 23543483 22732932 22076957 21414199 20658564 20042902 19319012 18751456
4741 18751456 18084265 17562391 17297456 16969668 16641110 16398501 16139704 15985597 15687046
4732 15687046 15269030 14802981 14458480 13982575 13563512 13230240 13094080 12796218 12435630
4723 12435630 12038967 11645690 11194972 11035940 10819343 10541338 10329974 10079189 9961442
4714 9961442 9892684 9685315 9596800 9484567 9318275 9186091 8960161 8711018 8492475 8343695
4704 8343695 8214697 8058414 7741257 7500361 7333057 7157815 7012459 6878528 6787878 6659637
4694 6659637 6488374 6345605 6273479 6283889 6143559 6045663 6112316 6066703 5944716 5821683
4684 5821683 5730882 5673953 5529397 5438253 5373749 5428664 5425974 5410961 5344326 5231296 5208635
4673E208635q3183M0836j4858l5905m6264r46j34181j37327J10105N6928k9515
4662D934325J57341M3892P3859J88588J88611K25253K34949J85968j469j61444
4652F069873l40401j56064j61266j19273j41790j88930k68345k31768j18453j31892
4642D211691j01398q8626k7447j05348N5120M1084o7655m1868q1465O2085M6016
4631C902189n076n8574N3293K0861j14950j6822R7072J01784j1998J57370J51338
4620D276487O5490j0131K7463l4676j35983l34492k71710j86354j92720K1530
4610C224904M3007p0610o6360J05971P2307n751L3402m3209l1110k0644Q7704
4599C329611K21200q0072o8005n601J15330L4041K9103r9942n2039p0422M26n6454
$$ plain form
4673 5208635 5125452 5166288 5151430 5115525 5069261 5068315 4934134 4796807 4906912 4963840 4934325
4662 4934325 5091666 5135558 5209417 5398005 5586616 5811869 6046818 6232786 6231317 6069873
4652 6069873 5729472 5573408 5412142 5292869 5151079 4962149 4693804 4462036 4343583 4211691
4642 4211691 4110293 4021667 3994220 3888872 3943992 3985076 3917421 3875553 3794088 3856173 3902189
4631 3902189 3897113 3838539 3891832 3912693 3797743 3780921 3877993 3979777 3967779 4125149 4276487
4620 4276487 4341977 4331846 4359309 4324633 4188650 3854158 3582448 3396094 3203374 3224904
4610 3224904 3267911 3197301 3130941 3236912 3309219 3303468 3336870 3293661 3262551 3241907 3329611
4599 3329611 3550811 3470739 3402734 3397133 3512463 3546504 3575607 3475665 3423626 3353204 3353630 3297176
4587C297176j6141j46425K5265k0943O264k9743l7394k6180M2414L6055j19826
4576C010522m9507l9001j8020N2917O698P5864J09431M2547J06718P4543k001
4565C370711p0491l6332Q3438L4061K6155N1202O1565m940K1056J3142K7999o6641
4553C510925L4110n6182N2870J91863L9556P9033L3399P8958J31188J69176o1309
4542D203587J6703P3298M0894N0906J52479K7287L1099J1057J20841K689O867
4531D737707J3757O8837J75274J56823L1538J31461J36862J44349K24909J82765
4521F004282J26357J80930L85806K98477L57998M58478M56539O70468P71908P81304
4511A0492547R14734J197692J305395J439259J613294J979595K493199K697077
$$ plain form
4587 3297176 3281035 3134610 3159875 3138932 3145196 3115453 3078059 3051879 3094293 3130348 3010522
4576 3010522 2961015 2922014 2903994 2956911 2963609 3039473 3148904 3191451 3298169 3372712 3370711
4565 3370711 3300220 3263888 3347326 3381387 3407542 3458744 3520309 3515369 3536425 3549567 3577566 3510925
4553 3510925 3545035 3488853 3541723 3733586 3773142 3852175 3885574 3964532 4095720 4264896 4203587
4542 4203587 4220290 4293588 4334482 4385388 4537867 4565154 4596253 4607310 4728151 4730840 4737707
4531 4737707 4751464 4820301 4995575 5152398 5183936 5315397 5452259 5596608 5821517 6004282
4521 6004282 6130639 6311569 6697375 6995852 7353850 7812328 8268867 8939335 9711243 10492547
4511 10492547 11407281 12604973 13910368 15349627 16962921 18942516 21435715 24132792
4503B4132792K345487J368055l91542k223608l264302l246291k748053k007904
4495A3964634j594769j269019j096725p71965m87102m87616l45608l21341j60877
4486G429612k02800j60758j40791j26094n0026j16991O5902j5794J6798J8497
4476F717555J75803J91106J02828Q1119J76779K07453J53844K86741L00094K35339
4466H628661O2830j18604k46281j63525j23533m0774J23199J64032J97739K62456
4456H746200L30446M58935M32246N32070M39544K97889J73673J35126L37917M34244
4446A2318290N48022Q08268Q84407R10976J009824J041033J034063J355830J748894
4437B1659607K158342K292859J693150M30118j123851k633402l296180k937153
$$ plain form
4503 24132792 26478279 27846334 27454792 25231184 21966882 18720591 15972538 13964634
4495 13964634 12369865 11100846 10004121 9232156 8745054 8257438 7911830 7590489 7429612
4486 7429612 7226812 7066054 6925263 6799169 6749143 6632152 6698054 6682260 6699058 6717555
4476 6717555 6893358 7084464 7187292 7268411 7445190 7652643 7806487 8093228 8393322 8628661
4466 8628661 8691491 8572887 8326606 8163081 8039548 7998774 8121973 8286005 8483744 8746200
4456 8746200 9076646 9535581 9967827 10499897 10939441 11237330 11411003 11546129 11884046 12318290
4446 12318290 12866312 13674580 14558987 15469963 16479787 17520820 18554883 19910713 21659607
4437 21659607 23817949 26110808 27803958 28234076 27110225 24476823 21180643 18243490
4429A8243490k274919j764063j285532r02417p16433n74549m36066l53179k23319
4420I713013j87565r3266j75916m7620m7027j45741j03919k00698j92321k32352
4410H286588l39303k73045k60656j80077j49643j09681r9440r1190n7227p054
4400F719272n0528q3714l6915l4719q4775m4287R2251J73251m2099L0612R5106
4389F733455Q1630R2140M6409P7449M3491j0508k1631j90000k26136Q2318j13667
4378F594950l8758K2505K8575q7877m668L2072l9124k6952j00716k52109Q437
4367F136335o5635k3490L6723K6757l649o7233J29800K6351l29O1832M3642Q9874
4355F390978J3719N5306J18458P8313J10856P7623J04052R4136J07306L3861n3252
$$ plain form
4429 18243490 15968571 14204508 12918976 12016559 11300126 10725577 10289511 9936332 9713013
4420 9713013 9525448 9432182 9256266 9208646 9161619 9015878 8911959 8711261 8518940 8286588
4410 8286588 7947285 7674240 7413584 7233507 7083864 6974183 6874743 6783553 6726326 6719272
4400 6719272 6668744 6585030 6548115 6513396 6428621 6384334 6476585 6649836 6607737 6638349 6733455
4389 6733455 6815085 6907225 6953634 7031083 7074574 7064066 7042435 6852435 6626299 6708617 6594950
4378 6594950 6556192 6578697 6607272 6519395 6514727 6546799 6507675 6480723 6380007 6127898 6136335
4367 6136335 6070700 6047210 6083933 6110690 6107041 6039808 6169608 6195959 6195630 6257462 6301104 6390978
4355 6390978 6404697 6460003 6578461 6656774 6767630 6845253 6949305 7043441 7150747 7184608 7131356
4344G131356J1845n0584l6421Q9861K1971Q4131R7696M5183J11157J55527R3386
4333G755108J32711J14875K24232K73230J08690M6385L1185k604J01716J69305
4323H954833Q8387O8605J70672J17988P3312J15933J45220J76396J62311J25335
4313A0198992M3781K6931j7945j11777r412J73978R1899J11866J5937Q5588J29071
4302A0738909R1337K8102J61474L31064K29025K32031K39502J63167K17559J60441
4292A2592611q618R7044J86113M11N5692K48144L04838J22770J60762J59162N4567
4281A3973496K28431J29085J04176J93337M53685L79505L08637L35652M72743
4272A6578747K43278M05720L35699K92572L67666L12109M40643N69423O27956
$$ plain form
4344 7131356 7143201 7092617 7056196 7146057 7168028 7252159 7349855 7395038 7506195 7661722 7755108
4333 7755108 7887819 8002694 8226926 8500156 8608846 8655231 8686416 8683812 8785528 8954833
4323 8954833 9043220 9111825 9282497 9400485 9473797 9589730 9734950 9911346 10073657 10198992
4313 10198992 10242773 10269704 10251759 10139982 10130570 10304548 10396447 10508313 10524250 10609838 10738909
4302 10738909 10830246 10858348 11019822 11350886 11579911 11811942 12051444 12214611 12432170 12592611
4292 12592611 12583993 12681037 12867150 12867561 12923253 13171397 13476235 13599005 13759767 13918929 13973496
4281 13973496 14201927 14331012 14435188 14628525 15082210 15461715 15770352 16106004 16578747
4272 16578747 16822025 17227745 17563444 17856016 18223682 18535791 18976434 19545857 20173813
4263B0173813Q40565R13681R75061J090328J236815J408236J618190K055375K333145
4254C2645209K896079K686367J369041l00380k222162l467416l364579k739270
4246B7502889k010645j632094j323122r29610p70495m21708k95659k13173J2729
4237A9919112J83903K41474K25874J36548n9082j01130l10511k34524j00148j25617
4227A9775899m807J28564L03056K24838K14098M07742L73562L65045M64278M76145
4217B2728420N61733O21708N87662P05809O57510P97108Q76599Q14679P86309
4208B9137537P19179P50010P53470O76245N10811O87357Q13741Q91912J030787
4199C5971049J167968R98823J045411J096364J082417J172338J357688J634308
$$ plain form
4263 20173813 21014378 21928059 22903120 23993448 25230263 26638499 28256689 30312064 32645209
4254 32645209 35541288 38227655 39596696 39296316 37074154 33606738 30242159 27502889
4246 27502889 25492244 23860150 22537028 21607418 20836923 20415215 20119556 19906383 19919112
4237 19919112 20103015 20344489 20570363 20706911 20647829 20546699 20236188 20001664 19901516 19775899
4227 19775899 19771092 19899656 20202712 20427550 20641648 21049390 21422952 21787997 22252275 22728420
4217 22728420 23290153 23911861 24499523 25205332 25862842 26659950 27536549 28351228 29137537
4208 29137537 29856716 30606726 31360196 32036441 32547252 33234609 34048350 34940262 35971049
4199 35971049 37139017 38137840 39183251 40279615 41362032 42534370 43892058 45526366
4191D5526366J969470K091116K317838K635121K686115K845266L309607L699499
4183F7080398M261636N034543N734181O563847P364228Q766093J0543918J2493055
4175A27841899J4551712J6626861J8615301K1346600K5001560K9657535L6221651
4168B89863119M4249062M6654996L8151718J5312228j5361770m3521127n7907726
4161C17440500n6326861m4542761l1807653k3577847j8584462j5929107j3911774
4154A12760035j1469866r182832p265969n834367n067686m443448m111126l505785
4146F1878956l160546k677920k059929j512865j266226r17026q14848o24726o21942
4137D8222928l92175k65510m2241M79663O70935l898r12273k032072k915375l488547
$$ plain form
4191 45526366 47495836 49586952 51904790 54539911 57226026 60071292 63380899 67080398
4183 67080398 71342034 76376577 82110758 88674605 96038833 104804926 115348844 127841899
4175 127841899 142393611 159020472 177635773 198982373 223983933 253641468 289863119
4168 289863119 334112181 380767177 418918895 434231123 418869353 375348226 317440500
4161 317440500 261113639 216570878 184763225 161185378 142600916 126671809 112760035
4154 112760035 101290169 92107337 84841368 79007001 73939315 69495867 65384741 61878956
4146 61878956 58718410 56040490 53980561 52467696 51201470 50284444 49469596 48844870 48222928
4137 48222928 47830753 47565243 47523002 48002665 48673600 48669702 47757429 45725357 42809982 39321435
4127C9321435l151362k662828k436680k039867j498035j328509j206464r64745
4119B4032945q47298p71538o52159o32329n94291m60203l23914l22084k36550
4110A9192579j40489k45940k63592k17838l42993l77929k87596k31428j68602
4101A6916172j07872r9355j8106K4275N0231r1930P636j2526j32674j12961l40512
4090A6082378k69117j40438k00948k44123m36905k72686k11197j60296j23964
4081A4022704J73679L9838k933q3040l42053m70252n12590m83446l04170k60677
4071A1777060k41179k81177j38814j77639p9429N1230r0941j96540j38689n4692
4061A0429190m0105p8088j60545n9275q6056R264L4492N9156l8695J80339O0288
$$ plain form
4127 39321435 36170073 33507245 31070565 29030698 27532663 26204154 24997690 24032945
4119 24032945 23185647 22414109 21761950 21129621 20535330 20075127 19751213 19429129 19192579
4110 19192579 19052090 18806150 18542558 18324720 17981727 17603798 17316202 17084774 16916172
4101 16916172 16808300 16708945 16690839 16715114 16765345 16673415 16681051 16668525 16535851 16422890 16082378
4090 16082378 15813261 15672823 15471875 15227752 14790847 14518161 14306964 14146668 14022704
4081 14022704 14196383 14236221 14233288 14150248 13808195 13337943 12825353 12341907 12037737 11777060
4071 11777060 11535881 11254704 11115890 10938251 10858822 10910052 10819111 10622571 10483882 10429190
4061 10429190 10389085 10310997 10150452 10091177 10005121 10014385 10048877 10108033 10069338 10249677 10309965
4050A0309965J3049j92601j53741l5485J3643N1896J3315Q1619L2221q1356R6992
4039A0149517p1480l9190Q3775K401m2549N0507J54800R6829P9307J54821j7836
4028A0600902J35894L0942o4574P9165j1215k079J19095J48784J16051L4315p9016
4017A1108264K07593K16039J61448J71260J32047P3635J43362J99132K24742K28734
4007A2866256L14227M61425L56821N10983N53449O76238O78870Q19735O73360
3998A7911364L34325o7691l65917o32268o90111n03433k65471r5992M6657J328
3988A5672791J8901K0629R4163J98148L01822K53636K93241M55790M32484N23552
3978A8265157O65833P49153Q45684J018344R80470J165584J318471J729420J891131
$$ plain form
4050 10309965 10323014 10130413 9976672 9941187 9954830 10006726 10020041 10101660 10133881 10052525 10149517
4039 10149517 10078037 10038847 10122622 10125023 10082474 10132981 10287781 10384610 10463917 10618738 10600902
4028 10600902 10736796 10767738 10703164 10782329 10771114 10769035 10888130 11036914 11152965 11187280 11108264
4017 11108264 11315857 11531896 11693344 11864604 11996651 12070286 12213648 12412780 12637522 12866256
4007 12866256 13180483 13641908 13998729 14509712 15063161 15739399 16418269 17238004 17911364
3998 17911364 18245689 18177998 17812081 17179813 16489702 15986269 15720798 15624806 15671463 15672791
3988 15672791 15691692 15712321 15806484 16004632 16306454 16560090 16853331 17309121 17741605 18265157
3978 18265157 18930990 19680143 20525827 21544171 22524641 23690225 25008696 26738116 28629247
3969B8629247J399920N00086l05088j029697j105284p47563j13391L39536O40330
3960B8208096J161720J435705J564865J255566L33817m25100p38603o15500j49501
3951C2031065K74202P81077J023800J172394J213441J077413R35993P49426O42537
3942C9901348L44119p6445o44936j214128j413998j080515k58744L38068R82408
3933C6877177J090234M69830l77382j436401j931787j938720j264829p48649l93405
3924C0346068p9755J24945M21348M95776N76884Q44865J076094J291040J565608
3915C6662873J643764J593518J167776M46677m78263r28199q03321n77909j13025
3906C8613891L2428o4657k74482k34822j26059L3197M33569O20579P80163J070754
$$ plain form
3969 28629247 30029167 30529253 30224165 29194468 28089184 27341621 27228230 27567766 28208096
3960 28208096 29369816 30805521 32370386 33625952 33959769 33534669 32796066 32180566 32031065
3951 32031065 32305267 33086344 34110144 35282538 36495979 37573392 38509385 39258811 39901348
3942 39901348 40245467 40169022 39524086 38309958 36895960 35815445 35556701 35894769 36877177
3933 36877177 37967411 38437241 38059859 36623458 34691671 32752951 31488122 30739473 30346068
3924 30346068 30266313 30391258 30812606 31308382 31885266 32730131 33806225 35097265 36662873
3915 36662873 38306637 39900155 41067931 41514608 41036345 40108146 39304825 38726916 38613891
3906 38613891 38646319 38581662 38307180 38072358 37946299 37979496 38413065 39033644 39813807 40884561
3896D0884561J241011J401700J443689J309679J332163J222036J167475J296852
3888E1299166J205756J447266J462204J633210J710139J670477J656294J670736
3880F3755248J862032K103204K472218K833666L089874K917388K842112K525013
3872H4400755K588476K964984L245384L414378L455213L397028L166888L025234
3864A09658340L016219L284284L651188M092844M957256N642060O540922O893184
3856A47736297O043151L880610J220508j167629k270125j508968k01947Q26107
3848A54558004J327102J383621J302940J233107J338838J496593J133179L25062
3840A64098446q61531j853431k639260k897796k725201k354667k057019j786440
$$ plain form
3896 40884561 42125572 43527272 44970961 46280640 47612803 48834839 50002314 51299166
3888 51299166 52504922 53952188 55414392 57047602 58757741 60428218 62084512 63755248
3880 63755248 65617280 67720484 70192702 73026368 76116242 79033630 81875742 84400755
3872 84400755 86989231 89954215 93199599 96613977 100069190 103466218 106633106 109658340
3864 109658340 112674559 115958843 119610031 123702875 128660131 134302191 140843113 147736297
3856 147736297 153779448 157660058 158880566 157712937 155442812 153933844 153731897 154558004
3848 154558004 155885106 157268727 158571667 159804774 161143612 162640205 163773384 164098446
3840 164098446 163236915 161383484 158744224 155846428 153121227 150766560 148709541 146923101
3832A46923101j401949o16753k53598r99079k819435n066316p130946q023432
3824A20611593p381244o010091m820580m036708l413584l161652k922961k944471
3816H5920302l116908l439393l554235l501292l378545l069412k661962k025696
3808F1172859j844350j806345j934954k197895k281150k041385j722033j175572
3800D6169175r72041j004949r90267j050447j083651j078542j086901q62863p17604
3791C7321910o69525o06514q61545j050919j039000j068590q89460p15572o49637
3782B9771148m68727k77705k20764j97813j33142j74447j77592l41128k31063
3773B7548767j85670j69325j54199p8316j27191k81460k70977n77742o46910n25291
$$ plain form
3832 146923101 145521152 144904399 144650801 143651722 140832287 135765971 128635025 120611593
3824 120611593 113230349 107220258 102399678 98362970 94949386 91787734 88864773 85920302
3816 85920302 82803394 79364001 75809766 72308474 68929929 65860517 63198555 61172859
3808 61172859 59328509 57522164 55587210 53389315 51108165 49066780 47344747 46169175
3800 46169175 45197134 44192185 43201918 42151471 41067820 39989278 38902377 38039514 37321910
3791 37321910 36652385 36045871 35184326 34133407 33094407 32025817 31136357 30420785 29771148
3782 29771148 29302421 29024716 28803952 28606139 28472997 28298550 28120958 27779830 27548767
3773 27548767 27363097 27193772 27039573 26961257 26834066 26552606 26281629 25703887 25056977 24531686
3763B4531686n23126m30626l56487k75948l01890l06078j64586o9814k24022j62757
3753B1716352k11678j20620k05235k09338k09877k85058m51017n17410m80331
3744A9025788l30057k41666l55546k43433j69294k06548p9041R018j8660q8868
3734A7301693J30334n6843M144M5259O0160J08463n3752j46939j7297r3158j27259
3723A7154805m2951j32174j98569j75307k79573o3405r8242l03842q3516j74961
3713A5602265k23928j87967o4312j40371p8633J4903r84l0752j4480j38853K3455
3702A4760343l8859L2494l0290j95520n959k1318o5992n510M8504r6626O6851
3691A4448118M5020N6960J0132l3952J40074J21468O6381R6002J66162l1647J2259
$$ plain form
3763 24531686 24008560 23577934 23221447 22945499 22643609 22337531 22172945 22103131 21879109 21716352
3753 21716352 21504674 21384054 21178819 20969481 20759604 20474546 20023529 19506119 19025788
3744 19025788 18695731 18454065 18098519 17855086 17685792 17479244 17400203 17409221 17390561 17301693
3734 17301693 17432027 17375184 17379328 17424587 17484747 17593210 17539458 17392519 17375222 17282064 17154805
3723 17154805 17111854 16979680 16781111 16605804 16326231 16262826 16164584 15860742 15777226 15602265
3713 15602265 15378337 15190370 15126058 14985687 14907054 14921957 14920973 14890221 14875741 14736888 14760343
3702 14760343 14721484 14753978 14723688 14528168 14522209 14500891 14434899 14429389 14477893 14381267 14448118
3691 14448118 14493138 14550098 14560230 14526278 14666352 14787820 14854201 14950203 15116365 15084718 15096977
3680A5096977R901O2703o9311J3290J19969p5191k0602K994J12582J64671J67641
3669A5585624J98426R2856J13424Q4219J82843R2192Q8457J69125K46137K25892
3659A7079195K93208K77791K80757L65103K82291K36509K01136J62449J91770
3650A9370209J75504k7311l334J21299R5220J0069O5538r9815l1671M8925p9666
3639A9644967k56657k60692j89526l01121k43299j51370k41628n8675j11447l9322
3629A7791230N6679M7785k0810J64882J79345J1151J54598N4938K0332j21875
3619A8338255M4027P4610L9320j07440q4595p164j41502k99521j81505l92452
3609A7282033m06921m17711l20637l70438k85246l01608l50892k32588j60275
$$ plain form
3680 15096977 15106878 15169581 15100270 15113560 15233529 15158338 15137736 15140730 15253312 15417983 15585624
3669 15585624 15784050 15876906 15990330 16074549 16257392 16349584 16438041 16607166 16853303 17079195
3659 17079195 17372403 17650194 17930951 18296054 18578345 18814854 19015990 19178439 19370209
3650 19370209 19545713 19518402 19515068 19636367 19731587 19741656 19807194 19707379 19675708 19724633 19644967
3639 19644967 19388310 19127618 18938092 18636971 18393672 18242302 18000674 17941999 17830552 17791230
3629 17791230 17847909 17895694 17874884 18039766 18219111 18230262 18384860 18439798 18460130 18338255
3619 18338255 18382282 18456892 18496212 18388772 18304177 18297013 18155511 17855990 17674485 17282033
3609 17282033 16875112 16457401 16136764 15766326 15481080 15179472 14828580 14595992 14435717
3600A4435717k25799r6295j06827l9144q6802j27190J9943o9018K1817L9127N8004
3589A3823533M4898p8314p5797n7175k5994j83419j59420n6651n3024j66108k67029
3578A2745500j33943j53495j32565j49777k72975k63654j64473j89223j62486
3569A1122909j36986k02289n0896j29859j21252j41686o9678O0736q3927l635
3559A0243437r5419l7637j71840O0369j7916l0272P6459j6176j43352j20809j18872
3548I627972j72986j47750K0962j45760k04425j6102j2454j78767r0841r9457
3538H580392p5173j2872k1980k9793L0208p5016j23878l5620j6147n0728q1917
3527H087476j30477r495n4403j43381m0811m6688J6712l8204j32007k2005K1619
$$ plain form
3600 14435717 14209918 14113623 14006796 13967652 13880850 13753660 13773603 13704585 13726402 13765529 13823533
3589 13823533 13868431 13790117 13714320 13657145 13631151 13447732 13288312 13231661 13178637 13012529 12745500
3578 12745500 12611557 12458062 12325497 12175720 11902745 11639091 11474618 11285395 11122909
3569 11122909 10985923 10783634 10732738 10602879 10481627 10339941 10270263 10330999 10247072 10243437
3559 10243437 10148018 10110381 9938541 9998910 9980994 9950722 10027181 10011005 9867653 9746844 9627972
3548 9627972 9454986 9307236 9328198 9182438 8978013 8961911 8949457 8770690 8679849 8580392
3538 8580392 8505219 8492347 8470367 8440574 8470782 8395766 8271888 8236268 8220121 8169393 8087476
3527 8087476 7956999 7947504 7893101 7749720 7708909 7662221 7678933 7640729 7508722 7486717 7508336
3516G508336l7373j00438J0652q6824j0667K7529j5154n5402n7936J2711K7942
3505G223376P9875n4257O4330n3291l5316o8572j31336L4623j39272r1280m1471
3494F787409k8185j30728Q7678j1587J2367L5977R098m7606Q456j17320n905O9166
3482F668820K383p6371N4876L5343o3170O4540o92Q447N6490P0935j31433Q7645
3470F777813J20332K9279Q5450Q5335J8929K8058J31478P4043n1974O9769J2538
3459G381050L1216J2278J03138J42014R1794l0374N2438J35577N0330J32056J69410
3448H270927P4756J35969J75861J16267Q6731K82257J65934J22967J88378J97164
3438I817211J49128J37909J98686K64036L17609J99127J96321L34981L63617L52663
$$ plain form
3516 7508336 7470963 7370525 7381177 7294353 7283686 7311215 7296061 7240659 7182723 7195434 7223376
3505 7223376 7303251 7248994 7313324 7260033 7224717 7156145 7024809 7059432 6920160 6828880 6787409
3494 6787409 6759224 6628496 6716174 6704587 6716954 6752931 6762029 6714423 6722879 6605559 6599654 6668820
3482 6668820 6671203 6594832 6649708 6685051 6621881 6686421 6685729 6694176 6750666 6821601 6690168 6777813
3470 6777813 6898145 6927424 7012874 7098209 7117138 7145196 7276674 7350717 7298743 7368512 7381050
3459 7381050 7412266 7424544 7527682 7669696 7761490 7731116 7783554 7919131 7969461 8101517 8270927
3448 8270927 8345683 8481652 8657513 8773780 8860511 9142768 9308702 9431669 9620047 9817211
3438 9817211 9966339 10104248 10302934 10566970 10884579 11083706 11280027 11615008 11978625 12331288
3428A2331288M47664M85950N56313O53253Q61023J075715J216051J616014J481012
3419B0724283J678189J932924K225946K764376L336670M389352N561148N070227
3411D7683115K649381r52125m537073o857371o173460m287677k829565j867118
3403B2828107j166516q58596m88699k77534j16189J9296K23233L01290N65471
3394B1029863O41901Q20363J174475J579338K028584K334727K608614K967151
3386C5185016L219888M047628M704512N802390P472020J0330959J0307383N817514
3378H6887310o00381q328660j3473046j3178702r546770o458252m345303l184928
3370B7771268k386778j754063j213897j094648r18639p47861l62536k20419j5550
$$ plain form
3428 12331288 12778952 13264902 13821215 14474468 15335491 16411206 17627257 19243271 20724283
3419 20724283 22402472 24335396 26561342 29325718 32662388 37051740 42612888 47683115
3411 47683115 50332496 49380371 44843298 37985927 31812467 27524790 24695225 22828107
3403 22828107 21661591 20802995 20314296 20036762 19920573 19939869 20163102 20464392 21029863
3394 21029863 21671764 22492127 23666602 25245940 27274524 29609251 32217865 35185016
3386 35185016 38404904 42452532 47157044 52959434 60431454 70762413 81069796 86887310
3378 86887310 86286929 77958269 64485223 51306521 41759751 35301499 30956196 27771268
3370 27771268 25384490 23630427 22416530 21321882 20403243 19655382 19292846 19072427 19056877
3361A9056877j26398K43949M62091O81983Q31292J120176J182450J467229J737994
3352B6657643K028196K522382L121541M395931M917420L111163K73787l238947
3344D3789116o221748o772483n308102l629869k436647j760710j321372j128516
3336A5209669q46974n74643o50957n54043l87603l77266k44130k85713k18601
3327A1069739j80343r3461j29687j21331j48771j02240j64902m0265K3462o1485
3317A0050716p1041j08025j59130q2914l1764N1840o9196N3880L7343l0864O5518
3306I706363L0777M0848L5917q5917J56128N4430O3686J53623k3547M7691P3647
3295A0253646K08544K15075J02620P5939N5542M4671J16711K36692M9464R7246
$$ plain form
3361 19056877 18930479 19174428 19636519 20318502 21149794 22269970 23452420 24919649 26657643
3352 26657643 28685839 31208221 34329762 38725693 43643113 46754276 47028063 43789116
3344 43789116 37567368 30794885 25486783 21856914 19420267 17659557 16338185 15209669
3336 15209669 14362695 13788052 13137095 12583052 12195449 11818183 11574053 11288340 11069739
3327 11069739 10889396 10795935 10666248 10544917 10396146 10293906 10129004 10088739 10112201 10050716
3317 10050716 9979675 9871650 9712520 9629606 9597842 9649682 9580486 9634366 9671709 9640845 9706363
3306 9706363 9737140 9777988 9813905 9727988 9884116 9938546 10002232 10155855 10132308 10179999 10253646
3295 10253646 10462190 10677265 10779885 10855824 10911366 10956037 11072748 11309440 11358904 11456150
3285A1456150J67861K7097J22824J27484J48112J66114K48583K87248K29734K43074
3275A3224281L18729K89902L04074K56236K78079M14982M24855M10346L91294
3266A6312778N33203N76807O55148P14442Q02328R09990R36735J179083J226457
3257B3846971J368370J214837J296488J251464J353663J196291Q73613N25199
3249C2926896K76198k44052p97584j335908j543187j768425j858235j663245j568109
3240B2424349j595824j370063j246479j120914r33347p46471q02826o37448o19995
3231A3350982m90906m33535l88527k96965k90473k52673j56748l16043l26888
3222A0398224l53409k48883k41236j33817k52216j39147j53727k17058k63468
$$ plain form
3285 11456150 11624011 11651108 11773932 11901416 12049528 12215642 12464225 12751473 12981207 13224281
3275 13224281 13543010 13832912 14136986 14393222 14671301 15086283 15511138 15921484 16312778
3266 16312778 16845981 17422788 18077936 18792378 19594706 20504696 21441431 22620514 23846971
3257 23846971 25215341 26430178 27726666 28978130 30331793 31528084 32401697 32926896
3249 32926896 33203094 32959042 32161458 30825550 29282363 27513938 25655703 23992458 22424349
3240 22424349 20828525 19458462 18211983 17091069 16157722 15411251 14608425 13970977 13350982
3231 13350982 12860076 12426541 12038014 11741049 11450576 11197903 11041155 10725112 10398224
3222 10398224 10044815 9795932 9554696 9420879 9168663 9029516 8875789 8658731 8395263
3213H395263j6717m0543j09445P3181o5812q9143m5129j3594j07263L6947M492
3202H022237l659r0617l1427p6787O8835N6885J14521P2870j354o992j64831j28333
3190G831348j73460k59791k90414r4180j86866j03038L317q8044Q105j62776l9376
3179F444825j0104K6731k6168N0237j9080j51563R229M2673P1267m0269p2315
3168F325463M5823j2121J16224Q301M6008J05103N9500n618j1435p2185J2264
3157F617327j06328j88495j99301j56577n0796k8856r7075l5063j48094q1270
3147E525472n390j12930Q9564l9734j18840K065p7189q883J09050j447j31358
3136E230380L7608n4527k6010j23533O5321q06l0908l7176n176J1956J3413r558
$$ plain form
3213 8395263 8378546 8338003 8228558 8301739 8235927 8146784 8101655 8088061 7980798 8017745 8022237
3202 8022237 8018578 7927961 7896534 7819747 7888582 7945467 8059988 8132858 8131504 8124512 7959681 7831348
3190 7831348 7657888 7398097 7107683 7013503 6826637 6723599 6726916 6638872 6646977 6484201 6444825
3179 6444825 6434721 6461452 6435284 6485521 6466441 6314878 6324107 6366780 6438047 6397778 6325463
3168 6325463 6371286 6359165 6475389 6483690 6529698 6634801 6694301 6688683 6677248 6605063 6617327
3157 6617327 6510999 6322504 6123203 5966626 5915830 5886974 5789899 5754836 5606742 5525472
3147 5525472 5520082 5407152 5496716 5456982 5338142 5340207 5263018 5254135 5363185 5361738 5230380
3136 5230380 5267988 5213461 5187451 5063918 5129239 5128433 5097525 5060349 5055173 5067129 5080542 5070984
3124E070984q0641J498j4560j13504q4378n398r6563l8950p2033k0113p2606K8543
3112D502279j2455P2079M2751r1203M7747K8690p114J9801j07434j13049q6449
3101D295643j31910J0877l8039m6501p5896K895j25803j90897l3014K7533P7085
3090C771973Q1392J2165m4018O924L351j16469j84819j17212m3027m9879r5313
3079C225068J0689j3219l8774m5273J19952O8661l237m6448k18708j53227R5791
3068C001275R1314q5273q8039o6306j30160R6324K8029o4497J7501q09p091k8711
3056B763557K8848K6191j4181o2089o0412j21789l0766j56180k0318O8596p3196
3045B348261L006Q6145r3617q7585N9805m1023J0229P8217k6746j05266r6249
$$ plain form
3124 5070984 4990343 4991841 4977281 4863777 4779399 4774001 4677438 4638488 4566455 4546342 4473736 4502279
3112 4502279 4489824 4561903 4604654 4513451 4561198 4589888 4582774 4602575 4495141 4382092 4295643
3101 4295643 4163733 4174610 4136571 4090070 4014174 4017069 3891266 3700369 3667355 3694888 3771973
3090 3771973 3853365 3865530 3821512 3828436 3831787 3715318 3530499 3413287 3370260 3320381 3225068
3079 3225068 3235757 3222538 3183764 3138491 3258443 3327104 3323867 3277419 3058711 2905484 3001275
3068 3001275 3092589 3007316 2919277 2852971 2722811 2819135 2847164 2782667 2800168 2799359 2792268 2763557
3056 2763557 2792405 2818596 2804415 2742326 2681914 2560125 2529359 2373179 2352861 2421457 2348261
3045 2348261 2351267 2437412 2343795 2256210 2316015 2274992 2285221 2363438 2336692 2231426 2135177
3034B135177N8055J81146o1169J9745j15549o4871O3048J05600j8228P7104n6473
3023B323585j58619M6505K02119j03209o3877J00589P8401j3631L4196Q1609j2408
3012B515260O0380m1337j50333m6970J11232M9725k6413k9245K4484Q6958R935
3001B563676q3063n2145Q6923K6659P733l6278L4784P6116k9634L8882j0570K9964
2989B653047J5073M3253P1786j6632j9609M9272Q5607J15176M8302N4926J15420
2978C215621J50299P5143j00746r8997m5616Q726j5108r1302P008n5557O0065
2967C109536r939N4103j08528J55191P0603r5306k2383N8947L4648J6851Q8011
2956C351734J46398J1711O9903o5537k8533J24069P0753Q0415P422J93778q0933
$$ plain form
3034 2135177 2193232 2374378 2313209 2332954 2217405 2152534 2215582 2321182 2302954 2380058 2323585
3023 2323585 2164966 2211471 2413590 2310381 2246504 2347093 2425494 2411863 2446059 2527668 2515260
3012 2515260 2575640 2534303 2383970 2337000 2448232 2497957 2471544 2442299 2466783 2553741 2563676
3001 2563676 2480613 2428468 2515391 2542050 2549783 2513505 2548289 2624405 2594771 2633653 2623083 2653047
2989 2653047 2668120 2711373 2783159 2766527 2746918 2796190 2881797 2996973 3045275 3100201 3215621
2978 3215621 3365920 3441063 3340317 3241320 3195704 3204430 3189322 3098020 3105028 3049471 3109536
2967 3109536 3099597 3153700 3045172 3200363 3270966 3175660 3153277 3212224 3246872 3263723 3351734
2956 3351734 3498132 3509843 3579746 3514209 3485676 3609745 3680498 3760913 3768335 3962113 3881180
2945C881180K35399J55595J02709K6580j7997K1872J55832J05051J02084J41206
2935D909511o2361j41853J12612q8110Q714P2513o8507J2017n2369J13135J54311
2924D969613q3414m4184k2788P5334Q8308O7917J10353J4656J48162J85907J66278
2913E676142K09278K86722J55889J69091J06551M4574J1424l3139m1657q1971
2903F502904l51069l73844l29060j67264k07513L4471p7548j88156r6945k8493
2893D717483n7281J23564k5957Q422L5579J08095J6412j4465P5005l397O9556
2882E053016m0103n0873j44960p4192P9172r2435o7503j34693l00750o2709j62747
2871D001223j52585j88784j20845m8934O6359q6155j29130l9554j55691P2433
$$ plain form
2945 3881180 4116579 4272174 4374883 4401463 4383466 4405338 4561170 4666221 4768305 4909511
2935 4909511 4847150 4705297 4817909 4729799 4738513 4811026 4742519 4754536 4702167 4815302 4969613
2924 4969613 4886199 4842015 4819227 4894561 4982869 5050786 5161139 5175795 5323957 5509864 5676142
2913 5676142 5885420 6172142 6328031 6497122 6603673 6648247 6659671 6626532 6584875 6502904
2903 6502904 6151835 5777991 5448931 5281667 5074154 5108625 5031077 4842921 4745976 4717483
2893 4717483 4660202 4783766 4757809 4766231 4801810 4909905 4926317 4911852 4986857 4983460 5053016
2882 5053016 5012913 4962040 4817080 4742888 4822060 4729625 4662122 4527429 4226679 4163970 4001223
2871 4001223 3848638 3659854 3539009 3490075 3556434 3470279 3341149 3301595 3145904 3218337
2861C218337J4641j28533j42811l1524q5138j12519j46466l8547q0302j04059
2851B363079l9591q3942j18645j35024j5829n4361R438n0229K036k6912p3544
2840A776476o1591o5868q920J51778k4864o9259l0761r0213r8551R5517j4084
2829A559660j30771o7809m7003m2738L9817j29752J0624K1446o1660O4164o9670
2818A146308n3850r442k8687K6651N6390j8218m7237p5200K9603K5372J6367j6946
2806A051111j56080J2464r26M3286L9707M6878j05616j05561O7220N1667j5371
2795I28779j5157l0423J9645r6504o0937m4462N356K5103q9329J26516r2644m4482
2783F31461O8973O0269j26635O303J7939j3469p5794k4239j9980J5784l7965P413
$$ plain form
2861 3218337 3232978 3104445 2961634 2930110 2844972 2732453 2585987 2547440 2467138 2363079
2851 2363079 2323488 2239546 2120901 1985877 1970048 1915687 1925125 1874896 1876932 1850020 1776476
2840 1776476 1714885 1649017 1640097 1791875 1767011 1697752 1666991 1576778 1478227 1573744 1559660
2829 1559660 1428889 1361080 1314077 1271339 1311156 1181404 1192028 1213474 1151814 1215978 1146308
2818 1146308 1092458 1083016 1054329 1080980 1137370 1119152 1071915 996715 1026318 1051690 1068057 1051111
2806 1051111 895031 907495 906569 949855 989562 1036440 930824 825263 892483 944150 928779
2795 928779 913622 883199 902844 806340 745403 700941 706297 731400 642071 768587 675943 631461
2783 631461 700434 760703 634068 640371 658310 644841 569047 544808 524828 540612 502647 510060
2771E10060R3360p9071k4777K2660K5453j377o3547l4788N4590m8489m7268J31655
2759E38461P85r3291Q9659q5890o3896N2176p2587o4269k3915J15190r04j5923
2747C75596J2242O2419K3247p9753L2321l3117r4191L7415m268p8701k1371K4956
2735B56795K8890K3818j1277N457J3702j7913l1461O2114Q8332o0876j17557m7051
2723A92973L6832r983J1219j50564Q1558O6550n4052J6559p74n6728L752J54854
2711B92196j8037r5587r639K8746J03495N1359o3342J3771j3766l9460r0171l6311
2699A23254P1053l8392l5385k9338k3614K956J70864j22890l0239Q7289P4025
2688B49583m5458j1530J8690j29175j0740o708M8180P8932n0540m1759K8790M4297
$$ plain form
2771 510060 603420 524349 499572 522232 547685 546308 482761 447973 502563 454074 406806 538461
2759 538461 539246 445955 535614 449724 385828 438004 365417 301148 277233 392423 391519 375596
2747 375596 387838 450257 473504 393751 426072 392955 298764 336179 331911 253210 231839 256795
2735 256795 285685 309503 298226 303683 317385 299472 268011 330125 418457 357581 240024 192973
2723 192973 229805 219822 231041 80477 162035 228585 174533 191092 190318 133590 137342 292196
2711 292196 274159 178572 168933 197679 301174 352533 289191 302962 289196 249736 159565 123254
2699 123254 194307 155915 120530 91192 67578 70534 241398 118508 88269 175558 249583
2688 249583 204125 192595 211285 82110 71370 64662 112842 191774 141234 99475 128265 172562
2676A72562n2636l8884L8828J36526k7950q4288J9420N3065P1459Q251l3345n0974
2664B12034P8191r2574k1205O4815Q665m7929P6103j33060l4515R0943L2135n4616
2652A78987J2988J15349r5687n1599J02262K5883l5487J4855Q817l9480K1020
2641B57908m1427J52509m175q9151N0591l4264j71315Q4430N4971q7024M3358
2630B16411R0262j8977o7242j323n658o0612K3881K9882k2468N5723M1204J8859
2618B99942K0690K2727j20589n40Q2891o3238k3485P2974K5830k6981N2016Q909
2606C51146k5524P1216o7013l277k3518k1664N9519N0593m3928n4800j0119p1595
2594B11036n2473K8787Q6617k3901L5625K3428j14048Q289m2399K2356L3766N3519
$$ plain form
2676 172562 119926 81042 119870 256396 228446 144158 163578 216643 288102 296353 263008 212034
2664 212034 290225 197651 176446 241261 249926 201997 278100 145040 110525 201468 233603 178987
2652 178987 191975 307324 211637 160038 262300 288183 252696 267551 276368 236888 257908
2641 257908 216481 368990 364815 275664 326255 291991 120676 205106 260077 173053 216411
2630 216411 306673 287696 220454 219131 213473 152861 176742 206624 184156 239879 281083 299942
2618 299942 320632 343359 222770 222230 305121 241883 218398 291372 317202 290221 342237 351146
2606 351146 325622 396838 329825 326548 303030 281366 340885 391478 347550 292750 282631 211036
2594 211036 158563 187350 273967 250066 285691 309119 195071 203360 160961 183317 217083 270602
2582B70602j9977m2432N69p421n1105l4999P151P9880j2805o1740l1474J9255
2570A15504k866J12031P7235L139K5788j958k194j29551n1857M1560Q975k718
2558A93088m2573J1750M9093j06427R3321o0011n1992N509N9652L530K2079j0673
2546A66346K0025o722j04630K4768K4713q026P4307o3209j34001J8539O9341N5719
2534A37170q0822j14783j5400P7891L8855p0928p4879P0941l8749L6050O3996
2523B9342K5219J3981j0589q391p4966k3629P9338L2397l3638K5915L1749j99759
2511a13031J4294j3328R206J3256O9139L0017M0334m099j46218J17079L5759J500
2499E3908k0337n7445p3520K4218O9363o5895j8482P6182J7325M635Q400J9165
$$ plain form
2582 270602 250625 208193 208762 201341 150236 115237 122388 202268 189463 127723 96249 115504
2570 115504 112638 224669 301904 305043 330831 328873 326679 197128 145271 186831 195806 193088
2558 193088 150515 162265 211358 104931 198252 138241 86249 91758 151410 154940 177019 166346
2546 166346 186371 179649 75019 99787 124500 116474 190781 127572 -6429 12110 81451 137170
2534 137170 56348 -58435 -73835 4056 42911 -28017 -102896 -31955 -70704 -34654 29342
2523 29342 54561 68542 57953 49562 -25404 -49033 30305 62702 29064 54979 86728 -113031
2511 -113031 -98737 -112065 -102859 -89603 -20464 9553 49887 45788 -100430 16649 52408 53908
2499 53908 33571 -23874 -97394 -73176 -3813 -69708 -88190 -12008 5317 9952 18352 37517
2487C7517O2118l9693r8389r2963J40066N9792Q380k9269k6968m8246L8600q335
2475B610o3950N1325J27172K473l7416N2518k03907n4033L1226Q215L8775M3614
2463a378o608o9980O6447K893j8358o2057Q635l8014k9586l0417P6546O5981j8996
2450e4892R0665o7970N0055J564q0812K4680J07045p062J5443o0375m064j06302
2438i2025M3128O6981O10q820p5217Q0308q291J2966k9162o3942m0310L6668O4842
2425a2264m8888P1651R0017j448j41853j1919j4955Q6460k6115L0376k4055J03703
2413A00710M2488n7588n1432N7148J3217q904K5589m5185r541J370l0444m5778
2401h350N3004J00763o2661l8210N6756k4416M5579n5053j9914j8710O1702n7080
$$ plain form
2487 37517 99635 59942 -38447 -131410 8656 68448 76828 47559 20591 -27655 10945 2610
2475 2610 -61340 -10015 117157 119630 82214 134732 -69175 -123208 -91982 -83767 -44992 -1378
2463 -1378 -7986 -77966 -11519 -8626 -26984 -89041 -80406 -118420 -148006 -178423 -101877 -35896 -54892
2450 -54892 35773 -32197 17858 19422 -61390 -36710 70335 63273 78716 18341 14277 -92025
2438 -92025 -48897 18084 18694 9874 -65343 14965 6674 19640 -9522 -73464 -113774 -77106 -12264
2425 -12264 -61152 10499 100516 99068 -42785 -54704 -69659 16801 -9314 21062 -2993 100710
2413 100710 143198 85610 34178 91326 104543 95639 121228 76043 66502 67872 37428 -8350
2401 -8350 44654 145417 82756 44546 101302 76886 122465 67412 47498 28788 90490 33410
2389C3410K7543q8548P152J01881M5086l8660M9492m1964l9079N4112J06605k5708
2377A91322j5428M1269K4922o7187l9505L6108j1764m4545m4226L1095r676J1142
2365A03527J006l864j541j9857l2375n2994R5700j10226J269P3758n869o074r1211
2352d8751M671M7955p67j8698K0433N854J49972r4833p220k0663P6226j05143
2340I036K3749n299L1573l7450n901n3538M1098N1567k9887K6612P2432o9145
2328E4847j4604k3164J1572P3080o7366k6850n6182M4317L8791Q9490J638l952
2316A21617m478o6181o3544Q8859K7828k1125k9729p842n5110P2796o1312o6998
2304f5219Q3873R9516p1392j7312K5801K2444m849L8536m6468L4416L9385l9832
$$ plain form
2389 33410 60953 -27595 -20443 81438 126524 87864 137356 95392 56313 110425 217030 191322
2377 191322 175894 217163 242085 174898 135393 171501 159737 115192 70966 102061 92385 103527
2365 103527 104533 100669 99128 79271 46896 -6098 89602 -20624 -19355 54403 48534 42460 -48751
2352 -48751 -44080 3875 3108 -15590 4843 10697 160669 65836 58616 37953 114179 9036
2340 9036 32785 27486 59059 21609 15708 -37830 3268 54835 24948 51560 123992 54847
2328 54847 40243 17079 28651 101731 34365 7515 -48667 -4350 34441 123931 125569 121617
2316 121617 117139 50958 -12586 76273 104101 82976 53247 45405 -9705 63091 1779 -65219
2304 -65219 18654 118170 46778 29466 55267 77711 72862 111398 64930 99346 138731 98899
2292I8899q0082Q7181O3409J6425k0516M3217n2725p0570K0348O6624n2315o9369
2280E0526l3419J19387n9717R543J20081M0349J1468M4215r7472q792P8710j08706
2268A66173J5468O388L9964l422L5738N7020r405p3658n0921O4177R2221n2486
2256B87257j5851M3982o4816r2130J29950p5684L3398M8096K9584J2399r9479
2245B36706K0082L4000M5749r3414P8211L6365n5964J7230K6133Q4410l6636n9679
2233C33193r742k9190J66383l5899J6706J447p8332J5179r161K4454j4533O0134
2221D40639j7930Q2732J22559n8762k3455l009j1413L7590o4498J43725J43J4220
2209F62541l5473K8738j1073Q688l4109R5747J13121r1291m1713q348m0919M2630
$$ plain form
2292 98899 18817 105998 169407 185832 165316 208533 155808 85238 105586 172210 119895 50526
2280 50526 17107 136494 76777 86320 206401 246750 258218 302433 204961 196169 274879 166173
2268 166173 181641 188029 227993 224571 260309 317329 307924 234266 183345 247522 339743 287257
2256 287257 271406 315388 250572 158442 288392 212708 246106 294202 323786 336185 236706
2245 236706 256788 290788 336537 243123 321334 357699 301735 318965 345098 429508 392872 333193
2233 333193 323451 294261 460644 424745 441451 442898 364566 379745 370584 395038 380505 440639
2221 440639 422709 505441 628000 569238 545783 542774 531361 568951 504453 648178 648321 662541
2209 662541 627068 655806 644733 653421 619312 715059 828180 736889 695176 686828 645909 688539
2197F88539L0893N9049p8608K0199k3633J26221q372n928q1908r945O7310L1900
2185H15717n3579j52402K0137Q5179J8662R8939J22329j9279m3889K4142k468
2174I13488n3503M9901l0272N452l998J04271K6477j7591J05187R8473K2314K0816
2162A241015J31206j9695m6636P7505Q4311J4702R913J68220O4365L0653R8847
2151A854406Q9353J9189L1417J07039O9407K7323J21463K4569O8781O8296Q8022
2140B569265P4763J22460J23915J47647K20164J66106J66024K04348K86683K35713
2130D317088K50198J90038K62347L88090N63715N59442N92952N77805O15855Q14485
2120I132015R41985J216451J386304J624725J748622K180066K739325L278364
$$ plain form
2197 688539 719432 778481 699873 720072 696439 822660 814288 808360 726452 716507 783817 815717
2185 815717 762138 609736 629873 715052 733714 832653 954982 935703 891814 915956 913488
2174 913488 859985 909886 879614 885066 881068 985339 1011816 994225 1099412 1197885 1220199 1241015
2162 1241015 1372221 1352526 1305890 1383395 1467706 1482408 1492321 1660541 1724906 1755559 1854406
2151 1854406 1943759 1962948 1994365 2101404 2170811 2198134 2319597 2344166 2412947 2481243 2569265
2140 2569265 2644028 2766488 2890403 3038050 3258214 3424320 3590344 3794692 4081375 4317088
2130 4317088 4567286 4757324 5019671 5407761 5971476 6530918 7123870 7701675 8317530 9132015
2120 9132015 10074000 11290451 12676755 14301480 16050102 18230168 20969493 24247857
2112B4247857M399833N799331M592128J677363k408773o168157p536062n788070
2104A8815450l918370k550379j939606j503145j050514q23034o49995m33028l36767
2095E610612k42969k54320l09084l08281l90227m40115j88272k48370l43206j39281
2085B746487k40527N6056j27371p2531j17382r0479j46679j36903q0395j05462
2075A684814j45816o1020L8750j59702j05687O0358j6016m689j23839q4641j1428
2064A071084K1613m4250m3870m5352K432p0073Q189J5046l0749l2455r7010p0279
2052F84326L4352P0944k0710n2482o2885q273O534q2320m8308O7159P0505j9367
2040F39475m3151l5620m7030J35441M4413j07110l0946j2154P1539q4346l8730
$$ plain form
2112 24247857 28647690 34447021 39039149 40716512 38307739 32139582 24603520 18815450
2104 18815450 14897080 12346701 10407095 8903950 7853436 7030402 6380407 5947379 5610612
2095 5610612 5367643 5113323 4804239 4495958 4105731 3665616 3477344 3228974 2885768 2746487
2085 2746487 2505960 2562016 2434645 2362114 2244732 2154253 2007574 1870671 1790276 1684814
2075 1684814 1538998 1477978 1516728 1357026 1251339 1311697 1295681 1290992 1167153 1082512 1071084
2064 1071084 1092697 1048447 1004577 959225 961657 891584 899773 914819 884070 851615 754605 684326
2052 684326 718678 789622 768912 716430 653545 645272 651806 569486 521178 588337 658842 639475
2040 639475 596324 560704 513674 649115 693528 586418 555472 543318 614857 530511 491781
2029D91781J8013n4588q3177p9436L5162J00398n1279l4639p2505p3546K8910
2018B25094M4882j02066J10423L7625j2093J2861n8531n141N4781j1573l7632
2007B58630l9406J7555p1952J07392O1645r6622L3540m717N136p7998M0066j972
1995B31297j3597m8586J26501r2042q0313R7662r6298j2762m3441P1346K0276
1984A60043L8017N3241J69o2142j69849k7876K20726p6545j16335o4638Q8422
1973D3233K5342o608k6253m4622J22891k6854q6418l174J6006O2778q813k8181
1961C9327J87957m4371j34487o5091m9637J06926r425q3378K9867p0625O9967
1950b2970Q8445j9467k2933q406m2069N2444P1729q4845l4802l9523O649J07701
$$ plain form
2029 491781 509794 455206 372029 292593 327755 428153 376874 342235 269730 196184 225094
2018 225094 269976 167910 278333 315958 303865 316726 258195 253054 307835 296262 258630
2007 258630 219224 236779 164827 272219 333864 237242 270782 266065 271201 193203 233269 231297
1995 231297 217700 169114 295615 203573 123260 220922 124624 111862 68421 139767 160043
1984 160043 198060 251301 251470 189328 19479 -8397 212329 135784 19449 -45189 43233
1973 43233 68575 61967 35714 -8908 113983 87129 711 -2463 13543 76321 67508 39327
1961 39327 227284 182913 48426 -16665 -66302 40624 31199 -52179 -22312 -92937 -22970
1950 -22970 65475 46008 23075 14669 -27400 25044 96773 11928 -22874 -62397 -55748 51953
1938E1953n4270O1265p6285M2549n8717O9669l8690K2781p7806m2376J48262j9892
1926B8443r3535J4676K8185M2877j8820n4055R9530o2327l9519N2293m7927j2425
1914f2604j7019j01736K7458J29122r7976m1544J51192M6837j12128j4946P2268
1903b1076L4543k3698L2447K1057j376r1051r767P0339p0089O7345j3516M9205
1891D4363L3366r1391K588m6095k401o0840j5484J00263O5980m5069m7052P5974
1879A4202o1487p9583J6968J04562l0714J396L8129J8132j2100m9522P544L0437
1867b036k1577l958K973M9332K349k4332l7713L3462j5818l0045n0315K5918O1042
1854a0718J8018J08316j17426j41811J62274M7612j4746K8331O134j5339k5684
$$ plain form
1938 51953 -2317 58948 -17337 25212 -33505 36164 -2526 20255 -57551 -99927 48335 28443
1926 28443 -65092 -50416 -22231 20646 1826 -52229 47301 -15026 -54545 -2252 -50179 -62604
1914 -62604 -79623 -181359 -153901 -24779 -122755 -164299 -13107 33730 -78398 -93344 -21076
1903 -21076 13467 -10231 22216 43273 41897 -49154 -58921 11418 -58671 8674 -4842 44363
1891 44363 77729 -13662 -11074 -57169 -59570 -120410 -135894 -35631 30349 -14720 -61772 14202
1879 14202 -47285 -126868 -109900 -5338 -36052 -34656 3473 21605 9505 -40017 -32473 -2036
1867 -2036 -23613 -27571 -24598 24734 27083 2751 -34962 -1500 -17318 -47363 -97678 -71760 -10718
1854 -10718 7300 115616 -1810 -143621 18653 66265 51519 79850 85984 70645 44961
1843D4961O0373J675k943M9027J8319m5533K4121k0601o6726N750j1875L3954
$$ plain form
1843 44961 105334 107009 104066 153093 171412 125879 150000 129399 62673 68423 56548 90502
$$ [...]
##END NTUPLES=NMR SPECTRUM
##END=
