##TITLE=1H_EC-3265(II-2)
 CDCl3
 8 sc, 
 9.12.2021
##JCAMPDX= 6.0         $$ Bruker NMR JCAMP-DX V2.0
##DATA TYPE= NMR SPECTRUM
##DATA CLASS= NTUPLES
##ORIGIN= UXNMR, Bruker Analytische Messtechnik GmbH
##OWNER= root
$$ XWIN-NMR		Version 3.5
$$ Thu Dec  9 12:07:08 2021 Russian Standard Time (UT+4h)  she@DPX200
##.OBSERVE FREQUENCY= 200.131346
##.OBSERVE NUCLEUS= ^1H
##.ACQUISITION MODE= SIMULTANEOUS
##.ACQUISITION SCHEME= undefined
##.AVERAGES= 8
##.DIGITISER RES= 18
##SPECTROMETER/DATA SYSTEM= spect
##.PULSE SEQUENCE= zg30
##.SOLVENT NAME= CDCl3
##.SHIFT REFERENCE= (INTERNAL, CDCl3, 0, 15.7182)
##AUDIT TRAIL= $$ (NUMBER, WHEN, WHO, WHERE, WHAT)
$$ ##TITLE= Audit trail, XWIN-NMR		Version 3.5
$$ ##JCAMPDX= 5.01
$$ ##ORIGIN= Bruker BioSpin GmbH
$$ ##OWNER= she
$$ F:/spectra/data/she/nmr/H-F/1/pdata/1/auditp.txt
$$ ##AUDIT TRAIL=  $$ (NUMBER, WHEN, WHO, WHERE, WHAT)
(   1,<2021-12-09 12:05:52.60 +0400>,<she>,<DPX200>,
      <created by zg, POWCHK disabled, PULCHK disabled
       configuration hash MD5:
       00 E9 B6 7A A2 85 ED C7 34 08 36 98 17 FE 4E 26
       data hash MD5: 16K
       DE EC DA BA 24 B7 9D 2A 67 3A 77 FF 55 EF 87 E2>)
(   2,<2021-12-09 12:05:54.93 +0400>,<she>,<DPX200>,
      <Start of raw data processing
       efp BC_mod = 2 LB = 0.24 FT_mod = 6 PKNL = 1 PHC0 = -15511.39 PHC1 = 12.6008 SI = 16K 
       data hash MD5: 16K
       85 C7 60 20 DD CB 55 00 AE C6 55 45 03 A0 C7 53>)
(   3,<2021-12-09 12:06:19.09 +0400>,<she>,<DPX200>,
      <pk PHC0 = 1.270836 PHC1 = -5.4 
       data hash MD5: 16K
       2B 83 06 15 F8 DA 78 85 B1 03 44 E7 0C 30 4D C7>)
(   4,<2021-12-09 12:06:22.53 +0400>,<she>,<DPX200>,
      <abs ABSG = 5 
       data hash MD5: 16K
       70 05 B6 D0 1F C2 20 01 CB BC 40 73 87 1A 5F 58>)
$$ ##END=
$$ 
$$ hash MD5
$$ D1 33 47 6A 81 08 F8 EC 92 22 49 8E BD 21 DF CB
##$RELAX= 
##$RELAX= 
##$RELAX= 
##$RELAX= 
##$RELAX= 
##$RELAX= 
$$ Bruker specific parameters
$$ --------------------------
##$DU= <F:/spectra>
##$EXPNO= 1
##$NAME= <H-F>
##$PROCNO= 1
##$TYPE= <nmr>
##$USER= <she>
##$AMP= (0..31)
100 100 100 100 100 100 100 100 100 100 100 100 100 100 100 100 100 100 
100 100 100 100 100 100 100 100 100 100 100 100 100 100 
##$AQSEQ= 0
##$AQ_mod= 1
##$AUNM= <au_zg>
##$AUTOPOS= <>
##$BF1= 200.13
##$BF2= 200.13
##$BF3= 200.13
##$BF4= 200.13
##$BF5= 200.13
##$BF6= 200.13
##$BF7= 200.13
##$BF8= 200.13
##$BYTORDA= 1
##$CFDGTYP= 0
##$CFRGTYP= 5
##$CHEMSTR= <none>
##$CNST= (0..31)
1 1 145 1 1 1 1 1 1 1 1 1 1 1 1 1 1 1 1 1 1 1 1 1 1 1 1 1 1 1 1 1 
##$CPDPRG= <>
##$CPDPRG1= <>
##$CPDPRG2= <>
##$CPDPRG3= <>
##$CPDPRG4= <mlev>
##$CPDPRG5= <mlev>
##$CPDPRG6= <mlev>
##$CPDPRG7= <mlev>
##$CPDPRG8= <mlev>
##$CPDPRGB= <>
##$CPDPRGT= <>
##$D= (0..31)
0 1.2 0 0 0 0 0 0 0 0.06 0 0.03 0 0 0 0 0.0002 0 0 0 0 0 0 0 0 0 0 0 0 
0 0 0 
##$DATE= 1639037151
##$DBL= (0..7)
120 120 120 120 120 120 120 120 
##$DBP= (0..7)
150 150 150 150 150 150 150 150 
##$DBP07= 0
##$DBPNAM0= <>
##$DBPNAM1= <>
##$DBPNAM2= <>
##$DBPNAM3= <>
##$DBPNAM4= <>
$$ [...]
##$SUBNAM2= <"">
##$SUBNAM3= <"">
##$SUBNAM4= <"">
##$SUBNAM5= <"">
##$SUBNAM6= <"">
##$SUBNAM7= <"">
##$SUBNAM8= <"">
##$SUBNAM9= <"">
##$SW= 18.0517287032376
##$SWIBOX= (0..15)
0 0 2 0 0 0 0 0 0 0 0 0 0 0 0 0 
##$SW_h= 3612.71676300578
##$TD= 16384
##$TD0= 1
##$TE= 0
##$TE2= 300
##$TE3= 300
##$TEG= 300
##$TL= (0..7)
0 120 120 120 120 120 120 120 
##$TP= (0..7)
150 150 150 150 150 150 150 150 
##$TP07= 0
##$TPNAME0= <>
##$TPNAME1= <>
##$TPNAME2= <>
##$TPNAME3= <>
##$TPNAME4= <>
##$TPNAME5= <>
##$TPNAME6= <>
##$TPNAME7= <>
##$TPOAL= (0..7)
0.5 0.5 0.5 0.5 0.5 0.5 0.5 0.5 
##$TPOFFS= (0..7)
0 0 0 0 0 0 0 0 
##$TUNHIN= 0
##$TUNHOUT= 0
##$TUNXOUT= 0
##$USERA1= <user>
##$USERA2= <user>
##$USERA3= <user>
##$USERA4= <user>
##$USERA5= <user>
##$V9= 5
##$VALIST= <valist>
##$VCLIST= <CCCCCCCCCCCCCCC>
##$VD= 0
##$VDLIST= <DDDDDDDDDDDDDDD>
##$VPLIST= <PPPPPPPPPPPPPPP>
##$VTLIST= <TTTTTTTTTTTTTTT>
##$WBST= 1024
##$WBSW= 4
##$XGAIN= (0..3)
0 0 0 0 
##$XL= 0
##$YL= 0
##$YMAX_a= 99527
##$YMIN_a= -167765
##$ZGOPTNS= <>
##$ZL1= 120
##$ZL2= 120
##$ZL3= 120
##$ZL4= 120
##$ABSF1= 15.71824
##$ABSF2= -2.33361
##$ABSG= 5
##$ABSL= 3
##$ALPHA= 0
##$AQORDER= 0
##$ASSFAC= 0
##$ASSFACI= 0
##$ASSFACX= 0
##$ASSWID= 0
##$AUNMP= <proc_1d>
##$AZFE= 0.1
##$AZFW= 0.1
##$BCFW= 0
##$BC_mod= 2
##$BYTORDP= 0
##$COROFFS= 0
##$CY= -3
##$DATMOD= 1
##$DC= 0
##$DFILT= <>
##$DTYPP= 0
##$F1P= 0
##$F2P= 0
##$FCOR= 1
##$FTSIZE= 16384
##$FT_mod= 6
##$GAMMA= 0
##$GB= 0
##$INTBC= 1
##$INTSCL= 0
##$ISEN= 128
##$LB= 0.24
##$LEV0= 0
##$LPBIN= 0
##$MAXI= 10000
##$MC2= 0
##$MEAN= 0
##$ME_mod= 0
##$MI= 1.114404
##$NCOEF= 0
##$NC_proc= -7
##$NLEV= 6
##$NOISF1= 3.799351
##$NOISF2= 2.8
##$NSP= 0
##$NTH_PI= 0
##$NZP= 0
##$OFFSET= 15.71824
##$PC= 1
##$PHC0= -15510.12
##$PHC1= 7.200799
##$PH_mod= 1
##$PKNL= yes
##$PPARMOD= 0
##$PSCAL= 0
##$PSIGN= 0
##$REVERSE= no
##$SF= 200.13000666646
##$SI= 16384
##$SIGF1= 3
##$SIGF2= 2
##$SINO= 5.538805
##$SIOLD= 16384
##$SREGLST= <1H.CDCl3>
##$SSB= 0
##$STSI= 16384
##$STSR= 0
##$SW_p= 3612.71676300578
##$SYMM= 0
##$S_DEV= 0
##$TDeff= 16384
##$TDoff= 0
##$TI= <>
##$TILT= no
##$TM1= 0
##$TM2= 0
##$TOPLEV= 0
##$USERP1= <user>
##$USERP2= <user>
##$USERP3= <user>
##$USERP4= <user>
##$USERP5= <user>
##$WDW= 1
##$XDIM= 16384
##$YMAX_p= 303484197
##$YMIN_p= -556175
$$ End of Bruker specific parameters
$$ ---------------------------------
##NTUPLES= NMR SPECTRUM
##VAR_NAME=  FREQUENCY,     SPECTRUM/REAL,   SPECTRUM/IMAG
##SYMBOL=    X,             R,               I
##VAR_TYPE=  INDEPENDENT,   DEPENDENT,       DEPENDENT
##VAR_FORM=  AFFN,          ASDF,            ASDF
##VAR_DIM=   16384,         16384,           16384
##UNITS=     HZ,            ARBITRARY UNITS, ARBITRARY UNITS
##FACTOR=    0.220516191357247, 1,           1
##FIRST=     3145.69143280511, 0,            0
##LAST=      -467.025330200668, 0,           0
##MIN=       -467.025330200668, -556175,     0
##MAX=       3145.69143280511, 303484197,    0
$$ Real data points
##PAGE= N=1
##DATA TABLE= (X++(R..R)), XYDATA
$$ [...]
7161A829403J14851l2720K01567J56431l8766n8882K07979J26030J62294p2920
$$ 1829403 1944254 1911534 2113101 2269532 2230766 2171884 2379863 2505893 2668187 2595267
7151B595267J94985J23305o6575j6367K10198j5615J10007L22218P655J29178
$$ 2595267 2790252 2913557 2846982 2830615 3040813 3025198 3135205 3457423 3465078 3594256
7141C594256R6301L4186J37529K6905j120K71943J22930K17303K18343M11371
$$ 3594256 3690557 3724743 3862272 3889177 3888057 4160000 4282930 4500233 4718576 5129947
7131E129947J46000M31242R8826K50037K50104L20497N64573L26311N14031M18558
$$ 5129947 5275947 5707189 5806015 6056052 6306156 6626653 7191226 7517537 8031568 8450126
7121H450126N26163P60422P13238P38769J192080J326370J045536J558663J993409
$$ 8450126 8976289 9736711 10449949 11188718 12380798 13707168 14752704 16311367 18304776
7112A8304776K306413L193293L696309M840598O065850P511827Q820962R800327
$$ 18304776 20611189 23804482 27500791 32341389 38407239 45919066 54740028 64540355
7104F4540355R745556Q306748M743449j553542o444685j0496215j1320800r666788
$$ 64540355 74285911 82592659 87336108 85782566 79337881 68841666 57520866 47854078
7096D7854078p435680n357078m123513k967216k712006k915501k824890k023533
$$ 47854078 40418398 35061320 30937807 27970591 25258585 22343084 19518194 17494661
7088A7494661j687237j724760j458840j007632j097365p98471m96846m70056p11590
$$ 17494661 15807424 14082664 12623824 11616192 10518827 9720356 9223510 8753454 8041864
7079H041864n82335l47141k67027k70282j46079k79288l69122l39406k71496R279
$$ 8041864 7459529 7112388 6845361 6575079 6429000 6149712 5780590 5441184 5169688 5178967
7069E178967p7962j70314k39964q9665k49273k05104r1203r9056o3743p5867q0104
$$ 5178967 5101005 4930691 4690727 4601062 4351789 4146685 4055482 3956426 3892683 3816816 3736712
7058C736712j11933n2518J24419o4190j10028L57723M3825j23455m685j80527
$$ 3736712 3624779 3572261 3696680 3632490 3522462 3880185 3924010 3800555 3795870 3615343
7048C615343l26410j86289J08820K09177j8274M6812J79715J23366O0133j91361
$$ 3615343 3288933 3102644 3211464 3420641 3402367 3449179 3628894 3752260 3812393 3621032
7038C621032k49881l51326l78579l18679j47756l1247j73689j37112j1305p1674
$$ 3621032 3371151 3019825 2641246 2322567 2174811 2143564 1969875 1832763 1821458 1749784
7028A749784k14208k15109N6631J34251j32348j13355L0022j51551o9062J48054
$$ 1749784 1535576 1320467 1377098 1511349 1379001 1265646 1295668 1144117 1075055 1223109
7018A223109l3804k88931j7462R0447N4020j87188k40357q503j7875K7681J48960
$$ 1223109 1189305 900374 882912 973359 1027379 840191 599834 591331 573456 601137 750097
7007G50097r0933j52190p1190q4903N703K33163M9188j023k1135J32718k0383
$$ 750097 659164 506974 435784 350881 356584 589747 638935 637912 616777 749495 729112
6996G29112n2123l09728O495J4054j58910J95374J49317L0338l8803P509k03211
$$ 729112 676989 367261 373756 387810 228900 424274 573591 603929 565126 572635 369424
6985C69424j20655K4373R4720j79650k1580K8422J12444L6973j14890j0778R8846
$$ 369424 248769 273142 367862 188212 166632 195054 307498 344471 229581 218803 317649
6974C17649k3568l1641k27854J09004J22544j5163k521J4458P779J57754j76503
$$ 317649 294081 262440 34586 143590 266134 250971 248450 262908 270687 428441 251938
6963B51938j79215l2163J74549n2025J99253j462j37130L1002j38028o4537j14436
$$ 251938 72723 40560 215109 163084 362337 360875 223745 254747 116719 52182 -62254
6952f2254J06501J29850P4400K5143J744Q6664o2760j80948J71211j43035L0916
$$ -62254 44247 174097 248497 273640 275384 362048 299288 118340 289551 146516 177432
6941A77432J00705q516O8217K6196o9109j28877m1972J25331l9820p1933J86645
$$ 177432 278137 269621 337838 364034 294925 166048 124076 249407 209587 137654 324299
6930C24299Q9238j82009K0838o9849k3738J96317n1496k53411J31895o8946M6390
$$ 324299 413537 231528 252366 182517 158779 355096 303600 50189 182084 113138 159528
6919A59528K4609J51177o2582j54513K09289R0548j12060j46481o5020K7742o1274
$$ 159528 184137 335314 272732 118219 327508 418056 305996 159515 94495 122237 60963
6908F0963J41915P9846P3525j37025J2787n6952j31378Q1458n5157P7185k12304
$$ 60963 202878 282724 356249 219224 232011 175059 43681 125139 69982 147167 -65137
6897f5137J34461J36695o8893j81711r8239j889J63100O4337j12615L4954p0036
$$ -65137 69324 206019 137126 -44585 -142824 -144713 18387 82724 -29891 5063 -64973
6886f4973r6694m9341K0989K02188J56476j8668J10247m7596j94345n9638J23652
$$ -64973 -161667 -211008 -190019 12169 168645 149977 260224 212628 18283 -41355 82297
6875H2297J53287j36257J94906l5277j96696K4987J09558k5938l8823O3485J6346
$$ 82297 235584 99327 294233 258956 62260 87247 196805 170867 132044 195529 211875
6864B11875j5266Q5147n2017o5744j46612J07787n590m5365J25672j67453J02485
$$ 211875 196609 281756 229739 163995 17383 125170 119580 74215 199887 32434 134919
6853A34919J46224r0054O7428J20598j13011l5223M1615m603q4140j76475J35700
$$ 134919 281143 191089 258517 379115 266104 230881 272496 267893 183753 7278 142978
6842A42978O802p9040R1396o6740l858k19288J79752j5561r35K21035j66928L8673
$$ 142978 149780 70740 162136 95396 91538 -127750 52002 36441 35506 256541 89613 128286
6830A28286O1951J16323p6009R9665l9545k7414j21369R6634M6315r2431j8788
$$ 128286 190237 306560 230551 330216 290671 263257 141888 238522 284837 192406 173618
6819A73618j1576j25183o146k5514n7476m767N8932J27738j5225J0881j7267O5762
$$ 173618 162042 36859 30713 5199 -52277 -57044 1888 129626 114401 125282 108015 173777
6807A73777n677j28623o3688P6848l5190R1200L0106R3426n8942o7002J37762
$$ 173777 168100 39477 -24211 52637 17447 108647 138753 232179 173237 106235 243997
6796B43997j65918Q189K62500p3611j3414q3103k5791J4429P2242l04922j51701
$$ 243997 78079 86268 348768 275157 261743 178640 152849 167278 239520 -65402 -217103
6785b17103n8674J59862J48299P7407K02101p0844j69765K4731j46485n689K44387
$$ -217103 -275777 -115915 32384 109791 311892 241048 71283 96014 -50471 -56160 188227
6774A88227J84611j64382j24026M312J33780J35854j14850m5753L4556k10920
$$ 188227 372838 208456 84430 88742 222522 358376 243526 197773 232329 21409
6764B1409k30802J41394L20025j50744O7341j20972J9688K40895r9667j8066j7897
$$ 21409 -209393 -67999 252026 101282 168623 47651 67339 308234 208567 190501 172604
6753A72604K1924Q3137j58161j24787M8013K76729m1625j15224P0006m3763M6028
$$ 172604 194528 277665 119504 -5283 42730 319459 277834 162610 232616 188853 234881
6742B34881q0467R1730j71077Q6712k6178R4759j12558m9029j10022L5516J04140
$$ 234881 154414 246144 75067 161779 135601 230360 117802 68773 -41249 -5733 98407
6731I8407N6583J50878m606k2551J26615j99580k91530L5874J23229J18200l920
$$ 98407 154990 305868 301262 278711 405326 205746 -85784 -49910 73319 191519 187599
6720A87599j85309J83770Q0657Q8772k17534j28520J0858J41554M1576R6852J7630
$$ 187599 2290 186060 266717 355489 137955 9435 20293 161847 203423 300275 317905
6709C17905Q2361K03950k7805J394n0993j31222k2749k0068o0700n4523J71024
$$ 317905 400266 604216 576411 577805 526812 395590 372841 352773 292073 237550 408574
6698D08574J59981j17859O3443j67479j4517m622q3844m954O9143p0902k06588
$$ 408574 568555 450696 514139 346660 332143 327521 243677 238723 307866 236964 30376
6687C0376Q6978j20865o0703J80948L1470J62556m4814j64978j45464O9735j25215
$$ 30376 117354 -3511 -64214 116734 148204 310760 265946 100968 -44496 25239 -99976
6676i9976m4177J62114J63018k20373R1037Q2222m7199l0427M0145m5452Q8961
$$ -99976 -144153 17961 180979 -39394 51643 133865 86666 56239 96384 50932 139893
6665A39893j91808r2911J1435j844O9232J34778K05705j17034j45472J04360j40344
$$ 139893 -51915 -144826 -133391 -135235 -66003 68775 274480 157446 11974 116334 -24010
6654b4010o814K1894j60524J69721m8993L549K07825m7946j7967R5760j70666
$$ -24010 -30824 -8930 -169454 267 -48726 -45177 162648 114702 96735 192495 21829
6643B1829K09172J23070k45050j07109J07618l964n7119j45749J8463K10744N4120
$$ 21829 231001 354071 109021 1912 109530 105566 48447 -97302 -78839 131905 186025
6632A86025j25753R0331Q3247r616k1489j4987K0648j60492J01153N2642j45549
$$ 186025 60272 150603 233850 224234 202745 187758 208406 47914 149067 201709 56160
6621E6160q4040J65519L7208m8702N9643j50367K03626j3457K3165P5542K8340
$$ 56160 -27880 137639 174847 126145 185788 35421 239047 225590 248755 324297 352637
6610C52637j05310j36046K050J68779K60724j83307r0078P6785j11269r6113Q3545
$$ 352637 247327 111281 113331 282110 542834 359527 269449 346234 234965 138852 222397
6599B22397o7710j9869K86105r5563j19322J18436r1057P9292o271j19643Q1958
$$ 222397 154687 134818 420923 325360 206038 324474 233417 312709 306438 186795 268753
6588B68753j7483l3223Q6256l24915j53083J52791J17170l5055r0544R8660J6641
$$ 268753 251270 218047 304303 -20612 -173695 -20904 96266 61211 -29333 69327 85968
6577H5968J48159P008M7228j70293J76292O0754j84664J20716P9733j10454o0739
$$ 85968 234127 241135 288363 118070 294362 355116 170452 291168 370901 260447 199708
6566A99708j07777p5283o0792J19635O6446p443J39441p2695J05773M6131p4200
$$ 199708 91931 16648 -44144 75491 141937 134494 273935 201240 307013 353144 278944
6555B78944q7222P6903j79556K27881L8065j15113K196L3568o1583k1379m826
$$ 278944 191722 268625 89069 316950 355015 239902 242098 275666 214083 192704 187878
6544A87878j20904O1119L7775k3015p5610K6840J20127p8686k0490K34993p3202
$$ 187878 66974 128093 165868 142853 67243 94083 214210 135524 115034 350027 276825
6533B76825j40721r1003L1057J09207j24951j20702K21658P7610L918k12670J65822
$$ 276825 136104 45101 76158 185365 60414 -60288 161370 238980 242898 30228 196050
6522A96050j96818J81856J05648k41286J32378q2505J17821m8082r2911J12468
$$ 196050 -768 181088 286736 45450 177828 95323 213144 165062 72151 184619
6512A84619P8324j8828k64571l987K87774K8592p4086j58824K80427k8804j46164
$$ 184619 262943 244115 -20456 -24443 263331 291923 217837 59013 339440 310636 164472
6501A64472O6801K9204L2111J19053j36180J0124j46158j1776O6843o0287n9559
$$ 164472 231273 260477 292588 411641 275461 285585 139427 127651 194494 134207 74648
6490G4648O8755M6368k6597J07987l9843j59200J76352J67501m6035j3027M1198
$$ 74648 143403 189771 163174 271161 231318 72118 248470 415971 369936 356909 398107
6479C98107J29338k55034q2705J62062j30267j1850K2124l7173J5449j75719k1859
$$ 398107 527445 272411 189706 351768 221501 209651 231775 194602 210051 34332 12473
6468A2473J42509K5874L9291J15647j04889k6896p3878j31729Q1234L9778J73710
$$ 12473 154982 180856 220147 335794 230905 204009 130131 -1598 79636 119414 293124
6457B93124j2111j96585j90478J26927J61796j90506k65605K17994K58848Q6968
$$ 293124 281013 84428 -106050 20877 182673 -7833 -273438 -55444 203404 290372
6447B90372O1922l4087l5353J9285J03628J0588K3453n264j09186L1734j1442
$$ 290372 352294 318207 282854 302139 405767 416355 439808 434544 325358 357092 345650
6436C45650k98935J4701J23486L7893o9688j92338o1665J91811j9134J48975r3696
$$ 345650 46715 61416 184902 222795 153107 -39231 -100896 90915 71781 220756 127060
6425A27060q2219p7893J10375M8754J39064L0274K3987J50415l24953n3081L2560
$$ 127060 44841 -33052 77323 126077 265141 295415 319402 469817 144864 91783 124343
6414A24343O3078P8562j03865m6453J7477k3065m8680J23519M8136k9036n17J3548
$$ 124343 187421 265983 162118 115665 133142 110077 61397 184916 233052 204016 203499 217047
6402B17047L514r091K0038j94778K3179L85519n2837k50040K1968j7203l2594
$$ 217047 220561 211470 231508 36730 59909 445428 392591 142551 164519 147316 114722
6391A14722P2626J30408r6129K5432N663j19320q8047j2108J1338M8642J70180
$$ 114722 187348 317756 221627 247059 252722 133402 45355 33247 44585 93227 263407
6380B63407P0478J8734j39544O4567J33794J00895k04841L4399j2016l8107J41228
$$ 263407 333885 352619 213075 277642 411436 512331 307490 341889 329873 291766 432994
6369D32994j18471q8140J24018P0531P1757j76926l7219p8169J00896J28385n6039
$$ 432994 314523 226383 350401 420932 492689 315763 278544 200375 301271 429656 373617
6358C73617O2629j02151Q5342O018J0393O1359J35212j49072J04843P1389r8534
$$ 373617 436246 334095 419437 425455 435848 497207 632419 483347 588190 659579 561045
6347E61045j50369J10886q4963m4485L47560l6501n7278m9644j45097J2632P7663
$$ 561045 410676 521562 436599 392114 739674 703173 645895 596251 451154 463786 541449
6336E41449L4653j10555K03308P6519p7091m7906j23m0560j56871j2243J90057
$$ 541449 576102 465547 668855 745374 668283 620377 620254 579694 422823 410580 600637
6325F00637J72789j00454k99691Q0770J16915O4972Q5008k9480j29875K73562
$$ 600637 773426 672972 373281 454051 570966 635938 720946 691466 561591 835153
6315H35153q3892j5968j81924P2784J56426k8139m0359r4984L2156m4404R6646
$$ 835153 751261 735293 553369 626153 782579 754440 714081 619097 651253 606849 703495
6304G03495n7617k425l18187J86077P6507p3499K427j4784N2709q3629k1617R0955
$$ 703495 645878 643453 325266 511343 587850 514351 516778 501994 554703 471074 449457 540412
6292E40412r2731q5330J29148P134K10054J16893l80982j91199R2542J30492J5316
$$ 540412 447681 362351 491499 498633 708687 825580 444598 253399 345941 476433 491749
6281D91749R6483K2183N7115k52095L4509O3523J0706Q0446k09880Q9620K3522
$$ 491749 588232 610415 667530 415435 449944 513467 524173 604619 394739 484359 507881
6270E07881k5504j9332l9478J2970k21994n9150K19558J44367Q3951m1998k42126
$$ 507881 482377 463045 423567 436537 214543 155393 374951 519318 603269 561271 319145
6259C19145k977o389j1839K53001o3727J15759P281n5906j41043J24149M4254
$$ 319145 316168 309779 297940 550941 487214 602973 610254 554348 413305 537454 581708
6248E81708P8538K607j57727J48401K4880j63595j70792k7409J93989r3295J2323
$$ 581708 660246 662853 505126 653527 678407 514812 344020 316611 510600 417305 429628
6237D29628L70174m6415j09552j37257J35999j29548j03706j6006L4084J49091
$$ 429628 799802 753387 643835 506578 642577 513029 409323 393317 427401 576492
6227E76492O9529R189q5927j85727J50435J52755k0302k09613K34969o2422p5654
$$ 576492 646021 655210 569283 383556 533991 686746 666444 456831 691800 629378 553724
6216E53724M8607p7795Q8639k7806k9265M4389J00528J9012j46924J40394J13311
$$ 553724 602331 524536 613175 585369 556104 600493 701021 720033 573109 713503 826814
6205H26814M0766K7803r0871K7520j15667J19203J48544k06927j63068K28119
$$ 826814 867580 895383 804512 832032 716365 835568 984112 777185 614117 842236
6195H42236P4948J22558J11733J211l4650L7355m3807q4997J45352j05801q9860
$$ 842236 917184 1039742 1151475 1152686 1118036 1155391 1111584 1026587 1171939 1066138 976278
6184I76278Q776Q5535j43677K1390J86027j61348J62117l8546q1285k20476J12564
$$ 976278 985054 1070589 926912 948302 1134329 972981 1135098 1096552 1015267 794791 907355
6173I07355J86130j6936K0452N1035J708J7659n9175j68529M3528L2659k9784
$$ 907355 1093485 1076549 1097001 1148036 1149744 1167403 1108228 939699 983227 1015886 986102
6162I86102L1632l527j74023J6039K85176J60188Q2530k7940j40250r4150N0411
$$ 986102 1017734 1014207 840184 856223 1141399 1301587 1384117 1356177 1215927 1121777 1172188
6151A172188l19410K9449L28993m4126k8776L4359R9581k4207q679l14223n0320
$$ 1172188 852778 882227 1211220 1167094 1138318 1172677 1272258 1248051 1239372 925149 874829
6140H74829L08757k4088m9164j21484L8479J74000L5609M9150J08839m2819M9951
$$ 874829 1183586 1159498 1110334 988850 1027329 1201329 1236938 1286088 1394927 1352108 1402059
6129A402059r7398Q2923M639k0109j22332K5332K56319j4255o7366j39582J60531
$$ 1402059 1304661 1387584 1392223 1372114 1249782 1275114 1531433 1517178 1449812 1310230 1470761
6118A470761K38015j56011o075K9403j48252R1055M546J52338O5101L2551j19563
$$ 1470761 1708776 1552765 1546690 1576093 1427841 1518896 1523442 1675780 1740881 1773432 1653869
6107A653869m4343N4128j1556K73413J00028J14259k27036o8984J61460j22494
$$ 1653869 1609526 1663654 1652098 1925511 2025539 2139798 1912762 1843778 2005238 1882744
6097A882744Q6836n3544J50842L7118P961K21793J28797k29322R9758j28634J01528
$$ 1882744 1969580 1916036 2066878 2103996 2111957 2333750 2462547 2233225 2332983 2204349 2305877
6086B305877J82469j54848J68910o1332j8313K00181J45733J9168L667R0316J35362
$$ 2305877 2488346 2333498 2502408 2441076 2422763 2622944 2768677 2787845 2791512 2881828 3017190
6075C017190o3032j5279K08617Q183j1258K04816J59663J45557r3166J03840K12093
$$ 3017190 2954158 2938879 3147496 3155679 3144421 3349237 3508900 3654457 3561291 3665131 3877224
6064C877224R5712O8249o9395O8601q4422O3386J09718J76752P6380J47886J79978
$$ 3877224 3972936 4041185 3971790 4040391 3955969 4019355 4129073 4305825 4382205 4530091 4710069
6053D710069J63205K13317R8986K64323J49198J72375L6891K32957L03113K34478
$$ 4710069 4873274 5086591 5185577 5449900 5599098 5771473 5808364 6041321 6344434 6578912
6043F578912J88309K14186L93755K32238L22869K97745K22242M63951N35993L81730
$$ 6578912 6767221 6981407 7375162 7607400 7930269 8228014 8450256 8914207 9450200 9831930
6033I831930K98044K69950N37544P23975P80535N96960M64189O30054O34835Q94109
$$ 9831930 10129974 10399924 10937468 11661443 12441978 13038938 13503127 14133181 14768016 15662125
6023A5662125P41653O79822P87780J264722J064931J085026J698675J947918K247840
$$ 15662125 16403778 17083600 17871380 19136102 20201033 21286059 22984734 24932652 27180492
6014B7180492K342680K405145K464951K026822J497059L84777m4754P3048P693
$$ 27180492 29523172 31928317 34393268 36420090 37917149 38301926 38257172 38330220 38337913
6005C8337913J70546j06465K45049N03171P36548R80694R77162J064726J401016
$$ 38337913 38508459 38401994 38647043 39150214 39886762 40867456 41844618 42909344 44310360
5996D4310360J106496J372538J760259J411134J343775J597902K075489K511688
$$ 44310360 45416856 46789394 48549653 49960787 51304562 52902464 54977953 57489641
5988E7489641L073586L520202L420958L094583K736152O41800l211369m805537
$$ 57489641 60563227 64083429 67504387 70598970 73335122 73976922 70765553 65960016
5980F5960016m306228k996527j781357j418952j102602r85198o10601p46217p68796
$$ 65960016 61653788 58657261 56875904 55456952 54354350 53369152 52758551 52012334 51243538
5971E1243538p99427j221496j602828j623247j287034j097380q18686q37361q58202
$$ 51243538 50444111 49222615 47619787 45996540 44709506 43612126 42793440 41956079 41097877
5962D1097877n94211o68394m68332q55112r65899j174269j856245k689831k894968
$$ 41097877 40503666 39835272 39366940 38511828 37545929 36371660 34515415 31825584 28930616
5953B8930616k527789k282617j743478j280135p10743n84663l08271j15248J7864
$$ 28930616 26402827 24120210 22376732 21096597 20385854 19801191 19492920 19377672 19395536
5944A9395536k98078j53139l7461q904m54401p97026m64223n00804n06026l46906
$$ 19395536 19097458 18944319 18906858 18897954 18443553 17646527 17182304 16681500 16175474 15828568
5934A5828568l60902k09832k83879m38367l37536j9658o9088k13391k26564k11236
$$ 15828568 15467666 15257834 14973955 14535588 14198052 14178394 14109306 13895915 13669351 13458115
5924A3458115J80628k18779k02095n08J05780J94584k22404P5482P5550J51521
$$ 13458115 13638743 13419964 13217869 13217361 13323141 13517725 13295321 13370803 13446353 13597874
5914A3597874M05701R9019L53614N2710P0123N8368J91010R1345K52960L26541
$$ 13597874 14003575 14102594 14456208 14508918 14579041 14637409 14828419 14919764 15172724 15499265
5904A5499265O3625K16335K85754L87347J35482O5077M06129L83018K73676L72360
$$ 15499265 15562890 15779225 16064979 16452326 16587808 16652885 17059014 17442032 17715708 18088068
5894A8088068N03476Q06638N63947P74438O27178P33315N58586O99286J060572
$$ 18088068 18591544 19398182 19962129 20736567 21363745 22097060 22655646 23354932 24415504
5885B4415504J053018J415713J545884J805589K076871K124280K049901J886443
$$ 24415504 25468522 26884235 28430119 30235708 32312579 34436859 36486760 38373203
5877C8373203J277257N62728j53832J67854J97867L14812P36395R40939R91757
$$ 38373203 39650460 40213188 40059356 40227210 40425077 40739889 41476284 42417223 43408980
5868D3408980J321586J462503J600176J873735J841697J807823J557476J440625
$$ 43408980 44730566 46193069 47793245 49666980 51508677 53316500 54873976 56314601
5860E6314601J264498J464402J846429J774039K192634K654376K347749K377496
$$ 56314601 57579099 59043501 60889930 62663969 64856603 67510979 69858728 72236224
5852G2236224J599263K61837k340767m392238m876240m000800l037582k597434
$$ 72236224 73835487 74097324 71756557 67364319 62488079 58487279 55449697 52852263
5844E2852263j893667j556617j145610j049722j063509r85346l12491k56566N8583
$$ 52852263 50958596 49401979 48256369 47206647 46143138 45157792 44845301 44588735 44647318
5835D4647318O269j39649l49755m08609l71543k74082j67270n67786p15660q60235
$$ 44647318 44653587 44513938 44164183 43755574 43384031 43109949 42942679 42374893 41659233 40798998
5825D0798998j091594j532654k326416k509448j946144j361788p57098m59572
$$ 40798998 39707404 38174750 35848334 33338886 31392742 30030954 29273856 28814284
5817B8814284j92764j51330l48750j065887j975054k552240j804302j289945j050146
$$ 28814284 28621520 28470190 28121440 27055553 25080499 22528259 20723957 19434012 18383866
5808A8383866o96865p21288m89600n45622q05307o12222o84623n68186n16087
$$ 18383866 17687001 16965713 16476113 15930491 15125184 14512962 13828339 13260153 12744066
5799A2744066n92922m30545m09089k2103k05541l1961Q4637J9836k2333j97187
$$ 12744066 12151144 11720599 11311510 11289407 11083866 11051905 11136542 11156378 11134045 10936858
5789A0936858j70039m73397n14709n13270j49104j20211m3548n1019j12278j83124
$$ 10936858 10766819 10293422 9778713 9265443 9116339 8996128 8952580 8901561 8789283 8606159
5779H606159j37210j03721j99807q3227K7282K8523J434j03404j43797K725J05966
$$ 8606159 8468949 8365228 8165421 8082194 8109476 8137999 8139433 8036029 7892232 7894957 8000923
5768H000923K00627K66728N21831L35202K85285M46541Q5356r573N3227k83349
$$ 8000923 8201550 8468278 8990109 9325311 9610596 10057137 10142493 10132920 10186147 9902798
5758I902798j83365l48198l36492k67092K5254k25962m55638k94030m86993l59739
$$ 9902798 9719433 9371235 9034743 8767651 8792905 8566943 8111305 7817275 7330282 6970543
5748F970543l2814j77284k71246l1355n7893j47502o0744J7495O4371L21677K13653
$$ 6970543 6937729 6760445 6489199 6457844 6399951 6252449 6191705 6209200 6273571 6595248 6808901
5737F808901J17672K43011K45616L23352K96409L22101J55790K8240j76096k63248
$$ 6808901 6926573 7169584 7415200 7738552 8034961 8357062 8512852 8541092 8364996 8101748
5727H101748o23333o93737n27621l94242l77941m14950k66295k96235l60871j68966
$$ 8101748 7478415 6784678 6257057 5862815 5484874 5069924 4803629 4507394 4146523 3977557
5717C977557K28890k62866r7645j81141j0136n5219j83517J1201J66482j25253
$$ 3977557 4206447 3943581 3845936 3664795 3654659 3599440 3415923 3427124 3593606 3468353
5707C468353J52560J02223Q3977J07776P8773K44666M1120K9031K892k23810l91688
$$ 3468353 3620913 3723136 3807113 3914889 3993662 4238328 4279448 4308479 4311371 4087561 3695873
5696C695873l08085j66645j72964j56194m3111j45096k47964L3554p3946p0052
$$ 3695873 3387788 3221143 3048179 2891985 2848874 2703778 2455814 2489368 2415422 2345370
5686B345370O6171j5217o6372o9280r2932l16811J36983K45501o1597l01298J76056
$$ 2345370 2411541 2396324 2329952 2260672 2167740 1850929 1987912 2233413 2171816 1870518 2046574
5675B046574P1179k1421j9287m3271n6380m5923o4466J24814J52075J34135J39580
$$ 2046574 2117753 2096332 2077045 2033774 1977394 1931471 1867005 1991819 2143894 2278029 2417609
5664B417609Q0338k878M346k3696J85708J43837K866J67559N6086K12573K13483
$$ 2417609 2497947 2495069 2499415 2475719 2661427 2805264 2808130 2975689 3031775 3244348 3457831
5653C457831L32702L33221J20671K44221K81682K10866k91022P7938N0074j70686
$$ 3457831 3790533 4123754 4244425 4488646 4770328 4981194 4690172 4768110 4818184 4647498
5643D647498o3740k47341n3118J55805L5466J57238J17634J9555L55845K71314
$$ 4647498 4583758 4336417 4283299 4439104 4474570 4631808 4749442 4768997 5124842 5396156
5633E396156M1273J00565J92176J23924K34579L84474L51129M52261L29678M71818
$$ 5396156 5437429 5537994 5730170 5854094 6088673 6473147 6824276 7276537 7606215 8078033
5623H078033K18978L9924n6073p6945J23535j31050k21593j80263k81615n8972
$$ 8078033 8297011 8336935 8280862 8203917 8327452 8196402 7974809 7794546 7512931 7453959
5613G453959k05204q2896J90639K1876J79447o3567k7595M2753q2470n6767j50444
$$ 7453959 7248755 7165859 7356498 7378374 7557821 7494254 7466659 7509412 7426942 7370175 7219731
5602G219731l20895k55184N3228L2250k43878j40609Q550Q3130l45150j81697
$$ 7219731 6898836 6643652 6696880 6729130 6485252 6344643 6353193 6436323 6091173 5909476
5592E909476k86226j18295l94599O6092m2172j45436Q5564N359M6331l3852j95643
$$ 5909476 5623250 5504955 5110356 5176448 5134276 4988840 5074404 5079763 5126094 5092242 4896599
5581D896599J31842J64178j76972K4477o2423J68224J16411K35116M40664N65509
$$ 4896599 5028441 5192619 5015647 5040124 4977701 5145925 5262336 5497452 5938116 6503625
5571F503625Q11619J000140J069317J271086J556872J639844J483987J089021
$$ 6503625 7315244 8315384 9384701 10655787 12212659 13852503 15336490 16425511
5563A6425511k05840k168288k677848k170787j669090r95385p75473o14693n39442
$$ 16425511 16219671 14051383 11373535 9202748 7533658 6538273 5762800 5148107 4608665
5554D608665m59524k46584l01156j57162j08399j86711j77806o1166J08397j74466
$$ 4608665 4149141 3902557 3601401 3444239 3335840 3149129 2971323 2910157 3018554 2844088
5544B844088L0598j78682R9878J59549n1047K27771K93066J8024o6872p574m59365
$$ 2844088 2874686 2696004 2795882 2955431 2904384 3132155 3425221 3443245 3376373 3368799 2909434
5533B909434k04118j82372l04010j00304j1909j99131j81667j13656m375P1532
$$ 2909434 2705316 2522944 2218934 2118630 2106721 1907590 1725923 1612267 1607892 1679424
5523A679424j7219m5178J35802o1215j40835j21246p3340o577k4180l8077p6610
$$ 1679424 1662205 1617027 1752829 1691614 1550779 1429533 1356193 1349616 1325436 1287359 1210749
5512A210749o8739k084m2295O1937J24527j17434q8273j84927M587J70053j73103
$$ 1210749 1142010 1139926 1097631 1159568 1284095 1166661 1078388 893461 898048 1068101 894998
5501H94998r2214L2140L1579J05990j07872R1242k15523M8954J22432k7103j52154
$$ 894998 802784 834924 866503 972493 864621 955863 740340 789294 911726 884623 732469
5490G32469Q0821K25403N6464j28910k60820j10215n1701J09678L4205N2121Q3908
$$ 732469 813290 1038693 1095157 966247 705427 595212 543511 653189 687394 739515 823423
5479H23423M45j24096m7350k4618O7648j51081r0103J11129J09746K8418P6553
$$ 823423 823868 699772 652422 627804 695452 544371 454268 565397 675143 703561 780114
5468G80114M698q1911J0775j52092j22739k00825m6063J8438R4870M8303K15816
$$ 780114 784812 702901 713676 561584 438845 238020 191957 210395 305265 353568 569384
5457E69384m1056o2420O38M9700J5154k43455P6743K04042M0005n3635K36846
$$ 569384 528328 465908 466546 516246 531400 287945 364688 568730 608735 555100 791946
5446G91946m2167j04206J3766q6400o9650R4195J5869j55371K24890k29953r0480
$$ 791946 749779 645573 659339 572939 503289 597484 613353 457982 682872 452919 362439
5435C62439k1352J63665n7735J39872L0164j15559R2765J17273Q3377k97759L3749
$$ 362439 341087 504752 447017 586889 617053 501494 594259 711532 794909 497150 530899
5424E30899O7004P481q9434j28949J51345P6046p7901J1683j39109J09255l692
$$ 530899 597903 605384 515950 387001 538346 614392 536491 548174 409065 518320 514628
5413E14628J09524j73348n4599P6734J29486q6616k60297P8110K31168P7931j36351
$$ 514628 624152 450804 396205 472939 602425 515809 255512 333622 564790 642721 506370
5402E06370k6890N7966l7823K09339j89033J03015J31957k65511k3878K7143K30927
$$ 506370 479480 537446 499623 708962 519929 622944 754901 489390 465512 492655 723582
5391G23582P6737j32847q0904n3190r7577N4481j03962J97400J23173L3519M7562
$$ 723582 800319 667472 586568 533378 435801 490282 386320 583720 706893 740412 787974
5380G87974Q4294K00724K2144k56001j42262N7463o4097N0811K35454J11425j3689
$$ 787974 872268 1072992 1095136 839135 696873 754336 690239 741050 976504 1087929 1074240
5369A074240m04320p4602L7532N0418l3912j05467J35914o6827J89641N7991j5944
$$ 1074240 669920 595318 632850 683268 649356 543889 679803 612976 802617 860608 844664
5358H44664o7524L9506O786Q381n6555j46112M9795o6225l4297J08732l5367J17172
$$ 844664 777140 816646 823432 831813 775258 629146 678941 612716 578419 687151 651784 768956
5346G68956j5080J19539P5306P0008k3434N5785k05232M1257O6346J1948j47913
$$ 768956 753876 873415 948721 1018729 995295 1051080 845848 887105 953451 965399 817486
5335H17486k723p2142J67300J27310n9013j31803m5766K66799P4424n0344p8118
$$ 817486 814763 742621 909921 1037231 978218 846415 800649 1067448 1141872 1091528 1013410
5324A013410j9735j12938J1747J34970J16084j8136k04547N3373K73379J1598
$$ 1013410 993675 880737 892484 1027454 1143538 1125402 920855 974228 1247607 1259205
5314A259205j73000k13238J25634J65620P7553K8724o6821k43451J30753j25774
$$ 1259205 1086205 872967 998601 1164221 1241774 1270498 1203677 960226 1090979 965205
5304I65205k367R4161J0633k3474J28347o004J04876J31202M8342J06095j295
$$ 965205 962838 1056999 1067632 1044158 1172505 1166501 1271377 1402579 1450921 1557016 1555721
5293A555721l9002j07571K2605K79160L6363J61111P6179r2789K16989J87371
$$ 1555721 1516719 1409148 1431753 1710913 1747276 1908387 1984566 1891777 2108766 2296137
5283B296137l4665K54461M5855N3662J93978M45642M63873J03272M60146M37147
$$ 2296137 2261472 2515933 2561788 2615450 2809428 3255070 3718943 3822215 4282361 4719508
5273D719508M9728J53569l4956r2906j77043j64073K5515m20887J25217J08211
$$ 4719508 4769236 4922805 4887849 4794943 4617900 4453827 4479342 4058455 4183672 4291883
5263D291883j3992J21856N683L61537J98070M43853M77384N97446N55139N12657
$$ 4291883 4277891 4399747 4405430 4766967 4965037 5408890 5886274 6483720 7038859 7551516
5253G551516N30897M78601J46075K40506K73134N34166L67621J04509J90737J41856
$$ 7551516 8082413 8561014 8707089 8947595 9220729 9754895 10122516 10227025 10417762 10559618
5243A0559618j07943n67430n61274q17189n61098n96858l24196k20011o9059J10902
$$ 10559618 10451675 9884245 9322971 8505782 7944684 7347826 7023630 6803619 6734560 6845462
5233F845462L58940M57701K79431M67913P16823N32189N34195Q8085k09837l79148
$$ 6845462 7204402 7662103 7941534 8409447 9126270 9658459 10192654 10280739 10070902 9691754
5223I691754m16631n96841n48583l30302k77873o434k12027j47758k41891k74315
$$ 9691754 9275123 8678282 8129699 7799397 7521524 7515090 7303063 7155305 6913414 6639099
5213F639099l27539k02795k74821r3610N0514k30598j63088J43841M23295J06222
$$ 6639099 6311560 6108765 5833944 5740334 5790848 5560250 5397162 5541003 5964298 6070520
5203F070520n6941J35017m3383L3552n4707j63501o59409k91859j35201l09645
$$ 6070520 6013579 6148596 6105213 6138765 6084058 5920557 5261148 4969289 4834088 4524443
5193D524443j74304k52902k79182l88113j73225L9048j17635j75452l6384r8150
$$ 4524443 4350139 4097237 3818055 3429942 3256717 3295765 3178130 3002678 2966294 2868144
5183B868144K66628k4859k0820M7470j15793j90551J12013J07390j75209M817
$$ 2868144 3134772 3109913 3089093 3136563 3020770 2830219 2942232 3049622 2874413 2879230
5173B879230L2466r2547k05895l80880M0263l0373J26000J63407k9419r5541J95375
$$ 2879230 2911696 2819149 2613254 2232374 2272637 2242264 2368264 2531671 2502252 2406711 2602086
5162B602086k54082j31225L8061k3854p4549M2279J7108k223O3811j62739M1469
$$ 2602086 2348004 2216779 2254840 2230986 2156437 2198716 2215824 2213601 2277412 2114673 2156142
5151B156142j0811L3025r8433J408l5332k7110L4629J9371n1105j25146j8180
$$ 2156142 2145331 2178356 2079923 2081331 2045999 2018889 2053518 2072889 2021784 1896638 1878458
5140A878458k9255k0219P9560j01958P4734J40062o9950p6087j52962r0451K44823
$$ 1878458 1849203 1828984 1908544 1806586 1881320 2021382 1951432 1875345 1722383 1631932 1876755
5129A876755J62881L2677K72258N4193j22982J77385J24640J87804N6125J30227
$$ 1876755 2039636 2072313 2344571 2398764 2275782 2453167 2577807 2765611 2821736 2951963
5119B951963N2281l14704M3149l24359k18679J4403k36730l01081J87620q8943
$$ 2951963 3004244 2689540 2732689 2408330 2189651 2204054 1967324 1666243 1853863 1764920
5109A764920o1514j46560M2645k0222j19984J1940O5113K78129J19776o2939o7765
$$ 1764920 1703406 1556846 1599491 1579269 1459285 1471225 1536338 1814467 1934243 1871304 1803539
5098A803539k2637l16819l2471Q4298K84397m4411j26525J43936R0362l3393k01004
$$ 1803539 1780902 1464083 1431612 1515910 1800307 1755896 1629371 1773307 1863669 1830276 1629272
5087A629272m9856J06118q9643j33681J63174J31223R281J39802q8801m3342J26742
$$ 1629272 1579416 1685534 1595891 1462210 1625384 1756607 1765888 1905690 1816889 1773547 1900289
5076A900289J72597j01161P8214R6780K7083K4899J46229J98242K1501M7427M41212
$$ 1900289 2072886 1971725 2049939 2146719 2173802 2198701 2344930 2543172 2564673 2612100 3053312
5065C053312M01031K01285M34218P74428N87530R35375J033596P13182N45823
$$ 3053312 3454343 3655628 4089846 4864274 5451804 6387179 7420775 8133957 8679780
5056H679780M84344l86481p73040q59122r46004m71653m27974m00499l95516n32732
$$ 8679780 9164124 8777643 8004603 7145481 6199477 5727824 5299850 4899351 4503835 3971103
5046C971103l69043m03712l29273j34277J07112j2358j79622j53055N5461j27431
$$ 3971103 3602060 3198348 2869075 2734798 2841910 2829552 2649930 2496875 2552336 2424905
5036B424905L6164j05800r2808m999k55081J23870J50982n4985J2876p502j23250
$$ 2424905 2461069 2355269 2262461 2257462 2002381 2126251 2277233 2222248 2235124 2227622 2104372
5025B104372M2637O527j54046M5652k61234k8753P249r2279k49971j93097J05170
$$ 2104372 2147009 2153536 1999490 2045142 1783908 1755155 1762404 1670125 1420154 1227057 1332227
5014A332227O1754R1082K49887k19542j09941J9468l7781j0126j71859m7017J90465
$$ 1332227 1393981 1485063 1734950 1515408 1405467 1424935 1387154 1377028 1205169 1158152 1348617
5003A348617K50054j84562N7348j33223n1601J9694j21352q5693P9874n3187J17428
$$ 1348617 1598671 1414109 1471457 1338234 1286633 1306327 1184975 1099282 1179156 1125969 1243397
4992A243397J76448J42948k94302j6698o9117q3790r6971j26443N7943K55735
$$ 1243397 1419845 1562793 1268491 1251793 1182676 1098886 1001915 875472 933415 1189150
4982A189150R4981j68428K45351L8271j58523M8287j96818n6532P3358J50733
$$ 1189150 1284131 1115703 1361054 1399325 1240802 1289089 1092271 1035739 1109097 1259830
4972A259830r177J692j90676p0475l4846j264J1065K8340N8496r485J32437K93351
$$ 1259830 1250653 1252345 1061669 991194 956348 955084 966149 994489 1052985 1043500 1175937 1469288
4960A469288j2647J8637j0794m8425Q7783q997O1988p9718O8091J04199K2494
$$ 1469288 1456641 1475278 1464484 1416059 1503842 1494845 1556833 1477115 1545206 1649405 1671899
4949A671899l5396K8709n6692J10336K53395j43089j13914P3357K02456j89689
$$ 1671899 1636503 1665212 1608520 1718856 1972251 1829162 1715248 1788605 1991061 1801372
4939A801372j64457J45712K01602J52025j18418n1977Q7108p0685L4301K50637
$$ 1801372 1636915 1782627 1984229 2136254 2017836 1965859 2052967 1982282 2016583 2267220
4929B267220p8033N2077K79490m6280Q0187L3535p0391p2540J498K32823J42186
$$ 2267220 2189187 2241264 2520754 2474474 2554661 2588196 2517805 2445265 2446763 2679586 2821772
4918B821772j75007J73967J3750K39269K5558k0274R8999j02059J21078J9058
$$ 2821772 2646765 2820732 2834482 3073751 3099309 3079035 3178034 3075975 3197053 3216111
4908C216111R9880p3189m2163K64411m0006L0048J63914P7950q5883K99453J68961
$$ 3216111 3315991 3242802 3200639 3465050 3425044 3455092 3619006 3696956 3611073 3910526 4079487
4897D079487j23642K7993J5965j9835K71023k03316J45702K84537J64197j233
$$ 4079487 3955845 3983838 3999803 3979968 4250991 4047675 4193377 4477914 4642111 4640878
4887D640878p135K97185j9024K23595K45507O2560K03960K73596M9145K63603
$$ 4640878 4633743 4930928 4911904 5135499 5381006 5443566 5647526 5921122 5970267 6233870
4877F233870o8307J7732K55595L38410J73494L19633L83103L70626L33045K96917
$$ 6233870 6165563 6183295 6438890 6777300 6950794 7270427 7653530 8024156 8357201 8654118
4867H654118L07023L24022L53100M74366L56103M56057N77226N39351R4176N00162
$$ 8654118 8961141 9285163 9638263 10112629 10468732 10924789 11502015 12041366 12135542 12635704
4857A2635704R58269P10511N30477R00835Q45104J193158J502721J893355K279436
$$ 12635704 13593973 14304484 14834961 15735796 16580900 17774058 19276779 21170134 23449570
4848B3449570K582278K895413L063983K832420K383930J430604p56361k874699
$$ 23449570 26031848 28927261 31991244 34823664 37207594 38638198 37881837 35007138
4840C5007138k630441j846016o51073m61299n934m9481N38307P66858J216196
$$ 35007138 32376697 30530681 29879608 29418309 29412375 29362894 29901201 30668059 31884255
4831C1884255J536091K014551K263804K776819L239151M443839M639200M598001
$$ 31884255 33420346 35434897 37698701 40475520 43714671 48158510 52797710 57395711
4823E7395711M220320N559702L285187K65438R67040L417625N612817Q342012
$$ 57395711 61616031 67175733 70460920 70726358 71693398 75111023 80723840 89065852
4815H9065852J1359633J5146618J7187353K1068969K5699677K9661314K9216671
$$ 89065852 100425485 115572103 132759456 153828425 179528102 209189416 238406087
4808B38406087K0787222J8864735K5426153j1425619n6997003n1852254l9622203
$$ 238406087 259193309 278058044 303484197 292058578 235061575 183209321 143587118
4801A43587118k7558509j9418270j3997341j0925256p996267o287266m492108
$$ 143587118 116028609 96610339 82612998 71687742 63691475 57404209 52912101
4794E2912101l268917k294072j337553l90722N05450P76994M56633N84043R3577
$$ 52912101 49643184 47349112 46011559 45620837 46126287 46903281 47359914 47943957 48037534
4785D8037534k509456m580017m480262m039996k996871k485562j928096j879001
$$ 48037534 45528078 40948061 36467799 32427803 29430932 26945370 25017274 23138273
4777B3138273j459344j662893j427945j133742j151256r68350r36842n68510n73975
$$ 23138273 21678929 20016036 18588091 17454349 16303093 15334743 14397901 13829391 13255416
4768A3255416q73618n53916n10919p6044k14159l23439l22284l15578l94635l46767
$$ 13255416 12381798 11827882 11316963 11240919 11026760 10703321 10381037 10065459 9670824 9324057
4758I324057l24006r5313l40502j69573J29789n7519j41439r7333J88234j41082
$$ 9324057 9000051 8904738 8564236 8394663 8524452 8466933 8325494 8228161 8416395 8275313
4748H275313m17878k98755l75722l10886l12455k46438k3326l44993l42093j01504
$$ 8275313 7857435 7558680 7182958 6872072 6559617 6313179 6289853 5944860 5602767 5501263
4738E501263j07185j46520J27404j92492k92439m14123k3459l03681k51959p6073
$$ 5501263 5394078 5247558 5374962 5182470 4890031 4475908 4452449 4148768 3896809 3820736
4728C820736R4905k05080n6010l89708j06342n7660m5001J2905j51961k71694
$$ 3820736 3915641 3710561 3654551 3264843 3158501 3100841 3055840 3068745 2916784 2645090
4718B645090j07376p8293n664j22578j07996j19642j70169q9701L72505j46125
$$ 2645090 2537714 2459421 2453757 2331179 2223183 2103541 1933372 1843671 2216176 2070051
4708B070051j10392n6062P1491K7500j34607j42735p97j48149J30056o6969O1455
$$ 2070051 1959659 1903597 1975088 2002588 1867981 1725246 1724449 1576300 1706356 1639387 1700842
4697A700842K2415K0785j00091k17778P7166q5657j00846K826J59754q1497k2430
$$ 1700842 1723257 1744042 1643951 1426173 1503339 1417682 1316836 1319662 1479416 1397919 1375489
4686A375489p1532K3348Q5051r7115l992k1024m6053j84491J71486J94769r7285
$$ 1375489 1303957 1327305 1412356 1315241 1311249 1290225 1244172 1059681 1231167 1425936 1328651
4675A328651j94740j09088O5285k9315J41908n6880l4405L5376O5686n1003O6823
$$ 1328651 1133911 1024823 1090108 1060793 1202701 1145821 1111416 1146792 1212478 1161475 1228298
4664A228298J26112M0563j36346j6158P5223j19875K52109J57303n0914j88084
$$ 1228298 1354410 1394973 1258627 1242469 1317692 1197817 1449926 1607229 1556315 1368231
4654A368231k2402p0010M3192m9765o7509O8442K42416m7729R1491Q5557n283
$$ 1368231 1345829 1275819 1319011 1269246 1201737 1270179 1512595 1464866 1556357 1641914 1636631
4643A636631N7132j44279J57419k7629j4318O720l9028j67310J8874j20845Q2975
$$ 1636631 1693763 1549484 1706903 1679274 1664956 1671676 1632648 1465338 1484212 1363367 1446342
4632A446342Q4623m0420j94810k9466o1471j52820n9583L7084R1353K2901j00581
$$ 1446342 1530965 1490545 1295735 1266269 1204798 1051978 992395 1029479 1120832 1143733 1043152
4621A043152j22512R758q3443J28530p8666M5704J60308J20746J8518j41159j68569
$$ 1043152 920640 930398 846955 975485 896819 942523 1102831 1223577 1242095 1100936 932367
4610I32367L4891l7840l8515o9898K6455K617J54848J27676P3587j13267m4165
$$ 932367 967258 929418 890903 821005 847460 850077 1004925 1132601 1206188 1092921 1048756
4599A048756L7108K3075J40756j39047O4675j69398L6415J9650K596o912Q8011
$$ 1048756 1085864 1108939 1249695 1110648 1175323 1005925 1042340 1061990 1064586 1057674 1145685
4588A145685K2400j03382J59181N34M4212J66703l0646j2449j38762j21935j039
$$ 1145685 1168085 1064703 1223884 1224418 1268630 1435333 1404687 1392238 1253476 1131541 1130502
4577A130502K12402j89266J35881O6586j09199k48510o5837p5945N2306J39622
$$ 1130502 1342904 1153638 1289519 1356105 1246906 998396 932559 856614 908920 1048542
4567A048542M5612R5307P8580j52178m1102R8620o8868j61757J16981J27m6375
$$ 1048542 1094154 1189461 1268041 1115863 1074761 1173381 1104513 942756 1059737 1059864 1013489
4556A013489J12181K72492l990J8169n2428M4883N8535k03647J4742M9682N0395
$$ 1013489 1125670 1398162 1394172 1412341 1359913 1404796 1463331 1259684 1274426 1324108 1374503
4545A374503j05765L6967L727J17025K991k786p4842K29482N6956m7828p0964
$$ 1374503 1268738 1305705 1309432 1426457 1429448 1426662 1351820 1581302 1638258 1590430 1519466
4534A519466J27881K58142O2110O1759L03640J60522L33428M16313J98347K68102
$$ 1519466 1647347 1905489 1967599 2029358 2332998 2493520 2826948 3243261 3441608 3709710
4524C709710j89334l14845k51439l19760l50192j39559k18361M3895Q2296J25007
$$ 3709710 3520376 3205531 2954092 2634332 2284140 2144581 1926220 1970115 2052411 2177418
4514B177418j74914k4094j34292J0299J9660l5007j00603N1335L72821M662j47001
$$ 2177418 2002504 1978410 1844118 1854417 1874077 1839070 1738467 1789802 2162623 2167285 2020284
4503B020284n3909K06469M4255P920J44100k2223j09343L66022l5681O400N94255
$$ 2020284 1966375 2172844 2217099 2225019 2369119 2346896 2237553 2603575 2567894 2574294 3168549
4492C168549M5178l7784K67765J54823j34489j87668J18k03962J11050r2338Q0133
$$ 3168549 3213727 3175943 3443708 3598531 3464042 3276374 3276492 3072530 3183580 3091242 3171375
4481C171375J30733K30389O0661K45427M9809m6631m0737J55689J64148K93627
$$ 3171375 3302108 3532497 3593158 3838585 3888394 3841763 3801026 3956715 4120863 4414490
4471D414490K97789O61525N19320M28953P74003O19116N45876O54646P25351M99896
$$ 4414490 4712279 5373804 5893124 6322077 7096080 7715196 8261072 8915718 9641069 10140965
4461A0140965N58292K13653j51661o59519j177322j074401p72144q37356l73259
$$ 10140965 10699257 10912910 10761249 10101730 8924408 7850007 7077863 6240507 5867248
4452E867248l46672l49661q4465m01336O9222K05549R6149K85888J96363L12091
$$ 5867248 5520576 5170915 5086450 4685114 4754336 4959885 5056034 5341922 5538285 5850376
4442E850376L70807M38632J83667L32996L10380L20230J45942J31424M95759O23588
$$ 5850376 6221183 6659815 6843482 7176478 7486858 7807088 7953030 8084454 8580213 9203801
4432I203801O85910M76182J85397l7889n28299j029681j075562q06690o61563
$$ 9203801 9889711 10365893 10551290 10513401 9985102 8955421 7879859 7073169 6411606
4423F411606q21841l87763l99984m39377l46192l28816p540k27354j02869K44391
$$ 6411606 5589765 5202002 4802018 4362641 4016449 3687633 3680093 3452739 3349870 3594261
4413C594261j97426k90623k91172n4622o0860J5907j50489L0811q7419m2438K01559
$$ 3594261 3396835 3106212 2815040 2760418 2699558 2715465 2564976 2595787 2508368 2465930 2667489
4402B667489m0009O3397J4756j327j89419j5134K8060r6327j53964N954K3194
$$ 2667489 2627480 2690877 2705633 2704306 2514887 2499753 2527813 2431486 2277522 2283476 2306670
4391B306670J78647Q9122k8449j47056P1496K87861L453k26705j12058l3683j0850
$$ 2306670 2485317 2574439 2545990 2398934 2470430 2758291 2761744 2535039 2422981 2389298 2378448
4380B378448K056J01867J75991j41043l8582J4211J89375N5653P4755L59464J61171
$$ 2378448 2380504 2482371 2658362 2517319 2478737 2492948 2682323 2737976 2812731 3172195 3333366
4369C333366N0806j60210L48030L28868J58663K82376L05957K06319J69827J92045
$$ 3333366 3384172 3223962 3571992 3900860 4059523 4341899 4647856 4854175 5024002 5216047
4359E216047q5390p0756j78674k78977j24345j77001j63952j56737j73460o2188
$$ 5216047 5130657 5059901 4881227 4602250 4477905 4300904 4136952 3980215 3806755 3744567
4349C744567J71273Q1845K73406L45827j0395P866J80212K40813L44976J83708
$$ 3744567 3915840 3997685 4271091 4616918 4606523 4614389 4794601 5035414 5380390 5564098
4339E564098K09471L63966K18133K59055J08122Q9947K39153K36567L17403K49601
$$ 5564098 5773569 6137535 6355668 6614723 6722845 6812792 7051945 7288512 7605915 7855516
4329G855516Q1563L02394L44156K9171J10314j55595k60066r0358r6195j41856
$$ 7855516 7937079 8239473 8583629 8612800 8723114 8567519 8307453 8217095 8120900 7979044
4319G979044l77613k0720O2241j56152j86290j99441K12140J47196J69713R6881
$$ 7979044 7601431 7580711 7642952 7486800 7300510 7101069 7313209 7460405 7630118 7726999
4309G726999L75961K57559R5949L92813J93648P3439K89647K06396m4470n4415
$$ 7726999 8102960 8360519 8456468 8849281 9042929 9116368 9406015 9612411 9567941 9513526
4299I513526J77267K59026nm0765J69494R2911J22480n728K09018r1216m24099
$$ 9513526 9690793 9949819 9949814 9909049 10078543 10171454 10293934 10288206 10497224 10406008 9981909
4288I981909n7737M0830L26644J55676n6327J23440K07672K10536J40371j11009
$$ 9981909 9924172 9965002 10291646 10447322 10390995 10514435 10722107 10932643 11073014 10962005
4278A0962005J36647K11747P5589q3634o9732J0440M8830J58210J8199k3231K40272
$$ 10962005 11098652 11310399 11385988 11302354 11232622 11243062 11291892 11450102 11468301 11445070 11685342
4267A1685342J53456J33826O5966K61600q2441k27260l61550k62672M6226j8052
$$ 11685342 11838798 11972624 12038590 12300190 12217749 11990489 11628939 11366267 11412493 11394441
4257A1394441l22905k75964J75984J33104L85178L60894O93480P84925Q20792
$$ 11394441 11071536 10795572 10971556 11104660 11489838 11850732 12544212 13329137 14149929
4248A4149929J040858J004440O03336L07448m51946j190087j051188o97975p86188
$$ 14149929 15190787 16195227 16798563 17106011 16654065 15463978 14412790 13714815 12928627
4239A2928627k97177k73188n21762j6990P3136M7298k4389J31807K19265J85353
$$ 12928627 12631450 12358262 11836500 11819510 11892646 11939944 11915555 12047362 12266627 12451980
4229A2451980K3665r8718N11607K57970M4568M1086K54568M22149N43498M71669
$$ 12451980 12475645 12376927 12888534 13146504 13191072 13232158 13486726 13908875 14452373 14924042
4219A4924042K96535K87859L61914M02382M47653M00995N02338O81751P41342
$$ 14924042 15220577 15508436 15870350 16272732 16720385 17121380 17623718 18305469 19046811
4210A9046811O58606N75680P24944R05474J139087J020783J111873J069987J660648
$$ 19046811 19705417 20281097 21006041 21911515 23050602 24071385 25183258 26253245 27913893
4201B7913893J565774J776869J886709J999710K086737K810405L188498L430592
$$ 27913893 29479667 31256536 33143245 35142955 37229692 40040097 43228595 46659187
4193D6659187L877548M755741N286248O991284Q437781J0808813J3715106J7556355
$$ 46659187 50536735 55292476 60578724 67570008 76007789 86816602 100531708 118088063
4185A18088063K1471550K6311273L1110980L3940983L2240974K7932955J0930829
$$ 118088063 139559613 165870886 196981866 230922849 263163823 291096778 302027607
4178C02027607j3206374l4697424m5054362l8529753l0034880k2337495j6774209
$$ 302027607 288821233 254123809 209069447 170539694 140504814 118167319 101393110
4171A01393110j2775800j0252148q310703p016349n303213m574625l704198l145470
$$ 101393110 88617310 78365162 70054459 63038110 57734897 53160272 49456074 46310604
4163D6310604k574893k198939k228258j835470r64540o16313o19510m24608k89964
$$ 46310604 43735711 41536772 39308514 37473044 36508504 35892191 35272681 34848073 34558109
4154C4558109l93270p04364o29312k69487K47338J134116J377385K272263K556851
$$ 34558109 34164839 33460475 32831163 32561676 32809014 33943130 35320515 37592778 40149629
4145D0149629L171814K801262K032465Q37416k396579m317599m346865m098198
$$ 40149629 43321443 46122705 48155170 48992586 46596007 42278408 37931543 33833345
4137C3833345l822319l024469k695985k047445j600849j475042j122801r79722
$$ 33833345 30011026 26986557 24290572 22243127 20642278 19167236 18044435 17064713
4129A7064713p90119o09878m29187n90816q4956k57843j60561j31313j84222j89742
$$ 17064713 16274594 15664716 15235529 14644713 14559757 14301914 14141353 14010040 13825818 13636076
4119A3636076j87680l97150k79308m39261j40556k84K04628J76323L46717N73601
$$ 13636076 13448396 13051246 12771938 12332677 12192121 12191837 12396465 12572788 12919505 13493106
4109A3493106N36144N31564L85123J78685r6847o66130j113447j043518q16738
$$ 13493106 14029250 14560814 14945937 15124622 15027775 14361645 13248198 12204680 11387942
4100A1387942r55918q05636m07233m05988n52606k61774k94964j89595k23022
$$ 11387942 10432024 9626388 9219155 8813167 8260561 7998787 7703823 7514228 7291206
4091G291206m40310m78767l85501q1549j09537j33377r4376q1622j13041j14662
$$ 7291206 6850896 6372129 5986628 5905079 5795542 5662165 5567789 5486167 5373126 5258464
4081E258464k68586R1962l14864M5574J06556k6243j41386p7413j03012L9926
$$ 5258464 4989878 5081840 4766976 4812550 4919106 4892863 4751477 4674064 4571052 4610978
4071D610978J57755P1428j12127p975n78218k05503L23807p4636N6379k1021l93876
$$ 4610978 4768733 4840161 4728034 4720059 4141841 3936338 4260145 4185509 4241888 4220867 3826991
4060C826991J58187j89951q3053Q6880N7527J36507j09821J57884J77592j20780
$$ 3826991 3985178 3795227 3712174 3799054 3856581 3993088 3883267 4041151 4218743 4097963
4050D097963k6488k786J25854J9954k4690J67231J03872J18670J4188J3212j31123
$$ 4097963 4071475 4068689 4194543 4214497 4189807 4357038 4460910 4579580 4593768 4606980 4475857
4039D475857Q0773O5072M19295K61294o3974K70228M4411J36185J85492N9394
$$ 4475857 4556630 4621702 5040997 5302291 5238317 5508545 5552956 5689141 5874633 5934027
4029E934027K3413L52872L76933L52060N54891M36813L06777O77480P54751N93819
$$ 5934027 5957440 6310312 6687245 7039305 7594196 8031009 8337786 9015266 9770017 10363836
4019A0363836Q00969P45390J382188J532553J893178J735349J363729J304732
$$ 10363836 11164805 11910195 13292383 14824936 16718114 18453463 19817192 21121924
4011B1121924m96112k016879k273381k020462j632909j310138p55787o17814k91074
$$ 21121924 20625812 18608933 16335552 14315090 12682181 11372043 10616256 9998442 9707368
4002I707368k32739k98434l55200r1904K4877p4316L5563R0855J97310J09193
$$ 9707368 9474629 9176195 8820995 8729091 8753968 8679652 8715215 8806070 9003380 9112573
3992I112573L03265M36734O51442J015929P00659R55786J344521J178567J158471
$$ 9112573 9415838 9852572 10504014 11519943 12220602 13176388 14520909 15699476 16857947
3983A6857947O88253j39985j549533j512563j272337j081483o49927l06675j28376
$$ 16857947 17546200 17406215 15856682 14344119 13071782 11990299 11340372 11033697 10905321
3974A0905321k14467J34804O9543K52133K80354M23474K58230N357J92213M17706
$$ 10905321 10690854 10825658 10895201 11147334 11427688 11851162 12109392 12114749 12306962 12724668
3964A2724668O07396N65756J145623J286340J572038J900501J983274J785908
$$ 12724668 13332064 13897820 15043443 16329783 17901821 19802322 21785596 23571504
3956B3571504J536001K78618j891814k544556k003046j593940r47478o53144l77967
$$ 23571504 25107505 25386123 23494309 20949753 18946707 17352767 16405289 15752145 15374178
3947A5374178k94207l38000p3927J63761K48643J27495N86247Q87617Q33315P67785
$$ 15374178 15079971 14741971 14668044 14831805 15080448 15207943 15794190 16681807 17515122 18282907
3937A8282907O47741O98666J191520J470450J971501K012643K390856K415634
$$ 18282907 18930648 19629314 20820834 22291284 24262785 26275428 28666284 31081918
3929C1081918J967940J948664J51474k237749k611252k691903k079733j655966
$$ 31081918 33049858 34998522 35149996 32912247 30300995 27609092 25529359 23873393
3921B3873393j039870l77000l11759K63904L97659L97119M92934K78036L68892
$$ 23873393 22833523 22456523 22144764 22408668 22806327 23203446 23696380 23974416 24343308
3912B4343308L57493J10347L17367O12434M94240P33352O67609P52023J015220
$$ 24343308 24700801 24811148 25128515 25740949 26235189 26968541 27636150 28388173 29403393
3903B9403393J102370J273589J267569J831114J733319J707277J910949J950264
$$ 29403393 30505763 31779352 33046921 34878035 36611354 38318631 40229580 42179844
3895D2179844J795202J937098K467453K630967K459499K384806K204508K289794
$$ 42179844 43975046 45912144 48379597 51010564 53470063 55854869 58059377 60349171
3887F0349171K246196K063102K335506K951608L410247M020269M426228M453205
$$ 60349171 62595367 64658469 66993975 69945583 73355830 77376099 81802327 86255532
3879H6255532L959343L899865K626956j66576j469188j498593m44473M13936J500846
$$ 86255532 90214875 94114740 96741696 96575120 95105932 93607339 93162866 93576802 95077648
3870I5077648J685617J303488J123505J026462J402005J362692Q68107k0780p34488
$$ 95077648 96763265 98066753 99190258 100216720 101618725 102981417 103849524 103828744 103094256
3861A03094256j538845j818671j619668j417515q54986p86069q61903o11268l28038
$$ 103094256 101555411 99736740 98117072 96699557 95844571 95058502 94196599 93585331 93257293
3852I3257293l76776o84153k024987m329707n705298n566786m468964l213601
$$ 93257293 92880517 92196364 90171377 85841670 80136372 74569586 70100622 66887021
3844F6887021k672453k136976k101131k081941j863188j811040k203110k233154
$$ 66887021 64214568 62077592 59976461 57894520 56031332 54220292 52017182 49784028
3836D9784028k220759k038952j918496j787543j691052j405710r36813j130540
$$ 49784028 47563269 45524317 43605821 41818278 40127226 38721516 37784703 36654163
3828C6654163j539992j270789j274574j158130p74326o77582l64611l69954l82874
$$ 36654163 35114171 33843382 32568808 31410678 30636352 29958770 29594159 29224205 28841331
3819B8841331m46564l72943n75646m55300l06362k15301l67955o42419o58283
$$ 28841331 28394767 28021824 27446178 26990878 26684516 26469215 26101260 25458841 24800558
3810B4800558p73119p13010n81263m20736m30063o81827l06854M9610L02775J08399
$$ 24800558 24027439 23314429 22733166 22312430 21882367 21200540 20893686 20943296 21246071 21354470
3800B1354470k08559o662j2038L5746K50764L71574K52744M0211n8039j35360
$$ 21354470 21145911 21139249 21127211 21162957 21413721 21785295 22038039 22078250 22020211 21884851
3790B1884851K60695r021p3665O3630j00022J76804K12214J62375N56716M69860
$$ 21884851 22145546 22136525 22062860 22126490 22026468 22203272 22415486 22577861 23134577 23604437
3780B3604437M41898N88743O10990Q71887Q30886P94984N03893J08095J06207
$$ 23604437 24046335 24635078 25246068 26117955 26948841 27743825 28247718 28355813 28462020
3771B8462020k57541m39969m52054n23386n15559k63131l96876o07364q96426
$$ 28462020 28204479 27764510 27312456 26789070 26273511 26010380 25613504 25006140 24109714
3762B4109714q12002o85573p36736p78456o09972m55073o99705k31359l0721K1753
$$ 24109714 23297712 22612139 21875403 21096947 20486975 20031902 19332197 19100838 19070117 19091870
3752A9091870K00594j23286J28525K97725K92539J46452L37179Q335k72924J72119
$$ 19091870 19292464 19169178 19297703 19595428 19887967 20034419 20371598 20379933 20107009 20279128
3742B0279128r1235j44725j56033l96045m18122m89019l96791k54481k16185j37406
$$ 20279128 20187893 20043168 19887135 19491090 19072968 18583949 18187158 17932677 17716492 17579086
3732A7579086k54387k81623k81251j56619o9444k95370k60400j71303j34614j5101
$$ 17579086 17324699 17043076 16761825 16605206 16535762 16240392 15979992 15808689 15674075 15658974
3722A5658974J82949m2438j01316J44405j56933j47180j02152J38563P4861N008
$$ 15658974 15841923 15799485 15698169 15842574 15685641 15538461 15436309 15574872 15649733 15654741
3712A5654741J3276L8198n0767o5388O4950J62504K10522N9702n982J19808L20479
$$ 15654741 15668017 15706215 15655448 15590060 15655010 15817514 16028036 16087738 16081756 16201564 16522043
3701A6522043J33739j70744P6941o4567O0559J38033j38169l1866q8561j20854
$$ 16522043 16655782 16485038 16561979 16497412 16557971 16696004 16557835 16525969 16437408 16316554
3691A6316554l21145r2604N2670N4173M1745n4732J24565L26698K44552J22925
$$ 16316554 15995409 15902805 15955475 16009648 16051393 15996661 16121226 16447924 16692476 16815401
3681A6815401K85388N84232L53102N61509L32788L9322M49623K24087K94203M81668
$$ 16815401 17100789 17685021 18038123 18599632 18932420 18971742 19421365 19645452 19939655 20421323
3671B0421323P06831P19976O64908L92246K75292K86482L01174K89729J01888
$$ 20421323 21128154 21848130 22513038 22905284 23180576 23467058 23768232 24057961 24159849
3662B4159849M6404q4990l91066n18985m82192j29472l02398l20893n4077m9168
$$ 24159849 24206253 24121263 23730197 23211212 22729020 22599548 22297150 21976257 21922180 21873012
3652B1873012m1890J49843j39776k05718l79240n49133l01680j79683j0364J9606
$$ 21873012 21831122 21980965 21841189 21635471 21256231 20707098 20405418 20225735 20215371 20234977
3642B0234977L51289J71811N9086m0347K70602K29259J18853L21450M1093r0333
$$ 20234977 20586266 20758077 20817163 20776816 21047418 21276677 21395530 21716980 21758073 21667740
3632B1667740k95117l40594l09926k84137p09956m86525l53643k66745k39864
$$ 21667740 21372623 21032029 20722103 20437966 19728010 19241485 18887842 18621097 18381233
3623A8381233m62294m68036n81735n68432o19760m21448l27968k67294m29426
$$ 18381233 17918939 17450903 16869168 16300736 15680976 15259528 14931560 14664266 14234840
3614A4234840k46350l05143j00024K08618j20320k38236Q796J22028N2928m5129
$$ 14234840 13988490 13683347 13583323 13791941 13671621 13433385 13442181 13564209 13617137 13572008
3604A3572008m7183m5839k84502l2605k66819n4290l19305l66752k08422j13463
$$ 13572008 13524825 13478986 13194484 13161879 12895060 12840770 12521465 12154713 11946291 11832828
3594A1832828o1985j73582k64289j41086l70539m33657k2577k52619k85947k05804
$$ 11832828 11770843 11597261 11332972 11191886 10821347 10387690 10365113 10112494 9826547 9620743
3584I620743k28743k18612k57137j12455k38804r0851O412k31607j95414n9962
$$ 9620743 9392000 9173388 8916251 8803796 8564992 8474141 8480553 8248946 8053532 7993570
3574G993570J03887R8788O9072p9788j02047K6452r7413J2570j49185j78024l0872
$$ 7993570 8097457 8196245 8265317 8185529 8083482 8109934 8012521 8025091 7875906 7697882 7667010
3563G667010k55270j43859k26441p439j13048R3903p4564N9508j03042j19634
$$ 7667010 7411740 7267881 7041440 7034001 6920953 7014856 6940292 6999800 6896758 6777124
3553F777124j98001q7101N0173j63162k45247P0800j00241m04064j71723N7662
$$ 6777124 6579123 6492022 6542195 6379033 6133786 6204586 6104345 5700281 5528558 5586220
3543E586220j30274j37033k85552q2064N0381j12176k82123j49421n381o5482
$$ 5586220 5455946 5318913 5033361 4951297 5001678 4889502 4607379 4457958 4452577 4387095
3533D387095q4852k15939R5132R6024L7299p3642j38J23058k4337k1475m6252
$$ 4387095 4302243 4086304 4181436 4277460 4314759 4241117 4240979 4364037 4339700 4318225 4271973
3522D271973j39466j95238k989J00802M711k84922j91816k84955j73709k1517
$$ 4271973 4132507 3937269 3934280 4035082 4039793 3754871 3563055 3278100 3104391 3082874
3512C082874j563J1021l05292j50740j47512j9866M3822r8140j53611p7889N6507
$$ 3082874 3081311 3092332 2787040 2636300 2488788 2468922 2512744 2414604 2260993 2183104 2239611
3501B239611j30201K1158m5143j26361J08378N6722n5418N5656n9984j46611O7486
$$ 2239611 2109410 2130568 2085425 1959064 2067442 2124164 2068746 2124402 2064418 1917807 1985293
3490A985293o9790l6510R6604j57418R739J78269M915m493k23102j43104L7130
$$ 1985293 1915503 1878993 1975597 1818179 1827918 2006187 2011102 2006609 1783507 1640403 1677533
3479A677533j72910j02733M1560q1484P7912L1508k466j47119L3412j85013Q1280
$$ 1677533 1504623 1401890 1443450 1361966 1439878 1471386 1468920 1321801 1355213 1170200 1251480
3468A251480n03j96202J04778O4120J57715j13328j60884K49859j01013n4245
$$ 1251480 1250977 1054775 1159553 1223673 1381388 1268060 1107176 1357035 1256022 1201777
3458A201777J39741M7631J9156R0049j05084P5749m8533k7241j09456O1052J84961
$$ 1201777 1341518 1389149 1408305 1498354 1393270 1469019 1420486 1393245 1283789 1344841 1529802
3447A529802o9521j82404k17748P4662J53749k1981k5419k01369J07053n730k1001
$$ 1529802 1460281 1277877 1060129 1134791 1288540 1266559 1241140 1039771 1146824 1141094 1120093
3436A120093K10912N6068J90478o4084k50424n2352J47304m5614l5054p7099J09567
$$ 1120093 1331005 1387073 1577551 1513467 1263043 1210691 1357995 1312381 1277327 1200228 1309795
3425A309795o0645L2559M0585j92973O570k7487M053J49931j18247k0167J20600
$$ 1309795 1249150 1281709 1322294 1129321 1135891 1108404 1112457 1262388 1144141 1123974 1244574
3414A244574k1183l63761J89614J19456j51248K45298N0874L1392j17693J09007
$$ 1244574 1223391 859630 1049244 1168700 1017452 1262750 1313624 1345016 1227323 1336330
3404A336330J81686K12940N5758j3766J21646j4025k64691j51466j54236k36554
$$ 1336330 1518016 1730956 1786714 1772948 1894594 1880569 1615878 1464412 1310176 1073622
3394A073622o1169J05219O1667j60916k44833j39837J16243j07856k0660J37663
$$ 1073622 1012453 1117672 1179339 1018423 773590 633753 749996 642140 621480 759143
3384G59143l6346j59003K9049r0584L5891j16445Q3320J87915j0260l1205O5528
$$ 759143 722797 563794 592843 502259 538150 421705 505025 692940 682680 651475 717003
3373G17003J97945k7139P8721J27217l140k1784o7966k16802m9251J36574J9873
$$ 717003 914948 887809 966530 1093747 1090607 1068823 1000857 784055 734804 871378 891251
3362H91251q2450j25665j16455J24629R9568q1798r5003k5439R5946K16640j23322
$$ 891251 808801 683136 566681 691310 790878 709080 614077 588638 684584 901224 777902
3351G77902k659j60558k2651K20737J19460j79204J4478K5354j4227l1289j01131
$$ 777902 775243 614685 592034 812771 932231 753027 767505 792859 778632 747343 646212
3340F46212O781K9462J7569q3070J32319K19448M7242j59858q4041N1942j9040
$$ 646212 652993 682455 700024 616954 749273 968721 1015963 856105 772064 824006 804966
3329H04966o5889L292j46935K93448r8617L5836N3908k56699m2226j8612n8071
$$ 804966 739077 742369 595434 888882 790265 826101 880009 623310 581084 562472 504401
3318E04401J66574N2603k9624n0166P9919L9547k4633L9655N8819R3339J42634
$$ 504401 670975 723578 693954 643788 723707 763254 738621 778276 837095 930434 1073068
3307A073068r7766J42388J43133j8585J08377j51572r8431n3036O1276l3392m2668
$$ 1073068 975302 1117690 1260823 1242238 1350615 1199043 1100612 1047576 1108852 1075460 1032792
3296A032792J3919l23880J24231J42543J17075P0939p7155N7806J70229O5276
$$ 1032792 1046711 722831 847062 989605 1106680 1177619 1100464 1158270 1328499 1393775
3286A393775k4709K5244p312K155K2877k2860J7513K4566J7222O6790o1826J32406
$$ 1393775 1369066 1394310 1386998 1389153 1412030 1389170 1406683 1431249 1448471 1515261 1453435 1585841
3274A585841J0637K13507J70022L3292J69288J65633R7595m8361J34640J95169
$$ 1585841 1596478 1809985 1980007 2013299 2182587 2348220 2445815 2397454 2532094 2727263
3264B727263j5229Q1099K75561J67208J69264K19804J82260J80427l0004l190
$$ 2727263 2712034 2793133 3068694 3235902 3405166 3624970 3807230 3987657 3957653 3954463
3254C954463P6817k03119l14970j09734j55821l0635j53984K0559J0152j07146
$$ 3954463 4031280 3828161 3513191 3403457 3247636 3217001 3063017 3083576 3093728 2986582
3244B986582k61131m2106j36595n8176j10690r4504m851j0034J05189K06964O0326
$$ 2986582 2725451 2683345 2546750 2488574 2377884 2283380 2278529 2268495 2373684 2580648 2640974
3233B640974k0143K60600j69901J4407K08736L6102K01490J57331J54961K05285
$$ 2640974 2620831 2881431 2711530 2725937 2934673 2970775 3172265 3329596 3484557 3689842
3223C689842n3656p1878K36630J08971n665K10612j9821N4668o5234k28046O8549
$$ 3689842 3636186 3564308 3800938 3909909 3904244 4114856 4095035 4149703 4084469 3856423 3924972
3212C924972j61299p4577k6415k20736P600k29100j13430K59519j12228l6494
$$ 3924972 3763673 3689096 3662681 3441945 3449545 3220445 3107015 3366534 3254306 3217812
3202C217812J24482n5987O6398J38339N2524O4220J68546J14361N2751O3474J54333
$$ 3217812 3342294 3286307 3352705 3491044 3543568 3607788 3776334 3890695 3943446 4006920 4161253
3191D161253J85321j80929l582K27369p9492q3255K35963J30453l25889j19971
$$ 4161253 4346574 4165645 4162063 4389432 4309940 4226685 4462648 4593101 4267212 4147241
3181D147241J11608p4377j7704o6371L5684j61283q9681j05647n7263P2914M8731
$$ 4147241 4258849 4184472 4166768 4100397 4136081 3974798 3885117 3779470 3722207 3795121 3843852
3170C843852j31714M487N6749n6949j08820K6111p3837O3462Q2393j11879N6280
$$ 3843852 3712138 3716625 3773374 3716425 3607605 3633716 3559879 3623341 3705734 3593855 3650135
3159C650135k34813J48852l6608r3133K7735Q1430j05619n3951J59273r2699p926
$$ 3650135 3415322 3564174 3527566 3434433 3462168 3543598 3437979 3384028 3543301 3450602 3442676
3148C442676J67575J11567N4256j97960r9784j04401j3014l9428j10191m1102
$$ 3442676 3610251 3721818 3776074 3578114 3478330 3373929 3360915 3321487 3211296 3170194
3138C170194m4355p5000J1857p5627p7810p1457r7842r3385p5052p4895K5334
$$ 3170194 3125839 3050839 3062696 2987069 2909259 2837802 2739960 2646575 2571523 2496628 2521962
3127B521962L8995j05167j21178N3489j59452j38877J52386O0871j90319j55433
$$ 2521962 2560957 2455790 2334612 2388101 2228649 2089772 2242158 2303029 2112710 1957277
3117A957277J13169q2897r806J46282j61016k9754K3219j4201L2584r0327N9816
$$ 1957277 2070446 1987549 1977743 2124025 1963009 1933255 1956474 1942273 1974857 1884530 1944346
3106A944346L5759M8226q6619J19782k2858j95445j54745K1126j01886r9582m5867
$$ 1944346 1980105 2028331 1941712 2061494 2038636 1843191 1688446 1709572 1607686 1508104 1462237
3095A462237K03722k16131k14879P8045k4708r0037k0818O052j2798O5266q4601
$$ 1462237 1665959 1449828 1234949 1312994 1288286 1198249 1177431 1183483 1170685 1235951 1151350
3084A151350K7145j07175j1049n0291J01643J03052n6703m4463L1348j98126j28975
$$ 1151350 1178495 1071320 1060271 1009980 1111623 1214675 1157972 1113509 1144857 946731 817756
3073H17756J69945Q9916j09613k52310j4975R5203m9896o1648j81542L7563j36424
$$ 817756 987701 1077617 968004 715694 700719 795922 746026 684378 502836 540399 403975
3062D03975L7556K03268q0751j42958O5850R1454k7782l28607M7501L19590n1582
$$ 403975 441531 644799 564048 421090 486940 578394 550612 222005 269506 589096 537514
3051E37514M1393o2402j93821P9858J71877j48950j7035K26978k6702j57020j07738
$$ 537514 578907 516505 322684 402542 574419 425469 408434 635412 608710 451690 343952
3040C43952j37752K02926q7256L5874r7893Q2738M2784j25562q1925r7116K03602
$$ 343952 206200 409126 321870 357744 259851 342589 385373 259811 177886 80770 284372
3029B84372n1956J23662j99229P5238j78861R1333q6927N9178L7678p6652P6869
$$ 284372 232416 356078 156849 232087 53226 144559 57632 116810 154488 77836 154705
3018A54705J47468q396k1860M7105j408n6627j02421L9590j57845J29264j88101
$$ 154705 302173 293777 271917 319022 317614 260987 158566 198156 40311 169575 -18526
3007a8526j20593N3652J55372k6083o2776M5872J39728P8090N7781k25162Q1286
$$ -18526 -139119 -85467 69905 43822 -18954 26918 166646 244736 302517 77355 158641
2996A58641M2958K10335j68965O2936r3391k46312j6687J88359N9429l6075K2449
$$ 158641 201599 411934 242969 305905 212514 -33798 -50485 137874 197303 161228 183677
2985A83677j84890q5371o698K30437J8425j49382j30574N8322Q4021M6330j81131
$$ 183677 -1213 -86584 -93282 137155 155580 6198 -124376 -66054 17967 64297 -116834
2974a16834j52655K81990J26080n2583j82650n0947J32627P3761R4118M4545N8203
$$ -116834 -269489 12501 138581 85998 -96652 -147599 -14972 58789 152907 197452 255655
2963B55655j44441k2164J85282k01605r4240K693R0594J04185n735j47143j02971
$$ 255655 111214 89050 274332 72727 -21513 -18820 71774 175959 170224 23081 -79890
2952g9890m9133K60735J18315j89065N5954r3605O9871r054j2933q0706J54669
$$ -79890 -129023 131712 250027 60962 116916 23311 93182 84128 71195 -9511 145158
2941A45158j8196p3072N359M2675J3338q1671K0177L9231p6276M4113m8713o9898
$$ 145158 126962 53890 59249 101924 115262 33591 53768 92999 16723 60836 12123 -57775
2929e7775j13875K1578K63237J96765Q2466O3227j41198p9676o1818J4836j24136
$$ -57775 -171650 -150072 113165 309930 392396 455623 314425 234749 172931 187767 63631
2918F3631M9378k176m4142P5545j27639q57P8663K20476k8612j41811n4226J52263
$$ 63631 113009 110833 66691 142236 14597 13740 92403 312879 284267 142456 88230 240493
2906B40493J06994k58986R3235J11220J2714l5790r4988j3739r3637J28682Q088
$$ 240493 347487 88501 181736 292956 305670 269880 174892 161153 67516 196198 204286
2895B04286j32883K087R9589Q957J30692j16502j67831J019q6476R5341J27667
$$ 204286 71403 73490 173079 182036 312728 196226 28395 29414 -57062 38279 165946
2884A65946o6893k5537M9617q0965k5652J52884j04297r0342j03706P8606N1571
$$ 165946 99053 73516 123133 42168 16516 169400 65103 -25239 -128945 -50339 1232
2873A232P2758J18128o4078n4896J288m037j1772J40672r6267j40823J42689j61600
$$ 1232 73990 192118 128040 73144 74432 70395 58623 199295 103028 -37795 104894 -56706
2861e6706J36612j09350j32316J32481j5336o0318K6190O1355m8600Q889k80037
$$ -56706 79906 -29444 -161760 -29279 -44615 -104933 -78743 -17388 -65988 -57099 -337136
2850c37136J36176J02100j67219P7043o5626K8493j1062k2414J23713Q3726k8480
$$ -337136 -200960 -98860 -266079 -189036 -254662 -226169 -237231 -259645 -135932 -52206 -80686
2839h0686N131Q7490r3195J34498L1687p1069j96010l0920M8927J03000q4186
$$ -80686 -75555 11935 -81260 53238 84925 13856 -182154 -213074 -164147 -61147 -145333
2828a45333l6762j0165J32206J05345k5281p3315j04086J04652P7056M2854j21054
$$ -145333 -182095 -192260 -60054 45291 20010 -53305 -157391 -52739 24317 67171 -53883
2817e3883m2081K3012o2311P0082o2116P5716J05729k02132M2263l9944n8883
$$ -53883 -95964 -72952 -135263 -65181 -127297 -51581 54148 -147984 -105721 -145665 -204548
2806b04548l6394J80456K17022l75864J622R0333j13450P5199J42391Q3664O6510
$$ -204548 -240942 -60486 156536 -219328 -217706 -127373 -240823 -165624 -23233 60431 126941
2795A26941l02395M4069P9879L3313K20798j58652l045p6936j06505J1740J28988
$$ 126941 -175454 -131385 -51506 -18193 202605 43953 40908 -36028 -142533 -130793 -1805
2784a805P6630P674p3074j43810k280L1461O5083n9168J16280K8274K3079n9571
$$ -1805 74825 82499 9425 -134385 -136665 -105204 -40121 -99289 16991 45265 68344 8773
2772H773j14350N8591o9381J35786q9146l7932Q9883m5641k14817J12786L7431
$$ 8773 -105577 -46986 -116367 19419 -69727 -107659 -17776 -63417 -278234 -165448 -128017
2761a28017N0033L1183m0639Q9404R8632l7077j339J63603m793j28595J4783J06509
$$ -128017 -77984 -46801 -87440 1964 100596 63519 62180 225783 220990 92395 107178 213687
2749B13687k73144Q8505o0429n9128J37565j74265P156q4908J00561J51450r0670
$$ 213687 -59457 29048 -31381 -90509 47056 -127209 -120053 -204961 -104400 47050 -43620
2738d3620J02730j62627O4686M8067j33149J42605j32412K0930J13750j06413
$$ -43620 59110 -103517 -38831 9236 -123913 18692 -113720 -92790 20960 -85453
2728h5453q954q3619q946l9149r7719L00502L5961P5980j48074J04914n5001k5760
$$ -85453 -94407 -178026 -186972 -226121 -323840 -23338 12623 88603 -59471 45443 -9558 -35318
2716c5318j48774N2091j55908J26686J84512k5760J6352R772J05323m3515j00327
$$ -35318 -184092 -132001 -287909 -161223 23289 -2471 13881 23653 128976 85461 -14866
2705a4866K543p2129k42006K07898l2062r9807K1080l8940j58502J16461J60281
$$ -14866 -12323 -84452 -326458 -118560 -150622 -250429 -229349 -268289 -426791 -310330 -150049
2694a50049m0101o3735J1634R4293J34217J6688M4639o1538Q018j8898J17784
$$ -150049 -190150 -253885 -242251 -147958 -13741 2947 47586 -13952 -5934 -24832 92952
2683I2952o5009j52010O4453j05488k9122J7500J01698j41873L5699J69993K3526
$$ 92952 27943 -124067 -59614 -165102 -194224 -176724 -75026 -216899 -181200 -11207 12319
2672A2319J35180k13876N8842k207R0578o7392L3030O7885j62186j67337M2194
$$ 12319 147499 -66377 -7535 -9742 80836 13444 46474 114359 -47827 -215164 -172970
2661a72970J23060J42983j09717j99114L7141q2950m2225J05396J12014K28956
$$ -172970 -49910 93073 -16644 -215758 -178617 -261567 -303792 -198396 -86382 142574
2651A42574o6091k16023k2437O3004J47639j51751N0243J34598k5833j86135n4532
$$ 142574 76483 -139540 -161977 -98973 48666 -103085 -52842 81756 55923 -130212 -184744
2640a84744Q8292L9160m2755m8718j7715m6210L92011j42117k18374J32957m810
$$ -184744 -96452 -57292 -100047 -148765 -166480 -212690 179321 37204 -181170 -48213 -53023
2629e3023q2752L3737J40563l8347l0411k01728R4137J50111k04128J53780J37793
$$ -53023 -135775 -102038 38525 178 -30233 -231961 -137824 12287 -191841 -38061 99732
2618I9732j04611J26263j3093q6303J25512k25243j21770J07697m0541J6293J59952
$$ 99732 -4879 121384 108291 21988 147500 -77743 -199513 -91816 -132357 -116064 43888
2607D3888K60020j05982k21503j008Q7364O2277k21807r3919J42185Q9516K68
$$ 43888 303908 197926 -23577 -24585 62779 125056 -96751 -190670 -48485 41031 41299
2596D1299k605M4871P919n9097P9125J37281j80697n2886Q0230p0946q6804j11245
$$ 41299 38694 83565 91484 32387 111512 248793 68096 15210 95440 24494 -62310 -173555
2584a73555K250J11346r4557o8996K03029j332j64064K11210K00682p8462k68209
$$ -173555 -171305 -59959 -154516 -223512 -20483 -21815 -185879 25331 226013 147551 -120658
2573a20658L2884R8952j27588k6543J1922J23022l3919J00809J60796k2702K8666
$$ -120658 -87774 11178 -116410 -142953 -131031 -8009 -41928 58881 219677 196975 225641
2562B25641j69320J9965K24716k5601k29543o8691K9899j10034O5117Q7347q7205
$$ 225641 56321 76286 301002 275401 45858 -22833 7066 -102968 -37851 49496 -37709
2551c7709j45761k2701P2358O493o7132k0746J68567p657J50911j67368k0330
$$ -37709 -183470 -206171 -133813 -127320 -194452 -215198 -46631 -54288 96623 -70745 -91075
2540i1075K5760r5333J35226l1966J0371R0421n3212J63501j92579j2728J9316
$$ -91075 -65315 -160648 -25422 -57388 -47017 43404 -9808 153693 -38886 -51614 -32298
2529c2298L2780m7688j68726J18338p7063j7601P8803Q2968R4331o8476j33034
$$ -32298 482 -47206 -215932 -97594 -174657 -192258 -113455 -30487 63844 -4632 -137666
2518a37666J10739M2980q860m7860J15901p3920L7928o7508P3756M1400L7097
$$ -137666 -26927 16053 7193 -40667 75234 1314 39242 -28266 45490 86890 123987
2507A23987l9462q1802L0068j77846j1914j07424l1330m3670k809N4832J73765
$$ 123987 84525 2723 32791 -145055 -156969 -264393 -295723 -339393 -342202 -287370 -113605
2496a13605J4885K290N1879K0326r2671Q3195K1551j50079j02261J24499J06056
$$ -113605 -98720 -96430 -44551 -24225 -116896 -33701 -12150 -162229 -264490 -139991 -33935
2485c3935K16937q7072r5481N6506j01535P2154j04226P6937m2834q6084M0455
$$ -33935 183002 95930 449 56955 -44580 27574 -76652 285 -42549 -128633 -88178
2474h8178k3098k6848J44803K6699j13108L0383K23290j0386o365l12554J41206
$$ -88178 -111276 -138124 6679 33378 -79730 -49347 173943 163557 157192 -155362 -14156
2463a4156j08985j22112L9634J62530r2805Q6633L9540j16375J96561R192n4790
$$ -14156 -123141 -245253 -205619 -43089 -135894 -49261 -9721 -126096 70465 79657 24867
2452B4867j72083K19735K5623j47238j23982K15094o0571L0856O617k09454J06527
$$ 24867 -147216 72519 98142 -49096 -173078 42016 -18555 12301 18918 -190536 -84009
2441h4009l1262q3308j02762J77643j27544J74069P7384n5552L7072k7656J55510
$$ -84009 -115271 -198579 -301341 -123698 -251242 -77173 211 -55341 -18269 -45925 109585
2430A09585n1994J10985k32270L4299N4959o1963O0125j78594J8273j0779J58191
$$ 109585 57591 168576 -63694 -29395 25564 -36399 23726 -154868 -136595 -147374 10817
2419A0817J51036j53732j66148J30010O0251R257J24122j66698J15915k57376
$$ 10817 161853 8121 -158027 -28017 32234 41491 165613 -1085 114830 -142546
2409a42546R2682J96172L4238N2102k00987q3369q0365K93710J32800j97990J1712
$$ -142546 -49864 146308 180546 232648 31661 -51708 -132073 161637 294437 96447 108159
2398A08159l1881n8826m5083r1830Q0378K40429J7527J53203j74503J55227J7150
$$ 108159 76278 17452 -27631 -119461 -39083 201346 218873 372076 197573 352800 369950
2387C69950j95946m8848J41584L7984j11065N2754j30796j21929j01709M16768
$$ 369950 174004 125156 266740 304724 193659 246413 115617 -6312 -108021 308747
2377C08747k16493n0632N1420j75914O0809r1108J06869o870J55465O2314M3110
$$ 308747 92254 41622 93042 -82872 -22063 -113171 -6302 -13172 142293 204607 247717
2366B47717j41076q271L7996k4061J66317m1550j96446J13595p0140o1561j1226
$$ 247717 106641 98370 136366 112305 278622 237072 40626 154221 84081 22520 11294
2355A1294j6473J53053o0902k7172M165K17675J11106m1997j19625j00259R8767
$$ 11294 -5179 147874 86972 59800 63965 281640 392746 350749 231124 130865 229632
2344B29632O5823o3303M3234N1931j51102k48182J05056J03642j7109m584J21774
$$ 229632 295455 232152 275386 327317 176215 -71967 33089 136731 119622 115038 236812
2333B36812j04512K1304m218j37975J34462J54036P6951j16124r7221J80943j45526
$$ 236812 132300 153604 149386 11411 145873 299909 376860 260736 163515 344458 198932
2322A98932O5967r3926l1011k61956J17258P1017N9800K70490k96263R031J09149
$$ 198932 264899 170973 139962 -121994 -4736 66281 126081 396571 100308 109339 218488
2311B18488r5145O4776l0157J42837J5436k13878R8817N8237o7591p9495L1170
$$ 218488 123343 188119 157962 300799 316235 102357 201174 259411 191820 112325 143495
2300A43495p1175j6265m4362o4959M6569R7340L9450P2379o4999j16454Q4985
$$ 143495 72320 56055 11693 -53266 -6697 90643 130093 202472 137473 21019 106004
2289A06004K16456j01110j61388J14865R1827j52425n6543r2014O0321L272n1610
$$ 106004 322460 221350 59962 174827 266654 114229 57686 -34328 25993 29265 -22345
2278b2345K06127o5896l9679r5088L5742K11287L6915P2495l8864j64821q8695
$$ -22345 183782 117886 78207 -16881 18861 230148 267063 339558 300694 135873 47178
2267D7178J14746L7875q1097J54440L9372m3742k21986J30241J43337k4300o310
$$ 47178 161924 199799 118702 273142 312514 268772 46786 177027 320364 296064 289754
2256B89754p4967J75427N2692J50808n9706k31127M8387J52122J6967j72485J66010
$$ 289754 214787 390214 442906 593714 534008 302881 351268 503390 520357 347872 513882
2245E13882N218r2776Q8581O5443R3664J590k4831j90799M1226j01234J2461m6889
$$ 513882 519100 426324 514905 580348 674012 675602 650771 459972 501198 399964 412425 365536
2233C65536N9316O4447j39282K01090R0639j21463L0225o9087O0838j16293K31073
$$ 365536 424852 489299 350017 551107 641746 520283 550508 481421 542259 425966 657039
2222F57039J4221j4911j15723n4211K6893j57569K40544K31055j43110m9077j21361
$$ 657039 671260 656349 540626 486415 513308 355739 596283 827338 684228 635151 513790
2211E13790J02876J9902O6613k51286J11829L9542q1315R5195Q8111Q7248K6665
$$ 513790 616666 636568 703181 451895 563724 603266 521951 617146 705257 792505 819170
2200H19170J64469j35174J16926j2253j12918r57J44053M4567P1808q8108M7844
$$ 819170 983639 848465 965391 953138 840220 839263 983316 1027883 1099691 1011583 1059427
2189A059427K06872j31541J61505k7372J4660N7026K22607J05484j29547Q1722
$$ 1059427 1266299 1134758 1296263 1268891 1283551 1340577 1563184 1668668 1539121 1620843
2179A620843J45312O9867N8190K6383l6709J47837J44822L6284L9085j31899J39625
$$ 1620843 1766155 1836022 1894212 1920595 1883886 2031723 2176545 2212829 2251914 2120015 2259640
2168B259640K62003j66315K19818J84654j17776M5783P9338J0239K68428J49556
$$ 2259640 2521643 2355328 2575146 2759800 2642024 2687807 2767145 2777384 3045812 3195368
2158C195368Q5979K2857J49336J63807K73616J53350L2779k2469P4365L68427
$$ 3195368 3281347 3304204 3453540 3617347 3890963 4044313 4077092 4054623 4128988 4497415
2148D497415K09347K54459M70919K82526K47134J66786N91555L40245N24663M86129
$$ 4497415 4706762 4961221 5432140 5714666 5961800 6128586 6720141 7060386 7585049 8071178
2138H071178P21010N06314Q61121R57515Q67963R60029J163202P84101J134568
$$ 8071178 8792188 9298502 10159623 11117138 11985101 12945130 14108332 14892433 16027001
2129A6027001J215117K006553K589205L830799M683539O144498P246624R404368
$$ 16027001 17242118 19248671 21837876 25668675 30352214 36496712 43743336 53147704
2121E3147704J1100196J3318019P881104Q620282l811457k0425630j4503880j2632775
$$ 53147704 64247900 77565919 85447023 94067305 90255848 69830218 55326338 42693563
2113D2693563q525180o077370m453480l581622k599969j957064j180305j023944
$$ 42693563 34168383 28091013 23637533 20055911 17455942 15498878 14318573 13294629
2105A3294629r27844q22952m91361o80466j088011j011981p10782n97842l70821
$$ 13294629 12366785 11543833 11052472 10372006 9283995 8272014 7561232 6963390 6592569
2096F592569o66158m83931j27396j26848l17244k50281j84127k47678j72866k13409
$$ 6592569 5926411 5442480 5315084 5188236 4870992 4620711 4436584 4188906 4016040 3802631
2086C802631k08061j27381k74207k12623k19955l10570O0234j14013m0985j04896
$$ 3802631 3594570 3467189 3192982 2980359 2760404 2449834 2510068 2396055 2355070 2250174
2076B250174P9039k28377k25075N4325j56877r8462J81440k8446L0473R5884l24620
$$ 2250174 2329213 2100836 1875761 1930086 1773209 1674747 1856187 1827741 1858214 1954098 1629478
2065A629478j30555J24280q0787j16574N4900k89239J1904p2487J14901p6995
$$ 1629478 1498923 1623203 1542416 1425842 1480742 1191503 1203407 1130920 1245821 1168826
2055A168826o8431j71650J41087n4876k67993o1638R1037J51703m1212K36371
$$ 1168826 1100395 928745 1069832 1014956 746963 685325 776362 928065 886853 1123224
2045A123224J5251l27131k07959K6665j5835J03337o5298j5129Q9515j09654j2710
$$ 1123224 1138475 811344 603385 630050 614215 717552 652254 637125 726640 616986 604276
2034F04276j9001k2702R8690O9547j92693j98940j14707R2142j55129J2845L3195
$$ 604276 585275 562573 661263 730810 538117 339177 224470 316612 161483 174328 207523
2023B07523q091P6213p0008M3378M9872K9308N0544q168M6867M7903K5285p6939
$$ 207523 199432 275645 205637 249015 298887 328195 378739 370571 417438 465341 490626 413687
2011D13687j58365j28112j8376J24536j07659n2692O9542J25319M8059l1467l01662
$$ 413687 255322 127210 108834 233370 125711 73019 142561 267880 315939 284472 -17190
2000a7190r8308k1589J21212J22005j74371k53708M35398M9183Q9698Q5448l5528
$$ -17190 -115498 -137087 -15875 106130 -68241 -321949 113449 162632 252330 337778 302250
1989C02250M9170j96321r3749k2411P1731J09201j91585J57577J2895j4768m2678
$$ 302250 351420 155099 61350 38939 110670 219871 28286 185863 198758 183990 141312
1978A41312m3354j13228J14023J06023o4585j89525p7253K78071K32600j70638
$$ 141312 97958 -15270 98753 204776 140191 -49334 -126587 151484 384084 213446
1968B13446k6112q079j31213n6902r4511j9240L02360J9139k55692R9139j13528
$$ 213446 187334 179255 48042 -8860 -103371 -122611 179749 198888 -56804 42335 -71193
1957g1193J37255R4124p7930l8902Q6604m6956n2183r0779M6034O5396j8248J68006
$$ -71193 66062 160186 82256 43354 129958 83002 30819 -59960 -13926 51470 33222 201228
1945B01228K4073j81732k18930J69346J35719N8845J9625l2459N9272j15730j84877
$$ 201228 225301 43569 -175361 -6015 129704 188549 208174 175715 234987 119257 -65620
1934f5620N3108q494n6722R6219o3860l5185m9228J26038O0173n6520J7089O8172
$$ -65620 -12512 -21006 -77728 18491 -45369 -80554 -129782 -3744 56429 -91 16998 85170
1922H5170j57311l4807J41909k7899m1469O3293j36818M131l1404r6349J25454
$$ 85170 -72141 -106948 34961 7062 -34407 28886 -107932 -103801 -135205 -231554 -106100
1911a06100j473L4931O8497J68722j1384j09N8423j71242k51374P9475o218l681
$$ -106100 -107573 -72642 -4145 164577 153193 153084 211507 40265 -211109 -131634 -137852 -141533
1899a41533q0854m4477r5252q932P1230J99224J41706m7820p5499m9745K4655
$$ -141533 -222387 -266864 -362116 -371048 -299818 -100594 41112 -6708 -82207 -131952 -107297
1888a07297J20736Q8940j45572M3958n071O8143j01111j70566J67733J93290k91295
$$ -107297 13439 102379 -43193 765 -4306 63837 -37274 -207840 -40107 153183 -138112
1877a38112m9922K60422J71729L9108k22701j57752L9431n0855O0491P1770J10989
$$ -138112 -188034 72388 244117 283225 60524 -97228 -57797 -108652 -48161 23609 134598
1866A34598p1563Q136p6005p8253r0848j70457R229K19317J45497R7566p2484
$$ 134598 63035 71171 -4834 -83087 -173935 -344392 -335163 -115846 29651 127217 54733
1855E4733O9230j10135K7654L66146q5756n6668P5305J8418p4035j84467P3916
$$ 54733 123963 13828 41482 407628 321872 265204 340509 358927 284892 100425 174341
1844A74341R3129j94305j99415K11014R2488k9641j73664j08489N9869j05074
$$ 174341 267470 73165 -126250 84764 177252 147611 -26053 -134542 -74673 -179747
1834a79747O9353R479j08356K3490Q5360J37054k37877j02343K3990R8867J0273
$$ -179747 -110394 -100915 -209271 -185781 -100421 36633 -201244 -303587 -279597 -180730 -170457
1823a70457K18310N8077r7336j32291M189q1983j96843J99234J2686n9753j08826
$$ -170457 47853 105930 8594 -123697 -119508 -201491 -398334 -199100 -186414 -246167 -354993
1812c54993K01499M3170J27851k28328q3116J37667L9049P78j24702K37319j77268
$$ -354993 -153494 -110324 17527 -210801 -293917 -156250 -117201 -116423 -241125 -3806 -181074
1801a81074l6567J92605M8248l9441j5447J76985r5726j15510k7605Q8095J17500
$$ -181074 -217641 -25036 23212 -16229 -31676 145309 49583 -65927 -93532 -5437 112063
1790A12063k54915J39533J04143l18991J73920p838N5439L5272j2840n4418l167
$$ 112063 -142852 -3319 100824 -218167 -44247 -52085 3354 38626 25786 -28632 -31799
1779c1799l6997K28168p8050j18114J25480J11005q2476k23384J39874j6544q8796
$$ -31799 -68796 159372 81322 -36792 88688 199693 117217 -106167 33707 17163 -71633
1768g1633J96443K5783J08530l4593m5942R6570j06249m7915k96613k06476Q9236
$$ -71633 124810 150593 259123 224530 178588 275158 168909 120994 -175619 -382095 -292859
1757b92859N0578J80430J18265J94137j27018k6742m3759L8169j16865j27278
$$ -292859 -242281 -61851 56414 250551 123533 96791 53032 91201 -25664 -152942
1747a52942O8288K1141n0229K31579O5181k47213r1297p5890J52690R4697o2268
$$ -152942 -84654 -63513 -113742 117837 183018 -64195 -155492 -231382 -78692 16005 -46263
1736d6263k6603P6905K08291N257k49820j16098R7330J28988n2977r6225m4026
$$ -46263 -72866 4039 212330 217587 -32233 -148331 -51001 77987 25010 -71215 -115241
1725a15241p5674R2053J33905j42265O3306Q4210k10539R0097m2032j34262K2240
$$ -115241 -190915 -98862 35043 -107222 -43916 40294 -170245 -80148 -122180 -256442 -234202
1714b34202N4918J3174Q1906K68474j62027J3637j38880r6986p8670k010O3293
$$ -234202 -179284 -166110 -84204 184270 22243 35880 -103000 -199986 -278656 -280666 -217373
1703b17373J45229Q2084k6911n8565J43525j02014j08144k4421J22233N3409j13546
$$ -217373 -72144 9940 -16971 -75536 67989 -34025 -142169 -166590 -44357 9052 -104494
1692a04494l1963m4515J40800K0653k9737J95263j17819K379o9948J8157l4031
$$ -104494 -136457 -180972 -40172 -19519 -49256 146007 28188 30567 -39381 -21224 -55255
1681e5255q941j1749j61962K78992J10864j41983p2272J03256k10970q6715J79541
$$ -55255 -64196 -75945 -237907 41085 151949 9966 -62306 40950 -170020 -256735 -77194
1670g7194K95J4237l2511j14460P488M3127n3419J24443R2345j35353P0050P8161
$$ -77194 -76899 -62662 -95173 -209633 -202145 -159018 -212437 -87994 4351 -131002 -60952 17209
1658A7209j97019J04109m4133q8815M6028J53010j5654p3030K3956J03039R0884
$$ 17209 -179810 -75701 -119834 -208649 -162621 -9611 -25265 -98295 -74339 28700 119584
1647A19584J0549j48692l5090J44929k08366J32140J24257l9206n3030j77532
$$ 119584 130133 -18559 -53649 91280 -117086 15054 139311 100105 47075 -130457
1637a30457J31808O1953k9749J3444p0680l6647l9422L7347r810q6535R4572K93773
$$ -130457 1351 63304 33555 46999 -23681 -60328 -99750 -62403 -72213 -158748 -64176 229597
1625B29597j03213m0920j12534j03111K20749M7574j19600K3204O6072O5075k891
$$ 229597 126384 85464 -27070 -130181 90568 138142 18542 41746 107818 172893 170002
1614A70002K00550p2710l51133j3148j1700J7959J09407j38121M0621j6284m2148
$$ 170002 370552 297842 -53291 -66439 -78139 -60180 49227 -88894 -48273 -64557 -106705
1603a06705j28712J94413K09532j24533r4835K2930J4396m0838j7420K22951n0054
$$ -106705 -235417 -41004 168528 43995 -50840 -27910 -13514 -54352 -71772 151179 101125
1592A01125j77339q6880j16608m2120J36817M8692J58976n4726j23318J59514
$$ 101125 -76214 -163094 -279702 -321822 -185005 -136313 22663 -32063 -155381 4133
1582D133J85236k18138q1567J61635M9324q5076J9536n9109O1626Q7647k34444
$$ 4133 189369 -28769 -110336 51299 100623 15547 35083 -24026 37600 125247 -109197
1571a09197Q7618r6510N2710o3402K0054P1401n3451M3001k5898n6495R54m2329
$$ -109197 -21579 -118089 -65379 -128781 -108727 -37326 -90777 -47776 -73674 -130169 -129215 -171544
1559a71544L04744r2135k02500r7444J85990L12162j84606k66344R6461J81531
$$ -171544 133200 41065 -161435 -258879 -72889 239273 54667 -211677 -115216 66315
1549F6315k23878n3492J83033j09527j72136N7076J15040N2245J27856r5509o1423
$$ 66315 -157563 -211055 -28022 -137549 -309685 -252609 -137569 -85324 42532 -52977 -114400
1538a14400J16707k6218p9090j8526o6282J75236j80634m9772j3677J76567K87699
$$ -114400 2307 -23911 -103001 -121527 -187809 -12573 -193207 -242979 -256656 -80089 207610
1527B07610p6401q1865J9355l0255k82088j07827J80439J6721J1715J25128K277
$$ 207610 131209 49344 68699 38444 -243644 -351471 -171032 -154311 -142596 -17468 -15191
1516a5191q3283o7185K22831l987j86818j53704K28809J19055j38925J33857J5898
$$ -15191 -98474 -165659 57172 53185 -133633 -287337 -58528 60527 -78398 55459 71357
1505G1357j30951Q500j08377n0956J1323N70J74813M409P0619p1873J26709L119
$$ 71357 -59594 -51094 -159471 -210427 -199104 -198534 -23721 -19312 51307 -20566 106143 109262
1493A09262J3408j44979j70950J58464m1751K8660R670K57548N3204p2785j0464
$$ 109262 122670 -22309 -193259 -34795 -76546 -47886 -38216 219332 272536 199751 189287
1482A89287k4159o9249r1355r2432K2746R7092Q6681J5773j57744R9450j54317
$$ 189287 165128 95879 4524 -87908 -65162 31930 118611 134384 -23360 76090 -78227
1471g8227n666J77615j40934J25610L0929m2591l5003j67802J63205n7899k38389
$$ -78227 -83893 93722 -47212 78398 109327 66736 31733 -136069 27136 -30763 -269152
1460b69152R7572Q1062J23145q9080n811o529O391k8981J54715J03351j3972k1158
$$ -269152 -171580 -90518 32627 -56453 -62264 -68793 -62402 -91383 63332 166683 152711 131553
1448A31553p81r0538j41173J5046J57067J28060k26686L0684K1923j01344J8022
$$ 131553 130772 40234 -100939 -85893 71174 199234 -27452 3232 25155 -76189 -58167
1437e8167L00971q3143k40646K8951l5764K6147J81170M9864R7997j13482p5622
$$ -58167 242804 159661 -80985 -52034 -87798 -61651 119519 169383 267380 153898 78276
1426G8276j59941j29508l3930j7590J60395J02352Q4434k06159J38391j03306
$$ 78276 -81665 -211173 -245103 -262693 -102298 54 84488 -121671 16720 -86586
1416h6586k7373j10865k7714Q0549J91640J24548M3071j69171m4674k14664J59037
$$ -86586 -113959 -224824 -252538 -171989 19651 144199 187270 18099 -26575 -241239 -82202
1405h2202L4592j12404K29737o6646j02117J4175N3789J13064J01117j97689m5619
$$ -82202 -47610 -160014 69723 3077 -99040 -84865 -31076 81988 183105 -14584 -60203
1394f0203J93156j71225o9379L01484k0741j70808k16573k460Q1629J68946j17143
$$ -60203 132953 -38272 -107651 193833 173092 2284 -214289 -216749 -135120 33826 -83317
1383h3317j24478J59882L0995J673o9362j03426J00473l0023j38403J92066m6295
$$ -83317 -207795 -47913 -16918 -15245 -84607 -188033 -87560 -117583 -255986 -63920 -110215
1372a10215j5455J72339j09716j0997J63906P690j58073l500o2827K4998l9667
$$ -110215 -125670 46669 -63047 -74044 89862 97552 -60521 -64021 -126848 -101850 -141517
1361a41517J56049j16744j66639O4004J84648J40414j83357L8994R0260m6602
$$ -141517 14532 -102212 -268851 -204847 -20199 120215 -63142 -24148 66112 19510
1351A9510q406J9205p8632k0232L56593k35121J9951J13595j07219l0605O7281
$$ 19510 11104 30309 -48323 -68555 288038 52917 72868 186463 79244 48639 115920
1340A15920j43152j99623R1139K58248j10748p2359J25279O7427J31914m4047
$$ 115920 -27232 -226855 -135716 122532 11784 -60575 64704 132131 264045 219998
1330B19998n0277n5301N6494m9307o3415j81116j3886O5052J70364P0638q5317
$$ 219998 169721 114420 170914 121607 58192 -122924 -136810 -71758 98606 169244 83927
1319H3927l1240N4141O6467j69672N734P8466j61423K3693M2785K17892R2729
$$ 83927 52687 106828 173295 3623 9357 87823 -73600 -49907 -7122 210770 303499
1308C03499k21806J8831p6128n9357J28569j44193j3241J15742j91384K96416
$$ 303499 81693 100524 24396 -34961 93608 -50585 -63826 51916 -139468 156948
1298A56948J08180k7544j67625L7555M5971p8785o3984k6422J22091q2298K07702
$$ 156948 265128 237584 69959 107514 153485 74700 10716 -15706 106385 24087 231789
1287B31789o9258k3001m7934J49911l0944k68261p0537K25201R181k11501R6098
$$ 231789 162531 139530 91596 241507 210563 -57698 -128235 96966 106147 -105354 -9256
1276i256P715J16984m4381k58167n3687K28282L8098q1323M9821J1307l8056Q9573
$$ -9256 -1541 115443 71062 -187105 -240792 -12510 25588 -55735 -5914 5393 -32663 56910
1264E6910J04939q3501o8175j3237N6863R6443p7734p9491l67667Q8252K08385
$$ 56910 161849 78348 10173 -3064 53799 150242 72508 -6983 -374650 -286398 -78013
1253g8013p4935Q482j5193k5887l8337M2764K52408R0445j54284j30540m5782
$$ -78013 -152948 -144466 -159659 -185546 -223883 -181119 71289 161734 7450 -123090 -168872
1242a68872J48827m3055R1042P026q4616J11849N3518k24625p2221N5052Q2497
$$ -168872 -20045 -63100 27942 34968 -49648 62201 115719 -108906 -181127 -126075 -43578
1231d3578O2335K26028k6058j41398l8440O8160j891j31412m8844o7281L5495
$$ -43578 18757 244785 218727 77329 38889 107049 105158 -26254 -75098 -142379 -106884
1220a06884O0521o2563J70241J18518q3183p6130K0204J44314J91611k43535M1852
$$ -106884 -46363 -108926 61315 179833 96650 20520 40724 185038 376649 133114 174966
1209A74966K5063r527K2196K6772k62673P1295k8747p5538n6463K3426M8479o7488
$$ 174966 200029 190502 212698 239470 -23203 48092 19345 -56193 -112656 -89230 -40751 -108239
1197a08239K32447k7613j33076o5304K30378p6448m7525M0797o647L268j6517
$$ -108239 124208 96595 -36481 -101785 128593 52145 4620 45417 38770 42038 25521
1186B5521K9074j27765p472M2489j77588q3930J1599J0714J57576J69016J7612
$$ 25521 54595 -73170 -80642 -38153 -215741 -299671 -288072 -277358 -119782 49234 66846
1175F6846K4393k39856J16372k5006M6945J9150j45437J14370R4367N4058j2006
$$ 66846 91239 -148617 -32245 -57251 -10306 8844 -136593 -22223 72144 126202 114196
1164A14196l5792O1635m6081J49560q3976j27396l2967j03355M0908J96519J1140
$$ 114196 78404 140039 93958 243518 159542 32146 -821 -104176 -63268 133251 144391
1153A44391m9742l3295j1946k8071J00106N5154P1746l6070m5029p8751j41725
$$ 144391 94649 61354 49408 21337 121443 176597 248343 212273 167244 88493 -53232
1142e3232o4341P5569K29103k52636j01010n6228o3265P4644Q1368j78783K205
$$ -53232 -117573 -42004 187099 -65537 -166547 -222775 -286040 -211396 -130028 -308811 -306606
1131c06606M5399J1410L4983j5491j38860J84715J67217J09636J01288j82117
$$ -306606 -261207 -249797 -214814 -230305 -369165 -184450 -17233 92403 193691 11574
$$ [...]
##END NTUPLES=NMR SPECTRUM
##END=
