##TITLE=1H_EC-3265(II-1)
 CDCl3
 8 sc, 
 9.12.2021
##JCAMPDX= 6.0         $$ Bruker NMR JCAMP-DX V2.0
##DATA TYPE= NMR SPECTRUM
##DATA CLASS= NTUPLES
##ORIGIN= UXNMR, Bruker Analytische Messtechnik GmbH
##OWNER= root
$$ XWIN-NMR		Version 3.5
$$ Thu Dec  9 12:00:20 2021 Russian Standard Time (UT+4h)  she@DPX200
##.OBSERVE FREQUENCY= 200.131346
##.OBSERVE NUCLEUS= ^1H
##.ACQUISITION MODE= SIMULTANEOUS
##.ACQUISITION SCHEME= undefined
##.AVERAGES= 8
##.DIGITISER RES= 18
##SPECTROMETER/DATA SYSTEM= spect
##.PULSE SEQUENCE= zg30
##.SOLVENT NAME= CDCl3
##.SHIFT REFERENCE= (INTERNAL, CDCl3, 0, 15.7182)
##AUDIT TRAIL= $$ (NUMBER, WHEN, WHO, WHERE, WHAT)
$$ ##TITLE= Audit trail, XWIN-NMR		Version 3.5
$$ ##JCAMPDX= 5.01
$$ ##ORIGIN= Bruker BioSpin GmbH
$$ ##OWNER= she
$$ F:/spectra/data/she/nmr/H-F/1/pdata/1/auditp.txt
$$ ##AUDIT TRAIL=  $$ (NUMBER, WHEN, WHO, WHERE, WHAT)
(   1,<2021-12-09 11:58:53.82 +0400>,<she>,<DPX200>,
      <created by zg, POWCHK disabled, PULCHK disabled
       configuration hash MD5:
       00 E9 B6 7A A2 85 ED C7 34 08 36 98 17 FE 4E 26
       data hash MD5: 16K
       1F 94 12 35 D8 AB A4 F4 45 3A D2 3D 20 34 34 24>)
(   2,<2021-12-09 11:58:56.39 +0400>,<she>,<DPX200>,
      <Start of raw data processing
       efp BC_mod = 2 LB = 0.24 FT_mod = 6 PKNL = 1 PHC0 = -15668.91 PHC1 = 11.0008 SI = 16K 
       data hash MD5: 16K
       05 13 67 5F 6D 01 13 70 93 10 69 1E 57 DF DA 21>)
(   3,<2021-12-09 11:59:22.12 +0400>,<she>,<DPX200>,
      <pk PHC0 = 157.5223 PHC1 = 1.6 
       data hash MD5: 16K
       2C 59 BC 7E BA 34 6D DB 29 80 80 92 0D B2 26 E5>)
(   4,<2021-12-09 11:59:25.25 +0400>,<she>,<DPX200>,
      <abs ABSG = 5 
       data hash MD5: 16K
       F2 5F A7 5F 58 DD 9E A7 56 F4 0E 46 3D 64 D6 A2>)
$$ ##END=
$$ 
$$ hash MD5
$$ 20 D0 94 50 EE 4E 65 43 1E 39 AA 22 1C 5C 57 FC
##$RELAX= 
##$RELAX= 
##$RELAX= 
##$RELAX= 
##$RELAX= 
##$RELAX= 
$$ Bruker specific parameters
$$ --------------------------
##$DU= <F:/spectra>
##$EXPNO= 1
##$NAME= <H-F>
##$PROCNO= 1
##$TYPE= <nmr>
##$USER= <she>
##$AMP= (0..31)
100 100 100 100 100 100 100 100 100 100 100 100 100 100 100 100 100 100 
100 100 100 100 100 100 100 100 100 100 100 100 100 100 
##$AQSEQ= 0
##$AQ_mod= 1
##$AUNM= <au_zg>
##$AUTOPOS= <>
##$BF1= 200.13
##$BF2= 200.13
##$BF3= 200.13
##$BF4= 200.13
##$BF5= 200.13
##$BF6= 200.13
##$BF7= 200.13
##$BF8= 200.13
##$BYTORDA= 1
##$CFDGTYP= 0
##$CFRGTYP= 5
##$CHEMSTR= <none>
##$CNST= (0..31)
1 1 145 1 1 1 1 1 1 1 1 1 1 1 1 1 1 1 1 1 1 1 1 1 1 1 1 1 1 1 1 1 
##$CPDPRG= <>
##$CPDPRG1= <>
##$CPDPRG2= <>
##$CPDPRG3= <>
##$CPDPRG4= <mlev>
##$CPDPRG5= <mlev>
##$CPDPRG6= <mlev>
##$CPDPRG7= <mlev>
##$CPDPRG8= <mlev>
##$CPDPRGB= <>
##$CPDPRGT= <>
##$D= (0..31)
0 1.2 0 0 0 0 0 0 0 0.06 0 0.03 0 0 0 0 0.0002 0 0 0 0 0 0 0 0 0 0 0 0 
0 0 0 
##$DATE= 1639036733
##$DBL= (0..7)
120 120 120 120 120 120 120 120 
##$DBP= (0..7)
150 150 150 150 150 150 150 150 
##$DBP07= 0
##$DBPNAM0= <>
##$DBPNAM1= <>
##$DBPNAM2= <>
##$DBPNAM3= <>
##$DBPNAM4= <>
$$ [...]
##$SUBNAM2= <"">
##$SUBNAM3= <"">
##$SUBNAM4= <"">
##$SUBNAM5= <"">
##$SUBNAM6= <"">
##$SUBNAM7= <"">
##$SUBNAM8= <"">
##$SUBNAM9= <"">
##$SW= 18.0517287032376
##$SWIBOX= (0..15)
0 0 2 0 0 0 0 0 0 0 0 0 0 0 0 0 
##$SW_h= 3612.71676300578
##$TD= 16384
##$TD0= 1
##$TE= 0
##$TE2= 300
##$TE3= 300
##$TEG= 300
##$TL= (0..7)
0 120 120 120 120 120 120 120 
##$TP= (0..7)
150 150 150 150 150 150 150 150 
##$TP07= 0
##$TPNAME0= <>
##$TPNAME1= <>
##$TPNAME2= <>
##$TPNAME3= <>
##$TPNAME4= <>
##$TPNAME5= <>
##$TPNAME6= <>
##$TPNAME7= <>
##$TPOAL= (0..7)
0.5 0.5 0.5 0.5 0.5 0.5 0.5 0.5 
##$TPOFFS= (0..7)
0 0 0 0 0 0 0 0 
##$TUNHIN= 0
##$TUNHOUT= 0
##$TUNXOUT= 0
##$USERA1= <user>
##$USERA2= <user>
##$USERA3= <user>
##$USERA4= <user>
##$USERA5= <user>
##$V9= 5
##$VALIST= <valist>
##$VCLIST= <CCCCCCCCCCCCCCC>
##$VD= 0
##$VDLIST= <DDDDDDDDDDDDDDD>
##$VPLIST= <PPPPPPPPPPPPPPP>
##$VTLIST= <TTTTTTTTTTTTTTT>
##$WBST= 1024
##$WBSW= 4
##$XGAIN= (0..3)
0 0 0 0 
##$XL= 0
##$YL= 0
##$YMAX_a= 160370
##$YMIN_a= -266938
##$ZGOPTNS= <>
##$ZL1= 120
##$ZL2= 120
##$ZL3= 120
##$ZL4= 120
##$ABSF1= 15.63451
##$ABSF2= -2.417337
##$ABSG= 5
##$ABSL= 3
##$ALPHA= 0
##$AQORDER= 0
##$ASSFAC= 0
##$ASSFACI= 0
##$ASSFACX= 0
##$ASSWID= 0
##$AUNMP= <proc_1d>
##$AZFE= 0.1
##$AZFW= 0.1
##$BCFW= 0
##$BC_mod= 2
##$BYTORDP= 0
##$COROFFS= 0
##$CY= -3
##$DATMOD= 1
##$DC= 0
##$DFILT= <>
##$DTYPP= 0
##$F1P= 0
##$F2P= 0
##$FCOR= 1
##$FTSIZE= 16384
##$FT_mod= 6
##$GAMMA= 0
##$GB= 0
##$INTBC= 1
##$INTSCL= 0
##$ISEN= 128
##$LB= 0.24
##$LEV0= 0
##$LPBIN= 0
##$MAXI= 10000
##$MC2= 0
##$MEAN= 0
##$ME_mod= 0
##$MI= 1.114404
##$NCOEF= 0
##$NC_proc= -7
##$NLEV= 6
##$NOISF1= 3.799351
##$NOISF2= 2.8
##$NSP= 0
##$NTH_PI= 0
##$NZP= 0
##$OFFSET= 15.71824
##$PC= 1
##$PHC0= -15511.39
##$PHC1= 12.6008
##$PH_mod= 1
##$PKNL= yes
##$PPARMOD= 0
##$PSCAL= 0
##$PSIGN= 0
##$REVERSE= no
##$SF= 200.130006667004
##$SI= 16384
##$SIGF1= 3
##$SIGF2= 2
##$SINO= 5.538805
##$SIOLD= 16384
##$SREGLST= <1H.CDCl3>
##$SSB= 0
##$STSI= 16384
##$STSR= 0
##$SW_p= 3612.71676300578
##$SYMM= 0
##$S_DEV= 0
##$TDeff= 16384
##$TDoff= 0
##$TI= <>
##$TILT= no
##$TM1= 0
##$TM2= 0
##$TOPLEV= 0
##$USERP1= <user>
##$USERP2= <user>
##$USERP3= <user>
##$USERP4= <user>
##$USERP5= <user>
##$WDW= 1
##$XDIM= 16384
##$YMAX_p= 377973354
##$YMIN_p= -485516
$$ End of Bruker specific parameters
$$ ---------------------------------
##NTUPLES= NMR SPECTRUM
##VAR_NAME=  FREQUENCY,     SPECTRUM/REAL,   SPECTRUM/IMAG
##SYMBOL=    X,             R,               I
##VAR_TYPE=  INDEPENDENT,   DEPENDENT,       DEPENDENT
##VAR_FORM=  AFFN,          ASDF,            ASDF
##VAR_DIM=   16384,         16384,           16384
##UNITS=     HZ,            ARBITRARY UNITS, ARBITRARY UNITS
##FACTOR=    0.220516191357247, 1,           1
##FIRST=     3145.69143281366, 0,            0
##LAST=      -467.025330192117, 0,           0
##MIN=       -467.025330192117, -485516,     0
##MAX=       3145.69143281366, 377973354,    0
$$ Real data points
##PAGE= N=1
##DATA TABLE= (X++(R..R)), XYDATA
$$ [...]
10082 205649 75684 130156 139990 253634 -37294 -50724 -57289 -198089 -147412 -195321 -279053
10071 -279053 -166977 -265217 -344815 -122040 -122138 7707 54943 60634 -49018 -1569 -99504
10060 -99504 -61482 98683 160963 211057 109345 20942 -60630 -26635 58675 50603 84529
10049 84529 87491 1709 -189656 -230089 -109322 -84590 57393 130844 65591 58831 168692
10038 168692 122232 230748 179558 135624 -44923 36849 81819 252546 206135 51757 103012
10027 103012 -98049 -232095 -2906 61208 -24021 -75712 -29623 -58772 -69844 77961 -65902
10016 -65902 -106419 -68550 -98669 -205367 -241029 -181167 -89977 -21075 245842 325435 216356
10005 216356 13513 1443 -141968 -216339 -211839 -110178 -193531 -48013 63151 21903 -42004
9994 -42004 -21094 4434 -30690 115314 -100410 -171490 -3842 -87342 26086 42991 -71135
9983 -71135 5001 -63370 91164 332182 322578 148850 -46325 -46722 89497 54773 -159257
9972 -159257 -158457 -270358 -179670 270891 201407 36972 -31312 160414 100668 29829 252046
9961 252046 133906 -162341 -86477 17233 -7313 -35622 -122898 -72051 -82863 94306 120136
9950 120136 131835 201350 224242 209596 185427 22833 160701 249504 31351 -123291 -135831
9939 -135831 6801 92024 125589 -66227 -170320 34819 48025 -85308 190912 134141
9929 134141 -71337 99564 281864 197829 92844 133597 42609 -27262 12560 285210 234809
9918 234809 102291 175126 114589 197916 265414 -47560 189694 190123 217667 139580 103500
9907 103500 159952 120027 105162 105168 130592 82609 -41119 -65521 167121 311847 344134 283157
9895 283157 205886 121231 137948 14363 82929 129485 137470 37291 106605 33902 104017
9884 104017 247976 25225 -135874 19886 169469 241324 24693 120493 59983 -56286
9874 -56286 160132 223385 157634 208531 190173 203996 299345 301541 280449 237405 437825 463110
9862 463110 217389 218426 44291 202665 200009 232783 286998 254019 152482 134803 277856
9851 277856 265508 51795 -166220 -54458 242388 294900 301267 247770 250983 62462 178450
9840 178450 370454 272993 284696 227900 55749 123772 261455 256076 63421 -5268 212241
9829 212241 150557 195094 77914 224983 153888 136142 340954 182037 23469 135660
9819 135660 -49550 159479 130565 -7347 -40272 -43856 -121773 40772 165066 35423 61726
9808 61726 110866 130982 148886 34729 -11505 12145 148978 6878 -190663 -195808 62442
9797 62442 238763 80335 -15046 -32876 98553 90653 78297 107734 78433 82008 126187 150564
9785 150564 100725 5266 -27160 22596 11185 -101010 -30305 40860 152650 159693 28507
9774 28507 95081 16001 58350 100256 -51227 -34352 -139165 29887 -67552 -146578 -131203
9763 -131203 -137423 206331 293526 64688 286077 210272 25087 98060 142015 258295 167551
9752 167551 145955 119549 -42077 -71924 -21820 36435 163402 184798 14995 -50755 197141
9741 197141 52471 -113522 -94020 -54196 136975 276975 221710 269166 146223 47991 43247
9730 43247 18227 51966 64973 114839 65433 60636 18722 -163687 -51509 274818 86380
9719 86380 -41808 233512 140634 84769 171131 164798 107542 107382 97532 109326 5925 -19547
9707 -19547 224785 339333 263281 155137 245901 298052 13766 49819 94883 -122204 72360
9696 72360 38085 -42365 -165920 41447 199467 57496 135496 351686 230560 134050 66042
9685 66042 127691 147280 116159 102553 159389 239051 135025 34015 16267 85882 148934
9674 148934 103377 213357 300695 223746 78159 237168 381603 191457 79117 -1943
9664 -1943 -15833 -94458 68953 71381 149085 150642 363863 529588 313246 353855 247461
9653 247461 295957 204944 175095 379554 184936 258189 101676 128466 231195 106537 23146
9642 23146 154525 168323 88398 198325 6577 -85857 62731 260758 201209 208238 145843
9631 145843 192557 392470 111182 70965 152454 193953 284471 203902 197975 109911 208494
9620 208494 276675 288817 131367 266145 164998 -16607 6936 156166 64604 40027 18340
9609 18340 23160 198716 5888 79718 270920 -139385 -248990 115010 119693 74991 -54456
9598 -54456 199852 41822 35972 60363 -25197 73157 233124 352945 375004 443497 402743
9587 402743 104104 292484 367050 413826 333424 353164 229971 154010 246367 19666 33183
9576 33183 67391 276360 289504 229506 257908 195326 240938 305558 216820 283102 290339 117687
9564 117687 280611 418940 417456 326682 246591 207545 212948 298572 154127 259395 471650
9553 471650 379952 268422 270325 177760 332762 291032 200187 280807 479384 289286 254232
9542 254232 110988 128750 269101 123655 202496 251262 329676 350929 373446 325209 414350
9531 414350 411359 286537 290372 167628 212434 289872 325980 342905 287918 339944 117514
9520 117514 249049 441345 315261 142099 11211 -8244 131295 214423 131370 260191
9510 260191 202385 286939 372837 386116 298423 425371 380767 327012 271304 372089 329387
9499 329387 260900 313239 328924 283492 258280 308631 333096 310114 84329 -17615 247467
9488 247467 421168 393239 190023 304019 506080 584046 303451 256000 392009 272309
9478 272309 452325 285589 454951 655841 589516 474737 507171 557923 744231 728256
9468 728256 720569 681503 520938 422255 576118 654417 756246 773004 727914 760112 827647
9457 827647 784366 852810 567320 511536 471689 479083 628693 805953 941289 927045 863826
9446 863826 770834 793827 837374 813077 756787 589339 737537 744888 845649 848554 669597
9435 669597 660081 736433 767539 706378 742454 796204 802444 796516 834748 838594 877033 969392
9423 969392 832903 953310 1103492 979752 1023923 843049 974942 838203 954727 1116406
9413 1116406 1049390 985584 977713 962504 1156219 1173995 1195054 1197169 1223272 1155629 1238425 1057907
9401 1057907 904117 1020766 1174184 1117257 1075232 1060637 995961 1091044 942515 835084
9391 835084 1085026 1263839 1097435 1158049 1155191 1210136 1413654 1387976 1312390 1165302 1114829
9380 1114829 1262134 1419910 1389839 1438849 1619796 1591431 1578485 1759577 2133124 2170993
9370 2170993 2008527 1918420 1854399 1931314 1924504 2081660 2245477 2016132 2079518 2314612 2360226
9359 2360226 2475254 2571522 2652891 2812324 2671410 2865777 3060230 3082565 3193004 3472799
9349 3472799 3580082 3750016 4099131 4191613 4341407 4328844 4498440 4707838 4884079 5054505
9339 5054505 5069457 5207298 5344387 5340696 5472220 5270445 5169683 5348842 5480454 5576607
9329 5576607 5865795 6338684 6487031 6775693 6820198 6804529 7155012 7366964 7451093 7589517
9319 7589517 7593457 7636560 7723414 7538495 7730554 7849628 8070836 8358197 8742756 8908992
9309 8908992 9389108 9957727 10414805 11032795 11561669 12580725 13251856 13730516 14243296
9300 14243296 15166540 16234148 16903827 16871567 16677226 16742007 17121759 17784955 17905200 17790844
9290 17790844 17105234 15992993 14849387 14201858 13538193 13148139 12726924 12378281 12142057
9281 12142057 11608313 10991595 10550680 10148186 9779314 9664989 9581870 9780116 9821254 9958832
9271 9958832 10277903 10753839 11357047 11782115 12482308 13218642 13976386 14716494 15169232 15679833
9261 15679833 15947071 16481929 17021377 17822099 17819502 17702123 17432291 17000999 16507447 15522641
9251 15522641 13978219 12679231 11766440 10755546 9952683 9687739 9639699 9330637 9236361
9242 9236361 9323037 9224797 9193236 9163049 8994483 8699200 8697816 8619432 8642595 8565351 8306010
9231 8306010 7979821 7340698 7003618 6739648 6570123 6380661 6216326 6262180 5989522 5878602
9221 5878602 5830182 5957311 5931178 5614264 5734535 5841389 5900385 5994586 6065055 6185071
9211 6185071 6426578 6820482 7076393 7276042 7323641 7349017 7358780 7678596 7831838 7951076
9201 7951076 8028011 8113335 8236878 8044081 7847628 7716181 7770200 7368408 7131125 6651005
9191 6651005 6168438 6010808 5786097 5683685 5630957 5442094 5490915 5349930 5275912 5227635
9181 5227635 5260050 5054403 4978382 5023122 5193210 5190719 5257313 5266350 5120865 4956304 5169104
9170 5169104 5308066 5193591 5191707 5145070 5036703 5036147 5097765 5233212 5019541 5132551 5374289
9159 5374289 5164716 4959353 5082966 5432082 5474045 5299540 5442851 5503538 5608629 5770895
9149 5770895 5915221 6125183 6111156 6211469 6288112 6585504 6785914 6815966 7061723 7135891
9139 7135891 7187986 7215817 7303553 7555051 7739681 7892128 8149228 8479236 8686148 8799443
9129 8799443 9062510 9693069 9677924 9816323 10288113 10790528 11239520 11646478 12284061 12741629
9119 12741629 13349305 14080324 14741636 15214702 15630097 16328534 16898380 17701855 18551762
9110 18551762 19294268 19959174 20665551 21592160 22412501 23461626 24738278 26149886 27967087
9101 27967087 30163745 32308956 34590031 37501809 41036598 44528702 47782605 51302848
9093 51302848 55863208 60720742 64989317 67563224 67762661 68301494 70316312 73387821
9085 73387821 76674850 77376343 74218045 69843343 63887208 58470772 54541533 51578434
9077 51578434 49939150 48934559 48310388 47273360 45829800 44600630 43671861 43120743 42975338
9068 42975338 43407475 44430846 45666292 47463881 49951619 53005505 56647178 61034462
9060 61034462 65388081 69548808 73566211 77857995 81209432 83442470 85709410 89297094
9052 89297094 93959759 97850924 98348996 96933767 95834025 93318362 89178365 82662985
9044 82662985 72812352 63214390 55713467 49460809 44854508 41459451 38933266 36980176
9036 36980176 35672773 34387675 33117033 31374894 29732509 28483128 27162326 26266459
9028 26266459 25693513 24989119 24607511 24255269 23884577 23547579 23362431 23160094 22847393
9019 22847393 22500078 22685442 22686033 22881062 22979861 22896654 23086734 23111550 22819932 22468607
9009 22468607 21743119 20985913 20706524 20598139 20392462 20349557 20408176 20256000 19855171 19050038
8999 19050038 18681035 17920906 17346892 16989996 16907263 16629608 16478376 16526016 16725223 16983742
8989 16983742 17116923 17287982 17480491 17836632 18268274 18766879 19522530 20510888 21623373
8980 21623373 22369766 23183015 23882370 24554760 25501184 26175391 26741978 27311860 27358281 27404695
8970 27404695 27806214 28293271 28701521 28768354 28921340 29024532 28511755 27459954 26224278
8961 26224278 25195584 24514049 24049813 23895611 23547138 23134957 22985871 22896666 22927963 22625066
8951 22625066 22149222 21668925 20905535 20250272 19710289 19136401 19147165 19137437 19166302 19398244
8941 19398244 19688280 19936554 20093428 20119862 20409036 20753273 21172376 21752320 22084582 22614649
8931 22614649 23238206 23803108 24502547 25501862 26542560 27864376 28989247 29872280 30697081
8922 30697081 31329552 31923667 31547625 30611954 29283688 28128003 26895153 25889877 25510777
8913 25510777 25146925 24836817 24356615 23877002 23873070 23868134 23831148 23900290 24047178 24530039
8903 24530039 24945401 25296493 25744434 26068404 26566467 27393076 28391151 29665402 30565706
8894 30565706 31609736 32568404 33725712 34724831 35848230 37595040 39437644 41231044
8886 41231044 42940354 44681536 46548815 48377058 50751740 53446418 56060777 58596133
8878 58596133 61484977 64634633 67743320 70498152 72089391 73037602 73984479 73956188 72363533
8869 72363533 69333920 65836243 62514340 59776283 57911578 57430704 57303972 56886857 56000944
8860 56000944 55024276 54668018 54383637 54839649 55862643 57682732 60042128 62565823 65198130
8851 65198130 68450110 71938336 75636275 79219708 83032170 87887465 93237448 98890543
8843 98890543 104643215 110117351 115456910 119086707 121068863 121284788 118127060 112496035
8835 112496035 104936140 97520426 91649871 87391875 83908338 79533645 74032284 69144884
8827 69144884 65083715 61533217 58458045 55857493 54016184 52678367 51685592 51026533
8819 51026533 51079405 51183262 51550332 52617341 54002604 55520659 57343799 59188714 61110492
8810 61110492 63672196 66046364 67457001 68272892 69778038 71260272 72770303 73797717
8802 73797717 73593804 72275814 68572791 63751345 57853952 51813967 47035425 43159463
8794 43159463 39968029 37501415 35730743 34266884 32771527 30949683 29294685 27648576
8786 27648576 26305451 25074928 23956371 23216951 22307271 21512388 20939743 20468689 20013969
8777 20013969 19230684 18787546 18098236 17714754 17188145 16932231 16572580 16287684 16006545
8768 16006545 15771588 15653964 15426227 15218886 14933146 14743849 14676701 14465045 14411227 14516720
8758 14516720 14314594 14211661 14266893 14336571 14306984 14331623 14382588 14502754 14415403 14603384
8748 14603384 14980604 15158402 15515980 15687960 15900343 16223330 16477535 16953422 17332636
8739 17332636 17883028 18067045 18400347 18704558 19109757 19725733 20720069 21454773 22375987
8730 22375987 23616419 25030553 26644616 28865791 31109312 33991010 37331070 41197447
8722 41197447 45550870 51015119 56713018 63253727 69754679 76886545 84188515 90124368
8714 90124368 86700965 78939732 72332192 64257225 58317638 53690671 50672907 47881925
8706 47881925 44721639 41614452 39459319 37345283 36024667 34989014 34353658 33644627
8698 33644627 33302551 33364612 33935023 34461752 34516747 34707883 35514141 36835099 38463261
8689 38463261 39830699 40768717 41321244 42422955 44005508 46274588 49139909 52386008
8681 52386008 54849482 55785952 55167983 52619414 48911441 44638391 41384061 38684498
8673 38684498 36864254 35700787 35030130 34356710 33073685 31485637 30173548 29392901 28683783
8664 28683783 27908693 27330246 27104952 26598881 25795132 24892176 24018827 23608134 23431131
8655 23431131 23477921 23900648 24532264 25085331 25085086 24886097 25069729 25386803 25788601 25614281
8645 25614281 24406527 23297493 22348099 21759204 21029992 20203193 18702913 17695114 16626698
8636 16626698 15917142 15316528 14902222 14336872 13636249 13235669 12856149 12515814 11949528
8627 11949528 11342069 10802630 10316156 9778128 9384537 8930573 8317972 7932005 7511695
8618 7511695 7275418 7211580 7039918 6722561 6492113 6446469 6242301 6081749 5939271 6008500
8608 6008500 5909435 5570533 5395757 5272028 4998958 4898681 4851940 4765927 4652575 4534494
8598 4534494 4238709 4261757 4252889 4167747 3929029 3983210 3887016 3668189 3523698 3260009 3185201
8587 3185201 3220976 2862897 2507336 2621404 2781576 2685138 2768350 2863534 2716050 2545480
8577 2545480 2510942 2340759 2377567 2399902 2317502 2118639 2118268 1984419 2001193 2093033 2021615
8566 2021615 1872981 1923413 2048157 2043614 2015894 1796534 1761442 1754752 1828019 1790498 1805615
8555 1805615 1727615 1688606 1645480 1683624 1618068 1639186 1378061 1129319 1298055 1370515 1386119
8544 1386119 1328723 1292029 1246604 1164292 1196645 1211921 1126094 1230427 1137696 971293 1258133
8533 1258133 1162903 900835 1020024 1147152 1017690 876516 1146822 1120544 1278240 1176212
8523 1176212 1050418 1093753 909805 962532 1179915 1299443 1118477 950614 1053470 1243816
8513 1243816 1063034 1075065 1151323 1255356 1496799 1445034 1200328 1110295 1045948 1133676 1151693
8502 1151693 1083777 1168322 1184838 1011408 1063435 1149289 1010267 1026161 968553 894787 809221
8491 809221 665356 572004 713907 972122 1189115 1168816 1066647 761351 876383 990468
8481 990468 1087501 1103131 750732 745117 781721 796488 851684 864541 1043551 1019590 1075427
8470 1075427 999664 983656 821267 921486 1065979 1196065 1152608 997116 894115 783608
8460 783608 740609 623537 737694 633207 729108 713128 644979 487812 470216 485932 563334
8449 563334 588972 564093 424988 693307 709164 374753 204674 389982 443535 325368
8439 325368 533659 595074 651556 593049 557499 620608 557442 592656 571374 692979 667789
8428 667789 501977 750045 581770 315764 363979 365956 276732 256383 611047 525770 323346
8417 323346 222339 234808 397561 314005 231015 290191 310776 318402 318330 314167 204311 234459
8405 234459 245272 224468 9442 55095 88382 95033 358794 400355 437140 361215 322302
8394 322302 287990 89386 166457 176370 209552 217086 174498 241961 168676 233341 234868 185523
8382 185523 184461 170067 163688 218951 200513 427922 489109 327447 279307 190049 316658
8371 316658 228355 99868 97758 290753 359228 398036 336994 318404 409792 442302 550869
8360 550869 248801 212599 399547 450949 643897 448457 331543 240302 277557 437112
8350 437112 419597 385454 251486 488264 384082 380340 270715 284427 129989 46041 3257
8339 3257 -49000 -75674 27754 171051 8939 76693 18871 149322 189481 -62566 64795
8328 64795 32716 70944 274246 187921 262062 234966 191261 145193 66692 220074 228163 229604
8316 229604 128314 244266 334857 342296 211519 243139 319753 520364 304850 118791 280418
8305 280418 157257 103809 169107 335720 315082 338193 231522 -52251 -3042 196707 189373
8294 189373 -48696 -131651 -68494 132467 117342 110511 282284 208426 6549 -38841 -124671
8283 -124671 -61877 55916 147898 175416 72311 217319 63005 242823 297625 293382 201368
8272 201368 212415 318419 355679 98271 -79657 -62828 117215 246686 20715 33747
8262 33747 100701 53659 149420 83140 65613 -136169 -164109 -85555 -118567 46900 -27001
8251 -27001 -60736 134827 275232 282796 250405 319065 349821 286791 58897 -17352 73340
8240 73340 220917 405262 318122 351662 310698 130539 12685 -152867 -39950 -23877 10166
8229 10166 196726 262030 306805 -101332 -10799 189861 182037 22290 -53477 22296 26741
8218 26741 5942 -1844 -129200 3765 -113415 -107156 -131841 -116627 35698 9905 -205313
8207 -205313 -307402 -196651 1533 -284155 -45662 -237638 -178805 -225418 -198896 -165087
8197 -165087 130268 65079 187968 -44548 959462 3021904 616249 426220 245684
8188 245684 96105 22451 -40695 45431 39746 -43320 50032 89255 -127562 -317735 -195089
8177 -195089 -291671 -277693 -109106 -147123 -44050 -84866 -20247 -11716 204666 36809 222826
8166 222826 203043 76643 123438 69101 -124775 8590 -56195 -69428 -133157 -132744 -82671
8155 -82671 -94524 -215221 -245868 -268679 -65717 -76500 -41749 -136513 15831 -128408 -223531
8144 -223531 93922 -15149 -153667 8202 55351 -57519 -19172 12333 -257473 -365176
8134 -365176 -234668 -115428 -130431 -18416 -85814 -47909 -19669 -253645 -365185 -152848
8124 -152848 -7341 -96342 -99463 -88002 -27889 -79374 -254999 -278159 -182360 -222499 -175330
8113 -175330 -140137 -140324 -231674 -199577 -272689 -103481 -46367 -51071 -224864 7527 47762 -30925
8101 -30925 -193661 -140310 6090 -21082 -8668 -35274 91787 -77233 -273510 -123661 -115934
8090 -115934 -157314 -101963 -97318 92116 -10926 141953 152236 129198 80637 121597 78146
8079 78146 -77850 -20082 -121621 -35958 -126072 -366691 -367897 -372362 -238720 -323591 -243607
8068 -243607 5217 -3952 -189962 -135083 -50917 34240 -127602 -227147 -145764 -220519 -253781
8057 -253781 -90237 -32530 -109527 -65614 -230560 -314291 -191986 -276530 -237637 -203904 -181092
8046 -181092 -103685 39502 -151091 -92833 40479 199837 14098 -246155 -79162 -16795
8036 -16795 92321 20792 -87336 -123066 8805 -4353 -94035 -197702 -275708 -221938 -85000
8025 -85000 -139014 131749 215564 201538 144902 30649 2638 -116914 -13060 -72011 -218670
8014 -218670 -129395 -68191 -110524 -103860 -93130 -37505 77202 94241 -40001 104574 42405
8003 42405 160463 72694 -167976 -67860 -25473 23283 -44405 -33590 23428 7204 -252739
7992 -252739 -16324 67583 178758 169847 236397 241686 57438 119727 -12309 -125145 -229544
7981 -229544 -16124 35167 -16314 -173320 -257466 -223093 -56171 -101976 43481 223334 214886
7970 214886 297800 -195950 -71344 50838 -36095 -170045 -88597 -190765 -24393 -126436
7960 -126436 -92401 -21465 -23843 -71550 -162515 -81788 -248360 -140576 10516 -113968 -108468
7949 -108468 -236147 -260031 -5580 129254 44927 160616 117041 -110691 -116273 -177656 -180823
7938 -180823 -226146 -15556 -86655 -113129 -120396 -82254 -74688 -38319 1427 -150472 -134267 -92424
7926 -92424 -76234 -93461 90504 -72629 -198656 -116277 -290088 -322660 -392429 -278649 -156952
7915 -156952 -113475 -24488 -56987 -102607 49735 -66350 -251890 -231613 -150668 -61115 40373
7904 40373 -70016 -235751 -238046 -226302 -121142 -106520 -232000 -107105 -16948 11550 14314
7893 14314 248677 144999 -188783 -182936 137378 110747 15490 -6685 119374 42558 -48433
7882 -48433 -233880 -336438 -248410 -28901 -68497 -178399 -180139 -151390 -12401 -88282 -34469
7871 -34469 -148104 -216346 -159018 -184638 -187741 -142075 9028 165152 -7566 58519 -35100
7860 -35100 -102102 24221 25283 -86913 -297560 -203869 -178558 -84559 38380 14442 -94569
7849 -94569 -108270 -118373 -210835 -374532 -308815 76942 -95490 -320364 -224175 -322348 -144587
7838 -144587 -129465 -125931 -121722 -93562 -140283 -293091 -136755 -198834 54838 -44699 -289671
7827 -289671 -234522 -404721 -288906 -251957 -192449 -214031 -161805 -96697 -216902 -275791 -201243
7816 -201243 -224923 -152082 19088 146960 86042 93171 -22825 -30501 -47007 -88022 89138
7805 89138 -64768 -221902 -312857 -336825 -155167 -355334 -69649 404145 -383 128763
7795 128763 -59042 -27462 -107799 -118337 -15173 78328 -147426 -151902 -29038 91144 -116223
7784 -116223 -142246 -49267 -98802 -99214 -161754 -111748 -118591 -175499 98892 205978 -81445 -184544
7772 -184544 -188729 -304670 -485516 -298383 -14164 26588 -200075 -230726 -260243 -13359 81232
7761 81232 -160441 -236702 -154448 -186399 -208287 -30862 -57585 39273 27379 -146985 -167392
7750 -167392 67618 29822 -46620 -189801 -39512 -33700 -76017 -110013 3750 97883 -110805
7739 -110805 -27719 185605 153001 -40864 -108181 -65629 -53835 -57605 -20325 -203644 -105309
7728 -105309 -115007 53985 9656 -2464 33254 39661 -55829 -54105 -131921 -130672 -87566 -7920
7716 -7920 30023 55798 148133 265529 208868 80904 -61614 -317801 -247817 -53439 118575
7705 118575 75676 71912 17339 -159621 -112236 -187421 -90295 -47608 -55622 -228082 -191713 -48358
7693 -48358 -147307 -258582 -201948 -133130 -147368 -291050 -178556 -190490 -224855 -150385 23025
7682 23025 -103821 -110958 -131931 -26279 61127 22806 -99198 -58789 203356 73658 85406
7671 85406 183218 188993 294679 232886 -40138 95968 25689 18797 -34677 -125310 22358
7660 22358 174977 5173 171786 183166 115701 62244 62210 161323 182499 65121 156721 107290
7648 107290 109930 6213 -3584 -118010 -149795 -14593 -176912 -68808 -185863 7252 131957
7637 131957 -97610 83318 234142 -8199 -173555 -128768 -12568 -81575 -212400 48506
7627 48506 229387 183224 57208 -114351 147232 34410 66790 41136 14735 -39308 -180173
7616 -180173 -85030 -176649 -308732 -349920 -206197 -162194 -87338 44915 43947 92812 45443
7605 45443 18661 -36760 -204525 -48773 -95821 -151420 -226835 -167105 -179374 -50943 52578
7594 52578 -42386 4193 -25201 -134833 -85964 -57984 -204074 -71661 38196 -96051 -76786
7583 -76786 -104168 21571 200179 93914 -158115 -265716 -139384 -177887 -84756 61459
7573 61459 81491 37872 19872 28231 -277304 -215732 -19662 44468 -44064 -94303 -105198 -84671
7561 -84671 -130927 -32210 74149 -137637 -142455 -85883 -145391 -32545 56859 -91276 -241221
7550 -241221 -125728 54849 23396 43211 7070 181899 58263 -137551 -56928 -41483 -85997
7539 -85997 -7785 9730 62160 -41915 -73451 -37325 184760 283360 150052 75526 40744
7528 40744 226178 26068 161601 51889 -193053 -92878 -174894 -24695 45639 -34456
7518 -34456 -95548 -101886 -103509 -39301 11633 52920 24151 105826 258806 315259 353072 354152
7506 354152 448124 491878 283846 389775 451139 472716 717626 691665 490925 293651 311817
7495 311817 487132 487968 461048 330790 77488 55586 282595 351893 126115 103527 159423
7484 159423 237545 53961 -6713 52420 64488 214518 31062 -61434 34815 159917 1390
7473 1390 17654 181370 78702 -156765 -346401 -201628 -33042 -67867 -85298 -4873 168039
7462 168039 216029 163224 245544 219202 157077 146994 420964 400824 193353 104663 11595
7451 11595 -60969 -53638 -161484 -107328 4434 -71546 7144 119193 163653 275846 236082
7440 236082 121604 2584 -85569 39761 34971 -17387 102472 245610 25063 54098 78563
7429 78563 18504 153366 248308 129910 -9331 -47925 86779 -13678 -107598 -119426 -60401
7418 -60401 33867 -49730 108863 272718 188215 226294 116769 -53868 81460 27563 -21145
7407 -21145 -303379 -350601 -237736 -13743 23192 -64705 -39976 120292 -113113 -366980 -222723
7396 -222723 -288204 -200506 -204237 -53408 -57493 82266 173625 229873 343883 149826 35775
7385 35775 -136988 -146438 -81615 -161839 3340 82928 83110 187304 86608 148005 143055 55188
7373 55188 233679 187548 165168 41758 75037 160512 69861 23241 12339 -97172 -95566
7362 -95566 41821 -90923 -49961 6202 -62438 -72039 -88557 -240630 -143565 20614 -50123
7351 -50123 75870 365091 286618 276859 67279 -102968 73368 -113358 -182773 1662 -40094
7340 -40094 -21675 -206255 -60391 -15484 65207 122260 162922 116862 62410 152420 29931
7329 29931 148682 269040 286732 198632 78075 331383 315415 255682 158694 -141621 -22402
7318 -22402 -114197 -159537 -16099 9622 -108846 -29958 37743 171216 12426 21755 87954
7307 87954 40358 184314 184505 170867 166927 133138 160364 134184 150713 36804 97026 205720
7295 205720 32868 179610 339627 208199 49138 63411 136669 169776 -946 130330
7285 130330 28266 23304 99430 -7727 237055 198072 269574 279305 276146 260107 142831
7274 142831 236600 488787 386566 233442 383063 540867 535414 445318 402366 394865 164474
7263 164474 249491 211869 452757 541233 338285 364953 250102 371356 400063 544371 519776
7252 519776 603780 401871 264376 226574 451050 438185 349445 537720 653531 466282
7242 466282 375230 721781 608813 544929 488393 648982 408607 561118 538633 230491
7232 230491 344788 254098 374746 646154 540983 457129 557751 508626 525680 579405 684261
7221 684261 826999 804883 710366 742699 686273 688410 618050 793513 722598 658302 814630
7210 814630 1020255 897088 910478 909727 966495 797780 825699 950690 997375 1122088 1041370
7199 1041370 1061255 1115124 1135118 1120976 1289323 1154968 1237938 1525740 1559595 1354505 1383907
7188 1383907 1445221 1468285 1479222 1575361 1739913 1771371 1745352 1808924 1702020 1920371 1852029
7177 1852029 1840500 2038486 2009532 2103809 2239013 2281695 2460704 2459652 2648275 2644499 2683632
7166 2683632 2828942 2900853 3074801 3206338 3277429 3140165 3152106 3137789 3312598 3467442
7156 3467442 3575208 3561315 3354140 3624659 3565699 3633673 3924458 4124430 4330941 4510852
7146 4510852 4704217 4764231 4874376 4896241 5115282 5287616 5575535 5915932 6143547 6396128
7136 6396128 6706071 6721920 6802519 7151787 7826212 8147762 8366014 8781562 9204778 9726587
7126 9726587 10395812 10949927 11563023 12145653 12902556 13862240 15105126 16204575 17514088
7117 17514088 19138435 21243596 23381025 26005751 29368221 32945469 37306233 42420765
7109 42420765 48351147 55196838 63095384 72436685 83197540 94200501 103524742 107891127
7101 107891127 105333816 97013888 84360866 71709171 60572031 51380917 44319608 39005215
7093 39005215 34955543 31388766 28376821 25716677 23467884 21220949 19331043 18003542
7085 18003542 16516321 15175040 14252337 13532398 12858956 12048603 11466931 10907761 10386404
7076 10386404 9952154 9715781 9305455 9030545 8657077 8469364 8229001 7918724 7652008
7067 7652008 7532835 7319935 7095081 6530471 6230901 6054377 5759687 5406056 5167880 5076621
7057 5076621 5227059 5153250 4962891 4890761 4817827 4776970 4774534 4719446 4565795 4166147 3799221
7046 3799221 3869924 4210038 4367799 4295286 4460845 4655902 4536958 4236940 3974216 3850107
7036 3850107 3568615 3294181 3055264 2830811 2629409 2670941 2638050 2593475 2575741 2483523
7026 2483523 2547408 2428217 2320388 2092089 1977747 1976232 1694763 1795220 1805557 1653236
7016 1653236 1802059 1703284 1632994 1651027 1343625 1408437 1433082 1333035 1313582 1362422 1272343
7005 1272343 1216690 1313650 1391389 1265776 1058399 1091602 1296026 1176275 1186295 1268411 1135397
6994 1135397 922343 925281 1008322 885513 941014 794447 914511 868606 898350 668474 656775
6983 656775 702282 734863 845821 798547 683607 867698 672798 618291 674459 664967 407792
6972 407792 397328 403776 578322 673585 607445 701603 551372 629695 522682 459606 557268
6961 557268 347512 433992 395957 431834 515260 645300 557019 367108 318504 285692 305572
6950 305572 390385 326552 217658 515734 545032 441541 602097 470568 588154 508521
6940 508521 611713 537699 445214 497372 240633 253980 139880 184543 249880 288564 192407
6929 192407 194698 352696 351516 97471 131351 76913 191091 202231 170295 253869 459609
6918 459609 325184 283840 183755 277098 329892 220614 177927 84641 167262 310627 240206
6907 240206 169462 202889 238803 316544 150539 201441 201183 195094 337774 467070 278062
6896 278062 295254 382413 153429 79348 96669 143849 131670 294832 363592 387637 143071
6885 143071 2804 -79475 121314 44747 -50364 3119 -34129 264043 168196 51951 218693
6874 218693 345671 225966 98906 153242 120920 113679 170471 259542 321257 125997 -38408
6863 -38408 -2225 -44819 -37697 -92870 -108248 6042 -149597 -41049 121473 -112364 -151768
6852 -151768 -53467 15811 17046 24899 293578 388961 282133 143084 41480 118731 75196
6841 75196 7352 -122655 -24145 79525 33724 -82192 -6290 53407 179021 -2033 -107710
6830 -107710 55158 32299 -32651 139119 -20140 -8735 233297 49979 -153398 -50862
6820 -50862 221000 256313 175875 3851 32949 -27463 -65563 -40694 50584 69639 4149
6809 4149 -179342 -235761 -95864 40234 -63815 -123471 -204 -35430 -79302 169456 139482
6798 139482 132485 36806 90042 61311 138283 128597 145291 64801 36236 73693 -90053 -864
6786 -864 111719 -24065 80944 -19023 -85733 106318 -28567 172395 322147 229730 129999
6775 129999 232406 325752 144055 -6887 81586 -91594 -54922 -83016 152429 261409
6765 261409 180091 260920 -6794 -76560 -215178 -298596 -208885 -8487 15178 240456 80500
6754 80500 103624 -216550 -176849 64918 -23743 -28753 36014 214554 76611 83356 120314
6743 120314 -74194 4315 46681 -2243 121514 103844 64497 205601 149048 -21040 -56566
6732 -56566 65899 313963 175262 208709 210917 130240 83742 152317 143694 124075 56100 34006
6720 34006 215260 323336 173970 285910 267108 216593 147377 131130 191860 320063 258523
6709 258523 191317 244799 240383 152262 303391 424702 401542 319537 175583 392181 722171
6698 722171 565175 295224 266770 247258 187130 352538 284583 104475 3975 175235
6688 175235 198291 -48694 40509 180219 274083 162660 39203 12044 -55281 -4875 -67443
6677 -67443 168148 223806 221300 310411 246347 147580 14608 176252 178326 217563 162672 154704
6665 154704 141850 158403 111372 -13807 -126885 -152847 -224570 -193948 -127451 -83085 -23543
6654 -23543 74089 94934 -81452 105321 262589 80643 180687 183074 34205 -49657 19413
6643 19413 -59434 -168378 -17545 35813 126740 35113 33220 54679 128310 167151 120873 47893
6631 47893 8167 226809 207352 181588 298546 163337 148209 135860 273004 165785 -23067
6620 -23067 -110547 -15108 243243 91584 -73482 -16001 137079 -18532 11968 79637 94549
6609 94549 55392 14025 59806 151905 -29658 -136640 -78714 -88032 -247856 -199862 -158824
6598 -158824 -133405 45703 146922 31244 73032 75557 -17428 67521 44690 20943 15194
6587 15194 -112383 -119260 -59512 73657 38297 -88211 -104448 77471 53345 49562 -85704
6576 -85704 -128571 -14397 -21463 115729 80261 -56782 -150442 25633 7667 -41266 7210
6565 7210 72453 167868 7608 95889 172399 34730 167509 183610 298076 -96767 -130241
6554 -130241 -132909 76860 173503 33201 -106868 -140860 -201949 -78814 -45321 -84924 39383
6543 39383 93708 118186 41634 200819 -58739 -160465 19257 -97304 -152653 -18752 108885
6532 108885 117711 192733 -9378 20562 198862 469 -123926 -161436 -76194 170500 277466
6521 277466 279028 223857 139133 49522 -109816 99202 83416 -141493 7513 178776 72682
6510 72682 211848 267397 279479 42996 -166250 -124085 35563 89647 137358 -263602 -199711
6499 -199711 4510 57578 -53672 -143743 -60669 -211323 -132488 -17061 21291 -77587 -240433
6488 -240433 -80477 141908 -43820 17060 57318 118941 60366 111864 68078 78293 118889
6477 118889 -13972 51558 32999 79679 77200 122386 81440 180250 223863 145078 176401 236302
6465 236302 91164 10924 182843 62209 -40364 12148 -129059 -260815 -53641 28815
6455 28815 30941 -13424 -59605 -217962 -204974 60554 199401 116828 72186 221374 68496
6444 68496 51158 260645 197734 197595 16139 99794 112807 39426 61983 -29871 218637 -50215
6432 -50215 19054 -3862 -14683 200230 263215 250579 233303 379112 347578 240811 127363
6421 127363 38714 88304 83749 -9165 50297 139128 97339 62811 5347 -96749 265704
6410 265704 229959 -86374 -24791 78289 79012 113107 71420 136064 103142 124661 56709 232043
6398 232043 216623 224895 283268 168194 189592 214905 80613 182899 252204 138583 175301
6387 175301 285509 226224 434172 194396 225474 325208 164136 320389 446041 389321
6377 389321 341543 422732 349309 439587 609860 550160 327737 449603 537542 508335 478574
6366 478574 432708 370081 384065 374181 308427 306297 298652 372617 398601 315565 370156 426402
6354 426402 542122 509935 464870 376515 532753 582921 528516 401642 395672 449229 635057
6343 635057 682975 587355 664259 849233 693353 640114 291493 504233 753926 690316 452663
6332 452663 318856 373681 449946 406155 698969 704081 646269 637339 646536 744163 646225 730617
6320 730617 620721 648959 612508 619696 719122 614125 835488 979171 609719 575281 544059
6309 544059 626487 831708 988795 893321 947943 679759 477427 478126 603772 466722 350405
6298 350405 317515 527032 645476 403156 474381 685021 596867 415344 262994 430290
6288 430290 470044 640597 666330 611665 410203 425467 659176 387137 377884 506837 548541
6277 548541 534783 418599 351813 200544 343381 533888 669065 388778 237897 300625
6267 300625 339698 450372 583812 577694 484523 459304 499430 664381 644775 680495 408672
6256 408672 329475 479104 588919 383686 413048 308074 538453 849931 718110 557962
6246 557962 718423 503700 394890 405276 236917 455935 567410 677261 515416 556972
6236 556972 817888 635075 560257 488599 404419 709970 676388 685859 759079 882148 1128546
6225 1128546 847225 726136 710181 698273 840718 861255 821229 684339 840481 1036854
6215 1036854 985744 1041421 890912 983082 867112 756281 826161 878534 861505 910552 1196194
6204 1196194 1223005 1084042 927597 941601 917304 893990 906625 1005867 1060562 994241 1288729
6193 1288729 1403289 1363862 1370302 1362088 1330108 1266180 1388938 1537125 1563243 1387442 1545011
6182 1545011 1546516 1380339 1546653 1494582 1489338 1936087 1983368 1756707 1626929 1540456 1663852
6171 1663852 1486031 1430341 1517926 1621568 1594802 1575663 1748839 1537803 1681321 1677849 1551164
6160 1551164 1881243 1840765 1771777 1846931 1833781 1939979 1762864 1824240 1887744 1880614 1816131
6149 1816131 1973505 2097001 2056382 2005999 2124971 2017201 2086818 2197226 2278647 2097510
6139 2097510 2088095 2329095 2446842 2506617 2486911 2604731 2421538 2416530 2516533 2520806 2621068
6128 2621068 2853041 2825845 2838664 2920240 3041701 2986373 2858422 2973941 3152998 3108709
6118 3108709 3341725 3350457 3366429 3442913 3484741 3700109 3521515 3603201 3943016 4000877 3988167
6107 3988167 4028522 3919571 3929826 3935312 4170244 4459795 4482214 4536106 4314533 4499798 4855483
6096 4855483 4846381 4976188 5212182 5350328 5302329 5477602 5779426 5885984 6015503 6183948
6086 6183948 6377229 6679686 7034363 7256165 7424103 7740493 8068242 8792481 9203031 9789535
6076 9789535 10445472 11240862 12366228 13188649 14200516 15567382 16904685 18484342 20468539
6067 20468539 22099633 22134614 20430644 18660285 17116861 15865517 15093700 14667291 14436413
6058 14436413 14292835 14311004 14429757 14550647 14893193 15158166 15411176 16039789 16629246 17222757
6048 17222757 18238448 19397923 20633039 22199853 24062922 25967318 28471549 31022619
6040 31022619 34223319 37508530 41616805 46449418 52242019 57176433 58876487 54389564
6032 54389564 47804154 43048449 38682325 35717962 33818567 32684601 32129113 31894647
6024 31894647 31960009 32400603 33169225 34008177 35262316 36796295 38313553 40327664 42705220
6015 42705220 45442280 48575538 52431299 56985352 61822151 66115962 69838837 73199947
6007 73199947 76609781 80084819 84189031 89456361 94390522 96576112 92958706 86111263
5999 86111263 80848969 76248015 73411281 71983766 71721695 72172926 73249241 74558951
5991 74558951 75719628 77139172 78982822 81383179 84372445 87760851 92024253 96837060
5983 96837060 100588369 101524789 98213894 93497506 89190014 85644818 83303520 81873188
5975 81873188 80904598 80206902 80215684 80604062 81018467 80369514 77456438 73012857 69132912
5966 69132912 65813131 63057377 60923319 59203835 57847277 56529740 55133725 53982697
5958 53982697 52906116 52123223 50806214 48750117 45657385 42248539 38828440 36141731
5950 36141731 33926741 32115769 30544245 29396208 28759383 27793930 27383016 27099941 26496100
5941 26496100 26011550 25500783 24823537 23990095 23383731 22986885 22436631 22052119 21533952
5932 21533952 21219616 20848302 20459446 20282075 20170241 20025561 19891569 19668968 19409138
5923 19409138 19072653 18869001 18759609 18747426 18693173 18682861 18523060 18645432 18741729 18660232
5913 18660232 18616980 18740193 19220738 19329864 19484993 19786131 20037298 20040236 19980526 20191634
5903 20191634 20567026 20871604 21175137 21450544 21790291 22076149 22386976 22777491 23395486
5894 23395486 24140276 24700405 25532021 26019730 26874281 27896156 29170974 30116486 31270188
5885 31270188 32482460 33970558 36050926 38156084 40632819 43361506 46062373 48697222
5877 48697222 50807777 52095575 52802856 53319569 53711422 54186500 54883437 55943184 57243517
5868 57243517 58471815 59896450 61735886 63757772 65856060 68168106 70358401 72382271
5860 72382271 74472175 76452642 78335725 80336873 82548840 85103052 87977275 91144239
5852 91144239 94193723 95853654 94634492 90882139 85813394 80954062 76816257 73108804
5844 73108804 70435066 68391831 66549233 64914526 63239117 61366165 59935254 59059113
5836 59059113 58341017 57882244 57477230 56875051 56585886 56174347 55694841 55225838 54528019
5827 54528019 53913754 53053501 51796169 49727282 46911249 43766759 40785381 37976856
5819 37976856 35188840 33184700 31404882 29762132 28659424 27576503 26340399 25125895
5811 25125895 24266547 23548616 22835274 22274289 21485026 20667018 19963382 19472082 18536467
5802 18536467 17662678 16802394 16305862 15907884 15503321 15269923 14935729 14654952 14357161
5793 14357161 14417814 14321781 14133189 13815400 13716076 13542796 13450224 13343101 13334339 13379982 13278777
5782 13278777 13116576 12697311 12429481 12212140 11970031 11726355 11203145 11154023 11090063 10810331
5772 10810331 10414263 10465415 10398137 10310189 10350367 10204639 10194582 10295007 10471660 10802420
5762 10802420 10773270 11004389 11017653 10802678 10870240 10648697 10318301 10141108 10024360 9953133
5752 9953133 9611409 9334858 8931083 8561291 8087722 7953222 7943960 7621144 7356228 7156161
5742 7156161 7051470 7017396 6891205 6941560 7071709 7212282 7408913 7421149 7493169 7660853
5732 7660853 7722703 7851451 7844398 7724306 7617824 7459280 6956416 6595190 6273477 5907881
5722 5907881 5647297 5395868 5098040 4655012 4579157 4668387 4680859 4452832 4238041 4043733
5712 4043733 4123453 4178322 4103532 4148075 4161803 4302234 4449085 4455867 4214441 4062975 4383472
5701 4383472 4550632 4408271 4439173 4451544 4186354 4153859 4026162 3909559 3681913 3484339
5691 3484339 3387352 3528593 3450513 2991845 2870463 2821842 2710143 2911716 2793848 2707543
5681 2707543 2976452 2713635 2505823 2604613 2614323 2546269 2628354 2613812 2541436 2451912 2536589
5670 2536589 2710269 2581518 2634254 2848864 2945350 2930295 3289274 3253387 3313533 3387881 3519053
5659 3519053 3644499 3635745 3533992 3368841 3351896 3598767 3598504 3676745 3884648 4188338 4254801
5648 4254801 4488425 4324871 4244785 4212221 4155754 4268804 4311009 4278162 4252149 4174838 4261040
5637 4261040 4342702 4632542 4518182 4505997 4883031 5204916 5111747 5101403 5238492 5439068
5627 5439068 5885260 6070551 6248752 6252961 6448000 6578288 6375030 6289157 6330242 6094339
5617 6094339 6200075 6054002 5947377 5888314 5824136 5614725 5685545 6099722 6096990 5974496
5607 5974496 5990923 5991432 5925190 5681781 5496941 5377830 5104696 4904452 4875187 5134616 5024594
5596 5024594 4549229 4344080 4287860 4281085 4124318 4164960 3911915 3766842 3737545 3713897 3630827
5585 3630827 3423324 3367979 3271135 3329833 3286146 3098736 2954334 2888200 2930646 2684358 2589427
5574 2589427 2362241 2453287 2412345 2290963 2354475 2543732 2547803 2522870 2339658 2466628 2448360
5563 2448360 2432180 2206072 2068808 1873359 2012193 1912646 1825678 1783314 1765758 1927136
5553 1927136 1898803 1716277 1781914 1732330 1568188 1755790 1554384 1639585 1677447 1677196 1711774
5542 1711774 1613954 1669764 1754586 1578369 1499848 1428501 1547981 1665664 1574425 1369651 1396027
5531 1396027 1522179 1431044 1592775 1574125 1314992 1359234 1526348 1490534 1450359 1431046 1413894
5520 1413894 1524484 1540259 1439180 1381118 1512541 1224363 989482 1178116 1120702 901502
5510 901502 1067801 1034727 963845 1006960 1114572 1082760 978561 1016007 1138014 1073173 956635
5499 956635 1099698 1117407 876955 969305 957429 1085691 1191917 1161523 1081473 810057 790160
5488 790160 799555 1019646 996670 824631 994086 986815 989062 917284 952636 791466 809672
5477 809672 800426 782317 859575 966479 908343 903404 810054 983723 914443 769291 677717
5466 677717 728867 655170 759129 934249 773563 871033 727650 842535 910035 741138
5456 741138 721399 698552 643773 709524 677918 858654 914345 1201039 1112686 992718 1024335
5445 1024335 1004659 1092765 968209 774613 925783 980195 938317 940807 966220 830987 762992
5434 762992 806594 614059 597247 695494 737747 953891 1113145 1040295 817566 719567 707693
5423 707693 881666 939708 797932 899281 1026924 1130224 1196534 1100794 999834 1029079
5413 1029079 982381 974822 1032594 1205808 1289585 1268781 1012795 1158302 1258894 1219835 1310600
5402 1310600 1428423 1524233 1840289 1984922 2201356 2145843 2210237 2200751 2020559 2047287 2236056
5391 2236056 2240718 2120353 2081438 1993626 2144028 2195911 2126085 2128961 2123113 2190348 2235928 2227595
5379 2227595 2321024 2333267 2581511 2854049 2848407 2714834 2788972 3000620 3216367 3364030
5369 3364030 3318264 3364170 3482516 3341002 3144892 2849744 2886328 2784482 2673265 2721050
5359 2721050 2603580 2581094 2410629 2382848 2254475 2238358 2239897 2173135 2062275 2129265 2262049
5348 2262049 2419424 2247363 2234163 2319330 2276185 2369001 2134258 2225290 2254179 2198203 1919269
5337 1919269 1757387 1740257 1741933 1688440 1550710 1418371 1583125 1682656 1780975 1692456 1572907
5326 1572907 1472660 1562522 1382752 1415678 1331754 1577314 1746514 1714392 1597999 1581140
5316 1581140 1412883 1497430 1409818 1361264 1271375 1446830 1420194 1264600 1185943 1221830 1358504
5305 1358504 1350274 1599749 1366143 1445911 1421783 1296780 1413575 1572836 1687151 1735970
5295 1735970 1568035 1528688 1706672 1747999 1896061 2009820 1885389 1943021 2117062 2035269
5285 2035269 1990208 2009709 1991777 1954708 2108184 2315921 2379137 2602212 2892758 3186524
5275 3186524 3180062 3486658 3665504 3808219 3918551 3879241 3768115 3594543 3469907 3419633
5265 3419633 3429547 3510677 3575043 3710192 3674272 3955529 3972761 4095347 4418594 4772530 4842124
5254 4842124 5167021 5651584 5773902 5930879 5850910 5909811 5934901 6041064 6493454 6599669
5244 6599669 6856757 6969720 6891301 6742441 6456174 6218253 6018017 5785955 5762112 5664298
5234 5664298 5660136 5837021 5939695 6013742 6069045 6496447 7010470 7207027 7721497 7837901
5224 7837901 7477686 7164439 6789962 6345051 6199047 6132695 5885553 5835091 5746848 5480547
5214 5480547 5267648 5298964 5044010 4768035 4745261 4598460 4487220 4405005 4656329 4613313
5204 4613313 4665187 4822475 4942311 4879336 4918683 5037246 4839477 4628177 4470022 4123929
5194 4123929 3633560 3314171 3322849 3281516 3103760 3305629 3293696 3273480 3073396 3027611 2962110
5183 2962110 2831953 2860416 2823213 2834704 2872848 2790479 2812231 2795871 2699486 2400748 2284304
5172 2284304 2464122 2425451 2213599 2211682 2361532 2469679 2548243 2613590 2661235 2497789 2358949
5161 2358949 2557295 2647303 2610935 2666759 2781169 2717448 2718798 2724118 2907240 3067266 3229291
5150 3229291 3244947 3182760 3019299 3067644 3169652 3067314 2891639 2512477 2381028 2461490
5140 2461490 2383967 2422436 2482885 2290207 2340548 2409065 2482021 2716857 2632391 2475447 2439008
5129 2439008 2672844 2920764 3054784 2836578 2937949 3173484 3413090 3485338 3588351 3767255
5119 3767255 3779499 3968409 3802825 3553516 3358839 3118450 3035257 2879753 2944516 2922303
5109 2922303 2856149 2896498 2760387 2838794 2830305 2983475 3055881 3018124 2975379 3149322 2940733
5098 2940733 2898110 3028549 2662938 2746073 2777775 2677071 2715537 2664708 2653479 2511174 2354734
5087 2354734 2409650 2522937 2588697 2839074 3098492 2921414 3039074 3310442 3263393 3309671
5077 3309671 3538619 3405926 3678617 4181798 4464209 4719403 4948110 4954829 5024266 5335292
5067 5335292 5839088 6169981 6425704 6806446 7446257 8335401 9178822 10096263 11354845
5058 11354845 12672208 14130493 15608168 16788073 16831904 15404732 13539720 11921690
5050 11921690 10257463 8911580 7948570 7260889 6661416 6037481 5745864 5435052 5233495
5041 5233495 5257389 5257598 5096520 4902744 4682600 4618548 4703538 4583424 4176111 4223075 4235696
5030 4235696 4211656 4195602 4308686 4417501 4598287 4628174 4665862 4643165 4357021 4034430
5020 4034430 3845012 3663138 3503721 2941299 2905807 3019803 2980863 2957450 2762342 2750244
5010 2750244 2719970 2574662 2529211 2397217 2326476 2294918 2241397 2205380 2315094 2268816 2236380
4999 2236380 2361282 2345789 2376734 2699436 2641613 2488556 2559165 2480119 2477285 2608308 2489247
4988 2489247 2505648 2707023 2834220 2628107 2484836 2530420 2553723 2628527 2723102 2542365
4978 2542365 2310722 2360312 2331419 2195818 2278243 2285881 2420365 2617384 2630327 2777853 2709402
4967 2709402 2631386 2583605 2703496 2832261 3010639 3032128 2941277 3014522 2817479 2899092 3232725
4956 3232725 3372099 3165174 3248356 3145835 3193258 3443990 3497021 3601349 3763848 3733764
4946 3733764 3558287 3475254 3738797 3666244 3494012 3674019 3912370 3885824 3809507 4084977
4936 4084977 3987651 3928616 3850378 4060225 4225553 4456831 4593931 4538507 4708068 4792604
4926 4792604 4693916 4823804 4867773 4929457 5024049 5203259 5233103 5319666 5287239 5664121 5700878
4915 5700878 5888708 5857591 5962100 6289887 6401923 6651811 6598933 6743097 7110344 7336376
4905 7336376 7600568 7784988 7916366 8192923 8350683 8547554 8884673 9100139 9438557 9600131
4895 9600131 9749643 9983602 10306038 10686196 11181730 11077645 11253088 11614529 12087101 12078693
4885 12078693 12003679 12272810 12619091 12958692 13494073 13765312 14162290 14667793 15203250 15864147
4875 15864147 16416407 17164804 17747690 18037945 18661358 19291479 20113715 20814194 21691409
4866 21691409 22351949 23083327 23949904 24981590 26223895 27445671 28721001 29641319 30885163
4857 30885163 32224162 33932109 35832493 37917628 40476199 43387586 46888267 51260302
4849 51260302 56222765 61916133 68845749 76850558 86069573 96842515 109032380 122764114
4841 122764114 135695176 150147610 168476032 192532080 213326233 221468079 197917465
4834 197917465 166396542 143013151 120660691 106440497 96361591 90414084 85762613
4827 85762613 83171932 81359284 81733610 82744966 85843408 89090811 93458811 96770879
4819 96770879 99475145 102963938 108968449 116834488 128048038 140540837 155687454 172718080
4811 172718080 194522020 218280376 243713384 272362933 309930351 350131432 377973354
4804 377973354 364640043 306487677 254687794 208189560 169781174 142016734 121665326
4797 121665326 106729154 95428954 86763998 79937201 74511911 70120917 66419818 63881013
4789 63881013 61942872 59986100 59192928 58377898 57279477 54670743 50893298 47093506
4781 47093506 43815794 40808174 38725998 36813030 35491161 33991123 32455109 30886181
4773 30886181 29553933 28323202 27284626 26250487 25265290 24233399 23229511 22196860
4765 22196860 21269006 20551040 19882851 19311146 18956028 18425497 18114211 17488211 16779009
4756 16779009 16439467 16394473 16019913 15789335 15611261 15562938 15399200 15483356 15410004 15065375
4746 15065375 14501365 13938239 13395172 12820031 12519776 12181091 11746632 11580945 11392777
4737 11392777 10977764 10625355 10481581 10291819 10331108 10274642 10081230 9839827 9672281 9241053
4727 9241053 8814525 8603994 8615830 8231231 7840908 7463301 7326686 7220130 7019431 6843109
4717 6843109 6637078 6502921 6435536 6219224 6179341 6088550 6029777 5924322 5510298 5437510
4707 5437510 5661213 5509313 5512549 5359499 5595514 5453530 5445909 5523047 5393393 5243963
4697 5243963 5118941 5081318 5103351 4860685 4713740 5012459 4967135 4746500 4841751 4805038
4687 4805038 4734323 4752189 4924002 5155325 5025854 5145927 5010887 5269464 5506166 5860471
4677 5860471 6346604 6477176 6323526 5956309 5354958 4937466 4765181 4538571 4491314 4220935
4667 4220935 4087805 3898913 3841301 3887940 3773071 3847769 3695058 3792400 3551726 3680580
4657 3680580 3680123 3534378 3450871 3307611 3148252 3035981 3233037 3387633 3263846 3187163
4647 3187163 3039784 3192132 3112124 3123887 3185372 3066107 3236457 3308055 3308125 3440210 3426619
4636 3426619 3369462 3157553 3206939 3112414 2899368 2973148 3025665 3005215 3095757 2928585 2818396
4625 2818396 2750119 2755087 2837549 2735297 2790680 2885791 2979747 2860552 2924507 3104625 3154870
4614 3154870 3252516 3274503 3282245 3222128 3226615 3351026 3279707 3406446 3480847 3517826 3592454
4603 3592454 3733952 3972106 4078452 4185631 4304516 4522908 4814130 5145326 5229151 5475020
4593 5475020 5333925 5139950 5076655 4844044 4439866 4316514 4412014 4416016 4365455 4434420 4264148
4582 4264148 4082626 3948434 3905461 4015304 4104495 4058595 3838918 3938008 4123753 4282497
4572 4282497 4278284 4074651 4115527 4098301 4119153 4382105 4590426 4658754 4635282 4786534 4820625
4561 4820625 4995659 5279413 5410432 5417757 5511692 5668157 5853843 5844281 5930759 6146112 6399343
4550 6399343 6194217 6439679 6630170 7063674 7488704 7767143 8296325 8716384 9047275 9553945
4540 9553945 10292184 11067089 11894042 12734397 14018635 15628633 17082882 18789208 21106807
4531 21106807 24029188 27032616 30419804 34467109 38844663 43695148 49623405 55280417
4523 55280417 58492707 56462739 49973169 42929478 36229496 30291276 25673659 22412196
4515 22412196 19962045 18070610 16578999 15451618 14230739 13235920 12354563 11951679 11419488
4506 11419488 10932558 10620329 10403804 10219903 9734809 9571179 9444573 9254124 9179394 9098220
4496 9098220 8979526 9142827 8940284 9059374 9123740 9021557 9321510 9539202 9574704 9229463
4486 9229463 9127728 8880775 8496241 8376690 8525685 8586112 8487815 8487046 8555557 8465018 8720604
4475 8720604 9014304 9131151 9384837 9802105 10174435 10542883 10912213 11465990 12056060 12608464
4465 12608464 13478070 14079422 14637971 15047193 15721052 16619137 17396618 17919610 18079540
4456 18079540 18162416 18098615 18237055 18817889 19527620 20394437 21838794 23824224 25771547
4447 25771547 28335497 31528961 35091926 39061565 43503346 48669210 54248071 58594346
4439 58594346 59249048 54767531 48538207 42624413 37215727 32884099 29474807 27016883
4431 27016883 25120581 23459292 22146048 20759798 19365604 17908451 16704436 15428100
4423 15428100 14530769 13658242 12664488 11982418 11276450 10809443 10184642 9556442 9355025
4414 9355025 9199311 8765750 8604923 8419738 8018886 7551844 7454781 7040375 6886819 6935697
4404 6935697 6886168 6625412 6471762 6337896 6242605 5868810 5739621 5683538 5736000 5694272
4394 5694272 5378706 5407894 5386254 5160958 5170851 5353497 5265726 5184424 5115315 5133544 5035124
4383 5035124 5041047 5136881 5071518 5095953 5105861 5058794 4978399 5054227 5118276 4891421 4864786 4814183
4371 4814183 4964963 4996586 4996491 5335064 5434269 5621281 5711081 5877779 6108269 6040531 6102255
4360 6102255 6175521 6191109 6327581 6369483 6135293 5899547 6167370 6233092 6202754 6083716
4350 6083716 5960309 5893854 6055768 6003738 6039918 6294464 6369107 6618059 6931896 7006078
4340 7006078 7068194 7249069 7419976 7670572 7983786 8301445 8319459 8453226 8698489 8694275
4330 8694275 8840902 9059994 9327129 9630934 9653258 9613841 9669617 9486615 9274648 9298334
4320 9298334 9396383 9258580 9228591 9162731 9078376 9153217 9488246 9585624 9506610 9805563 9953280
4309 9953280 10126214 10300163 10505594 10830150 11041288 11153839 11188887 11382030 11572721 11740661
4299 11740661 12222397 12327353 12568243 12768684 13003354 13194179 13481271 13670679 14026770
4290 14026770 14342365 14679279 14994909 15218782 15710184 16329544 16712619 17114264 17524407
4281 17524407 18345835 19289220 20301574 21395443 22443151 24099588 25812108 27806345
4273 27806345 29960396 32426786 35336633 38736217 42729939 46757007 51451289 57054099
4265 57054099 63344195 68468511 69812483 64192064 56469095 49786903 43478167 38573523
4257 38573523 34781129 31883064 29398252 27578709 26443966 25633869 24968791 24708962 24510297
4248 24510297 24648536 24899793 25278434 25441572 25239657 24347984 23332218 22644580 21882206
4239 21882206 21147410 20961134 20644042 20373480 20069672 20074620 20140402 20331332 20273505 20294808
4229 20294808 20265904 20339989 20608443 20566204 20681869 20948332 21277334 21824466 22261072 22687513
4219 22687513 22972961 23426235 24052825 24523890 25002170 25664976 26306480 27236176 28196058
4210 28196058 29010151 29927432 31202901 32523323 33728923 35257195 37246292 39196588
4202 39196588 40975473 42767640 44776432 46978285 49964794 53238294 56828559 61373126
4194 61373126 66468274 72341788 79290899 87418688 97077566 108618385 121881389 136990928
4186 136990928 154410114 175053636 198456210 225649512 257552039 294951979 334036212
4179 334036212 363798232 366220039 341441620 297476685 251206175 212562362 180327388
4172 180327388 155643812 135837636 120251973 107684062 97682700 89273291 82465785
4165 82465785 77017518 72280780 68125969 64417214 60864849 57903699 55174434 53038089
4157 53038089 51083123 49676163 48433052 47419552 46160502 45231914 44686244 44310608 44036803
4148 44036803 44147793 44473958 45111464 46057630 47413272 48602741 49402514 48283748 45426191
4139 45426191 41889673 38540823 35682366 32888585 30572062 28519876 27126835 26047444
4131 26047444 24991712 24323891 23541709 22750045 22172889 21853802 21754653 21626996 21032529
4122 21032529 20418177 20011082 19556638 19058438 18554861 18160021 17956805 17627027 17384700
4113 17384700 17368300 17453562 17382929 17520069 17687289 17916218 18016714 18092722 18421181 18330737
4103 18330737 17948551 17202396 16347691 15403103 14863334 14395811 13808397 13592065 13299221
4094 13299221 13080233 12814155 12503382 11850770 11208093 10983176 10516718 10163747 9766259
4085 9766259 9506901 9347027 9231944 9112822 9003086 9020236 8892118 8914877 8752273 8708327
4075 8708327 8839651 8766129 8470286 8451862 8386585 8016993 7894294 8013930 7901245 7748271
4065 7748271 7692658 7601961 7687676 7392294 7348101 7275019 7223192 6970702 6928852 7042546 7445789
4054 7445789 7356991 7175831 7029153 7116945 7163088 7118957 7041766 7068742 7109024 7051813 7066191
4043 7066191 7161529 7185656 7305057 7404962 7519826 7488704 7605723 7946957 7985808 7934186 8063657
4032 8063657 8176193 8224309 8238994 8324384 8485790 8498275 8796301 9044336 9242285 9730573
4022 9730573 10140666 10450765 10900148 11484404 12034617 12483544 13149041 14010391 15346195
4013 15346195 16400997 17027925 17029692 16274245 15315100 14318027 13111046 12362038 11706246
4004 11706246 11450748 11168707 10917349 10859902 10831825 10700167 10836348 10899295 10875510 11071914
3994 11071914 11266654 11500816 11637328 12152770 12609343 13075065 13631850 14167398 15035122
3985 15035122 15992989 16911674 17936633 18491260 17856379 17017424 16375007 15676651 15161970
3976 15161970 14971438 15113420 15199414 15402235 15836344 15824538 15938533 15873714 16024928 16456694
3966 16456694 16742143 16985277 17415077 17809288 18301710 19292487 20194757 21180644 22681822
3957 22681822 24387817 25973284 27326778 27455060 26899229 26310726 25914969 26002560 26895857
3948 26895857 27454779 27772699 27217910 26203905 24978696 24144207 23642568 23424683 23774618
3939 23774618 24063129 24591831 25466060 26325968 27059916 27593565 28091364 29024123 30261850
3930 30261850 31534683 32943795 34794086 36103505 35686064 34469690 33041748 31653409
3922 31653409 30744351 30325534 30271314 30576743 30972283 31557568 32518337 33397382 34468651
3913 34468651 35221357 36104024 36634018 37259975 38006342 38924287 40044421 41105740 42200061
3904 42200061 43561345 45265345 46773241 48118142 49962651 52015636 54392278 56989603
3896 56989603 59516514 61684089 63918695 66644522 70013143 73402133 76684891 80057921
3888 80057921 83204217 86327506 89278134 92073339 95029332 98391201 102416949 106733467
3880 106733467 111706769 117128749 123126632 128656959 131740120 132159393 130885570 129478121
3872 129478121 129107401 129755326 130971889 132494628 133788025 135002287 136491980 137863285
3864 137863285 139389051 140290047 140262991 139595034 137902133 135787607 133728227 132016271 130261779
3855 130261779 128661003 127050235 126126173 125650213 125636995 124911165 122386511 117065631 110399756
3846 110399756 104176562 98580035 94121456 90445851 87078304 84254685 81865079 79258000
3838 79258000 76371800 73544233 70639586 67813945 64827189 61905890 59323490 57206280
3830 57206280 55561951 54046762 52247417 50226973 48315901 46471415 44762250 43438031
3822 43438031 42524832 41635527 40769050 40168951 39351528 38482582 37484738 36685549 35939615
3813 35939615 35130939 34319214 33724931 33142538 31975762 30845520 29993258 29406119 28765439
3804 28765439 28391204 28106160 27595328 27354084 27133594 27026667 26871184 26731070 26748305 26688257
3794 26688257 26854919 26731305 26541621 26311964 26186816 26124871 25656165 25250947 25089185 24669356
3784 24669356 24652072 24308716 23913331 23767181 23500927 23415013 23488827 23331175 23480334 23507760
3774 23507760 23609823 23636591 23570140 23602877 23905558 23918921 24057435 24367803 24337039 24662026
3764 24662026 25137150 25485540 26191730 27231055 28078777 28928101 30032271 31532203 33266512
3755 33266512 35175334 36819002 37902384 37792119 36705449 35294864 33724849 32127741
3747 32127741 30327471 28716835 27382596 26197734 25089851 24398214 23892538 23335073 23006476
3738 23006476 22472608 21845651 21291079 20709863 20396787 20032626 19554837 19306898 18921934
3729 18921934 18759689 18245239 18127848 17861220 17733348 17535529 17312408 17231195 17047243 16940526
3719 16940526 16992128 16986513 16787405 16468477 16422919 16420202 16312828 16284610 16340476 16411623 16410825
3708 16410825 16725151 16553639 16463370 16435126 16314641 16399254 16414715 16269353 16529698 16689996
3698 16689996 16569801 16704579 16827571 16723966 16419687 16386029 16271159 16122502 16204274 16370513
3688 16370513 16172700 16048808 16221002 16043597 16082913 16302293 16349190 16382111 16661392 17074251
3678 17074251 17357900 17548295 17934968 18079818 18193338 18437008 18558735 18985275 19580411
3669 19580411 19856083 20248606 20697494 20879505 21181371 21277020 21383401 21463710 21515986 21347872
3659 21347872 21251257 21063228 20807621 20586522 20479096 20288858 20122243 19994098 19982939 20030605
3649 20030605 19846548 19621937 19193336 19096482 19021467 18935044 18927828 19078449 19206130 19333468
3639 19333468 19469887 19518755 19607275 19812999 19864784 19759794 19931736 19793624 19634443 19559096
3629 19559096 19376111 19225037 18823490 18521013 18322953 18164618 17773698 17465697 17123468
3620 17123468 16580615 16070981 15703865 15314923 15110694 14959363 14711910 14352510 14276892 14134626
3610 14134626 13890148 13743109 14194496 14057943 13969668 13879150 13916981 13915585 13884438 13788778 13714532
3599 13714532 13736639 13547167 13582550 13465922 13206480 13112406 13017984 12859057 12794829 12462857
3589 12462857 12399375 12310376 11741666 11572698 11401386 11259320 11118788 10785901 10598682 10426732
3579 10426732 10348272 10319727 10261405 10050332 9937725 9755580 9802582 9802984 9866087 9772105 9730710
3568 9730710 9858061 9815250 9853284 9767349 9647876 9654775 9508892 9135587 9046771 9178253 9002488
3557 9002488 8914090 8935446 8946849 8861190 8807673 8529065 8478518 8354951 8508617 8406325 8423415
3546 8423415 8280001 8151837 8099213 7770828 7592605 7433460 7246175 7293622 7384569 7166721
3536 7166721 7047270 7044254 6848969 7010194 7113403 7190416 7066146 7093134 6887056 6871645
3526 6871645 7077786 7095940 7271446 7176260 7006886 7038386 7063772 7186697 6925475 6894881
3516 6894881 6977718 6963842 6757307 6661729 6613524 6416301 6447835 6340757 6143470 6249728
3506 6249728 6230411 6349861 6331719 6178377 6443808 6345467 6195879 6393078 6550061 6451974
3496 6451974 6303601 6527643 6595725 6495617 6534099 6551569 6735507 6792608 6842785 6945772
3486 6945772 6957430 7028155 7025822 6847276 6834657 6928468 6953077 6945017 7058419 7096763 7475193
3475 7475193 7595198 7167139 7177424 7476793 7313733 7482881 7901763 8104569 7976788 8208961
3465 8208961 8386148 8603738 8597651 8635085 8935930 9129677 9353142 9697364 10168163 10424769
3455 10424769 10599520 10924105 11373399 11797189 12030484 12472607 12809457 13420856 14036698
3446 14036698 14934346 15793695 16878763 18241164 19897422 21761334 23859293 26276556
3438 26276556 29498148 32497740 36227260 40913678 46848144 52561959 55993653 52679637
3430 52679637 45497186 39383916 33981252 29879653 27060121 25302944 23925653 22998125
3422 22998125 22400278 21870934 21743989 21846650 22217440 22335506 22762358 23631282 24969629
3413 24969629 26248900 27667441 29915812 32690632 35831736 39435094 43339628 48782216
3405 48782216 54791159 61408998 69488392 80169380 91521416 99989107 96316923 80895626
3397 80895626 68382014 56676715 47382702 40796105 36021909 32567781 30112341 28102436
3389 28102436 26693169 25248886 23940975 23092662 22734501 22383602 22038652 21934261 22213078
3380 22213078 22647291 23351904 24244538 25247203 26456753 28062452 30410323 32952544 35989411
3371 35989411 39370201 44172775 49554150 53633598 53316758 46678647 39981475 33875284
3363 33875284 28677212 25000797 22246942 20211794 18693694 17592889 16510258 15825172
3355 15825172 14903108 14150862 13580423 12933498 12574110 12192911 11655089 11324890 11106600
3346 11106600 10909354 10710528 10466684 10333757 10042474 10017549 9882043 9695413 9563402 9369989
3336 9369989 9342870 9266652 9188942 9231912 9214521 9122635 9139748 8952376 8876164 8869909 8951614
3325 8951614 8933329 8954025 8550127 8334698 8058746 7968477 7838039 7921987 7606308 7631054
3315 7631054 7504795 7595525 7573905 7379996 7557626 7589372 7624533 7578691 7825206 7760016 7878918
3304 7878918 8173826 7977725 7910002 7781971 7958334 8082679 8064927 8115700 8304342 8348200
3294 8348200 8555561 8568511 8465543 8396837 8442618 8349359 8401741 8532026 8693298 8854629
3284 8854629 8787105 8929908 9020478 9073959 9345295 9427384 9565986 9749788 10025847 10234612
3274 10234612 10551693 10860862 10889078 11325795 11712259 12132473 12562084 13049847 13325753 13812468
3264 13812468 14294315 14807842 15256443 15594540 15972532 16327936 16433285 16457788 16522910 16065063
3254 16065063 15530648 15001667 14581737 13926673 13152622 12556613 12283151 12166123 11991022
3245 11991022 11605972 11267554 10857976 10544672 10391206 10050160 9764719 9379215 9067585
3236 9067585 8835376 8663455 8786426 8657897 8393052 8491501 8565631 8518305 8498645 8448445
3226 8448445 8522803 8617737 8522204 8669105 8756975 8696276 8843257 8808043 8759987 8695879 8799092
3215 8799092 8921854 9052282 9269301 9236574 9287342 8967166 8766586 8487792 8067823 7721653
3205 7721653 7507064 7397913 7107244 6985287 6912542 6942239 6957512 7078949 7137305 7099663
3195 7099663 7112478 7157454 7148451 6826465 6983076 7120233 6992382 7022289 6969586 7149437 7328424
3184 7328424 7389587 7257656 7223666 7348698 7369307 7350302 7258716 6990412 6774087 6873145 6629180
3173 6629180 6538879 6420486 6473513 6384808 6240225 6133231 6146409 6097775 6019556 5968677 5885339
3162 5885339 5929207 5830401 5686540 5634807 5541771 5554515 5442297 5704240 5778166 5577896 5539702
3151 5539702 5538457 5543611 5660120 5691916 5581294 5279486 5310030 5470048 5342260 5402068 5461166
3140 5461166 5320122 5167918 5092496 5162645 5247058 5284544 5037767 4862746 4918553 4840549 4875869
3129 4875869 4704350 4457218 4474449 4507716 4303868 4337244 4423879 4397057 4510451 4411566 4385826
3118 4385826 4349612 4381443 4302269 4096138 4281621 4456482 4621459 4459051 4389134 4224360
3108 4224360 4309736 4506234 4234274 4082513 4091979 4042532 3997897 3943148 3881044 3781305 3787122
3097 3787122 3657250 3617061 3548384 3474954 3403727 3491502 3506897 3353617 3422255 3280547 3057662
3086 3057662 3130172 3057358 3134101 3107905 3116268 3140915 3332159 3327582 3116315 2994628 3133540
3075 3133540 3284955 3230252 3206943 3218462 3077296 2939796 2863840 2820641 3040226 3168963
3065 3168963 2869884 2702025 2677443 2833908 2944574 2785879 2691761 2540366 2497800 2551161
3055 2551161 2482955 2441041 2372987 2405094 2573579 2637615 2656502 2639706 2504926 2491713 2710588
3044 2710588 2833937 2858688 2796110 2937731 2793378 2821230 2912343 2914296 2814085 2890530 3003050
3033 3003050 2950499 3008432 3246731 3204228 3221042 3347382 3296945 3342413 3434808 3452724 3673309
3022 3673309 3949415 3764743 3854481 3938498 4168832 4186734 4016977 4165199 4467692 4346570
3012 4346570 4324357 4364687 4255570 4193734 4278606 4236570 4153291 4044785 4049968 4293521 4356510
3001 4356510 4225340 4202384 4300817 4328635 4275363 4336862 4593434 4715061 4796401 4996980 5369033
2990 5369033 5570681 5726127 5884598 6043712 6150164 6452541 6539700 6717235 6709792 6857315
2980 6857315 6995477 7045658 7002322 6805576 6710060 6656385 6196776 6128077 6229190 6153669 6021068
2969 6021068 5788331 5702220 5365784 5221297 5406932 5349136 5172016 4976477 4982572 5198982
2959 5198982 5216362 5391868 5494237 5647035 5595640 5526872 5605338 5633680 5766314 5960803
2949 5960803 6206241 6381513 6596166 6729323 6657019 6596302 6550124 6351585 6334901 6346084
2939 6346084 6386162 6259950 6223129 6116402 5844148 5893482 5897365 5842835 5725436 5676622 5675941
2928 5675941 5678063 5715548 5789382 5891009 5824038 5888714 6145621 6313909 6565075 6545927 6505349
2917 6505349 6398914 6424349 6366534 6138696 6216068 5973072 5774133 5494791 5384425 5629823
2907 5629823 5657478 5598145 5414482 5579764 5441512 5548977 5476566 5296382 5349990 5336822
2897 5336822 5499141 5708033 5871932 5745362 5747288 5605854 5668702 5733584 5646642 5524940
2887 5524940 5387095 5432565 5414303 5313664 5033914 4915386 4797449 4669636 4400118 4321186
2877 4321186 4199511 4262756 4411286 4269382 4216026 4097054 4115824 4049389 3939591 4037302
2867 4037302 3975144 3788808 3610110 3584588 3546947 3382217 3332374 3306157 3254338 3056690 2809244
2856 2809244 2860279 3052434 2767866 2819493 2758136 2674044 2784535 2676213 2455001 2428454
2846 2428454 2421514 2391993 2110379 2013605 2082334 2243724 2342861 2275930 2138267 2103388 2120560
2835 2120560 1984456 2044076 1812686 1744491 1711846 1662723 1851682 1967265 1663667 1555496
2825 1555496 1642350 1807039 1886101 1853665 1978102 1906985 1906207 1720894 1623014 1609066 1554963
2814 1554963 1417367 1390098 1519283 1336355 1336093 1279874 1326302 1323461 1434611 1432669 1202489
2803 1202489 1267572 1386979 1446172 1200237 1054281 1171417 1194611 1221597 1176078 1322773
2793 1322773 1211383 1299417 1169843 1074066 1026356 1063168 1036804 966706 939264 945061 1073282
2782 1073282 776244 867448 1038089 824638 663833 718031 718920 766459 1137716 1112190 898558
2771 898558 807458 783162 854348 993389 1007377 935591 808412 683094 890157 779420 811349
2760 811349 626695 807657 911339 788961 854179 685301 525537 644760 804668 892349
2750 892349 857870 850859 670830 698786 718767 554495 647638 656025 690836 624153 570052 551288
2738 551288 583822 398285 497392 637484 550425 559073 583640 629591 476598 612640 729256
2727 729256 797586 783177 745555 720253 730510 738481 615658 730773 684181 395441 387794
2716 387794 541644 470233 477512 407427 547196 546840 464073 727912 567104 433572 594594
2705 594594 684204 641234 517969 360247 390756 419739 493828 580455 503546 580857 559238
2694 559238 510056 416310 529082 525303 700804 779060 792299 825623 618593 515473 484992
2683 484992 793981 691889 702093 738036 566668 507081 760374 806736 811633 666886 610051
2672 610051 598626 751087 834720 830864 815793 757930 944630 987040 828946 1038768 1072972
2661 1072972 1007224 1135831 1080525 1083340 1209964 1095224 1078515 942397 928282 1073951 1001337
2650 1001337 1023110 1037021 1019585 1025171 1231182 1148973 1241503 1481370 1442424 1306919 1474031
2639 1474031 1398596 1364923 1289353 1273779 1425035 1533228 1509426 1688953 1749820 1584040 1475306
2628 1475306 1594001 1638143 1806831 1618299 1542259 1769222 1831407 1633048 1690092 1637067
2618 1637067 1740994 1834062 2028469 2001429 1608772 1654028 1582709 1748278 1952974 1866089
2608 1866089 1833936 1831972 1989968 2057126 1985919 2074880 2112027 1942483 1993209 2104628 2046183
2597 2046183 2015802 2030077 1936539 1673979 1868132 1988518 1666745 1427697 1676713 1825264
2587 1825264 1750239 1744394 1573973 1453419 1480062 1620949 1626527 1500342 1442372 1550988 1693034
2576 1693034 1716690 1700193 1513999 1617760 1664030 1740497 1827411 1736499 1823230 1593771 1483339
2565 1483339 1690905 1561068 1628036 1550538 1391440 1441288 1301233 1270415 1146568 1049577
2555 1049577 896297 929290 1076657 1104474 1072753 1055798 1232301 1000528 826954 912165
2545 912165 942907 865158 873400 671993 668139 660497 745453 765413 897729 908585 727179 671864
2533 671864 868635 831330 904948 755335 696369 839324 737643 752430 582543 422821
2523 422821 351351 546789 448346 363494 412830 321579 417386 441069 367481 543105 422494
2512 422494 359377 258054 117933 233070 426803 542241 330372 487200 256699 161270
2502 161270 384746 368916 237963 200475 248629 308559 433778 375040 433342 474427 395560
2491 395560 389144 337752 288495 222140 205810 69576 115398 138109 42429 358325 395609
2480 395609 312936 199162 119394 216215 195248 172591 104077 139603 198687 237522 209476
2469 209476 94833 103924 207548 349968 -487 -138289 3971 263757 42815 -109023
2459 -109023 18263 85146 227561 268758 264492 164753 42575 22256 93579 165322 407023
2448 407023 510315 331736 274092 154365 173202 108871 -10775 -124959 -57112 208315
2438 208315 281296 322200 256309 379057 349332 386438 470133 141426 143962 34436 -65658
2427 -65658 -204670 -124269 70974 45710 201306 223031 138290 83361 212732 268081 -75199
2416 -75199 28535 65462 180244 100531 24958 119491 148769 213779 185078 199348 110467
2405 110467 121257 225873 280573 284182 299043 293657 280983 329083 446190 357371 484131
2394 484131 548665 615022 618936 779336 691294 463706 528722 640160 756355 715778 618892
2383 618892 870804 808897 609040 626166 458590 324123 519500 516678 534416 418183 432365
2372 432365 390784 301265 220484 297129 338591 359965 443435 277325 442368 461832 206399
2361 206399 181521 241097 276125 290588 133781 223388 183147 146292 83165 295065 494079
2350 494079 420168 247183 209768 110989 157406 219763 128504 20350 127958 126239 321105
2339 321105 236208 -12197 -69809 60015 24757 3017 75735 95431 264685 403537 403433
2328 403433 364298 341081 391626 305659 167272 219531 143184 363229 377951 413422 159244
2317 159244 50314 117919 136600 105634 -33395 1374 169642 134146 188637 13281 67810
2306 67810 125689 108472 52859 179492 120195 247515 369908 117397 46810 198470 276365
2295 276365 249958 308455 237373 325733 227356 110777 180008 176412 282352 174168 128609
2284 128609 339629 206702 97479 132310 280947 476557 480580 436627 475089 405386 433644
2273 433644 558066 331528 243655 473384 551237 328636 533013 674878 485363 353824
2263 353824 309163 339326 180123 290512 549191 591984 671688 717267 533787 487712 581666
2252 581666 495186 438967 643054 694738 604251 589424 680285 769294 666928 673237 516542
2241 516542 566331 571898 484707 489071 670822 695558 749404 858780 722552 774900 644447
2230 644447 657392 834825 843372 724281 612274 463211 533330 537013 903484 1026199 879691
2219 879691 911109 946620 925461 1128481 1098487 1307093 1241200 1061999 1177717 1203418 1262025
2208 1262025 1312977 1176779 1214488 1299970 1338466 1696490 1563679 1569032 1704804 1687532 1784273
2197 1784273 1502117 1786898 1980004 1920212 1923537 1958434 2096944 2117769 2104974 2221463 2569256
2186 2569256 2598212 2355949 2404100 2654571 2660086 2704285 2711678 2841010 2925883 2820708 2783127
2175 2783127 2951874 3200398 3201601 3288259 3467426 3524739 3472031 3430061 3524071 3629175 3714441
2164 3714441 3966893 3854619 3936898 4209193 4391645 4485382 4445006 4373836 4888152 5135910
2154 5135910 5526598 5685800 5959708 6214805 6497637 6905529 7105391 7541316 8110711 8484125
2144 8484125 8768668 9145830 9905100 10447699 10827920 11367992 12311023 13282207 14422149
2135 14422149 15791615 17537007 19061570 20892005 22295777 24058780 26579450 29837313
2127 29837313 33723871 38316681 43430371 50010984 57695579 65726759 75544678 88574140
2119 88574140 103934005 118266413 119786282 98777630 81335485 67040387 53539436
2112 53539436 44074695 37081482 32145150 28321854 25362126 23065714 21699669 20312117
2104 20312117 19251255 18305321 17550065 16274754 14984098 13765803 12937020 11849282 11183623
2095 11183623 10521615 9925807 9300152 8889712 8601520 8674144 8344415 7928982 7341464 6938991
2085 6938991 6676915 6540325 6363078 6210016 6066294 5821276 5524103 5320193 4979040 4668644
2075 4668644 4464641 4322504 4153573 4195373 3962102 3871305 3712226 3640322 3459437 3363332
2065 3363332 3174310 3087904 3110772 3062302 2980826 3096411 2935917 2829885 2882560 2823178 2763539
2054 2763539 2778006 2660396 2827860 2457373 2460517 2587733 2607051 2564830 2426610 2400717 2316036
2043 2316036 2087632 2124478 2280064 2151666 2083410 2032616 1968508 1876181 1721528 1566188
2033 1566188 1516540 1616912 1537950 1473827 1381836 1339401 1338606 1321003 1325427 1438115 1422330 1225936
2021 1225936 1121203 1183097 1268508 1025999 1144801 1167664 1015720 1109050 1109986 1119358 1020871
2010 1020871 960738 941658 916479 944032 912840 785606 946555 977630 913886 697547 818300
1999 818300 1002245 907689 935226 955904 912403 820937 826603 812582 678486 684959 717957 875750
1987 875750 801526 738891 818162 680813 790559 687505 725251 546609 545879 570215 647437
1976 647437 839083 665254 651541 531293 769464 726651 666750 776988 653051 564952
1966 564952 522906 510111 320181 402374 440918 537317 567826 569972 503024 593652 423330
1955 423330 392203 362532 390966 320152 273813 290135 380671 461526 504834 508887 584640 456190
1943 456190 406294 253378 191956 24700 134661 179864 245992 394188 370022 524642 369270
1932 369270 302989 180084 161120 329219 292448 453822 650024 458543 346847 389431
1922 389431 332553 433984 383153 329049 253824 295731 414412 423185 293452 320606 282866
1911 282866 494840 526752 392054 390599 293698 183019 263548 121350 161311 452900 332961
1900 332961 481718 350475 217692 245812 111787 94386 139734 172089 50326 -33299 -10950
1889 -10950 102424 374253 350469 402411 453833 432127 366347 234791 255287 380260 458615
1878 458615 403561 399318 374307 280818 227732 325908 349624 281224 403408 355124 238116
1867 238116 244196 359570 209153 381339 255517 249762 381340 335131 235966 207567 360142
1856 360142 509022 431401 455786 417253 403560 408191 528231 578515 616858 490112 530954
1845 530954 563718 523378 411982 398399 487310 293651 198210 224962 109838 328965 300947
1834 300947 183691 321862 389977 394813 360407 415517 343632 327497 472383 259219 81382
1823 81382 150828 301096 349549 403096 299594 87842 186008 168033 347830 318477 315732
1812 315732 155426 93301 -14974 100786 71432 158115 78539 154094 183737 94742 171947
1801 171947 286311 145075 302657 254729 164923 323615 383644 292897 251645 136684 11168
1790 11168 142465 130336 175118 22531 -198128 -128541 -33640 -89730 -135576 -84476 57286
1779 57286 101480 189130 8164 133211 -96534 127870 209010 264688 281008 422671 515085
1768 515085 167474 155342 135391 95864 187215 27857 -75999 7296 86502 47934 176625
1757 176625 185086 -11647 8442 -28052 22350 105904 215863 138856 -66406 -165646 -68720
1746 -68720 -4336 121995 161301 187366 332182 216800 14223 -26666 87023 53488 -26239
1735 -26239 -25285 -4812 118154 195234 132389 18065 123829 69622 -114058 103877 52756
1724 52756 199728 180027 46044 64397 74428 -9185 -77965 110520 136976 32553 132549
1713 132549 41911 105373 396442 442135 326464 52305 89707 105247 -20797 -4654 29212
1702 29212 -5455 63863 126388 279432 94741 130147 214760 391832 236820 2159 -76907
1691 -76907 35851 75317 58847 172015 310195 189785 284100 27421 -95511 18983
1681 18983 -71748 -3745 95509 -75429 -17912 -12210 49940 164231 114798 97275 30946 -10388
1669 -10388 124700 90430 -87098 116226 22573 -20105 -25072 -66581 -69294 24535 175413
1658 175413 -37189 -78616 -11720 42341 32408 188640 196754 95658 43914 -65526 -79884
1647 -79884 -24122 61593 133502 17033 34984 177735 -54547 -64054 -33633 161092 432416
1636 432416 45171 74561 -15412 -89581 33062 92577 152997 85466 113383 6679 -55772
1625 -55772 -66752 44434 183654 175013 178436 218582 107945 123207 241758 285572 130256
1614 130256 102906 130852 110245 158766 74001 -26576 74764 69169 222886 188438 241390
1603 241390 159347 225416 50703 14540 206007 210499 -43613 -23919 265555 138922 151800
1592 151800 272749 253735 173036 124939 126720 -10799 67891 -87047 -66311 -311619 -73266
1581 -73266 -115873 140865 -25209 -127934 -159306 31716 124374 95010 -64602 -123827 135810
1570 135810 -37664 -31390 180195 166510 59023 109267 156284 76168 -114154 -107051 -157075
1559 -157075 -151301 -132037 83718 145819 55600 3400 -3601 -80337 -18792 58402 -7668 -8523
1547 -8523 107601 -129865 -180114 41116 187886 59922 61716 90382 -124957 24108 -44600
1536 -44600 -17499 53593 22647 253757 1889 -132743 218367 55069 -11046 141363 113099
1525 113099 184795 -63304 28517 -93771 29075 2507 82820 -9339 -21908 59355 222368
1514 222368 229191 82262 108537 22310 107898 204804 121649 -52862 -95165 95499 -58763
1503 -58763 135359 191637 89005 -61770 70772 -127956 -108226 -56877 9939 43440 92193
1492 92193 89833 119396 204543 93122 11823 74549 71122 121829 210300 120672 -4874 163433
1480 163433 223948 66940 141582 270752 264096 231724 174873 179988 134237 153851 106890 7628
1468 7628 -26518 -133708 -78765 -117011 -211315 -58645 -8122 49278 -113300 -76661 122261
1457 122261 -63254 -104680 -95953 -135302 15056 12551 -156650 41766 98464 -9262 -62941
1446 -62941 43135 128391 143946 144030 168644 -4628 -111281 -105083 17618 148870 21732
1435 21732 -141310 86855 171135 214914 -31820 24503 -43505 110424 104332 205740 60757
1424 60757 -53575 -24579 -2554 116376 247689 193464 175169 -66604 98780 88344 71095
1413 71095 151615 167553 116209 38894 47334 245597 46607 -61367 69710 -80457 -152172
1402 -152172 -77187 -225135 -274485 -191123 -42867 60692 -200169 -268991 -63045 228056
1392 228056 158598 262108 206516 212482 75015 51152 73307 -61651 20432 112592 -13822
1381 -13822 4800 174871 5686 -96395 -6611 194065 255790 81707 -21948 -76792 71636
1370 71636 -157229 -248819 -137712 -42241 1811 -120314 279594 94625 -113718 30118
1360 30118 -16640 -62885 -124293 93223 241937 280076 172796 335329 286400 180904 79146
1349 79146 1145 61319 202391 197939 177580 124821 93973 52204 -138166 -98063 -70120 -108020
1337 -108020 -4924 142646 162752 165248 211748 199253 331837 452766 327425 251261 303312
1326 303312 242751 53851 -41491 42840 -46865 134026 291196 174890 -22700 -87472 -128227
1315 -128227 18239 23344 -28829 9463 81938 186255 27125 223405 209549 148143 284285
1304 284285 137260 -16129 -65855 -77272 4347 99260 156554 97055 -112928 -71511 -28535
1293 -28535 10792 -63942 -30908 31080 36709 -53496 -187596 -177418 -49031 19192 -138851
1282 -138851 -175915 -127658 -250451 -25911 -50056 -212541 -76172 -191577 -217223 -82243
1272 -82243 63106 -26127 -25062 57252 119091 32232 -11528 96827 87111 64855 18907 74951
1260 74951 21638 27532 65286 38763 55745 28531 -36005 -46688 79676 173713 2934 -19966
1248 -19966 62533 164798 20517 -139736 -28520 112397 -12382 -174943 -198695 77037
1238 77037 209658 85460 -50234 -73577 -7002 -67375 98157 166633 55110 -28582 -13293
1227 -13293 -181110 -59668 75542 207583 110271 205544 193524 5047 49763 33708 -27288
1216 -27288 -192277 64370 -15020 -81458 60481 13624 -139877 -56882 3246 -90749 3977
1205 3977 -10636 254598 141443 -26245 -43864 -50553 124572 84910 -72755 -248380 -123308
1194 -123308 80186 -90770 -305837 -31394 231424 267738 100264 45957 184830 168490
1184 168490 -95477 -137878 144274 33560 4028 -173817 -358580 -234210 -118740 -40931
1174 -40931 19534 -190243 -30365 -46220 16630 -197427 24419 -138802 6250 9863 -88211
1163 -88211 -98489 -88372 31226 111448 260460 130951 35125 -121222 13404 223915 354040
1152 354040 204552 -2610 36504 157880 93263 139156 -7789 -18801 18549 63478 127092
1141 127092 99272 -8313 179651 46366 64989 229026 -11840 -103604 48968 104226
1131 104226 201155 95964 112709 40851 -144580 -43509 -74188 76228 178950 82698 -33128
1120 -33128 14684 63639 142081 202683 54091 151982 75819 185803 51030 4937 73254
1109 73254 104777 32173 21142 30049 139861 144022 -16795 141360 170695 117671 91444 -64342
1097 -64342 -87747 78280 65796 -4008 -60389 -96461 -75812 61477 -147101 -437712 -203333
1086 -203333 -266989 -156402 46293 1399 72428 8851 -82436 -75333 13178 134376 166801
1075 166801 67605 -138863 -297952 -130105 -105 -116557 -72602 -186047 -37174 120725
1065 120725 -3669 -29764 70191 20279 -135949 47521 -19811 -112130 -69205 -78572 -160271
1054 -160271 -169896 -43781 39453 19201 -187785 -200204 -273392 4312 123082 32023 -6204
1043 -6204 33364 -101216 -326473 -110852 -124995 -100232 -7587 -14509 -160569 41413 93897
1032 93897 62674 96607 -12300 -169647 33482 273135 119237 20889 -92438 -215832
1022 -215832 -238109 -230546 -161040 -48855 61418 -55694 -51074 -114547 -193833 -18882 12448
1011 12448 147050 -63842 -122940 146620 39465 -48669 111340 108890 63895 27441 -153623
1000 -153623 -250923 -121435 -72096 10202 162314 21874 -5663 68239 183642 109424 -208952
989 -208952 -263004 -273717 -190913 -104846 43067 57287 -43177 116162 178631 72437 -3655
978 -3655 -1715 36097 27703 -49479 -21809 91820 256645 65021 -125527 -142314 -199689 -69671
966 -69671 -194220 -212969 11008 -17348 1617 67838 21873 -92439 63495 -4050 -76696
955 -76696 -83872 183992 69877 63705 -72521 -16844 -58577 -116786 42102 20977 169731
944 169731 76292 -58463 -8843 83056 64416 28373 29798 92020 23915 -162020 84335
933 84335 44656 -31262 147649 14740 -90840 40475 4136 109752 135074 145043 178983
922 178983 26394 35064 -58464 -70322 -49619 30006 -89001 -217993 -239728 -181692 -187416 -219821
910 -219821 -167632 -280360 -315958 44109 -23337 -107436 -224544 -120317 8813 206382 199899
899 199899 37698 -44281 -137432 -222149 -320826 -66038 -24664 -97954 -78134 -103846 -9920
888 -9920 -197284 -62320 -95308 -29017 3731 -12661 -23565 -164218 -35653 -153896 -4219
877 -4219 -98868 -188547 -13218 -7435 146060 47092 -12953 -162961 -156120 -5655 137505 35174
865 35174 -91907 -54501 -91555 -93143 -15653 185723 65942 -28848 26458 47089 91124 -284924
853 -284924 -178801 25440 -86116 -163516 -87256 34148 283651 308996 55926 19713 132891
842 132891 -49738 -167367 -86661 3368 -34730 -168978 -185531 -135192 -41610 -14400 7759
831 7759 -118170 -151864 -222467 -187834 -173201 -148874 11662 -120109 -95774 128325 184041
820 184041 294952 62186 -177836 -223281 78835 57299 -44347 -34392 218997 201528 -92060
809 -92060 -169153 31945 -54280 -199714 -172868 74989 33586 -93068 -95046 -190150 -181968 87237
797 87237 200241 25575 167967 260188 135813 133945 19660 -128721 -139431 -44961 87383
786 87383 214945 -97335 -1370 45524 -129949 -290306 -330491 -285922 -236104 -3747 97257
775 97257 101274 4133 208622 71150 -35259 -177221 -71421 4769 27158 -24791 -71442
764 -71442 107119 -27665 -183072 -318351 -192632 -229657 -89597 -64008 -34406 -157491 -92767
753 -92767 67709 29030 76619 25775 1378 -79362 -84583 -46338 -59306 -142101 -139701 -140480 2439
740 2439 -45877 90799 -53353 -107358 116742 37813 -31256 72994 -42179 -38011 -68931
729 -68931 57002 -152430 -278098 -174862 41822 107078 46106 1235 132571 76054 -88637
718 -88637 -111456 -298024 -205085 -64282 -67866 5750 -78149 -244534 -346818 -295084 -209095
707 -209095 -99958 82081 97526 78515 42296 64493 -89404 -183326 -95303 -89638 -207963
696 -207963 -177879 -133376 -13814 -82434 -205114 -58441 -111291 -127255 -37480 124399 -79063
685 -79063 -22138 -17482 -184454 683 29283 -158480 -263749 -67267 -34599 -56383 9050
674 9050 98514 98634 2654 147103 368029 399208 255955 -119997 -156371 -235832 -304994 -200485
662 -200485 -172643 -161147 -193081 -90481 116570 86136 30532 -59408 34640 293291 273234
651 273234 10960 -4027 220370 38286 -151606 77220 38480 -49520 46691 -71861 -116067
640 -116067 -75923 -92415 -145800 -144210 -126155 -202651 67050 96008 128918 -50231 -201839
629 -201839 -213096 -135729 -134572 -62112 -88996 26317 78552 -157727 -155148 -22034 -95928 -64600
617 -64600 25343 -39814 -54837 -42443 91492 165493 123565 68316 -8222 -159092 -123638 -67434
605 -67434 -43270 91324 30475 -110006 -166254 -169201 -8664 1091 -23028 -197921 -232601 -70411
593 -70411 -134868 -78536 103019 -54238 -106244 -80777 105048 180300 55442 13715 -139751
582 -139751 -223185 -312001 -277000 -27638 -5997 -9113 7659 -3097 48555 171475 23381
571 23381 48014 13442 18904 -3038 -46333 47357 149697 39615 27869 107000 904 -29727
559 -29727 51297 72548 75770 -53072 -25791 -42883 193962 244613 140716 54588 19562 -28895
547 -28895 29898 -4231 -245850 -306591 -235159 -41583 -114017 -161042 -172713 -138999 -132008 -9091
535 -9091 -135210 -165993 -203406 -246663 -37728 -145361 -305276 -206102 -99940 41926 -181223
524 -181223 -279753 -10947 990 -92993 62235 30371 -46989 -25730 -99632 32150 -105414
513 -105414 -145699 -135206 -220590 -35963 77621 -47345 -121648 22118 84839 63481 51456
502 51456 74478 -15028 130875 78921 99695 37393 -149032 -309668 -162367 -223446 -92359
491 -92359 214275 177087 21162 -175087 -130586 -22793 53212 -95603 -182249 -214510 -130812
480 -130812 40002 81420 -48373 -31330 -68581 -98579 -168668 -251367 -251712 -177273 -59489 -22739
468 -22739 -76340 -101215 -113260 -63210 -59874 112260 94292 -103971 -105409 -245924 -201360 10738
456 10738 -60815 -147263 -96199 23311 86613 -1784 51294 83237 -208052 -104721 18653
445 18653 -207840 -154318 -217973 54366 27985 37962 210479 -20142 -29233 -40126 -136113 -55442
433 -55442 -61639 7293 89017 -129177 -59920 102790 -30114 -183655 -180822 189519 131993
422 131993 184071 124351 18888 -6584 -76713 42137 -27984 -287251 -123281 -14651 -183474
411 -183474 -181754 -295920 -153509 -251889 -55059 -54283 -197825 -159939 -106020 45073 194470
400 194470 245601 72629 5261 106230 -65534 -221754 17285 -81611 -153859 -107890 28567
389 28567 -206856 -297230 -73303 39496 151735 263527 120986 87606 74972 -193194 -287215
378 -287215 -127529 -119568 -182207 -308488 -422842 -178987 -310574 -280789 -266158 -221341 -131816
367 -131816 -83996 -60435 63954 -3086 136122 155010 -44474 -26385 -105317 -197144 -85008
356 -85008 -94623 54636 12173 -8781 32965 58816 -63831 26635 -69001 -5634 -33681 -10270
344 -10270 89751 262946 153011 -163184 -73759 -45568 -92164 -181422 118286 -70510 -58268
333 -58268 109471 -16198 -21013 -127013 -178210 -44091 90472 71882 -69780 -213172 -163994
322 -163994 -137372 -235027 9031 46463 -302799 -239268 4208 -220887 -179412 -257897 -90719
311 -90719 -13437 -58211 -180817 -138742 -160807 -218381 -237218 -98609 -19203 -52144 -60338 -16972
299 -16972 -57279 -146121 -47278 27207 -14437 -80196 -157310 -54784 214279 -4330 -165255
288 -165255 -147908 33162 91689 27764 26440 -13845 -46126 22934 -77239 46161 -136783
277 -136783 -110863 25292 42613 208343 -34761 -105800 -293047 -239991 -67028 -22165 111274
266 111274 51960 -71341 -185500 -9872 61415 -124142 -295402 -425038 -407234 -442804 -379469
255 -379469 -308238 -40865 -196837 -209079 -172600 -192994 12450 229382 4037 -37892 58213
244 58213 134092 43699 -75063 -57916 76642 67861 -14230 7581 -126635 -193677 -257918 -72507
232 -72507 -84844 50449 5013 -170515 -215940 -109320 -138128 -58105 15310 -30886 -63098
221 -63098 88342 49580 -141568 93003 126468 63444 -100798 -158823 -82119 -59708 9591
210 9591 -148956 -123735 -133263 115955 66757 128741 -27043 -113475 -17909 59500 -30092 -33047
198 -33047 -208376 -171251 64864 71211 -80260 -133999 -178541 -33394 84387 62714 95264
187 95264 6717 -123568 -240516 -259623 -328761 -84862 95443 -61283 -203169 -124853 -164447
176 -164447 -71177 -115009 -43348 -171411 16739 -21397 20561 -147745 -305850 -338191 -353529
165 -353529 -413075 -211285 -84508 14517 55353 86189 -54632 -206419 -143596 -107399 -189228
154 -189228 -178239 -134174 -22968 31171 -92392 -15118 33614 67712 -107577 -127434 -64958
143 -64958 60611 -29876 7744 209578 167171 108863 6300 -106247 -208403 -143376 -39461
132 -39461 -31350 61772 -109071 -182699 -152393 -24700 40120 69242 -77729 -110677 -97033 101794
120 101794 78416 -100399 55880 119626 -70599 -139589 -109697 -101075 -52204 68166 -37611
109 -37611 -180868 -225404 -204517 -82310 -94058 -160684 -200824 -112521 -135203 -134081 -289566 -254808
97 -254808 -63688 -22464 -186429 -91475 -42409 -38997 -56797 -118810 -45228 -9062 166837 100025
85 100025 54722 -134380 -219629 -223946 -121959 -66181 -70250 -326 -61101 -122934 -41346 -26625
73 -26625 3293 51489 51872 -82255 -25343 18128 -57696 -136903 -22182 -129148 -125390 -135527
61 -135527 -213248 -188313 -219007 -301084 -266051 -207342 -228378 -213560 -185603 -267103 -204278 -93018
49 -93018 -162193 -99081 -108964 21609 28854 -21715 -6330 -12334 13396 108574 102108 81990 -31635
36 -31635 -140084 -114237 22426 36668 144884 -95981 58764 148597 112988 106521 -49643
25 -49643 -72739 -94203 -155578 -128294 -91000 -74849 21328 19653 -112472 6760 -59292 33309
13 33309 -5630 -231085 -78189 -93105 -77888 610 -24622 -214708 -239539 -184894 -115071 -145756
1 -145756 -210134
0 -210134
$$ Imaginary data points
##PAGE= N=2
##DATA TABLE= (X++(I..I)), XYDATA
16383 -1439244 -1352971 -1468995 -1467215 -1304366 -1250439 -1279793 -1240772 -1195118 -1190703 -1285136 -1110469
16372 -1110469 -1028754 -1221462 -1123037 -995765 -1006278 -1040536 -1033315 -1000780 -976256 -976006 -934172
16361 -934172 -931684 -873795 -927397 -813844 -744254 -563285 -635363 -668718 -582102 -562230 -502843
16350 -502843 -533635 -561265 -539332 -386725 -420581 -517645 -430246 -367923 -290579 -304107 -238875
16339 -238875 -193764 -295729 -288304 -163831 -63533 -132159 -16732 14479 -59170 49011 -13206
16328 -13206 50081 115415 180701 60876 52846 75470 7061 98443 154085 205147 296644 313613
16316 313613 419163 432432 354793 217906 344579 357039 487574 647153 459259 597390
16306 597390 689420 643995 529888 653732 715576 729647 755827 779194 917279 991319 868833
16295 868833 882812 689259 808859 809321 864925 983667 902462 836364 834437 1084916 1021587
16284 1021587 1076399 1097044 1057453 1083201 1202695 1216106 1246265 1275681 1165089 1147466 1143314
16273 1143314 1351991 1488774 1429930 1486916 1374300 1492953 1557085 1375050 1329786 1417725
16263 1417725 1437822 1372295 1443482 1440211 1541724 1561032 1485563 1388760 1619382 1620031 1586332
16252 1586332 1715714 1722922 1704437 1769415 1801119 1718904 1766644 1877487 1927578 1869895 1840079
16241 1840079 1968637 2068336 2154783 2175218 2000193 1745206 1851179 1966931 2140218 1964197
16231 1964197 1938495 1972962 2043323 2088275 2003780 2173066 2290086 2196262 2125670 2229453 2177419
16220 2177419 2216582 2064779 2059437 2088986 2071201 2044998 2250382 2398164 2514576 2576434 2522511
16209 2522511 2403905 2317641 2313688 2381662 2349417 2371472 2403857 2369671 2429003 2501249 2581562
16198 2581562 2611205 2463859 2493277 2445916 2424636 2584979 2490538 2316688 2419594 2585136
16188 2585136 2365765 2378720 2467903 2465763 2595899 2382352 2570765 2549245 2524735 2611243 2612574
16177 2612574 2620208 2367427 2388659 2442738 2567430 2734569 2788022 2911403 2930060 2821551
16167 2821551 2938076 2762791 2745392 2755842 2682920 2455531 2426340 2592173 2652633 2657144 2752745
16156 2752745 2623513 2780941 2811224 2804206 2880400 2805038 2700667 2902973 2935556 2833491
16146 2833491 2968405 3044891 2962968 2771971 2918441 2862178 2893940 2941057 2918477 2735852
16136 2735852 2687809 2708888 2634905 2689665 2687493 2764141 2765092 2651833 2661296 2847849 2911180 2767023
16124 2767023 2686309 2822438 2957192 2922905 2891748 2899207 3003979 2861931 2862402 2937700 3003810
16113 3003810 3130178 3241228 3153963 2874031 2748552 2824696 2779966 2819073 2991238 2852248
16103 2852248 2752524 2855311 2872928 2821986 2744263 2918257 3001865 2972335 3082315 3083290 2922940
16092 2922940 2792298 2886456 2952009 2627577 2888925 2914007 2851062 2955138 2997636 2896281
16082 2896281 2863901 2876136 2836357 2885846 3066533 2962229 2998193 3079161 2910344 2913540 2838280
16071 2838280 2950789 2964984 3079171 3134989 2939405 3072007 3197763 3081252 3107897 3028406
16061 3028406 3151063 3018601 2846918 2851616 2936870 3013091 3177771 3103366 3128527 3419636
16051 3419636 3354388 3164479 3131467 3212435 3261056 3162172 3265194 3060188 2985550 2930366 2876709
16040 2876709 2925969 3055172 3013384 3101946 3207827 3103844 3241577 3009700 3002109 3013655
16030 3013655 3025655 3025121 3064318 2944303 2848451 2952833 2914403 2759191 2980307 3075318 3185271
16019 3185271 3237948 2990170 3183996 3152691 3185998 2971910 2889869 3170058 3042378 2867582
16009 2867582 2765807 2911682 3046633 3201849 3241374 2998909 3065204 3075604 2908012 3127612
15999 3127612 3149012 3049363 3181738 3115206 2845730 2831992 2903503 2824541 2838626 2952449 3154603
15988 3154603 3018261 3032191 2968003 3132379 3006282 3024803 3117881 2919408 2893654 2928641
15978 2928641 3114905 3103320 3081249 2998661 3001817 3093741 3136275 3232758 3279488 3176853 3273758
15967 3273758 3221589 3212736 3191453 2976650 2935553 2797380 2788090 2731723 2845332 2944219 2914987
15956 2914987 2951328 2963526 2964374 2975692 3099198 3131062 2988898 3044641 2992794 3026227 3043854
15945 3043854 3046778 3081458 2915121 2839687 2915279 3084605 3134587 3122785 3000077 3098874 3130202
15934 3130202 3227896 3203000 3251130 3373336 3361145 3310905 3392759 3223754 3077064 3351308
15924 3351308 3274071 3066502 3190044 3228978 3167892 3207098 3112796 3304374 3252791 3082713
15914 3082713 3025795 3231345 3195574 3136898 3157993 2982230 3123118 3083192 3081978 2960718 2910812
$$ [...]
##END NTUPLES=NMR SPECTRUM
##END=
