##TITLE=1H_EC-3265(5)
 CDCl3
 8 sc, 
 14.12.2021
##JCAMPDX= 6.0         $$ Bruker NMR JCAMP-DX V2.0
##DATA TYPE= NMR SPECTRUM
##DATA CLASS= NTUPLES
##ORIGIN= UXNMR, Bruker Analytische Messtechnik GmbH
##OWNER= root
$$ XWIN-NMR		Version 3.5
$$ Tue Dec 14 12:53:58 2021 Russian Standard Time (UT+4h)  she@DPX200
##.OBSERVE FREQUENCY= 200.131346
##.OBSERVE NUCLEUS= ^1H
##.ACQUISITION MODE= SIMULTANEOUS
##.ACQUISITION SCHEME= undefined
##.AVERAGES= 8
##.DIGITISER RES= 18
##SPECTROMETER/DATA SYSTEM= spect
##.PULSE SEQUENCE= zg30
##.SOLVENT NAME= CDCl3
##.SHIFT REFERENCE= (INTERNAL, CDCl3, 0, 15.7182)
##AUDIT TRAIL= $$ (NUMBER, WHEN, WHO, WHERE, WHAT)
$$ ##TITLE= Audit trail, XWIN-NMR		Version 3.5
$$ ##JCAMPDX= 5.01
$$ ##ORIGIN= Bruker BioSpin GmbH
$$ ##OWNER= she
$$ F:/spectra/data/she/nmr/H-F/1/pdata/1/auditp.txt
$$ ##AUDIT TRAIL=  $$ (NUMBER, WHEN, WHO, WHERE, WHAT)
(   1,<2021-12-14 12:52:42.64 +0400>,<she>,<DPX200>,
      <created by zg, POWCHK disabled, PULCHK disabled
       configuration hash MD5:
       00 E9 B6 7A A2 85 ED C7 34 08 36 98 17 FE 4E 26
       data hash MD5: 16K
       F2 33 37 4C F8 58 22 11 8B 85 BA EF 31 B7 FB 5C>)
(   2,<2021-12-14 12:52:45.04 +0400>,<she>,<DPX200>,
      <Start of raw data processing
       efp BC_mod = 2 LB = 0.24 FT_mod = 6 PKNL = 1 PHC0 = -15874.94 PHC1 = 10.4008 SI = 16K 
       data hash MD5: 16K
       B5 AF 38 B3 10 A1 91 76 04 B8 6C 86 99 C8 8F B7>)
(   3,<2021-12-14 12:53:04.78 +0400>,<she>,<DPX200>,
      <pk PHC0 = 4.966846 PHC1 = -1.4 
       data hash MD5: 16K
       1D E1 1C 53 A1 86 6C 68 7C D1 15 0B F8 C2 D7 E4>)
(   4,<2021-12-14 12:53:08.10 +0400>,<she>,<DPX200>,
      <abs ABSG = 5 
       data hash MD5: 16K
       22 95 FD BA 12 F6 DB CC 64 D0 C9 F1 30 14 34 8C>)
$$ ##END=
$$ 
$$ hash MD5
$$ 3A 0E 44 00 C1 87 56 B8 28 2C 88 42 B0 DC C1 50
##$RELAX= 
##$RELAX= 
##$RELAX= 
##$RELAX= 
##$RELAX= 
##$RELAX= 
$$ Bruker specific parameters
$$ --------------------------
##$DU= <F:/spectra>
##$EXPNO= 1
##$NAME= <H-F>
##$PROCNO= 1
##$TYPE= <nmr>
##$USER= <she>
##$AMP= (0..31)
100 100 100 100 100 100 100 100 100 100 100 100 100 100 100 100 100 100 
100 100 100 100 100 100 100 100 100 100 100 100 100 100 
##$AQSEQ= 0
##$AQ_mod= 1
##$AUNM= <au_zg>
##$AUTOPOS= <>
##$BF1= 200.13
##$BF2= 200.13
##$BF3= 200.13
##$BF4= 200.13
##$BF5= 200.13
##$BF6= 200.13
##$BF7= 200.13
##$BF8= 200.13
##$BYTORDA= 1
##$CFDGTYP= 0
##$CFRGTYP= 5
##$CHEMSTR= <none>
##$CNST= (0..31)
1 1 145 1 1 1 1 1 1 1 1 1 1 1 1 1 1 1 1 1 1 1 1 1 1 1 1 1 1 1 1 1 
##$CPDPRG= <>
##$CPDPRG1= <>
##$CPDPRG2= <>
##$CPDPRG3= <>
##$CPDPRG4= <mlev>
##$CPDPRG5= <mlev>
##$CPDPRG6= <mlev>
##$CPDPRG7= <mlev>
##$CPDPRG8= <mlev>
##$CPDPRGB= <>
##$CPDPRGT= <>
##$D= (0..31)
0 1.2 0 0 0 0 0 0 0 0.06 0 0.03 0 0 0 0 0.0002 0 0 0 0 0 0 0 0 0 0 0 0 
0 0 0 
##$DATE= 1639471961
##$DBL= (0..7)
120 120 120 120 120 120 120 120 
##$DBP= (0..7)
150 150 150 150 150 150 150 150 
##$DBP07= 0
##$DBPNAM0= <>
##$DBPNAM1= <>
##$DBPNAM2= <>
##$DBPNAM3= <>
##$DBPNAM4= <>
$$ [...]
##$SUBNAM2= <"">
##$SUBNAM3= <"">
##$SUBNAM4= <"">
##$SUBNAM5= <"">
##$SUBNAM6= <"">
##$SUBNAM7= <"">
##$SUBNAM8= <"">
##$SUBNAM9= <"">
##$SW= 18.0517287032376
##$SWIBOX= (0..15)
0 0 2 0 0 0 0 0 0 0 0 0 0 0 0 0 
##$SW_h= 3612.71676300578
##$TD= 16384
##$TD0= 1
##$TE= 0
##$TE2= 300
##$TE3= 300
##$TEG= 300
##$TL= (0..7)
0 120 120 120 120 120 120 120 
##$TP= (0..7)
150 150 150 150 150 150 150 150 
##$TP07= 0
##$TPNAME0= <>
##$TPNAME1= <>
##$TPNAME2= <>
##$TPNAME3= <>
##$TPNAME4= <>
##$TPNAME5= <>
##$TPNAME6= <>
##$TPNAME7= <>
##$TPOAL= (0..7)
0.5 0.5 0.5 0.5 0.5 0.5 0.5 0.5 
##$TPOFFS= (0..7)
0 0 0 0 0 0 0 0 
##$TUNHIN= 0
##$TUNHOUT= 0
##$TUNXOUT= 0
##$USERA1= <user>
##$USERA2= <user>
##$USERA3= <user>
##$USERA4= <user>
##$USERA5= <user>
##$V9= 5
##$VALIST= <valist>
##$VCLIST= <CCCCCCCCCCCCCCC>
##$VD= 0
##$VDLIST= <DDDDDDDDDDDDDDD>
##$VPLIST= <PPPPPPPPPPPPPPP>
##$VTLIST= <TTTTTTTTTTTTTTT>
##$WBST= 1024
##$WBSW= 4
##$XGAIN= (0..3)
0 0 0 0 
##$XL= 0
##$YL= 0
##$YMAX_a= 152254
##$YMIN_a= -254877
##$ZGOPTNS= <>
##$ZL1= 120
##$ZL2= 120
##$ZL3= 120
##$ZL4= 120
##$ABSF1= 15.76782
##$ABSF2= -2.284031
##$ABSG= 5
##$ABSL= 3
##$ALPHA= 0
##$AQORDER= 0
##$ASSFAC= 0
##$ASSFACI= 0
##$ASSFACX= 0
##$ASSWID= 0
##$AUNMP= <proc_1d>
##$AZFE= 0.1
##$AZFW= 0.1
##$BCFW= 0
##$BC_mod= 2
##$BYTORDP= 0
##$COROFFS= 0
##$CY= -3
##$DATMOD= 1
##$DC= 0
##$DFILT= <>
##$DTYPP= 0
##$F1P= 0
##$F2P= 0
##$FCOR= 1
##$FTSIZE= 16384
##$FT_mod= 6
##$GAMMA= 0
##$GB= 0
##$INTBC= 1
##$INTSCL= 0
##$ISEN= 128
##$LB= 0.24
##$LEV0= 0
##$LPBIN= 0
##$MAXI= 10000
##$MC2= 0
##$MEAN= 0
##$ME_mod= 0
##$MI= 1.114404
##$NCOEF= 0
##$NC_proc= -7
##$NLEV= 6
##$NOISF1= 3.799351
##$NOISF2= 2.8
##$NSP= 0
##$NTH_PI= 0
##$NZP= 0
##$OFFSET= 15.71824
##$PC= 1
##$PHC0= -15869.97
##$PHC1= 9.0008
##$PH_mod= 1
##$PKNL= yes
##$PPARMOD= 0
##$PSCAL= 0
##$PSIGN= 0
##$REVERSE= no
##$SF= 200.130006666648
##$SI= 16384
##$SIGF1= 3
##$SIGF2= 2
##$SINO= 5.538805
##$SIOLD= 16384
##$SREGLST= <1H.CDCl3>
##$SSB= 0
##$STSI= 16384
##$STSR= 0
##$SW_p= 3612.71676300578
##$SYMM= 0
##$S_DEV= 0
##$TDeff= 16384
##$TDoff= 0
##$TI= <>
##$TILT= no
##$TM1= 0
##$TM2= 0
##$TOPLEV= 0
##$USERP1= <user>
##$USERP2= <user>
##$USERP3= <user>
##$USERP4= <user>
##$USERP5= <user>
##$WDW= 1
##$XDIM= 16384
##$YMAX_p= 511424040
##$YMIN_p= -505493
$$ End of Bruker specific parameters
$$ ---------------------------------
##NTUPLES= NMR SPECTRUM
##VAR_NAME=  FREQUENCY,     SPECTRUM/REAL,   SPECTRUM/IMAG
##SYMBOL=    X,             R,               I
##VAR_TYPE=  INDEPENDENT,   DEPENDENT,       DEPENDENT
##VAR_FORM=  AFFN,          ASDF,            ASDF
##VAR_DIM=   16384,         16384,           16384
##UNITS=     HZ,            ARBITRARY UNITS, ARBITRARY UNITS
##FACTOR=    0.220516191357247, 1,           1
##FIRST=     3145.69143280807, 0,            0
##LAST=      -467.025330197713, 0,           0
##MIN=       -467.025330197713, -505493,     0
##MAX=       3145.69143280807, 511424040,    0
$$ Real data points
##PAGE= N=1
##DATA TABLE= (X++(R..R)), XYDATA
$$ [...]
7129A1847244M14662Q93954M86002O64303O95127O86002J082226R36873P33280
7120A8439673R59609J572176J851104J820700K231935K642024L051477L623187
7112C6191885M342228N022775O386634P513952Q957898J0016398J1527674J3219324
7104A03178768J5175506J5151780J2198341M874956n218217j3120333j9207655
7097A13033146j8840537j6739791j3147704r551286p018223n229262m359023l952870
7089C4194450l321093k802425k293428k187172j868934j513057j465530j060042
7081A7682769j377194j086837r26725p00005m66234o19812o73460l26249l96637
7072A1109616n58693l07653k77136l82819l81830l03688k79478j91218l16408
$$ plain form
7129 11847244 12261906 13155860 13641862 14306165 15001292 15687294 16769520 17706393 18439673
7120 18439673 19399282 20971458 22822562 24643262 26875197 29517221 32568698 36191885
7112 36191885 40534113 45556888 51943522 59457474 68415372 78431770 89959444 103178768
7104 103178768 118354274 133506054 145704395 150579351 145361134 132240801 113033146
7097 113033146 94192609 77452818 64305114 54753828 47735605 42506343 38147320 34194450
7089 34194450 30873357 28070932 25777504 23590332 21721398 20208341 18742811 17682769
7081 17682769 16305575 15218738 14292013 13592008 13125774 12505962 11832502 11506253 11109616
7072 11109616 10550923 10243270 9966134 9583315 9201485 8897797 8618319 8427101 8110693
7063H110693l03230m69949m35334j07102k14691p6160m04127k45604j61017o3335
7053E630144L3532q6573k00395k01929j35649Q1406o7893j4321p0025K4280R5525
7042E088102P3717Q6246M3790K01836j58135r9138k03601k90879n21369k81944
7032C938625R1422l39038l66924j72802Q9740n572j49537j00376p7494r1806p9971
7021B736267j94963j19171l5034M3323k9248j78436k5149p0661j75102L4685k01375
7010A785136p150n0887N9023j6819P823j00961q7338j04200m8957Q8152J30916
6999A654738j56216j36175O8990N5956j55893j70770O7598r5342j19140J1972
6989A025718K88650L0691n3648j67240q8272r628R4593m0184J71230p9961j83380
$$ plain form
7063 8110693 7807463 7337514 6902180 6795078 6580387 6504227 6100100 5854496 5693479 5630144
7053 5630144 5663676 5577103 5376708 5174779 5039130 5120536 5052643 5038322 4968297 4992577 5088102
7042 5088102 5161819 5248065 5291855 5493691 5335556 5236418 5032817 4741938 4220569 3938625
7032 3938625 4030047 3691009 3324085 3151283 3241023 3235451 3085914 2985538 2908044 2816238 2736267
7021 2736267 2541304 2422133 2387099 2430422 2401174 2222738 2197589 2126928 1951826 1986511 1785136
7010 1785136 1777986 1727099 1786122 1769303 1777126 1676165 1588827 1484627 1435670 1523822 1654738
6999 1654738 1498522 1362347 1431337 1487293 1331400 1160630 1228228 1132886 1013746 1025718
6989 1025718 1314368 1345059 1291411 1124171 1035899 1026271 1120864 1080680 1251910 1171949 988569
6978I88569P0723p9595j643n656j43223n193Q0225R8178P283j72646Q0459q8012
6966H29469m4247J27236n8772K0321j24044l9261j25129Q5012k8746j14480k8760
6955D98599K7340J18084q4015R1010n4885l0835L3183K19264K86722j28638m9850
6944I25979j82883M8941l9606m8302l22014o8344L17466P7717j14929K3487j13249
6933E04263J70233j28053J86239j4472j76844l9232J9039M4613M4874M736j32576
6922D82820p4039Q2432j76331j15924J13498J13397p8592N4871J29436j70485
6912C61083J74805j41769O7244J35624n0743j11175j69148j57708J57291O5622
6902C31126M6042j41435K1630P3583N2335M4663l5848j71048k1680J03012p614
$$ plain form
6978 988569 1059292 979697 978054 972398 829175 823982 904207 1002385 1009668 837022 917481 829469
6966 829469 785222 912458 853686 874007 749963 710702 585573 670585 641839 527359 498599
6955 498599 525939 644023 560008 651018 596133 565298 598481 817745 1104467 975829 925979
6944 925979 743096 792037 752431 704129 382115 313771 631237 708954 594025 617512 504263
6933 504263 674496 546443 732682 718210 541366 502134 521173 565786 610660 615396 482820
6922 482820 408781 491213 314882 198958 312456 425853 347261 402132 531568 361083
6912 361083 535888 394119 461363 596987 546244 435069 265921 108213 265504 331126
6902 331126 377168 235733 257363 330946 383281 427944 392096 221048 199368 302380 294766
6891B94766j48985K42746%r0178j32107K46036j01835K8714r8409j54681J57240
6880B43307J57094P9277p2756j33712p2037Q6788r590p3246J71306r4119M4169
6869C26481r0128p3693J75646Q7085j46556j54660J40512r1248q5846J1824j20863
6858b1446J21002m7857K6290J54816n6131J04298j19918j19227K06625r826j4678
6847B23948J06743j10036J30103K49788l44624r0818K09302j03270r2339Q634
6837A87431M8433j25670J48345N6668M2819k71362N1280J98373j50121n5614P1512
6826B02094p1598k3937k24048K24706J37046k3122r2626M4347p760j57959N5583
6815F2726J7686j06999J50692r2129j42855O5095K40949K9760R2342j13292j7108
$$ plain form
6891 294766 145781 388527 388527 298349 166242 412278 310443 339157 240748 86067 243307
6880 243307 400401 479678 406922 273210 201173 287961 278371 205125 376431 282312 326481
6869 326481 236353 162660 338306 425391 278835 124175 264687 173439 87593 99417 -21446
6858 -21446 99556 51699 77989 232805 176674 280972 161054 41827 248452 238626 223948
6847 223948 330691 220655 350758 600546 255922 165104 374406 271136 178797 187431
6837 187431 235864 110194 258539 315207 358026 86664 137944 336317 186196 130582 202094
6826 202094 130496 106559 -117489 107217 244263 221141 128515 172862 165102 7143 62726
6815 62726 80412 -26587 124105 31976 -110879 -45784 195165 224925 317267 203975 186867
6804A86867L3290R2909M9875j49820L2715K43082j18127k07404q5327q4372N3932
6793D7620L04J06330N7137p3851P0825m4297p3468L9198j691N2332O0766Q5730
6781C26935r2255M5125j49129q9412K0181j5848o3883Q130l2941k8587P4069n6223
6769e3838q9334J58015K76240n6455j42672L4978p7834J15708k27526m5736J61045
6758E2591J29332Q453J10O1325j56767J01264o6654l9663J41833o3434J5J7612
6746A86017P7307J09433l28346j42745J04086n698j2417J06975o1276p5056l9582
6735h1302p6025O6465M0658K44473j87917J36339J89594J2797j05880m6524j64393
6724B8285p0190O9279J05680L8197J80815M8366k46219n4592J724J73814j17258
$$ plain form
6804 186867 220157 313066 362941 213121 245836 488918 370791 163387 78060 -6312 47620
6793 47620 47924 154254 211391 137540 208365 164068 90600 129798 128107 180439 241205 326935
6781 326935 234680 279805 130676 41264 61445 45597 -18286 -10156 -43097 -71684 2385 -53838
6769 -53838 -143172 14843 291083 234628 91956 126934 49100 164808 -62718 -108454 52591
6758 52591 181923 190376 190486 251811 95044 196308 129654 89991 231824 168390 168405 186017
6746 186017 263324 372757 44411 -98334 5752 54 -12363 94612 33336 -41720 -81302
6735 -81302 -157327 -90862 -50204 194269 6352 142691 332285 345082 239202 192678 28285
6724 28285 -41905 27374 133054 171251 352066 400432 154213 99621 101345 275159 157901
6713A57901p5063J43034J33687L881l8023M4865q9587J42646J50873J59653R6543
6702H30410j43486K1910J07556K7851J03965M76j28005j32997n3611j45480j68301
6691C20288K1657O0668K1908P2790l4730j35756k07203j73168M6462p4934J83230
6680A01212J28978k17577P770J424J56731K88366j06979j08427j7225R3207j93588
6669A33892Q7869j9639j61007P6841j8645K2444p8361q3224q1285J08768J2117
6658b30O3337J23116K01550k26953k8102m1605J59510n4540Q6115p7771k34685
6647c0258J16481j83118K10580N2444j42319N5843J61437k1935Q4509j91483L5383
6636A47564l6645J4448O6N5433j17710P9555J5927O8955r4368j49139R4916J9142
$$ plain form
6713 157901 82838 225872 359559 363440 325417 370282 280695 423341 574214 733867 830410
6702 830410 686924 708834 816390 844241 948206 948682 820677 687680 634069 488589 320288
6691 320288 341945 402613 424521 497311 462581 326825 119622 -53546 -7084 -82018 101212
6680 101212 230190 12613 20383 21807 178538 466904 359925 251498 234273 327480 133892
6669 133892 221761 202122 41115 117956 99311 121755 43394 -39830 -121115 -12347 -230
6658 -230 63107 186223 387773 160820 132718 91113 250623 196083 282198 204427 -30258
6647 -30258 86223 -96895 113685 166129 23810 79653 241090 219155 303664 112181 147564
6636 147564 110919 125367 125433 180866 63156 142711 158638 227593 133225 -15914 79002 98144
6624I8144j27248p8955j16341O6451J18009O7178K6106P2106k21372o3471O4724
6613i4669Q1456p504q2661J94525j82877m651k748K1423J84187j05742j0819K10486
6601B00406j24752o9899l9880R553Q0773j0988L3031j15910n6159R7224r8069
6590i4670K42222o2309k2603Q0199j31134q9283q211J6850O2681J76500j4987
6579A55255p3134k4979J36605J70961k82474p7802J18163M1869L7634N9801P3266
6568C35165k98651j43632O3849L16506j28694k64251m2137M7801K55831p388k925
6557A31474j95005n9837J50534J16925L9454p0399J22107j52571O4210K7811n7319
6546A17384O0369j12145m8878j14507n4140M9781J53802m0526J18716P7204n1176
$$ plain form
6624 98144 -29104 -108059 -224400 -157949 -39940 27238 53344 125450 -95922 -159393 -94669
6613 -94669 -13213 -20717 -103378 91147 -91730 -96381 -99129 -77706 106481 739 -10080 200406
6601 200406 75654 5755 -34125 -24572 56201 45213 78244 -37666 -93825 3399 -94670
6590 -94670 147552 85243 62640 142839 11705 -77578 -85789 -68939 -6258 170242 155255
6579 155255 82121 57142 193747 364708 82234 4432 122595 164464 202098 261899 335165
6568 335165 36514 -107118 -43269 273237 144543 -119708 -161845 -114044 141787 134399 131474
6557 131474 -63531 -123368 27166 144091 183545 113146 235253 82682 146892 174703 117384
6546 117384 177753 65608 16730 -97777 -151917 -102136 51666 11140 129856 207060 155884
6535A55884k06789p9630J42392O4395J89L7507j45421r4376N6018M8769N2523
6524C1461J6830N1923J00496j0860q2744j31595J46108O8236r130J9814j76579
6513B3960K1170r6695K8579K15490L3768o9079L6031p484L5885k1491j26259N3962
6501A27837o1376J22098j00560o6655K22066J19383R5044j9357j61169j55387
6491A21924M6674j31693j9816m3980J21302n3598l4377R979Q4168k2649j6809
6480F1125o452o6562J54655L772J38415j13818R531M4957N1641m9439M1419r0339
6468A78905j34260p6356O041K314J04569p0737R4600J50018M5385j67261j68961
6457c5743J27946o4564K4081P2654j19914J38329J17694k05939l6321P3831L55645
$$ plain form
6535 155884 -50905 -130535 11857 76252 76441 113948 -31473 -125849 -69831 -21062 31461
6524 31461 48291 100214 200710 189850 107106 -24489 121619 189855 180725 200539 23960
6513 23960 45130 -51565 -22986 192504 226272 157193 193224 185740 221625 200134 73875 127837
6501 127837 66461 188559 87999 21344 243410 362793 457837 438480 277311 121924
6491 121924 168598 36905 17089 -26891 94411 40813 6436 16415 100583 77934 61125
6480 61125 54673 -11889 142766 146538 284953 171135 180666 225623 277264 227825 269244 178905
6468 178905 44645 -31711 -25670 -23356 81213 10476 105076 255094 300479 133218 -35743
6457 -35743 92203 27639 51720 124374 4460 142789 260483 54544 18223 92054 447699
6446D47699j16972k73896j00077J60783J93272p2907j45383J61051j6766j15919
6436A20885k8579J4331J21090j56169R1248j2548j35l1838j24251M4758j55024
6425a16232L01576J09038L179M070N8464j52571k70090L51413J95908k5239J0294
6414D69810k46578r3386O9317P9940q8238K4616n5498j36527N8949J61393j08377
6403A35421j89319J14420J33081L0476J05940q6021j38765K21118P8511m0314
6393C64548q4451M0459p7321k07830J10074P2921m5432m9343j75917J70217p2729
6382D5196J73769L8334j28034J78441J36285j03141j96146J09409P6836M1540
6372C72489j09677N7915J12536m6828M2843M644o4273k28347K447J74644p3646
$$ plain form
6446 447699 330727 56831 -43246 117537 310809 237902 92519 253570 236804 120885
6436 120885 92306 106637 227727 71558 162806 150258 150123 118285 -5966 38792 -116232
6425 -116232 185344 294382 297561 301631 360095 207524 -62566 288847 484755 459516 469810
6414 469810 223232 129846 199163 279103 190865 215481 159983 23456 82405 243798 135421
6403 135421 -53898 60522 193603 224079 330019 243998 105233 326351 404862 364548
6393 364548 280097 320556 243235 35405 145479 218400 172968 123625 -52292 117925 45196
6382 45196 218965 257299 129265 307706 443991 340850 144704 254113 330949 372489
6372 372489 262812 320727 433263 386435 429278 433922 369649 141302 143749 318393 244747
6361B44747M3714J1858j04196J48729N8994j15753L2869Q0370J54055J50668P4255
6350G80310k8828p9642o333q555q8100L5076J02109l4911j1366J00042l3755j13684
6338F12363j25329K9428j5742j5394R3668K86664R8708j89969j52141J14898J21285
6327H58439J80457m4258L691j3394Q0655l4612l2060j3378k4250J09950O7420
6316A138660p245j85487k47676j06843O8431J86976J07446k04779j41128o2206
6306E46149J70562m3477j79781o3841J39979J46287j17131L6237K15104K2243
6296H72331J05052q855j96046j57281Q4254m2835P1572J4157j58768p3283n3201
6285D57097l5567P6923m8308l7887m5981Q5837J09054R8400m0898q3813j0979
$$ plain form
6361 244747 288461 300319 196123 344852 403846 288093 320962 401332 555387 706055 780310
6350 780310 751482 671840 665507 656952 568852 603928 706037 671126 659760 759802 726047 612363
6338 612363 487034 516462 500720 485326 578994 865658 964366 774397 622256 737154 858439
6327 858439 1038896 994638 998329 984935 1065590 1030978 998918 985540 961290 1071240 1138660
6316 1138660 1131415 945928 698252 591409 659840 846816 954262 749483 608355 546149
6306 546149 716711 673234 493453 429612 569591 715878 598747 634984 850088 872331
6296 872331 977383 968528 772482 615201 699455 656620 728192 742349 583581 510298 457097
6285 457097 421530 498453 450145 412258 366277 452114 561168 659568 618670 534857 523878
6274E23878J38963r5872l5444N0169N217L3331m0206O3818o2148Q8700j51522
6263E18884j15708J03311K5186q7704L1863o134J45185R7725l33719K5394L5876
6252D40159Q1957J10429J00852j97734k33721J37904L17103J53091P998k10321
6242G07717p3977J4029J02225j78916n3970m0880n9729J62573l0395p1920J05216
6231E81973O1938J09443k9519M9565j47954K5906L4547j1843k7444L3390L17243
6220I97245m1584j91615n052L50748j14722j24839m2487K25217l6720j43240L02350
6209A175301K7267p9762k7315p0122R0537O8975J21329n8633m4508j62097K07243
6198A248215N2099j42166j9134m9394K09769J10986l3793P0400j21601J98477
$$ plain form
6274 523878 662841 566969 531525 581694 586911 620242 580036 643854 581706 670406 518884
6263 518884 403176 506487 531673 443969 475832 469698 614883 712608 378889 404283 440159
6252 440159 522116 632545 733397 535663 301942 439846 756949 910040 918038 707717
6242 707717 633740 647769 749994 571078 517108 476228 416499 579072 548677 476757 581973
6231 581973 643911 753354 723835 773400 625446 651352 685899 674056 646612 680002 997245
6220 997245 955661 764046 758994 1109742 995020 870181 827694 1052911 1016191 872951 1175301
6209 1175301 1202568 1122806 1095491 1025369 1115906 1184881 1306210 1247577 1203069 1040972 1248215
6198 1248215 1300314 1158148 1139014 1089620 1299389 1410375 1376582 1446982 1325381 1523858
6188A523858L0728k2376Q442k16414m5250L94630o174P3277j1959p475m7790k10736
6176A462761J26335J03290o9014K01911p364l6285o2745r3854K6857P2030J13132
6165A837054Q9393k80941o0964m5271Q1119J45897j69386J41358j5902o1406J49733
6154A810684q9606p0064J0583J23175j19718j28840L7500K18714j404q4671J90853
6143A897206j50098n7650k8260R2101N0735J01046Q013M2440l5975J02040P8869
6132B100467L2714j51843Q2220K33286j28710J420P7530k03005N8625J14644Q3229
6121B300577L5855J47375K306O1174j7681J29205J26863j82030P4454J30147q2096
6110B726149j4295P1952j06266O1519J45284J14747K02752m7965j20869K35865
$$ plain form
6188 1523858 1554586 1532210 1540652 1324238 1278988 1673618 1667444 1740721 1728762 1721287 1673497 1462761
6176 1462761 1589096 1692386 1623372 1825283 1817919 1781634 1718889 1625035 1651892 1723922 1837054
6165 1837054 1926447 1645506 1584542 1539271 1620390 1766287 1596901 1738259 1722357 1660951 1810684
6154 1810684 1721078 1651014 1661597 1784772 1665054 1536214 1573714 1792428 1791024 1706353 1897206
6143 1897206 1747108 1689458 1661198 1753299 1804034 1905080 1913093 1955533 1919558 2021598 2100467
6132 2100467 2133181 1981338 2063558 2296844 2168134 2169554 2247084 2044079 2102704 2217348 2300577
6121 2300577 2336432 2483807 2486113 2547287 2529606 2658811 2785674 2603644 2678098 2808245 2726149
6110 2726149 2711854 2783806 2677540 2739059 2884343 2999090 3201842 3153877 3033008 3268873
6100C268873K44134k0474j3589l2235J77476J95989K01321Q6978j50392n3351
6090C904730L08090k9640L7343L6723J79756K19966J84697J68697O8475r569R968
6079E079236J20274J89379J06238Q1029J72656K96930K4131K31367M31065p0982
6069F661323n3636J97048K21669P3516K60070J26152J36547J26794K24319J09223
6059H083025K24395K49712K59758J18106L41703K79926R0121L94534L79950L05180
6049A0726410L58972J50119L85778L33353K69057N88975J84592L56265L91446
6040A3744967L93623L49728M77256L47454O34874O06035M97134P04180P19047
6031A8474298P18859Q56697O25631Q23120J078570Q95839J045895J169852J335710
$$ plain form
6100 3268873 3513007 3492533 3478944 3446709 3624185 3820174 4021495 4108473 3958081 3904730
6090 3904730 4212820 4183180 4220523 4257246 4437002 4656968 4841665 5010362 5078837 5069268 5079236
6079 5079236 5199510 5388889 5495127 5576156 5748812 6045742 6069873 6301240 6732305 6661323
6069 6661323 6607687 6804735 7026404 7099920 7359990 7486142 7622689 7749483 7973802 8083025
6059 8083025 8307420 8557132 8816890 8934996 9276699 9556625 9646746 10041280 10421230 10726410
6049 10726410 11085382 11235501 11621279 11954632 12223689 12812664 12997256 13353521 13744967
6040 13744967 14138590 14488318 14965574 15313028 15947902 16553937 17051071 17755251 18474298
6031 18474298 19193157 20049854 20675485 21498605 22577175 23473014 24518909 25688761 27024471
6022B7024471J448314J944778J720456J731990K074059K443939K753015L248167
6014D4389189L666613M041477M425575M435457L763994K415590P50315P2381p9197
6005F7881394m17921k79080j83613j99694l5719M02645J000439J131476J519874
5996G0819801K066616K668102K935252L225266L089950L301652L437709L620369
5988I5164717M306012M804748N651178O743345O815912M750164J096562m615775
5980A24716863p377710p057486o205052m749732l116367k803765k600212k457066
5972H8349473k271619k231681k794313k707616k800212k280163j586008j063824
5964G0614037r30842r77827o51442o36079j079427q65487n99572r06216j838371
$$ plain form
6022 27024471 28472785 30417563 32138019 33870009 35944068 38388007 41141022 44389189
6014 44389189 48055802 52097279 56522854 60958311 64722305 67137895 67888210 67960591 67881394
6005 67881394 67463473 67184393 67000780 66801086 66765367 67168012 68168451 69299927 70819801
5996 70819801 72886417 75554519 78489771 81715037 84804987 88106639 91544348 95164717
5988 95164717 99470729 104275477 109926655 116670000 123485912 128236076 129332638 124716863
5980 124716863 117339153 110281667 104076615 99326883 96210516 93406751 90806539 88349473
5972 88349473 86077854 83846173 81051860 78344244 75544032 73263869 71677861 70614037
5964 70614037 69683195 68705368 68053926 67417847 66338420 65472933 64873361 63967145 62128774
5955F2128774k531795m084772m486563m537317l803358l098089k474643j827671
5947C5284566j443032j097565r58122q40605q02691p50897o65908p47608p49647
5938B7228491p09259o78947o74064o31254l57185n86376k24506k44354m07228
5929B2715318k18467Q6670j95442l0840k59116k98823k88718l12897j06540k16076
5919B0875069j5531J92490J69171k2913j02020j972K23898K03220K95506K52380
5909B2069298L43794Q2036L85200M43917M47007L31410J78695N02038M55793P20001
5899B5959189L37237M93951L45999N17865P85167P66283J079142P93822Q97587
5890C1976242J175881J280298J258808J355348J540774J861100K237248K543812
$$ plain form
5955 62128774 59596979 55512207 51025644 46488327 42684969 39586880 37112237 35284566
5947 35284566 33841534 32743969 31785847 30945242 30142551 29391654 28725746 27978138 27228491
5938 27228491 26519232 25840285 25166221 24534967 24177782 23591406 23366900 23122546 22715318
5929 22715318 22496851 22583521 22388079 22357239 22098123 21799300 21510582 21197685 21091145 20875069
5919 20875069 20859538 21052028 21221199 21198286 21096266 21094294 21318192 21521412 21816918 22069298
5909 22069298 22413092 22495128 22880328 23324245 23771252 24102662 24281357 24783395 25239188 25959189
5899 25959189 26296426 26790377 27136376 27654241 28439408 29205691 30284833 31078655 31976242
5890 31976242 33152123 34432421 35691229 37046577 38587351 40448451 42685699 45229511
5882D5229511K944662L335077L800720L749678L962014L494502K596031J637666
5874G0749861O82277L97439M79527M15850R53245J318634J429333J889263J976303
5865H0291732K351361K730802L022866K988647K850530L019793L128416L097344
5857A03481491L222250L235529L450665L888888M527703M766764L704237J034126
5849A31311653l041401o231963p639631p588439o535372m938197l815985l126904
5841H8393761k320154k107377k275433k114573j816354j345983q44876o33878
5833G4935133o21587l50393j53119o1786n5805l12473o58371n10286r97540j639453
5823F9574320k678375m013241m311127m165051l854884k610929j784007j350970
$$ plain form
5882 45229511 48174173 51509250 55309970 59059648 63021662 66516164 69112195 70749861
5874 70749861 71432138 71829577 72309104 72724954 73678199 74996833 76426166 78315429 80291732
5865 80291732 82643093 85373895 88396761 91385408 94235938 97255731 100384147 103481491
5857 103481491 106703741 109939270 113389935 117278823 121806526 126573290 130277527 131311653
5849 131311653 128270252 122038289 114398658 106810219 100274847 95336650 91520665 88393761
5841 88393761 86073607 83966230 81690797 79576224 77759870 76413887 75569011 74935133
5833 74935133 74313546 73963153 73810034 73748248 73692443 73379970 72721599 72211313 71213773 69574320
5823 69574320 66895945 62882704 58571577 54406526 50551642 47940713 46156706 44805736
5815D4805736j057662j522590k195159k579808k677466k096501j993926j683651
5807B8998973j267934r64095j040784j118048j058769j193016q39146p39860p98166
5798A9979155m92411m34057l55984l98170k68590k86403l29938k13074k10958
5789A6989570l37634o15677m59768n06670k83112l47254l79993l75937j75550
5780A3507975j44114l05751n07241l12462l53879j90292o6497j14537j29268k10404
5770A1173530k50807n7921o1500k65102R6813J18023J13158J38994n7815l12086
5760A0635287k32384O0030o43368j09626k02607j63144j57795j28704k95634l80751
5750H381304l13830j59261n5700j13850l59377r4165j53062j04959j94548l19883
$$ plain form
5815 44805736 43748074 42225484 40030325 37450517 34773051 32676550 30682624 28998973
5807 28998973 27731039 26766944 25726160 24608112 23549343 22356327 21517181 20777321 19979155
5798 19979155 19486744 19052687 18696703 18298533 18029943 17743540 17413602 17200528 16989570
5789 16989570 16651936 16036259 15576491 15069821 14786709 14439455 14059462 13683525 13507975
5780 13507975 13363861 13058110 12550869 12238407 11884528 11694236 11627739 11513202 11383934 11173530
5770 11173530 10922723 10864802 10803302 10538200 10635013 10753036 10866194 11005188 10947373 10635287
5760 10635287 10402903 10462933 9819565 9709939 9507332 9344188 9186393 9057689 8762055 8381304
5750 8381304 8067474 7908213 7852513 7738663 7379286 7285121 7132059 7027100 6832552 6512669
5740F512669J75165P6315N1590J29497m1364k50807N6234J89917K5067M3880K27467
5729G195630j80408l30355l49784k53357j29872m01614l73021j20465j75536j61570
5719D719648l00563o2678J15375j69699j44934P9479j79397j17545Q1041K9080
5709D049807r9647L3271P1474j15122K8131m5906J87136M754Q405j14193m9608
5698C958502J70685k10813l07156j46431l7032j74335j90818L3512J11229l14634
5688B892709N464J33556r6636p3823J33489m4609j65623N9830O6501N6628j90246
5677B777240j33397O0632r9234j28612q0245R4600L30822p9177j20885O8845M4650
5666B735239K81981n3051p3289j39126q9018J53458J11316J44193p625n8185J39519
$$ plain form
5740 6512669 6687834 6764149 6815739 6945236 6903872 6653065 6709299 6899216 6924283 6968163 7195630
5729 7195630 7015222 6684867 6335083 6081726 5951854 5550240 5177219 5056754 4881218 4719648
5719 4719648 4419085 4356407 4471782 4302083 4157149 4236628 4057231 3939686 4020727 4049807
5709 4049807 3950160 3983431 4054905 3939783 3967914 3922008 4109144 4113898 4122303 4008110 3958502
5698 3958502 4129187 3918374 3611218 3464787 3427755 3253420 3062602 3096114 3207343 2892709
5688 2892709 2898173 3031729 2935093 2861270 2994759 2950150 2784527 2844357 2910858 2967486 2777240
5677 2777240 2643843 2704475 2605241 2476629 2396384 2490984 2821806 2742629 2621744 2690589 2735239
5666 2735239 3017220 2964169 2890880 2751754 2662736 2816194 2927510 3071703 3064078 3005893 3145412
5655C145412L3999O9221p8914K37939K48483M0873r4845J96693n0311k9717J1494
5644C730327j42557J23396k8739K441K10978O9882j70280m6187K2650j05977J42130
5633C808064J94888Q3031K64981J81868Q8758K4360L84897P2583P7745J71081
5623E352256R3136m6601N7022J00634k04880J19899j17464k42818k10942k49695
5613D650547n6016L03917L4367l7157L55595Q9881k30915o6085j18276M5213P8069
5602E049140j71748j06037K114r5103j16479j47508L75j70029L1203k6883n0631
5591D198414k69615o1964Q1041j27335j6212N1988J13274M4481P6966M3647o9560
5580D065125J24958K79273o4382J42191J16943K84639L75304M18604O44273M27499
$$ plain form
5655 3145412 3179411 3248632 3169718 3407657 3656140 3697013 3602168 3798861 3748550 3718833 3730327
5644 3730327 3587770 3711166 3682427 3684868 3895846 3965728 3795448 3749261 3771911 3665934 3808064
5633 3808064 4002952 4085983 4350964 4532832 4621590 4645950 5030847 5103430 5181175 5352256
5623 5352256 5445392 5398791 5455813 5556447 5351567 5471466 5354002 5111184 4900242 4650547
5613 4650547 4594531 4898448 4932815 4895658 5251253 5341134 5110219 5044134 4925858 4971071 5049140
5602 5049140 4877392 4771355 4773469 4678366 4561887 4414379 4414754 4244725 4275928 4249045 4198414
5591 4198414 3928799 3866835 3947876 3820541 3804329 3856317 3969591 4014072 4091038 4134685 4065125
5580 4065125 4190083 4469356 4404974 4547165 4664108 4948747 5324051 5742655 6386928 6814427
5570F814427M54354J060673J020765J272085J222066J584582J482967O54724p25676
5561A4840967j863139k293106j946835j397152r75336j048576n29657k63890m44381
5552D078895l04988k63508p4343l1521P8022j47405k42708L8569l69j93250J67819
5541C105213P0091J15739J98484R3163P7562K0170J6356n8247l11069k07171k05987
5530B914304j17496j31657n3451j14543m8187k3719j64792j65516k960J62273
5520B254256o3945j95433j45466J74404J9228j95283j37666k3873r0149n3835
5510A542238r1640R942J6253J30070j50678j63534o3919R5465J13739m5648K6512
5499A418800P775r1118l7821n462O6592j1625o0816J37207p3575k08547K04569
$$ plain form
5570 6814427 7268781 8329454 9350219 10622304 11844370 13428952 14911919 15566643 14840967
5561 14840967 12977828 10684722 8737887 7340735 6365399 5316823 4787166 4523276 4078895
5552 4078895 3773907 3510399 3436056 3404535 3482557 3335152 3092444 3131013 3130644 2937394 3105213
5541 3105213 3175304 3291043 3489527 3582690 3660252 3680422 3696778 3638531 3327462 3120291 2914304
5530 2914304 2796808 2665151 2611700 2497157 2448970 2425251 2260459 2094943 2091983 2254256
5520 2254256 2190311 1994878 1849412 2023816 2043044 1847761 1710095 1686222 1596073 1542238
5510 1542238 1450598 1460540 1476793 1606863 1456185 1292651 1228732 1324197 1437936 1392288 1418800
5499 1418800 1426575 1335457 1297636 1292174 1358766 1347141 1286325 1423532 1349957 1141410 1345979
5488A345979q4898j88344J7364j71559o4596J83863k09629j57662J04350n2749
5478G22119M6882n660P3374K23832j00384o997J53908q6962j08630k7776P1090
5467I54796L4820j37073o0965O0768l9880r9230J2673n1782L3409J22273j10903
5456G18906J01283J50331j14275n8587K6257o0158p060q486n1751J24175M0517
5445H61152m52794J09819M8185M3979m1898K21585j8842n9668K53298L7072j84093
5434H17795p7042n0970j196P0420J3227j79266p1924P3455M895J01931k99544
5423D01781L951J49205J9802k3897L0348J43267J92792O4972j34041j58430J3975
5412G03725O049k28746R6093j5249M7482K61221M8666k45604k24922j5013N2246
$$ plain form
5488 1345979 1261081 1072737 1090101 918542 853946 1037809 828180 670518 774868 722119
5478 722119 769001 763341 836715 1060547 960163 953166 1107074 1020112 911482 883706 954796
5467 954796 989616 852543 791578 852346 812466 713236 725909 674127 707536 829809 718906
5456 718906 820189 970520 856245 797658 823915 763757 756697 748211 696460 820635 861152
5445 861152 408358 518177 566362 610341 568443 790028 771186 711518 964816 1001888 817795
5434 817795 740753 689783 688587 759007 772234 592968 521044 594499 599394 701325 401781
5423 401781 405732 554937 574739 550842 581190 724457 917249 982221 848180 689750 703725
5412 703725 709774 481028 577121 561872 609354 870575 919241 673637 448715 433702 485948
5401D85948J42790J2447M5898P6866n9880Q2061K4867J03068J52425k21719J30858
5390I75629j33728r3829J69544m5506m4206j20880m0235Q6581J6656P4318r4674
5379G49670M174J02787k726J11365j24015o0003J1913O5552l7344k7974j13713
5368F79686O69j69869K39133N32k07174K73021R9087j47325M198K20010l6073
5357I55895r9443J32141j02619r6356p518J61526L4174j01988J15037l8916j17722
5346H34211J1630k2558p5228k4525M0796m1767J58292o6598J54058m4344j1245
5335I12722r500j41020P2555n9749P2857l8615M9926J3714R3273k6591j19716
5324H19856J25051o046l2107q4828o826J20773j93146R7970j1371L39494j67602
$$ plain form
5401 485948 628738 641185 687083 763949 704069 786130 810997 914065 1066490 844771 975629
5390 975629 841901 748072 917616 872110 827904 707024 666789 753370 770026 844344 749670
5379 749670 753844 856631 853905 965270 841255 781252 793165 858717 821373 793399 679686
5368 679686 680355 510486 749619 750151 542977 815998 915085 767760 771958 991968 955895
5357 955895 856452 988593 885974 789618 782100 943626 977800 875812 990849 951933 834211
5346 834211 845841 823283 748055 723530 764326 722559 880851 814253 968311 923967 912722
5335 912722 903222 762202 834757 775008 847865 809250 859176 872890 966163 939572 819856
5324 819856 944907 938861 906754 821926 815100 935873 742727 840697 829326 1168820 1001218
5313A001218j26092L4431j5471l7294J17314Q5290P2446n020j67830J45927J88522
5302A293441l6027q2430o8881k6777l0291R3922M6388o6297r7167J03059J51153
5291A280093K84199J45807j99162j04268l5135l938K68005j12163J34647K605
5281A660690j85267J78538l1779P8937L07394J30594L35256L11900J0435O6803
5271B863501L0106P8555r2147k78421J5282L0473p0882j54580j10151K44869J84493
5260B741098K55467J07171J02649K87793K39318J95324L36146K19688K11432J07416
5250D803502K99219K55368K14091L96360j201j40122j544j20464j99745m81412
5240E024052n43221j21073m5593j08769k38345L3754j01846p160J08139M0196
$$ plain form
5313 1001218 875126 909557 894086 856792 974106 1059396 1131842 1126822 958992 1104919 1293441
5302 1293441 1257414 1174984 1106103 1079326 1049035 1142957 1189345 1123048 1025881 1128940 1280093
5291 1280093 1564292 1710099 1510937 1406669 1371534 1367596 1635601 1523438 1658085 1660690
5281 1660690 1475423 1653961 1622182 1701119 2008513 2139107 2474363 2786263 2796698 2863501
5271 2863501 2893607 2972162 2880015 2601594 2616876 2647349 2576467 2421887 2311736 2556605 2741098
5260 2741098 2996565 3103736 3206385 3494178 3733496 3928820 4264966 4484654 4696086 4803502
5250 4803502 5102721 5358089 5572180 5968540 5967339 5827217 5825673 5705209 5505464 5024052
5240 5024052 4480831 4359758 4314165 4205396 3967051 4000805 3898959 3891799 3999938 4040134
5230D040134K8369K50414L95269J31169j14502K03791k69755k95251m9355j98967
5220D121316K35620K689j29541j59636j52074n0148j74367k68983N4377j11883
5210C367370j90736j00276J56124l17902J4638L24798r0274m6711R0337J94148
5200C401516R5709k05918L0003J8429k91532l24334q253j01000j53488k69328
5190B191804j06115o6581j08852M0966K7249J16988J0966N0992m7680j83618o4054
5179A862065L8092j00000j19145N4102j954q8979J24627Q656l4657M4458k72935
5168A514330J2575J34799P5161q1278J31910n984j43602M3404j3194p6409k217
5157A589495r6168K1027K0103R1505q244p4428m8250O7715j04413j18511n761
$$ plain form
5230 4040134 4068503 4318917 4714186 4845355 4730853 4934644 4664889 4369638 4320283 4121316
5220 4121316 4356936 4359625 4230084 4070448 3918374 3868226 3693859 3424876 3479253 3367370
5210 3367370 3176634 3076358 3232482 2914580 2929218 3254016 3163742 3117031 3207368 3401516
5200 3401516 3497225 3291307 3321310 3339739 3048207 2723873 2715620 2614620 2461132 2191804
5190 2191804 2085689 2019108 1910256 1951222 1978471 2095459 2106425 2157417 2109737 1926119 1862065
5179 1862065 1900157 1800157 1681012 1735114 1733160 1644181 1768808 1777464 1742807 1787265 1514330
5168 1514330 1526905 1661704 1736865 1655587 1787497 1781513 1637911 1681315 1668121 1591712 1589495
5157 1589495 1493327 1514354 1534457 1625962 1617718 1543290 1495040 1562755 1458342 1339831 1334070
5146A334070R4415R1329j3100M7999l0849J25970M17q7705N267R4754K5300j1990
5134A675877j1350K007j56301L2770J98661P6575J03561K79296K11521J12555
5124B525172J24778R7956L95995N5027J85597L66545J37986J00550l90028m12237
5114C187341k45314k70672m31600K8428r2461m50471l9127l9687R0453m6470P2352
5103A762772K8321L7187R0400n1321j85246J60345j97384P6514J26006R1593J0909
5092A950096j55894M315J12046J72979j69098N487P0231Q6735k47522J03020L08042
5081B240437J09100k06046r0125K03147K88092J47943O6510k7958J45636R9369
5071B976105K10689L25717K67373L5868K98405K35202O45144L75420O89480M93322
$$ plain form
5146 1334070 1428485 1519814 1506714 1554713 1523864 1649834 1650251 1562546 1567813 1662567 1687867 1675877
5134 1675877 1664527 1666534 1510233 1543003 1741664 1818239 1921800 2201096 2412617 2525172
5124 2525172 2649950 2747906 3143901 3198928 3384525 3751070 3889056 3989606 3599578 3187341
5114 3187341 2942027 2671355 2239755 2268183 2175722 1725251 1686124 1646437 1736890 1690420 1762772
5103 1762772 1791093 1828280 1918680 1867359 1682113 1842458 1645074 1721588 1847594 1939187 1950096
5092 1950096 1794202 1798517 1910563 2083542 1914444 1919931 1990162 2076897 1829375 1932395 2240437
5081 2240437 2349537 2143491 2053366 2256513 2544605 2692548 2759058 2731100 2876736 2976105
5071 2976105 3186794 3512511 3779884 3815752 4114157 4349359 4994503 5369923 6059403 6552725
5061F552725P74707Q91928Q52470J129966J346418J000242O38594m87012j519673
5052A1180365j590891j256249j023255q96079q14103n93033l86183m5372k24497
5043D350703l02634k59258j0229j3186j65641j46456j28512j05223Q3022j04701
5033C197885K31226L0972j12740l958J05013K71900J3718N8290J21098j39859
5023C773545j51465l8563m17336l29410r5611j4654j87579o3118j52172O7154
5013B390791J24745o974k56101o0704L1654j77568l47303J5943J36742O5022n3077
5002A863170J14366j71607J51506l8502n5157l2467J83140M7727k57633K3973
4992A828516J95003j86929k25966L18394J9967L7249Q533L234J30847k2993M0094
$$ plain form
5061 6552725 7327432 8219360 9071830 10201796 11548214 12548456 13187050 12700038 11180365
5052 11180365 9589474 8333225 7309970 6413891 5599788 5006755 4620572 4575200 4350703
5043 4350703 4048069 3788811 3778582 3765396 3599755 3453299 3324787 3219564 3302586 3197885
5033 3197885 3429111 3460083 3347343 3343385 3448398 3720298 3734016 3792306 3913404 3773545
5023 3773545 3622080 3583517 3166181 2836771 2741160 2726506 2538927 2475809 2323637 2390791
5013 2390791 2515536 2508562 2252461 2191757 2223411 2045843 1698540 1714483 1851225 1916247 1863170
5002 1863170 1977536 1805929 1957435 1918933 1863776 1831309 2014449 2062176 1804543 1828516
4992 1828516 2023519 1836590 1610624 1929018 1948985 1986234 1994767 1998001 2128848 2105855 2145949
4981B145949k1517j2181p9348J23989j24000j00379M3792L08234j10490j47185
4971B026864J70835r238q4499k0490Q4325K05223n3764j50218j30011L56439L15252
4960B710718O2241j02744P563J26846l4335o757o1550M8910Q3676n36K18258n6112
4948B996178R8863n0445K0128j46426j2468K32692j2079j07644J08326M8476j95361
4937B980240J08481J36699k14329o0054K02910J75776j71241M8656K47892J41512
4927C596542J9934J56995j17192J34290J93741j8425P275L02553J60838K92667
4917D729218j37668J5330J00828O1037J38543O2361Q0468k04850J57498M81482
4907E484247q4124Q2014J21507K33577J16855J43720J55013J72007J87196J43985
$$ plain form
4981 2145949 2124432 2112251 2032903 2156892 2032892 1932513 1976305 2284539 2174049 2026864
4971 2026864 2197699 2188461 2103962 2083472 2167797 2373020 2319256 2169038 2039027 2395466 2710718
4960 2710718 2772959 2670215 2677778 2804624 2770289 2763532 2701982 2750892 2834568 2834032 3052290 2996178
4948 2996178 3095041 3044596 3064724 2918298 2905830 3138522 3126443 3018799 3127125 3175601 2980240
4937 2980240 3088721 3225420 3011091 2951037 3153947 3329723 3158482 3207138 3455030 3596542
4927 3596542 3616476 3773471 3656279 3790569 3984310 3965885 3973160 4275713 4436551 4729218
4917 4729218 4591550 4606880 4707708 4768745 4907288 4969649 5050117 4845267 5002765 5484247
4907 5484247 5400123 5482137 5603644 5837221 5954076 6097796 6252809 6424816 6612012 6755997
4897F755997j07736O9371J71947M84725M41602J98039K14458K4113N02326K86783
4887I041625J51694m6752L22914L58454K43876J87711J47240J40619L16508L57849
4877A1221738O71212K72933L54766J77625L17684L1728L03111L28673N87334p7359
4867A4189445M67281K69652K49811J82227L35544K55790L74334L76950O37668
4858A7338702L62489N09212M51646M98798M86734P70564R79730J010925P41340
4849B3150140J173857J141802J439481J292659J960126K026505K360627J830849
4841C6376046Q16219j938K97804J06724M13399R92005J128328J165020J965959
4832D3259566J648396K169436J977299K608495K387272K822274K860236L702821
$$ plain form
4897 6755997 6648261 6717632 6889579 7374304 7815906 8013945 8228403 8252516 8754842 9041625
4887 9041625 9193319 9146567 9469481 9827935 10071811 10259522 10406762 10547381 10863889 11221738
4877 11221738 11892950 12165883 12520649 12698274 13015958 13047686 13350797 13679470 14266804 14189445
4867 14189445 14656726 14926378 15176189 15358416 15693960 15949750 16324084 16701034 17338702
4858 17338702 17701191 18210403 18662049 19160847 19647581 20418145 21397875 22408800 23150140
4849 23150140 24323997 25465799 26905280 28197939 30158065 32184570 34545197 36376046
4841 36376046 37192265 37190327 37488131 37594855 38008254 39000259 40128587 41293607 43259566
4832 43259566 44907962 47077398 49054697 51663192 54050464 56872738 59732974 63435795
4824F3435795L528150N121828N536254O090444N973123O522084P732106J0179502
4816A14119286J2626420J6021177J9029914K3433633K6836265L3212086L6150411
4809B81429192L9070172M3954087N7286307N4752653L4931629o195508p6632079
4802D28596453p9629179p0027212n7744785m0745462k8823974k0254590j5048636
4795A16322615j1840677r828467q303334o723578n228581m376183l487824k868164
4787F3665807k333137k545786k224392l200425l509220l525714l094627k804691
4779D0427815k196348j917734j549894j440280j315971j474372j126056j207139
4771B8200021r85668q93448p14426j004441j040167q96578o78730o91079m72978
$$ plain form
4824 63435795 66963945 72085773 77622027 83712471 89685594 96207678 103939784 114119286
4816 114119286 126745706 142766883 161796797 185230430 212066695 245278781 281429192
4809 281429192 320499364 364453451 421739758 476492411 511424040 505228532 428596453
4802 428596453 348967274 278940062 221195277 180449815 151625841 131371251 116322615
4795 116322615 104481938 94653471 86350137 79626559 74397978 70021795 66533971 63665807
4787 63665807 61332670 58786884 56562492 53362067 49852847 46327133 43232506 40427815
4779 40427815 38231467 36313733 34763839 33323559 32007588 30533216 29407160 28200021
4771 28200021 27214353 26320905 25606479 24602038 23561871 22665293 21986563 21295484 20822506
4762B0822506o01250m32157o11143l46658o00922l45290m11251J8950j02728K02157
4752A7592214k40503L26599J21597K63599m60762q70561p86304o62382q69608
4743A4413889p28945o41464n27393m03656k93750j07577k45128n94336j66765
4734A0704875k81718k19349k51570j67185k02392j56657l50974k38769k57178
4725H579083k99435l70281j86165k25369j61533k43873l0178o7294l35231j35387
4715F524337k54332k44837p0036o7194p2310k99983j87684k17230J8019j10829
4705E017921k13341j76749J15256j73209n1765k23801L0455j7349j99961k9967
4695D077490r2892O2731K17639n9081p3848j22571o3212Q8174j11858k66413j30672
$$ plain form
4762 20822506 20221256 19789099 19177956 18831298 18230376 17885086 17473835 17492785 17390057 17592214
4752 17592214 17351711 17678310 17799907 18063506 17602744 16732183 15945879 15283497 14413889
4743 14413889 13684944 13043480 12516087 12112431 11818681 11711104 11465976 10871640 10704875
4734 10704875 10423157 10203808 9952238 9785053 9582661 9426004 9075030 8836261 8579083
4725 8579083 8279648 7909367 7723202 7497833 7336300 7092427 7062249 6994955 6659724 6524337
4715 6524337 6270005 6025168 5955132 5887938 5815628 5515645 5327961 5110731 5128750 5017921
4705 5017921 4804580 4627831 4743087 4569878 4518113 4294312 4324767 4307418 4107457 4077490
4695 4077490 3984598 4047329 4264968 4205887 4132039 4009468 3946256 4034430 3922572 3656159 3525487
4684C525487M8633K14233K0950r1051m8130l924k6538R755R2187L982K6548q7197
4672C684935k39650j06366M1196o956j02718p9656m8191n8255J89508j50028j53909
4661B969910m7726R1466J8034j55827m63J0328n4203M9863k01533J3809j3891
4650B679767P7856J19874j41905L7626J35808p420R0794L3930n5555J64201J53409
4639C288385j17697r8674J03488p8013j23050J67265J21146o493k9556R8453P8109
4628C403363K06093N3874j60871n7485M7037l32640m72017q9491o3803j73222
4618B360838m1621j25754K85291J45559j48541k03892P94J5509j23729O4863k4108
4607B205209l5124o3318K3686J54157r0473J49942l8916r9125k41115L3053J55633
$$ plain form
4684 3525487 3574120 3788353 3809303 3718252 3670122 3666198 3639660 3649415 3741602 3745584 3772132 3684935
4672 3684935 3445285 3338919 3380115 3373159 3270441 3190785 3142594 3084339 3273847 3123819 2969910
4661 2969910 2922184 3013650 3031684 2875857 2875394 2885722 2831519 2881382 2679849 2693658 2679767
4650 2679767 2757623 2877497 2735592 2773218 2909026 2901606 2992400 3026330 2970775 3134976 3288385
4639 3288385 3170688 3072014 3175502 3097489 2974439 3141704 3262850 3256357 3226801 3325254 3403363
4628 3403363 3609456 3663330 3502459 3444974 3492011 3159371 2687354 2597863 2534060 2360838
4618 2360838 2319217 2193463 2478754 2624313 2475772 2271880 2272674 2288183 2164454 2229317 2205209
4607 2205209 2170085 2106767 2130453 2284610 2194137 2344079 2305163 2206038 1964923 1997976 2153609
4596B153609n5725k0387N6226r8991n3399l3936K22558j12236q6835k61361K11893
4585A921416J98358o5981K56464M6256k21047q2463K2728l2004j7499j46502J1390
4574A891116m2547P6634q5037j60629O3459m962P1626J37574j13044k2461m1445
4563A770284m9843j04186Q8702l6253m2210J09096J48646J55383k03077m8012
4553A788530m2335m580L7627P5723Q0595q7754m3660n2708l928n4802Q5691R5811
4541A874210k4285J14115Q3564M706l928O7384J42441J10711P7048J27801K12455
4530B786222K17489k7020K05019N51281M12852J03516K94188Q9544l35504m35182
4520C862405m93219k35884k67431j33821p1310J9632M3504k1808k04581R3102
$$ plain form
4596 2153609 2097884 2077497 2133723 2034732 1981333 1947397 2169955 2057719 1970884 1709523 1921416
4585 1921416 2119774 2053793 2310257 2356513 2135466 2053003 2075731 2043727 2026228 1879726 1891116
4574 1891116 1848569 1925203 1840166 1679537 1742996 1738034 1809660 1947234 1834190 1811729 1770284
4563 1770284 1720441 1616255 1704957 1668704 1626494 1735590 1884236 2039619 1836542 1788530
4553 1788530 1746195 1741615 1779242 1854965 1935560 1847806 1804146 1751438 1747510 1692708 1778399 1874210
4541 1874210 1849925 1964040 2047604 2052310 2048382 2115766 2258207 2368918 2445966 2573767 2786222
4530 2786222 3003711 2976691 3181710 3732991 4145843 4249359 4543547 4633091 4297587 3862405
4520 3862405 3369186 3133302 2865871 2732050 2660740 2680372 2723876 2702068 2497487 2590589
4510B590589M2372r5755J28518L8081m6914j38654r494o794J67377N6772O6333
4499B792431K45344Q9469L32674K06972J12328J47467L51660K20645M91749J99144
4489E189883L16493J54989j20295j33720n44147k89966K04402m775j08153n185
4479D659526o4652J32174L98938K891M9083Q3567K59616L51437N68361M09713
4469F850654L70321O64517M89599M27804M29130J97465L25157L88128M10390N61477
4459A1114642K70739k88674n98677r96811o92757o46215p32550m78278k08255
4450F743164k74875k07567j32946J37197L68330P2340K07796P3093K81897L89531
4440G657960M42916J49977J01116j76819R2141K20486J49113M16087L63365L84572
$$ plain form
4510 2590589 2632961 2537206 2665724 2703805 2656891 2518237 2508743 2501949 2669326 2726098 2792431
4499 2792431 3037775 3127244 3459918 3666890 3779218 3926685 4278345 4498990 4990739 5189883
4489 5189883 5506376 5661365 5541070 5407350 4863203 4573237 4777639 4772864 4664711 4659526
4479 4659526 4594874 4727048 5125986 5128877 5177960 5261527 5521143 5872580 6440941 6850654
4469 6850654 7220975 7885492 8375091 8802895 9232025 9429490 9754647 10142775 10553165 11114642
4459 11114642 11385381 11096707 10498030 9501219 8808462 8162247 7429697 6951419 6743164
4450 6743164 6468289 6260722 6127776 6264973 6633303 6705643 6913439 6986532 7268429 7657960
4440 7657960 8100876 8250853 8351969 8175150 8267291 8487777 8636890 9052977 9416342 9800914
4430I800914M40873L20893j63893o90085p04971p35383o83294o72729p10106l96613
4420E805606k75669m12747J9304j33127k12935j31442J20459K7494j53237l76089
4410D277617j00692o4083l09747o6824j31279M5252j85505J32803n2436j06747
4400C438359j01p3640K5962N6956j02882m4801q824j94163J27984R0309R821j98988
4388C125992L0613J65150O4001O9594Q0161j10901K7561L9837N0644N3183L8281
4377C634116j99477j84157j83940J82055K71807k25759j14759L54487P30l4625
4367C500478k5237J20637K75713n5005K8978J84873J79024M70343j30975j1030
4357D537799o2908N2708l7671j53166N0401J9999p8644J81429J99973k59490l7979
$$ plain form
4430 9800914 10241787 10562680 10398787 9708702 9003731 8268348 7585054 6912325 6202219 5805606
4420 5805606 5529937 5117190 5136494 5003367 4790432 4658990 4779449 4806943 4653706 4277617
4410 4277617 4176925 4112842 3803095 3736271 3604992 3650244 3464739 3597542 3545106 3438359
4400 3438359 3438258 3364618 3390580 3447536 3344654 3299853 3291029 3096866 3224850 3315159 3324980 3125992
4388 3125992 3156605 3321755 3385756 3455350 3535511 3424610 3452171 3492008 3542652 3595835 3634116
4377 3634116 3434639 3250482 3066542 3248597 3520404 3294645 3179886 3534373 3535103 3500478
4367 3500478 3475241 3595878 3871591 3816586 3845564 4030437 4209461 4679804 4548829 4537799
4357 4537799 4474891 4527599 4489928 4336762 4387163 4407162 4328518 4509947 4709920 4450430 4412451
4346D412451J47211Q7951M4459L49964O3229Q9803R8338M76583J52385j32696
4336E789678Q7948K9978K70584J03686P6972K55304q288K06556K19838J00555
4326G132811K06207J13289l1120k47673k91998j5397l9347L7371j86904L19203
4316F996442L8779n3537K36261n6203L4021J36568K26220K84893K28842L19052
4306H391338L8507K42743J64934J30045L787J7392P4520L39116R8642O7093J30524
4295I698641M5759K31164K63642L67773J89947K9108J73017K19786N15546J90973
4285A1925356k9987J74077P9061K40216K97406L34932J74813J44451K85974K31693
4275A3857992J87145J46763L99410K50573m631M51255M28276N68888N04236K95353
$$ plain form
4346 4412451 4559662 4647613 4692072 5042036 5105265 5195068 5293406 5769989 5922374 5789678
4336 5789678 5877626 5907604 6178188 6281874 6358846 6614150 6605862 6812418 7032256 7132811
4326 7132811 7339018 7452307 7421187 7173514 6881516 6866119 6826772 6864143 6677239 6996442
4316 6996442 7035221 6981684 7217945 7161742 7195763 7332331 7558551 7843444 8072286 8391338
4306 8391338 8429845 8672588 8837522 8967567 8971354 8988746 9063266 9402382 9501024 9568117 9698641
4295 9698641 9744400 9975564 10239206 10606979 10796926 10826034 10999051 11218837 11734383 11925356
4285 11925356 11895369 12069446 12148507 12388723 12686129 13021061 13195874 13340325 13626299 13857992
4275 13857992 14045137 14191900 14591310 14841883 14837252 15288507 15716783 16285671 16789907 17085260
4265A7085260N17527O93700N31221J15698M94794L52374J46743j31713l35215
4256A9470389k76388k34243r960L62967L73505O42054P13649P85236Q10187P00052
4246B3337448N69900K51274m14201r73112p83682o50918m88470m81573j41630
4237B0225036k85972K8950J93713J58500J80842O3875L25075N17646K96944M14076
4227B2118685L20747L17266N20834L46087M91692O69424O19494J004285P81558
4218B7190072R30719J097889J185205J134025J191061J214145J518838J436231
4210C6898185J534539J805909J751200J714310K341864J914679K258172K380394
4202E2599252K557224K364563K950825L373511M068410M373234N204043N879187
$$ plain form
4265 17085260 17602787 18296487 18827708 18943406 19438200 19790574 19937317 19805604 19470389
4256 19470389 19194001 18959758 18949798 19312765 19686270 20328324 21041973 21827209 22637396 23337448
4246 23337448 23907348 24158622 23744421 22771309 21987627 21336709 20848239 20366666 20225036
4237 20225036 19939064 19968014 20161727 20320227 20501069 20564944 20890019 21407665 21704609 22118685
4227 22118685 22439432 22756698 23277532 23623619 24115311 24784735 25404229 26408514 27190072
4218 27190072 28120791 29218680 30403885 31537910 32728971 33943116 35461954 36898185
4210 36898185 38432724 40238633 41989833 43704143 46046007 47960686 50218858 52599252
4202 52599252 55156476 57521039 60471864 63845375 67913785 72287019 77491062 83370249
4194H3370249P071506Q006479R527522J1090619J3671755J6149177J9479214K2672016
4186A91038537K7087996L0968875L5733471M0414223M7756935N0950960M6028184
4179D69979181K2881646j6533778m8299590o7954661o2814731n2061772l9651679
4172B05544616k8963923k1927555j7225483j3986631j1884139r955076q432052
4165I3169757o643859n528710n119076m314408m126662l862438l163921k778536
4157E7632147k544038k216822k153632j711628j418342j139444j040991q69442
4149D4537808m28167l12413J34802L86303N20006P39119L48512q11639k293793
4140D2820538l322095l097696k583123k433624j856631j530087j484817j155802
$$ plain form
4194 83370249 90441755 98448234 107975756 119066375 132738130 148887307 168366521 191038537
4186 191038537 218126533 249095408 284828879 325243102 373000037 423950997 469979181
4179 469979181 492860827 476327049 428027459 360072798 297258067 245196295 205544616
4172 205544616 176580693 154653138 137427655 123441024 111556885 101601809 93169757
4165 93169757 86525898 80997188 75878112 71563704 67437042 63574604 60410683 57632147
4157 57632147 55088109 52871287 50717655 49006027 47587685 46448241 45407250 44537808
4149 44537808 44109641 43797228 43932030 44318333 44838339 45577458 45925970 45114331 42820538
4140 42820538 39498443 36400747 33817624 31384000 29527369 27997282 26512465 25356663
4132B5356663j046588p95297o53876o45444n73436l54378n35569l68668m42170
4123A9941237k20091l06194m45113k55456k34064j44576l02551k71391j46979
4114A7614822o5521J64654L36317J69318M68438J74195L88800N65212L37495k83954
4104A9869776m01154j073251p97574q29382o79017q61418n83121m04045l42258
4095A3898556k05158j23746j70706k54694m4709k82705m58012n32739l69847k63205
4085A1193035k99065Q0521N877j08900k46837o51892o17667l74252m9189J03467
4075I035098r9700j93931K1479J49475k88477j95189j40632j36987q6882j24282
4065G939972j48626K04135j80255j79925j82803n0182J278n7176N1185l8291L7910
$$ plain form
4132 25356663 24310075 23514778 22860902 22215458 21642022 21287644 20752075 20383407 19941237
4123 19941237 19721146 19414952 18969839 18714383 18480319 18335743 18033192 17761801 17614822
4114 17614822 17549301 17713955 18050272 18219590 18688028 18862223 19251023 19816235 20153730 19869776
4104 19869776 19468622 18395371 17597797 16768415 16089398 15227980 14644859 14240814 13898556
4095 13898556 13693398 13569652 13398946 13144252 13099543 12816838 12358826 11826087 11456240 11193035
4085 11193035 10893970 10974491 10980368 10871468 10624631 9972739 9355072 8980820 8931631 9035098
4075 9035098 8935398 8741467 8762946 8912421 8623944 8428755 8288123 8151136 8064254 7939972
4065 7939972 7791346 7995481 7815226 7635301 7452498 7402316 7403594 7346418 7397603 7359312 7397222
4054G397222r0864R9814l4945j62644P1234J76178L28605J26446k4909j3559n8666
4043G813912K7291J37772O9890K5786k10558n3782J6013l6051J88818L9752O0567
4032H079410n2583J57174J8697m3701K63615J2417J37231K23206L41878K65232
4022I402576J99045J67373K16596M16233N10235M29720O67878O58614O79704Q09122
4012A4157096L53486J64068l86992m72901p75375n20707m77412m38540j51331
4003A1451392O6219K369m1246O3027q1251L1709K87430J79362K71865K87370K63512
3992A2781758M80207K98661Q22607R75663Q54341R78854J149642J097242J306829
3983B0745804J052077l36840o12732j193224j122942n92745l53396r6536K34384
$$ plain form
4054 7397222 7306358 7406172 7371227 7208583 7279817 7455995 7784600 7911046 7886137 7872578 7813912
4043 7813912 7841203 7978975 8048865 8074651 7864093 7810311 7826324 7790273 7979091 8018843 8079410
4032 8079410 8026827 8184001 8202698 8158997 8422612 8435029 8572260 8795466 9137344 9402576
4022 9402576 9601621 9768994 9985590 10401823 10912058 11341778 12009656 12668270 13347974 14157096
4012 14157096 14510582 14674650 14287658 13814757 13039382 12518675 12041263 11602723 11451392
4003 11451392 11517611 11519980 11478734 11541761 11460510 11492219 11779649 11959011 12230876 12518246 12781758
3992 12781758 13261965 13560626 14383233 15358896 16213237 17192091 18341733 19438975 20745804
3983 20745804 21797881 21461041 20848309 19655085 18532143 17939398 17586002 17489466 17723850
3974A7723850M61335L49038L77625j073l59869j69698r9574M8262K61133L58195
3964A8949224L05227O34004M88073R40385R69024R60684J437188J568168J226472
3955B7478449R64728j06408p80496o82118n43785k00101J63218J27561J39100
3946B6560148l83004m65371r1734l04624J15310K54235M98722P49983Q79879J140879
3936B8954423P67828R06416R08266P96464Q82403O93235J266290J452894R52431
3927C7580650O31131l57040q69139p99627m87284j47818L0948N54606P98980Q30827
3917C7766234J118518J426421J282368J590606J351351J112580O79284J091751
3909D7419113J172961J386266J425969J751010J612715J480113J674914J965849
$$ plain form
3974 17723850 18185185 18534223 18911848 18910775 18550906 18381208 18281634 18329896 18591029 18949224
3964 18949224 19254451 19888455 20376528 21316913 22285937 23246621 24683809 26251977 27478449
3955 27478449 28443177 28336769 27556273 26874155 26330370 26130269 26293487 26421048 26560148
3946 26560148 26177144 25711773 25620039 25315415 25430725 25684960 26183682 26933665 27813544 28954423
3936 28954423 29722251 30628667 31536933 32333397 33215800 33909035 35175325 36628219 37580650
3927 37580650 38211781 37854741 36985602 36185975 35698691 35550873 35581821 36136427 36935407 37766234
3917 37766234 38884752 40311173 41593541 43184147 44535498 45648078 46327362 47419113
3909 47419113 48592074 49978340 51404309 53155319 54768034 56248147 57923061 59888910
3901E9888910K511764K933028L130708L321533L752966L779014L380100L287518
3893H5985541L862511M042581M455915M735123M503490M298853M230085M196955
3885A20311054L966927M177197M977246N890144O275670O908135P712534Q148712
3877A68367619P617600M947555J096143j527756j978422q69728P50759J491237
3869A79895007K302490K491149J866448J821607J808039J990425J616208M91536
3861A94282909j078795k431275l136331l078473k962700k568051k497485k429020
3853A74100779j627276j001203k41977r81311l325670o704817r136314r352866
3845A41729345q376426o920270n485199m780790m188463l929105l723916l553138
$$ plain form
3901 59888910 62400674 65333702 68464410 71785943 75538909 79317923 82698023 85985541
3893 85985541 89848052 93890633 98346548 103081671 107585161 111884014 116114099 120311054
3885 120311054 124277981 128455178 133432424 139322568 145598238 152506373 160218907 168367619
3877 168367619 175985219 180932774 182028917 180501161 178522739 177653011 178403770 179895007
3869 179895007 182197497 184688646 186555094 188376701 190184740 192175165 193791373 194282909
3861 194282909 193204114 190772839 187636508 184558035 181595335 179027284 176529799 174100779
3853 174100779 172473503 171472300 171230323 170249012 166923342 160218525 151082211 141729345
3845 141729345 133352919 126432649 120947450 116166660 111978197 108049092 104325176 100772038
3837A00772038l989281m325137m079121m179242m169865l722614l168158k533684
3829G0604936k248354k239258k735567k916685k586030k134970k068043j622477
3821E2053552j384882j188415j084114j295075j091537j125829j351380j186626
3813D2345694q31081q73868r35992r78396j304267j207762j356638r63920o09451
3804C3284319q06090l19852k37784l26337r4401j06356K0185M9575J47334P1913
3794C1682506L21029N13240N19241M52941M72821Q72269Q21891Q97420J260984
3785C7814342J513369J778907K400428K282603K139414R95419k631216m292905
3777D2000361l856454l322424k807333k390781j614996j361016j071841r83255
$$ plain form
3837 100772038 96782757 92457620 88378499 84199257 80029392 76306778 73138620 70604936
3829 70604936 68356582 66117324 63381757 60465072 57879042 55744072 53676029 52053552
3821 52053552 50668670 49480255 48396141 47101066 46009529 44883700 43532320 42345694
3813 42345694 41514613 40640745 39704753 38726357 37422090 36214328 34857690 33893770 33284319
3804 33284319 32478229 32158377 31920593 31594256 31499855 31393499 31413684 31463259 31610593 31682506
3794 31682506 32003535 32516775 33036016 33488957 33961778 34834047 35655938 36553358 37814342
3785 37814342 39327711 41106618 43507046 45789649 47929063 48924482 46293266 42000361
3777 42000361 38143907 34821483 32014150 29623369 28008373 26647357 25575516 24592261
3769B4592261r15154r50242r13173o11946o85888n13782o94651n12278k86708
3760A8508439n89447p08735l02692k02994l24661k59311j51085j49110k58626
3751A5561778J0081j25248J07731J73281J07073j85603J20831R7423k5445q1315
3741A5760587j38313j45496k21715l90344r8489j26918j92078k18503k17494o1702
3731A3949535l10206k23006m31259k89146j75003k12561J35918p207j45263M7347
3721A2339149k61316o8830n6254L2523r7375j06815P6537O2959k3238j70842n753
3710A1720745n2988j930J50126K33481j4569n4336J4393R2377l1141j64918r4287
3699A1796953L780j22852q1886j5801N543j98611j60788R199j17411j15111R1779
$$ plain form
3769 24592261 23677107 22726865 21813692 21201746 20515858 20002076 19307425 18795147 18508439
3760 18508439 17918992 17210257 16907565 16704571 16379910 16120599 15969514 15820404 15561778
3751 15561778 15571859 15446611 15554342 15727623 15834696 15649093 15769924 15867347 15841902 15760587
3741 15760587 15622274 15476778 15255063 14864719 14766230 14639312 14447234 14228731 14011237 13949535
3731 13949535 13639329 13416323 12985064 12695918 12520915 12308354 12444272 12437065 12291802 12339149
3721 12339149 12077833 12009003 11952749 11985272 11887897 11781082 11857619 11920578 11897340 11726498 11720745
3710 11720745 11667757 11665827 11815953 12049434 12034865 11980529 11994922 12087299 12056158 11891240 11796953
3699 11796953 11800733 11677881 11595995 11580194 11585737 11387126 11226338 11235537 11118126 11003015 11094794
3688A1094794j5865Q5064O1390J70267L3597j30648J58813L06811N5191J71520
3678A1990934K52153J10053K34336K67677J65355J83688K12366M47395K15333
3669A4079290J93035K41798K05839K43069J44491O2768J31295j33777j58980Q9125
3659A5097953o2016r2235k07191j77537R3711j78551j080L75564j57983M9330
3649A4739965r8171j96938l86118j11449l56975j26652Q5582J37871J58780m736
3639A3841159k16119L2166M6557J2561p7974L9613J04065m4821n1925k57759k77306
3628A3150217j66117k83943j14733k28868k28073j30919k14918k46779n34734
3619A1001133j25550k81804q4607k59367k69810j91060j82443j54338j73405R6667
$$ plain form
3688 11094794 11078929 11163993 11225383 11395650 11429247 11298599 11457412 11764223 11819414 11990934
3678 11990934 12243087 12353140 12587476 12855153 13020508 13204196 13416562 13863957 14079290
3669 14079290 14272325 14514123 14719962 14963031 15107522 15170290 15301585 15167808 15008828 15097953
3659 15097953 15035937 14943702 14736511 14558974 14652685 14474134 14473054 14848618 14690635 14739965
3649 14739965 14641794 14444856 14058738 13947289 13590314 13463662 13549244 13687115 13845895 13841159
3639 13841159 13625040 13657206 13703763 13716324 13638350 13677963 13782028 13737207 13685282 13427523 13150217
3628 13150217 12984100 12700157 12585424 12356556 12128483 11997564 11782646 11535867 11001133
3619 11001133 10875583 10593779 10509172 10249805 9979995 9788935 9606492 9452154 9278749 9375416
3609I375416K565K6472l76646P9038J7796p8374L5941o2967J0493K41903k6428
3598I245209j80909k63597J92223j33425k40983r8828r4798m896k43778J1278
3588H187496k25309m14289j72064o7435k33454j00841J77577J3529k28228k54449
3578F682533j43014r4471M2900j62179j10998J67710j55844O5691Q1766J02917
3568F477011k24686j57079J66480k08351n0027r9409k7154K5684j66150j17112
3558E619207q0228o7843o9351J3859j19468r432o5472l3957j62440k7934J82900
3547E179841j40481j03663K8737m37422k25333m1610Q3106P8007j57866K2421
3537D285737q8971q8465j0284j30009K3648k74747J48231P3380J6019J1458m9228
$$ plain form
3609 9375416 9377981 9404453 9027807 9106845 9124641 9046267 9082208 9019241 9029734 9271637 9245209
3598 9245209 9064300 8800703 8992926 8859501 8618518 8519690 8424892 8419996 8176218 8187496
3588 8187496 7962187 7547898 7375834 7308399 7074945 6974104 7151681 7165210 6936982 6682533
3578 6682533 6539519 6445048 6487948 6325769 6214771 6382481 6226637 6292328 6374094 6477011
3568 6477011 6252325 6095246 6261726 6053375 6003348 5903939 5876785 5902469 5736319 5619207
3558 5619207 5538979 5471136 5401785 5415644 5296176 5286744 5221272 5187315 5024875 4996941 5179841
3547 5179841 5039360 4935697 4964434 4527012 4301679 4260069 4343175 4421182 4263316 4285737
3537 4285737 4196766 4108301 4098017 3968008 3991656 3716909 3865140 3938520 3954539 3965997 3916769
3526C916769k7381j1466R051j06156j86178k35293J4974J24407j16251P6009p5231
3515C383254q1452m0291r4063j07775M8305j18704o0937j15009Q8P8747j18173
3504B773990k28953J51199J3636j37638m9370j20373L2623j0013L69765j31241
3494B663625p7709p3002j27040q2849M8733P3213j21913R0568J82523j71696n8751
3483B345702J18690j410k08367K02530L6865j49556r3006q2794O070k05411P2070
3472B041383p7711J25498k5494r9023o1686L3236n493J7851L0914j00037k13387
3461A666051O0874n6906J5533J89736j32912J57856K9191j35644M976K57721j5426
3450B041050J03094R3723m5621N304j25015o5904j64806l1664J02905O914n5188
$$ plain form
3526 3916769 3889388 3877922 3886973 3780817 3594639 3359346 3374320 3498727 3382476 3458485 3383254
3515 3383254 3301802 3261511 3167448 3059673 3107978 2989274 2928337 2813328 2813416 2892163 2773990
3504 2773990 2545037 2696236 2709872 2572234 2522864 2402491 2435114 2425101 2794866 2663625
3494 2663625 2585916 2512914 2385874 2303025 2351758 2424971 2303058 2393626 2576149 2404453 2345702
3483 2345702 2464392 2462982 2254615 2457145 2494010 2344454 2251448 2168654 2174724 1969313 2041383
3472 2041383 1963672 2089170 2063676 1964653 1902967 1936203 1930710 1948561 1979475 1879438 1666051
3461 1666051 1726925 1670019 1685552 1875288 1742376 1900232 1929423 1793779 1798755 2056476 2041050
3450 2041050 2144144 2237867 2192246 2197550 2072535 2006631 1841825 1810161 1913066 1919980 1864792
3439A864792j7401j81405N3360R9209k0031R243j61040J8990j66567J2821K84090
3428A796061j14399Q6166K15178j3867j26992O3352J17427l40501J12223J7672
3418A812320J59665j13197o8155j5342q3549r9280L6382J36911j243k34626J37761
3407A667647k5937n8664k0277M5866O5526L7089J39722k7452j34781K63997j23485
3396A829251k14517R184k4786k650p8274M1832P8153k1311j67842J93525R5153
3385A737718j63530k1377J08515j72600O1705K03442j01463j41858p9685Q6554
3375A517421N1481j42973j37563J78207L3413l3360K66266L9880j63220j94319
3365A415233J40048J27254j15624k5567l0392j66642K8638m4917J25861j51601
$$ plain form
3439 1864792 1847391 1665986 1719346 1818555 1798524 1807767 1646727 1665717 1499150 1511971 1796061
3428 1796061 1681662 1767828 1983006 1969139 1842147 1905499 2022926 1682425 1794648 1812320
3418 1812320 1971985 1858788 1790633 1775291 1691742 1592462 1628844 1765755 1764512 1529886 1667647
3407 1667647 1641710 1583046 1562769 1608635 1674161 1711250 1850972 1823520 1688739 1952736 1829251
3396 1829251 1614734 1623918 1599132 1596482 1518208 1560040 1638193 1616882 1449040 1642565 1737718
3385 1737718 1574188 1552811 1661326 1488726 1550431 1753873 1652410 1510552 1430867 1517421
3375 1517421 1568902 1425929 1288366 1466573 1499986 1466626 1732892 1772772 1609552 1415233
3365 1415233 1555281 1682535 1566911 1541344 1510952 1344310 1372948 1328031 1453892 1302291
3355A302291N5441J26957l4898j7923p4851n8879M9011q6713j16875J54970Q097
3344A306628J05685n1770k0373J02800j09592r3657n232J26297J1270J38245J10699
3333A621000j68361r886K50274j38390o5292o9601o6886K6793m6902r601M45j8837
3321A304756j01695j08164N3739J61301j4395l8175Q8431M5327N7674J02914K3767
3310A575480j02842N2315k03343M7631J77584J95434o803j22234j32793J63155
3300A643584j301K3501o8683N746Q4152Q7637L5106n8614J14286j1264r0001J67596
3288A931745J21174n2339j57437K6836M13051j301q6611L1088J33848J14916k1954
3277B453016J09653P8905j82652L4014J4328M03242J8042J03462K63012J62082
$$ plain form
3355 1302291 1357732 1484689 1449791 1431868 1357017 1298138 1347149 1260436 1143561 1298531 1306628
3344 1306628 1412313 1360543 1340170 1442970 1333378 1239721 1234489 1360786 1372056 1510301 1621000
3333 1621000 1452639 1442753 1693027 1554637 1489345 1419744 1352858 1379651 1332749 1323148 1323593 1304756
3321 1304756 1203061 1094897 1148636 1309937 1295542 1257367 1345798 1391125 1448799 1551713 1575480
3310 1575480 1472638 1524953 1321610 1369241 1546825 1742259 1735456 1613222 1480429 1643584
3300 1643584 1642283 1665784 1597101 1602847 1686999 1774636 1809742 1751128 1865414 1854150 1764149 1931745
3288 1931745 2052919 2000580 1843143 1869979 2283030 2281729 2195118 2226206 2360054 2474970 2453016
3277 2453016 2562669 2641574 2458922 2492936 2507264 2910506 2928548 3032010 3295022 3457104
3267C457104L3211Q8808J75306K96426L65557J14602r5660L23551K42351O1913
3257E063169j88844j20495l9984p1571l10829R1855k32315l64576l24624k44780
3247C257006j21557k34155k6913N4440j9764j21205p1014n1693j7754k00145j59567
3236B287679k7386J96579k6818L5369j62153J15875L2326N2482l3964R0659N2785
3225B613433N8755O0481J3524q7015m1850J01559J3525K7110k80836o3241L07149
3214B722594o0595j26246m7752o9344j049m2424l8618J05886k07142J23018l8400
3203B319928l6819j50597o8753p2458R1626L90110l0796k05349J32863J91440
3193B561195l5523q1666K0825J78100M7723O7418k21407j59378k30127l6394J83234
$$ plain form
3267 3457104 3490315 3579123 3754429 4050855 4416412 4531014 4435354 4758905 5001256 5063169
3257 5063169 4874325 4753830 4713846 4642275 4331446 4423301 4190986 3826410 3501786 3257006
3247 3257006 3135449 2901294 2874381 2928821 2909057 2787852 2716838 2665145 2647391 2447246 2287679
3236 2287679 2260293 2456872 2430054 2465423 2303270 2419145 2451471 2503953 2469989 2560648 2613433
3225 2613433 2672188 2732669 2746193 2659178 2617328 2718887 2732412 2759522 2478686 2415445 2722594
3214 2722594 2661999 2535753 2488001 2418657 2417608 2375184 2336566 2442452 2235310 2358328 2319928
3203 2319928 2283109 2132512 2063759 1991301 2082927 2473037 2442241 2236892 2369755 2561195
3193 2561195 2525672 2444006 2464831 2642931 2690654 2758072 2536665 2377287 2147160 2110766 2294000
3182B294000K04260j34882l6500K1404j21740m4834J48773O5281r2818j39993
3172B162951R3113n8410n343O9752j9130j56710J86760M1868o0251r0675j80859
3161A983066M8275M5527p0572K138Q6487n0004P5723o6090m3333o5556p7611J93112
3149B061162N1748Q941P7972k4842j93248r8406J21254K20657q3508j77823p8846
3138A885061r2867j74824P5825J24447Q248j99895J85624K9673j55228K9980j2679
3127A703365j96981o6927J09395O0518J9892m3701J75801L0112j90468K8891Q413
3116A638310J86584k02288m78620m5093K28468J27663j45133O0246j881j32900
3106A235356n4999p2856J6596Q3563j2006q0511R3687O3975j17317J18461j08985
$$ plain form
3182 2294000 2498260 2363378 2326878 2348282 2226542 2181708 2330481 2395762 2302944 2162951
3172 2162951 2256064 2197654 2192311 2262063 2242933 2086223 2272983 2314851 2254600 2163925 1983066
3161 1983066 2031341 2076868 2006296 2008434 2094921 2044917 2120640 2054550 2011217 1945661 1868050 2061162
3149 2061162 2112910 2121851 2199823 2174981 1981733 1883327 2004581 2225238 2141730 1963907 1885061
3138 1885061 1792194 1617370 1693195 1817642 1825890 1625995 1811619 1841292 1686064 1716044 1703365
3127 1703365 1506384 1439457 1548852 1609370 1629262 1585561 1761362 1791474 1601006 1629897 1638310
3116 1638310 1824894 1622606 1143986 1098893 1327361 1455024 1309891 1370137 1368256 1235356
3106 1235356 1180357 1107501 1124097 1207660 1195654 1115143 1208830 1272805 1155488 1273949 1164964
3095A164964k994j11291M4085r7165r1287j37936l1054N8156j0982Q893q7458
3084G05931J41650J72084J2287q0801j14942j4758j91738n0408m6389L28194j07068
3073G54042j19292j07705O5498r054j40748j7709J55963Q034P617M7660m0042
3062F04264p8762N2290n1940N7866P131J2218R7909N4339k24576n703O7410q050
3050E84396j8559j97092N2642R9122j24067p2937P7856O2050M3587J14456K5430
3039F46884l48068o9951j371K0599p5182Q47J40773k6822M8669j25166k2260N2931
3027B41883J8120J45471J1675J22225l2679O4509m2280J9428j29596j3661o6839
3016C38256k3964j60192j4356l1790J21076R2182o9969l6938k9435j09680J28570
$$ plain form
3095 1164964 1161970 1050679 1094764 997599 906312 768376 737322 795478 784496 793389 705931
3084 705931 847581 1019665 1031952 951151 836209 821451 629713 579305 532916 861110 754042
3073 754042 634750 527045 592543 583489 442741 425032 580995 589029 596646 644306 604264
3062 604264 525502 577792 525852 583718 590849 603067 700976 755315 530739 525036 592446 584396
3050 584396 565837 368745 421387 520509 396442 323505 401361 463411 506998 621454 646884
3039 646884 298816 228865 227494 248093 172911 173758 314531 287709 336378 211212 188952 241883
3027 241883 260003 405474 417149 539374 506695 571204 528924 548352 418756 405095 338256
3016 338256 314292 154100 139744 107954 229030 321212 251243 214305 184870 75190 203760
3005B03760K846J64820L280p2979j23519j45182o2120q4942J58623K67517J15712
2994D27816J46318j82739j9173J19558l4932K0572p1782n5292M9703p7742N2640
2983C74947M41p862M9755j26502O8988n8324j12634m869K63822j42579j42976
2972A62207J10680R3873K8748j86101j62411J43555O3763m9975J5694J8551J8756
2961B57340j02625Q6734m5591M0782J28495q5145R5615J84953r4229j83899O8939
2950C51369p4798Q7546J04018j33663L8629M6641M8367J6907j0802Q7952r5002
2939D67164k6779J8725J74157R7745j86058q2594j5503j93947J36195J83597q6629
2928D86073L406L0447J8764L9J42519j22684J23342N7011j43343j8426j32975
$$ plain form
3005 203760 206606 371426 374706 301727 178208 33026 -29094 -114036 44587 312104 427816
2994 427816 574134 391395 372222 491780 456848 477420 405638 350346 400049 322307 374947
2983 374947 375388 367526 417281 290779 359767 301443 188809 183940 447762 305183 162207
2972 162207 272887 366760 395508 209407 46996 190551 254314 204339 220033 238584 257340
2961 257340 154715 241449 195858 236640 365135 279990 375605 560558 466329 282430 351369
2950 351369 276571 364117 468135 334472 373101 419742 468109 485016 474214 562166 467164
2939 467164 440385 459110 633267 731012 544954 462360 446857 252910 389105 572702 486073
2928 486073 489479 519926 538690 538729 681248 558564 681906 738917 595574 577148 444173
2917D44173r0890J19554O3379N4080R3923j65451q3218P0347p022L5848K50481
2906G85204L1327k4656j50421j06394K2577J33280j87227n8653q9785j4524J12849
2895D53577l0304r6771M4696K5550o6193J45236j5985j84976J75211J32032j05197
2884D76876J1378r6374j38381J41891j90551J21189O1162j62057K05046q8350
2874C41829j53222J64634l5112k08172K5036q34P3779J27677l4587r2868J25560
2863C33720j67352j47302J76253q4919q7347m6072K52302J09935k35152O3424
2853A67490j54754q0759J7557O6277n300m9788J04138N5068r8766j343j88218
2842a68398J09376J41035J16710M5419j29484r4191R2331j35428j71372o4639
$$ plain form
2917 444173 353283 472837 536216 590296 684219 518768 435550 505897 498875 534723 785204
2906 785204 816531 791875 641454 535060 557637 690917 503690 445037 355252 340728 453577
2895 453577 423273 326502 371198 396748 330555 475791 459806 274830 450041 582073 476876
2884 476876 488254 391880 253499 395390 204839 326028 387190 225133 430179 341829
2874 341829 188607 353241 318129 109957 134993 134159 207938 335615 301028 208160 333720
2863 333720 166368 19066 195319 110400 23053 -23019 229283 339218 104066 167490
2853 167490 12736 -68023 -50466 15811 10511 -39277 64861 119929 21163 19820 -168398
2842 -168398 -59022 82013 198723 244142 114658 20467 112798 -22630 -194002 -258641
2832b58641Q0701J86837j74428J29479K70135q3679J35777J11110j74299o1618
2822A61374M8866R211j10366Q7199j3644O9668n8572j95q4870j15891m0043J80940
2810A33677Q8273j41118M1267k3177j15845J04379j21559k1630J05597j16116
2800f6252J69830j04735j98553K99951K44130l26474k1862j07981Q6245J26753
2790A01052m9548R0344j17995K02754m0048j01091J32327j10581R1381J5104j16784
2779I6915j22844J34J30319l00388K2495q0618J31870k656j27093L06184J01935
2768A56253j92565o5766J80190J77066k22772j34274K9226k2673J47661j67932
2758a15586l362N2024q1929j52710J44099J05040K0579P4001L5504j19492M6396
$$ plain form
2832 -258641 -177940 8897 -165531 -36052 234083 150404 286181 397291 222992 161374
2822 161374 210240 219451 109085 196284 182640 252308 193736 193541 108671 -7220 -47263 133677
2810 133677 221950 80832 122099 98922 -16923 87456 -34103 -55733 49864 -66252
2800 -66252 103578 -1157 -199710 100241 344371 17897 -3965 -111946 -25701 101052
2790 101052 51504 141848 23853 226607 186559 85468 217795 107214 198595 213699 96915
2779 96915 -25929 -25795 104524 -195864 -173369 -253987 -122117 -124773 -251866 54318 156253
2768 156253 -36312 -102078 78112 255178 32406 -101868 -72642 -95315 52346 -115586
2758 -115586 -118948 -66924 -148853 -301563 -157464 -52424 -31845 42156 77660 -41832 4564
2747D564K37435l05108J3612J12366q6538o7203l5342K43462K0914n4897o9400
2736A3865j65096K1752K33807n2410n554Q8737M9303j80248j1152R1039p3718
2725A0325r1864l2783J3447j02065R57n3396o6328Q2795J52581J98255J23206
2714B35130j43041j07657J59679O66J7336O787m5474j45795K0744O0343l6629
2703B2089K33164j79543k05731P7798J89394j25182o7903k2504n9779Q2573o3177
2692a18801j34784O7825K34277q5290k26835K00404R3324j1223r9198p767O344
2681h1724J14367K6638j22818J88308K511M9617j08212n2381J15052k714j13752
2670A4892M3456j07402j68288M6768J63466p6181J09319n9397j60170J0818J36802
$$ plain form
2747 4564 241999 -63109 -49497 62869 -23669 -90872 -126214 117248 138162 83265 13865
2736 13865 -151231 -129479 104328 51918 46364 135101 184404 4156 -6996 84043 10325
2725 10325 -81539 -114322 -100875 -202940 -201983 -255379 -321707 -238912 -86331 111924 235130
2714 235130 92089 -15568 144111 144777 162113 168900 123426 -22369 -1625 58718 22089
2703 22089 255253 75710 -130021 -52223 137171 11989 -55914 -78418 -138197 -55624 -118801
2692 -118801 -253585 -185760 48517 -36773 -263608 -63204 30120 18897 -80301 -88068 -81724
2681 -81724 32643 59281 -63537 124771 127282 176899 68687 16306 131358 128644 14892
2670 14892 58348 -49054 -217342 -170574 -7108 -83289 26030 -33367 -193537 -182719 -45917
2659d5917J9907J47735k5842j32706j02983l38j28203n864K38239J01250j23957
2648e8679K2060k2398j03530J3837k0283Q5781K27112K03844j41916k0732j91964
2637f868j61725o5974M3092J69111R6393Q3163l1282j27892j12967L0601J91421
2626A07073m8867L366j46704M3215L5726J10552j86281J2105N2117m4844j05893
2615a68435Q6084J05638K1600J49603q8011m0928j9970m2319J51972j49750j8035
2604a2551j52216j2962j7326Q3285J17866j27706J43294L8022m9686M9131J61706
2593B20857q7344k32601j699M1612M5070k9452j69295J55742R8401N1662q9275
2582C678n7216J66808O0714m0108J0108m6461q8804j14725r5448J39186r3706
$$ plain form
2659 -45917 -26010 121725 95883 -36823 -139806 -140144 -268347 -274211 -35972 65278 -58679
2648 -58679 -36619 -59017 -162547 -148710 -168993 -83212 143900 347744 205828 185096 -6868
2637 -6868 -168593 -234567 -191475 -22364 74029 157192 125910 -1982 -114949 -84348 107073
2626 107073 58206 61572 -85132 -41917 -6191 104361 -81920 -69815 -17698 -62542 -168435
2615 -168435 -82351 23287 44887 194490 106479 65551 45581 3262 155234 5484 -12551
2604 -12551 -164767 -177729 -195055 -111770 6096 -121610 21684 59706 10020 59151 220857
2593 220857 133513 -99088 -100787 -59175 -14105 -43557 -212852 -57110 41291 92953 3678
2582 3678 -53538 113270 173984 133876 143984 97523 8719 -106006 -201454 -62268 -155974
2571a55974K6728j0843n860R4112o2812M2773k0280R0822r5203j27820K15952
2560h405J61612k7815n3880J03993m9718l809j82260p144M9531r5919J48305O2521
2548I7012j3305j83016O3949p073R0620N5616p9246j12543k31388R1699P4527
2537a53148J80178K0409q0730N4600J01046K0911K2544r8121j37004P7049j39977
2526a32243p6603J2082J29013J37427j57767R4571O4611j21770M31936j61997
2516B19260k73069q6144M9066J34307J41512q3562K2819J50321j60343k64776
2506a50609K6448L6972J52168j04148N9101N0255k6668j40960K7304l0570L3232
2495f7475J8423L5623M3394Q6138j79904n4463J8426j11535l3084J39679J3388
$$ plain form
2571 -155974 -129246 -140089 -145949 -51837 -114649 -71876 -92156 -1334 -96537 -224357 -8405
2560 -8405 153207 125392 71512 175505 125787 121978 -60282 -67426 -17895 -113814 34491 97012
2548 97012 83707 -99309 -35360 -42433 48187 103803 24557 -87986 -319374 -227675 -153148
2537 -153148 27030 47439 -33291 21309 122355 143266 165810 67689 -69315 7734 -132243
2526 -132243 -208846 -196764 -67751 69676 -88091 6480 71091 -50679 381257 219260
2516 219260 -53809 -139953 -90887 43420 184932 101370 124189 274510 114167 -150609
2506 -150609 -124161 -87189 64979 -39169 19932 70187 43519 -97441 -70137 -100707 -67475
2495 -67475 -49052 -13429 29965 116103 -63801 -118264 -99838 -211373 -244457 -104778 -91390
2484i1390J0063M8421p1993J62112J9087k1467q1908N7024q9337j22022K02892
2473B1482j72736j1433m0086m2593J55149J38832L898l9185l4130q1433J31582
2462B9347L6253j6797K384J8425N2102K0110M8229q9488k52363J7490R4783N8973
2450A9448p292J85273j77923P2004j1995j01255N3521K75666K0284n0714j16392
2439A60625K6330q2081K67347j44290r0772p6675j51507m2771O0281P8201P867
2428A2555j18873o5218K03155L9025K1203J01504O2612j45900j51902r2195O8021
2417f6013O8474P0071K14096m61519o482J34385K24644k07715L5042J61822j59931
2406F874j44862J03281J36635J23104o527j88204L3158n4646J6837o4007L8660
$$ plain form
2484 -91390 -81327 -32906 -104899 57213 76300 54833 -27075 29949 -59388 -181410 21482
2473 21482 -151254 -162687 -202773 -245366 -90217 48615 52513 13328 -20802 -102235 29347
2462 29347 65600 48803 51187 69612 121714 141824 190053 100565 -151798 -134308 -39525 19448
2450 19448 12156 197429 19506 91510 79515 -21740 31781 307447 327731 277017 160625
2439 160625 186955 104874 372221 227931 137159 60484 -91023 -133794 -73513 4688 12555
2428 12555 -106318 -171536 31619 70644 91847 193351 255963 110063 -41839 -134034 -66013
2417 -66013 2461 72532 286628 -174891 -181373 -46988 177656 -30059 4983 166805 6874
2406 6874 -137988 -34707 101928 225032 218505 30301 63459 8813 25650 -38357 303
2395C03K70846P6378q2817M8006Q5382R0881O4831k13103l4743P0908J60546K30668
2383G68086k03251j63731n7962p1862j98002J42531Q990O8262m8086j668j521
2372B41786L854m820M8708p8486n1261l8182R4047k26137J60739J43432k5291
2361B68389j41476J04490p3579n4696J39112j6460J2348N1119O4088j71854o2350
2350A19131J8119J06612l7139j52568J3657J13753O1341O2022k36546J064r7713
2339b8267R5401J07974k7666N5211j68265J52537K2240J19024j51383j59006Q3705
2328A01505O9762r5040J96331k04635o823p450q3961P7651J20805N8757J64060
2317C90962R0130j07691k16242r149K522j41747m982M7657j51871K82313k2475
$$ plain form
2395 303 271149 347527 264710 312716 398098 488979 553810 340707 305964 376872 537418 768086
2383 768086 564835 401104 343142 271280 73278 215809 224799 293061 244975 243307 241786
2372 241786 245640 240820 289528 211042 159781 121599 215646 -10491 150248 293680 268389
2361 268389 126913 231403 157824 103128 242240 225780 238128 289247 353335 181481 119131
2350 119131 137250 243862 206723 54155 67812 181565 242906 304928 68382 69446 -28267
2339 -28267 67134 175108 147442 202653 34388 186925 209165 328189 176806 17800 101505
2328 101505 171267 76227 272558 67923 61100 53650 -30311 47340 168145 226902 390962
2317 390962 481092 373401 157159 148010 150532 8785 3803 51460 -100411 181902 159427
2306A59427j88613K47536n6020J56124J3284q9259Q917M8486p2724k3593J02592
2295C06157r6890j051J17811N0801k31351j12654R7881J81727M8255p5049J45261
2284D30898j9555N3130R9705j25748p8415M9182j77890p7724K02079O4345q0289
2273C39718L4215k8550J09805O3855K8054m6841R9979k8875M875j76106N9583
2262D59712P823P9537J9454o5648k34755L8508M2304P7963J380k3466J15566m7386
2250D70992n675K12367J28521k87441j30196J48489N6901R4992j0809n9371O0308
2239F79078J5042Q4067q824m8953r9374J26937K20837p5991n6340J06896j54998
2228G88377j37473J54522J5089m1184q8394n2377K50941J86715J4085j33980m9508
$$ plain form
2306 159427 -29186 218350 162330 318454 331738 242479 251396 299882 227158 203565 306157
2295 306157 209267 208216 326027 376828 145477 32823 130704 312431 360686 285637 430898
2284 430898 411343 464473 564178 438430 360015 409197 231307 153583 355662 420007 339718
2273 339718 373933 345383 455188 519043 547097 500256 600235 571360 576235 400129 459712
2262 459712 467535 547072 566526 500878 266123 304631 346935 424898 426278 402812 518378 470992
2250 470992 465317 677684 806205 518764 388568 537057 593958 688950 678141 618770 679078
2239 679078 694120 778187 769363 720410 621036 747973 968810 892819 836479 943375 788377
2228 788377 650904 805426 820515 779331 690937 638560 889501 1076216 1090301 956321 906813
2217I06813L12156m4066J19091k735L2487n1779L4695j14032J71158K61731L3798
2206A659317j04525o1843J78879p8484L8269m3233n5953J51984L72159K21303
2196B277873l03166L3993J72490J37405p5896r6849K71335K57513q8990j02852
2186B482856J11764K94963l5148O5225k6514R775K0806q3193j8124Q6095J86933
2175C095438J83693Q0714O4969L5260J57305K5783m5491K9535m6890K97491J80378
2164D058185m1600J30637L91274j26605j3725K75109J56102j4002K02924N73536
2154E591835M46665J96418M28261K92475L64590L36962M61255K48529N20754M84768
2144I372512M18534M36292R03591O83632O45121N31181P08129Q96440J239265
$$ plain form
2217 906813 1218969 1174903 1293994 1291259 1323746 1271967 1306662 1192630 1363788 1625519 1659317
2206 1659317 1554792 1492949 1671828 1593344 1631613 1588380 1532427 1684411 2056570 2277873
2196 2277873 1974707 2008700 2181190 2318595 2242699 2145850 2417185 2674698 2585708 2482856
2186 2482856 2594620 2889583 2854435 2919660 2893146 2902921 2923727 2840534 2822410 2908505 3095438
2175 3095438 3279131 3359845 3424814 3460074 3617379 3643162 3597671 3627206 3580316 3877807 4058185
2164 4058185 4016585 4147222 4538496 4411891 4398166 4673275 4829377 4815375 5018299 5591835
2154 5591835 6038500 6234918 6663179 6955654 7320244 7657206 8118461 8366990 8887744 9372512
2144 9372512 9791046 10227338 11130929 11814561 12459682 12990863 13698992 14595432 15834697
2135A5834697J333738J687841J526413J750848J461525K040973K514485L633967
2127C1784487M326071N465996N905146P934394Q236033R501206J1048858J5596218
2119I9798409J1591091P992447q843139k2259387j6175361j5704080j1001093
2112D5398887q176404n343608m414747k560840k465792j728954j583922r86763
2104A8137857q97047p88252j301268j234416j211049r62734r17527p08895p59814
2095I356855n38067n77288m44021k82194j85478j62934m74413m95891N1488j70258
2085F077799j40064j42665l22933l87370k53497k16185o5665p052j39051j87235
2075D216082k25136j27379k20587m0390j81240r4274l52522j05854K42112j13343
$$ plain form
2135 15834697 17168435 18856276 20382689 22133537 23595062 25636035 28150520 31784487
2127 31784487 36110558 41576554 47481700 55416094 63652127 73153333 84202191 99798409
2119 99798409 111389500 119381947 110538808 88279421 72104060 56399980 45398887
2112 45398887 37222483 31878875 27464128 24903288 22437496 20708542 19124620 18137857
2104 18137857 17240810 16452558 15151290 13916874 12705825 11743091 10825564 10116669 9356855
2095 9356855 8818788 8241500 7797479 7515285 7329807 7166873 6692460 6196569 6248057 6077799
2085 6077799 5937735 5795070 5472137 5084767 4831270 4615085 4549420 4542368 4403317 4216082
2075 4216082 3990946 3863567 3642980 3602590 3421350 3327076 2974554 2868700 3110812 2997469
2065B997469o8466l05635o8818j31182M8821o2717M4029p146P7k46044j69436
2054B030952n9047J01590p2350j50616n550R077q5070P438j61720r2111L05754
2043A828347M4637j07735M4125p8767m4446k8p5853N926k71952J38262J9516q4699
2031A417333k74917j23541J63363r7312M6223J61244j85466o372j5821k31294
2021H53440n2758J43144j97225J05771j1080K0583k76408J93357M4416p5395J15440
2010H63285m5074j84283j02244J14030J59010K5674J00734k45560j90712N541
2000E00401J16886J6696N9252M8628j85645k20677K27993L7528l106k07098m5354
1989C45504J88177M4411n5318m7160P6801j5819j85841M3801N6741m239p6344
$$ plain form
2065 2997469 2929003 2623368 2554550 2423368 2472189 2409472 2453501 2446355 2446432 2200388 2030952
2054 2030952 1971905 2073495 2001145 1850529 1844979 1854056 1768986 1776424 1614704 1522593 1828347
2043 1828347 1872984 1765249 1809374 1730607 1686161 1686133 1610280 1616206 1344254 1482516 1502032 1417333
2031 1417333 1142416 1018875 1182238 1084926 1131149 1292393 1106927 1100555 1084734 853440
2021 853440 800682 943826 746601 852372 841292 861875 585467 778824 823240 747845 863285
2010 863285 818211 633928 531684 645714 804724 830398 931132 685572 494860 500401
2000 500401 617287 633983 693235 741863 556218 335541 563534 601062 597956 390858 345504
1989 345504 533681 578092 522774 475614 552415 536596 350755 394556 451297 447058 370714
1978C70714J5205m00P4074K61300o913k65742l2613r5487J38072j67461J30094
1967D20843O1531q1162Q6001j4636j63674p3124O6523k04853K39635p9818q4549
1956A72717K623J53598N2977J23826N1531o6245J1633j18698l3359N9261j20431
1945B89433j59670N4126M3051j00614L7762j54860L1289J33141J28589j89087
1935A13160O3821K512n8608k9729n866J36568P6121k8109j0592J31553j43254
1924B47577l9199l2172m2088J37486l0639k2294q9607o7461r5048R690o1332J14165
1912B9078J38157p5841q6710R7799j30164R3536n6653J57141m8374j20304r734
1901a2069M0827o1414M6657K41824j51095l5916R2159r243j65817L8422j9791
$$ plain form
1978 370714 385919 385519 459593 720893 713980 448238 415625 320138 458210 290749 420843
1967 420843 482374 401212 487213 472577 308903 235779 302302 97449 337084 257266 172717
1956 172717 175340 328938 381915 505741 557272 491027 502660 383962 350603 409864 289433
1945 289433 129763 183889 226940 126326 164088 9228 40517 173658 302247 113160
1935 113160 176981 179493 120885 91156 85290 221858 297979 269870 259278 390831 247577
1924 247577 208378 176206 134118 271604 240965 218671 129064 61603 -33445 -23755 -85087 29078
1912 29078 167235 91394 4684 102483 -27681 65855 9202 166343 117969 -2335 -12069
1901 -12069 28758 -32656 14001 255825 104730 68814 160973 151730 -14087 24335 4544
1890D544K06196J66410j09441p5070J71315j5233j89450j22194m1726j19462L9911
1879h4200L43521m8735j86182J4534R3862p8356p6033K49230J23218j38441j10198
1868A02220j46910K82804J81003m7024o3746j04764L584k28491J28679J15410
1858B22765Q7043j17546O8358m3690k547q1643J49445P1654M3370K58231K4930
1847F80370P6667j32661P5218l75979J0818o0406o1168K6906P9986M3408l5478
1836C27681N0593j83477J55567r1533k8943R038m3905j00825j14967J33909J2296
1825A25434J19487M5805l60414m4787l2324J27560J67560r1183J4777o8865n6675
1814e3625R2655J94036O234k50319k17919J434l1078J00451J89912P3779K38665
$$ plain form
1890 4544 210740 377150 267709 192639 363954 348721 159271 37077 -4649 -124111 -84200
1879 -84200 259321 210586 24404 38938 132800 54444 -21589 227641 350859 212418 102220
1868 102220 -44690 238114 419117 372093 308347 203583 207167 -21324 107355 222765
1858 222765 309808 192262 260620 216930 214383 132740 282185 353839 397209 655440 680370
1847 680370 757037 624376 699594 323615 334433 274027 212859 239765 319751 363159 327681
1836 327681 378274 194797 350364 258831 229888 238926 195021 94196 -20771 113138 125434
1825 125434 244921 290726 -69688 -114475 -146799 -19239 148321 57138 71915 3050 -53625
1814 -53625 39030 233066 239300 -11019 -228938 -227504 -258582 -158131 31781 105560 344225
1803C44225n7408l30580l9824K14P0510o8485J63749m7513J6992J96600k0442
1792B28038j43448j27932L9944K10035k5419j96702l0616k30526J32973J80943
1782C7290J178j29924o1037M4029m7941L8670J48903q2279J02232j45034J16048
1771B2135j80234M6994O8123q4755k6632j7275P0462J12429K6957m7146m895k30139
1759b43976m9026K25061K97676r2914q9980N8989j84653J42582P6095p4892j55425
1748i0463r0550k9294q8895R4890m2054n8307K45581J0845N8593J34923j04987
1737D0282O3263o6444P114j92221N2236j49797K31017M2486N721R1323k8156m7194
1725D9630k38381J03391l1177j16482O8185M2741J43053n2047r7701j345N1629
$$ plain form
1803 344225 286817 -43763 -83587 -83373 -12863 -81348 82401 34888 51880 248480 228038
1792 228038 84590 -43342 -3398 206637 181218 -15484 -46100 -276626 -143653 37290
1782 37290 38468 -91456 -152493 -108464 -156405 -117735 31168 -51111 51121 -93913 22135
1771 22135 -158099 -111105 -42982 -127737 -154369 -171644 -101182 11247 38204 -8942 -13837 -243976
1759 -243976 -293002 -67941 229735 136821 46841 105830 -78823 63759 139854 64962 -90463
1748 -90463 -181013 -210307 -299202 -204312 -246366 -304673 -59092 -48247 10346 145269 40282
1737 40282 103545 37101 44215 -148006 -95770 -245567 -14550 27936 33657 124980 96824 49630
1725 49630 -188751 -85360 -116537 -233019 -164834 -122093 20960 -31087 -128788 -130133 -78504
1714g8504N0994L222o0592j11820K5458j25817K77202J39281r3226O5868r6045
1703c979j45487k1114R8964J13037P7247R3643j63889k4937P3636R688J9553K2473
1691A48835k27177r915N5906r2312O9989N3493l3493M4996M9441q1747L10893
1680B88909l50193N7765L3160j7606o5568L8295J4755K5784N1597k18813J00829
1669d1086K59174l7795j09311j28332n2768J03058L6172K9056q9974N8271P9212
1658A05677M4629j56256O6590k27469q4223L2268Q8476j14265J7800J75980n2848
1647a03641P924m0787j28024j2764J41739j9917M3519J24673K2752j21428J71272
1636H5318o6382j13606n5783j05516j4913M5921R7020K4535n2773j13193K5333
$$ plain form
1714 -78504 -27510 -24288 -84880 -196700 -171242 -297059 -19857 119424 26198 92066 -3979
1703 -3979 -149466 -170580 -71616 41421 118668 212311 48422 23485 97121 106809 126362 148835
1691 148835 -78342 -88257 -32351 -124663 -54674 -1181 -34674 10322 59763 -21984 288909
1680 288909 -61284 -3519 29641 12035 -53533 -15238 -483 25301 76898 -141915 -41086
1669 -41086 218088 180293 70982 -57350 -110118 -7060 29112 58168 -31806 26465 105677
1658 105677 150306 -5950 60640 -166829 -251052 -218784 -130308 -244573 -226773 -50793 -103641
1647 -103641 -95717 -136504 -264528 -277292 -135553 -155470 -111951 12722 35474 -85954 85318
1636 85318 18936 -94670 -150453 -255969 -270882 -224961 -127941 -103406 -156179 -269372 -244039
1625b44039N669j3629j32033K28230O5250o2745P0118j0364J33231J26498o095
1614A60091p1488j57373j49105q230O4474J78419p0557P0492J9977k12612J53386
1603b2526J64128k75236o6112R1134J43199J34557j43943J0285j33377l1305k4661
1592a53857K2741M0507j31323O6754m2607N6318J60245P1536l301j2899j62J7390
1580I1342l4235o0919q4330j76281K7206M1753j12314o9135J97536R0070Q8252
1569a055m9500j25503J00157O8348M1486o3433L2994m7269j19692J83883j5021
1558E395j90904J57898R2612m2432N100o9259j35040j06520L4364l0621j0972
1547b90379K20347k4473J16068J6476q1849J41666L2293J15809n8530j06168j80651
$$ plain form
1625 -244039 -238370 -251999 -384032 -155802 -90552 -153297 -83179 -93543 39688 166186 160091
1614 160091 88603 -68770 -217875 -226105 -161631 16788 -53769 16723 36700 -175912 -22526
1603 -22526 141602 -133634 -199746 -108612 34587 169144 25201 35486 -97891 -129196 -153857
1592 -153857 -131116 -90609 -221932 -155178 -197785 -141467 18778 90314 87013 74114 73952 91342
1580 91342 57107 -3812 -88142 -264423 -237217 -195464 -307778 -376913 -179377 -89307 -1055
1569 -1055 -50555 -176058 -75901 -7553 33933 -29500 3494 -43775 -163467 20416 5395
1558 5395 -185509 -27611 65001 22569 27669 -41590 -176630 -283150 -248786 -279407 -290379
1547 -290379 -70032 -94505 21563 38039 -43810 97856 130149 245958 187428 81260 -99391
1536i9391L7912Q2723N6563m3960m053p673M5622q0111j87069Q7892O3419r5136
1524a43262q112n086l9393P1599l7825q2084J21510j21712K41220P0292j93715
1513a26568L8593j6720J73816m149l7743j46672j29190J42792K30830j6257j86982
1502g8250N7823j51013j17221L27532J70601k20358j43287K02237R2407r2021
1492D8450k28269j30567K00123Q7741p4616J28016O2934n7378J20998q7849j90018
1481a20435O8379R3455p3536J06042l5536m2707o463n2740J59808m4969J24853
1470A76151k15901P5704O4463p3518L6332K54591j72758o3658k9814j3703n8485
1459b0596M9036J2798P654p1382K1971j0239o1654P1664j27931M1209N7656M4214
$$ plain form
1536 -99391 -61479 21244 77807 33847 29794 22121 67743 -12368 -199437 -111545 -48126 -143262
1524 -143262 -151374 -156460 -195853 -124254 -162079 -244163 -122653 -244365 -3145 67147 -126568
1513 -126568 -87975 -104695 69121 64972 27229 -119443 -248633 -105841 124989 108732 -78250
1502 -78250 -20427 -171440 -288661 38871 209472 -10886 -154173 48064 140471 48450
1492 48450 -179819 -310386 -110263 -22522 -97138 30878 93812 36434 157432 69583 -120435
1481 -120435 -52056 41399 -32137 73905 38369 -4338 -10801 -63541 96267 51298 176151
1470 176151 -39750 35954 100417 26899 63231 317822 145064 81406 51592 37889 -20596
1459 -20596 28440 41238 48892 -22490 -519 -10758 -72412 -748 -128679 -87470 -29814 14400
1447A4400l3738p4771P9467J96909n4907l82n7192j2732n4658N3528k07660m0451
1435a92187P2898Q2759M0609M8869l1980Q540N5314j51060j60524K16472l075
1424a3365j72850p8768O0508L52720k4784j2375m4760j12802J8174k39258M2169
1413b25391M7529P7216K37504q2227o9183p3429J0904R2909l0276J2778p8647
1402h0313J48104n9919k33902J00471P5179J19830j84284m9104K12493Q4433k70596
1391a37608k4827k4567P1748J93437n0895m302o7843p5817j13136R8487L1279
1380a04044J26725m1763P5405n3231P602K01891j063k1001j66077m2643J01611
1369H3412m3993l6408O181j39284Q0392n1924J60507k05080j00036L375J7384
$$ plain form
1447 14400 -19338 -94109 -14642 182267 127360 126978 69786 57054 2396 55924 -151736 -192187
1435 -192187 -119289 -36530 4079 52948 20968 29508 84822 -66238 -226762 -10290 -13365
1424 -13365 -186215 -264983 -204475 148245 123461 111086 66326 -46476 -28302 -267560 -225391
1413 -225391 -177862 -100646 136858 54631 -14552 -87981 -77077 15832 -14444 -1666 -80313
1402 -80313 67791 7872 -226030 -125559 -50380 69450 -114834 -163938 48555 132988 -137608
1391 -137608 -162435 -187002 -115254 78183 27288 22986 -44857 -120674 -233810 -135323 -104044
1380 -104044 22681 -19082 56323 3092 10694 212585 211522 190521 24444 -18199 83412
1369 83412 39419 3011 9192 -130092 -49700 -101624 58883 -146197 -246233 -242858 -225474
1358b25474P6977o841M8802q4774P6497J43907M3031P5666O34j24357O3391J41231
1346B28690j79807p9147M9459k25059J10349M6735m6672j22288l5947p078J3878
1335b46887P8580O9678J00548J27754L0862L8971K6033K3934j44999J32432j35087
1324A01819k17596N7567R2837j18255l8489J69565P9770N0354J7899n2817l5205
1313A07449j57820j3841J6065N4191J94123o2519k13340M7644n5503j14043J95521
1302b073p2438n306R6998J46104j95041j86295N5344N0068n9932n1977j53798
1291c78346K49761J89864r5914J5060J74565m7623R2614O2440j24594N1397j21816
1280F7408j16113p5851J46800m0389o6423J29689J24592j94365m8036J02426J60945
$$ plain form
1358 -225474 -148497 -155338 -106536 -191310 -114813 29094 72125 147791 148425 24068 87459 228690
1346 228690 48883 -30264 19195 -205864 -95515 -48780 -95452 -217740 -253687 -260765 -246887
1335 -246887 -168307 -98629 1919 129673 160535 199506 225539 249473 104474 236906 101819
1324 101819 -115777 -58210 34627 -83628 -122117 47448 127218 177572 195471 142654 107449
1313 107449 -50371 -64212 -48147 6044 200167 137648 -75692 -28048 -83551 -197594 -2073
1302 -2073 -74511 -79817 17181 163285 -31756 -218051 -162707 -112639 -172571 -224548 -378346
1291 -378346 -128585 61279 -34635 -19575 154990 107367 199981 262421 137827 189224 67408
1280 67408 -48705 -124556 22244 -18145 -84568 45121 169713 -24652 -72688 29738 190683
1269A90683r4824n4510J02272k24444L2978J01332N8864j42300j4828l146J64341
1258A16418q1782j08490O6471J34007q688j87669L1500J11908n6912r5496j11655
1247a90388J01660R9294K7833q3923r1836m7342Q2027J03344n0648J27903j5469
1236F2455Q587P8358j62768M4638j40196O758P2812O0653N1767l08883L6205K18702
1224B9088J09856r2665Q0576N223J04452j27594J9141N458j19245j06078N3795
1213c7993J8587J2666P7617j52379O12m3657o3614Q0800o990k8900L005O3171
1201g7075J65255J62161j14695j81469J8872J09041N0756m8111p2966J29995M5241
1190A87005k19443j09877M0636j39042L31038L3665k49092N0001J09337J24691
$$ plain form
1269 190683 95859 41349 143621 -80823 -47845 53487 112351 -29949 -44777 -47923 116418
1258 116418 34636 -73854 -7383 126624 117936 -69733 -38233 73675 16763 -78733 -190388
1247 -190388 -88728 10566 38399 -45524 -137360 -184702 -102675 669 -49979 77924 62455
1236 62455 71042 149400 -13368 31270 -108926 -102168 -29356 31297 83064 -225819 -189614 29088
1224 29088 138944 46279 126855 132078 236530 108936 128077 133535 14290 -91788 -37993
1213 -37993 -19406 -6740 70877 -81502 -80890 -124547 -188161 -107361 -114351 -143251 -140246 -77075
1201 -77075 88180 250341 135646 -45823 -26951 82090 132846 84735 11769 141764 187005
1190 187005 -32438 -142315 -101679 -240721 90317 123982 -125110 -75109 34228 158919
1180A58919j66255L1752J47703j24105k09601K1574k24280J00684N5162O8766
1170a39681J8354J04746M3339L0041K9428r1536k622j27483K3518Q3689j4896
1159d3103m4342R8428K1086N0980q9932m0756L5652N5144Q204j44351J47424J08279
1147A62713j79380J10738j79309K69559J22476j33342J4411k14412J35507J12293
1137B21254p644j0965j63540R231R7530k08705r182O5611o5201O9303j10750Q9817
$$ plain form
1180 158919 -7336 24416 172119 48014 -161587 -140013 -364293 -263609 -208447 -139681
1170 -139681 -121327 -16581 26758 56799 86227 -5309 -7931 -135414 -111896 -28207 -43103
1159 -43103 -87445 10983 32069 83049 -6883 -47639 -11987 43157 51361 -92990 54434 162713
1147 162713 -16667 94071 -85238 184321 306797 173455 187866 -26546 108961 221254
1137 221254 213610 202645 39105 48336 145866 -62839 -72021 -6410 -71611 -2308 -113058 -23241
$$ [...]
##END NTUPLES=NMR SPECTRUM
##END=
