##TITLE=1H_EC-3265(3)
 CDCl3,8 sc, 
 26.10.2021
##JCAMPDX= 6.0         $$ Bruker NMR JCAMP-DX V2.0
##DATA TYPE= NMR SPECTRUM
##DATA CLASS= NTUPLES
##ORIGIN= UXNMR, Bruker Analytische Messtechnik GmbH
##OWNER= root
$$ XWIN-NMR		Version 3.5
$$ Tue Oct 26 10:24:53 2021 Russian Standard Time (UT+4h)  she@DPX200
##.OBSERVE FREQUENCY= 200.1313468511
##.OBSERVE NUCLEUS= ^1H
##.ACQUISITION MODE= SIMULTANEOUS
##.ACQUISITION SCHEME= undefined
##.AVERAGES= 8
##.DIGITISER RES= 18
##SPECTROMETER/DATA SYSTEM= spect
##.PULSE SEQUENCE= zg30
##.SOLVENT NAME= D2O
##.SHIFT REFERENCE= (INTERNAL, D2O, 0, 15.7238)
##AUDIT TRAIL= $$ (NUMBER, WHEN, WHO, WHERE, WHAT)
$$ ##TITLE= Audit trail, XWIN-NMR		Version 3.5
$$ ##JCAMPDX= 5.01
$$ ##ORIGIN= Bruker BioSpin GmbH
$$ ##OWNER= she
$$ F:/spectra/data/she/nmr/H-F/1/pdata/1/auditp.txt
$$ ##AUDIT TRAIL=  $$ (NUMBER, WHEN, WHO, WHERE, WHAT)
(   1,<2021-10-26 10:23:42.37 +0400>,<she>,<DPX200>,
      <created by zg, POWCHK disabled, PULCHK disabled
       configuration hash MD5:
       00 E9 B6 7A A2 85 ED C7 34 08 36 98 17 FE 4E 26
       data hash MD5: 16K
       57 D9 92 DF 10 C8 D1 7F FD F7 31 9C E5 55 C3 9A>)
(   2,<2021-10-26 10:23:44.95 +0400>,<she>,<DPX200>,
      <Start of raw data processing
       efp BC_mod = 2 LB = 0.24 FT_mod = 6 PKNL = 1 PHC0 = -15153.46 PHC1 = 12.60083 SI = 16K 
       data hash MD5: 16K
       C2 6C 2B 7B 07 9F FD FB 7E 03 95 B0 F8 04 7D 4C>)
(   3,<2021-10-26 10:24:01.26 +0400>,<she>,<DPX200>,
      <pk PHC0 = -0.4765573 PHC1 = -0.4000001 
       data hash MD5: 16K
       10 1D 33 F8 BE C4 A4 79 4A E6 DB D5 8F 22 8C B1>)
(   4,<2021-10-26 10:24:04.75 +0400>,<she>,<DPX200>,
      <abs ABSG = 5 
       data hash MD5: 16K
       5B A0 14 0D F3 89 65 33 E8 A7 10 3B 63 20 96 F6>)
$$ ##END=
$$ 
$$ hash MD5
$$ C5 B3 D4 CF 8A 80 D9 CF D6 04 A6 55 24 85 4E C5
##$RELAX= 
##$RELAX= 
##$RELAX= 
##$RELAX= 
##$RELAX= 
##$RELAX= 
$$ Bruker specific parameters
$$ --------------------------
##$DU= <F:/spectra>
##$EXPNO= 1
##$NAME= <H-F>
##$PROCNO= 1
##$TYPE= <nmr>
##$USER= <she>
##$AMP= (0..31)
100 100 100 100 100 100 100 100 100 100 100 100 100 100 100 100 100 100 
100 100 100 100 100 100 100 100 100 100 100 100 100 100 
##$AQSEQ= 0
##$AQ_mod= 1
##$AUNM= <au_zg>
##$AUTOPOS= <>
##$BF1= 200.13
##$BF2= 200.13
##$BF3= 200.13
##$BF4= 200.13
##$BF5= 200.13
##$BF6= 200.13
##$BF7= 200.13
##$BF8= 200.13
##$BYTORDA= 1
##$CFDGTYP= 0
##$CFRGTYP= 5
##$CHEMSTR= <none>
##$CNST= (0..31)
1 1 145 1 1 1 1 1 1 1 1 1 1 1 1 1 1 1 1 1 1 1 1 1 1 1 1 1 1 1 1 1 
##$CPDPRG= <>
##$CPDPRG1= <>
##$CPDPRG2= <>
##$CPDPRG3= <>
##$CPDPRG4= <mlev>
##$CPDPRG5= <mlev>
##$CPDPRG6= <mlev>
##$CPDPRG7= <mlev>
##$CPDPRG8= <mlev>
##$CPDPRGB= <>
##$CPDPRGT= <>
##$D= (0..31)
0 1.2 0 0 0 0 0 0 0 0.06 0 0.03 0 0 0 0 0.0002 0 0 0 0 0 0 0 0 0 0 0 0 
0 0 0 
##$DATE= 1635229421
##$DBL= (0..7)
120 120 120 120 120 120 120 120 
##$DBP= (0..7)
150 150 150 150 150 150 150 150 
##$DBP07= 0
##$DBPNAM0= <>
##$DBPNAM1= <>
##$DBPNAM2= <>
##$DBPNAM3= <>
##$DBPNAM4= <>
$$ [...]
##$SUBNAM2= <"">
##$SUBNAM3= <"">
##$SUBNAM4= <"">
##$SUBNAM5= <"">
##$SUBNAM6= <"">
##$SUBNAM7= <"">
##$SUBNAM8= <"">
##$SUBNAM9= <"">
##$SW= 18.0517286264689
##$SWIBOX= (0..15)
0 0 2 0 0 0 0 0 0 0 0 0 0 0 0 0 
##$SW_h= 3612.71676300578
##$TD= 16384
##$TD0= 1
##$TE= 0
##$TE2= 300
##$TE3= 300
##$TEG= 300
##$TL= (0..7)
0 120 120 120 120 120 120 120 
##$TP= (0..7)
150 150 150 150 150 150 150 150 
##$TP07= 0
##$TPNAME0= <>
##$TPNAME1= <>
##$TPNAME2= <>
##$TPNAME3= <>
##$TPNAME4= <>
##$TPNAME5= <>
##$TPNAME6= <>
##$TPNAME7= <>
##$TPOAL= (0..7)
0.5 0.5 0.5 0.5 0.5 0.5 0.5 0.5 
##$TPOFFS= (0..7)
0 0 0 0 0 0 0 0 
##$TUNHIN= 0
##$TUNHOUT= 0
##$TUNXOUT= 0
##$USERA1= <user>
##$USERA2= <user>
##$USERA3= <user>
##$USERA4= <user>
##$USERA5= <user>
##$V9= 5
##$VALIST= <valist>
##$VCLIST= <CCCCCCCCCCCCCCC>
##$VD= 0
##$VDLIST= <DDDDDDDDDDDDDDD>
##$VPLIST= <PPPPPPPPPPPPPPP>
##$VTLIST= <TTTTTTTTTTTTTTT>
##$WBST= 1024
##$WBSW= 4
##$XGAIN= (0..3)
0 0 0 0 
##$XL= 0
##$YL= 0
##$YMAX_a= 138155
##$YMIN_a= -228133
##$ZGOPTNS= <>
##$ZL1= 120
##$ZL2= 120
##$ZL3= 120
##$ZL4= 120
##$ABSF1= 15.72375
##$ABSF2= -2.328099
##$ABSG= 5
##$ABSL= 3
##$ALPHA= 0
##$AQORDER= 0
##$ASSFAC= 0
##$ASSFACI= 0
##$ASSFACX= 0
##$ASSWID= 0
##$AUNMP= <proc_1d>
##$AZFE= 0.1
##$AZFW= 0.1
##$BCFW= 0
##$BC_mod= 2
##$BYTORDP= 0
##$COROFFS= 0
##$CY= -3
##$DATMOD= 1
##$DC= 0
##$DFILT= <>
##$DTYPP= 0
##$F1P= 0
##$F2P= 0
##$FCOR= 1
##$FTSIZE= 16384
##$FT_mod= 6
##$GAMMA= 0
##$GB= 0
##$INTBC= 1
##$INTSCL= 0
##$ISEN= 128
##$LB= 0.24
##$LEV0= 0
##$LPBIN= 0
##$MAXI= 10000
##$MC2= 0
##$MEAN= 0
##$ME_mod= 0
##$MI= 1.114404
##$NCOEF= 0
##$NC_proc= -8
##$NLEV= 6
##$NOISF1= 3.799351
##$NOISF2= 2.8
##$NSP= 0
##$NTH_PI= 0
##$NZP= 0
##$OFFSET= 15.72375
##$PC= 1
##$PHC0= -15153.94
##$PHC1= 12.20083
##$PH_mod= 1
##$PKNL= yes
##$PPARMOD= 0
##$PSCAL= 0
##$PSIGN= 0
##$REVERSE= no
##$SF= 200.130006415052
##$SI= 16384
##$SIGF1= 3
##$SIGF2= 2
##$SINO= 5.538805
##$SIOLD= 16384
##$SREGLST= <1H.CDCl3>
##$SSB= 0
##$STSI= 16384
##$STSR= 0
##$SW_p= 3612.71676300578
##$SYMM= 0
##$S_DEV= 0
##$TDeff= 16384
##$TDoff= 0
##$TI= <>
##$TILT= no
##$TM1= 0
##$TM2= 0
##$TOPLEV= 0
##$USERP1= <user>
##$USERP2= <user>
##$USERP3= <user>
##$USERP4= <user>
##$USERP5= <user>
##$WDW= 1
##$XDIM= 16384
##$YMAX_p= 421708392
##$YMIN_p= -1130512
$$ End of Bruker specific parameters
$$ ---------------------------------
##NTUPLES= NMR SPECTRUM
##VAR_NAME=  FREQUENCY,     SPECTRUM/REAL,   SPECTRUM/IMAG
##SYMBOL=    X,             R,               I
##VAR_TYPE=  INDEPENDENT,   DEPENDENT,       DEPENDENT
##VAR_FORM=  AFFN,          ASDF,            ASDF
##VAR_DIM=   16384,         16384,           16384
##UNITS=     HZ,            ARBITRARY UNITS, ARBITRARY UNITS
##FACTOR=    0.220516191357247, 1,           1
##FIRST=     3146.79421127174, 0,            0
##LAST=      -465.922551734045, 0,           0
##MIN=       -465.922551734045, -1130512,    0
##MAX=       3146.79421127174, 421708392,    0
$$ Real data points
##PAGE= N=1
##DATA TABLE= (X++(R..R)), XYDATA
$$ [...]
6975A1473781r64385n55223o53548o34852m16472p37492q03707P7305n46343m50710
$$ 11473781 10509396 9954173 9300625 8665773 8249301 7511809 6708102 6785407 6239064 5788354
6965E788354j22957j39050o41040j07001m26147j22946j43356j32987o0159J09923
$$ 5788354 5665397 5526347 4885307 4778306 4352159 4229213 4085857 3952870 3892711 4002634
6955D002634r4711k3844j62826k11876l5663n3038q1539l71092n1040K80967k50639
$$ 4002634 3907923 3884079 3721253 3509377 3473714 3420676 3339137 2968045 2917005 3197972 2947333
6944B947333m03334l27264m04963J0289K58998K13466J92917K05627n60954o17945
$$ 2947333 2543999 2216735 1811772 1822061 2081059 2294525 2487442 2693069 2132115 1514170
6934A514170L74399Q1109k9486o4183L47985J08609k92134j48346j11072J00495
$$ 1514170 1888569 1969678 1940192 1876009 2223994 2332603 2040469 1892123 1781051 1881546
6924A881546J19793l37714J42486K78741j55723L73357n04403k54382O1374k15728
$$ 1881546 2001339 1663625 1806111 2084852 1929129 2302486 1798083 1543701 1605075 1389347
6914A389347j15972j13788l9624k5185j61308O3845k26896n5341P34753j76907
$$ 1389347 1273375 1159587 1119963 1094778 933470 997315 770419 715078 1449831 1272924
6904A272924k08948j56850m44817m9791M46753R1375O98240m77810k65859o8778
$$ 1272924 1063976 907126 462309 412518 859271 950646 1648886 1171076 905217 836439
6894H36439J9518K81266k98585k57923J64151J02752j90066L8790l6880P0654
$$ 836439 855957 1137223 838638 580715 744866 847618 657552 696342 659462 730116
6884G30116R0507j11696O8082J56970j51853j68198K95942j21451q1405K38925
$$ 730116 820623 708927 777009 933979 782126 613928 909870 788419 707014 945939
6874I45939k53013P2395L9397p7746l47175J14449J78423O947l9543j1541j81932
$$ 945939 692926 765321 804718 726972 379797 494246 672669 679616 640073 628532 446600
6863D46600N2451J69846o8415K4389Q9855K54966q6811p6718n734j90739q1705
$$ 446600 499051 668897 600482 624871 714726 969692 882881 806163 800429 609690 527985
6852E27985m24538M28710j29841k17306q1305O50681o5297l84900K3350O33119
$$ 527985 103447 532157 402316 185010 103705 754386 689089 304189 327539 960658
6842I60658j61878k63119k08253m8101J99690k62251j45690K9718J79482l74778
$$ 960658 798780 535661 327408 279307 478997 216746 71056 100774 280256 -94522
6832i4522J30945K09224M9946j33491K21623J71860k30501P4945k53829k23828
$$ -94522 36423 245647 295593 162102 383725 555585 325084 400029 146200 -77628
6822g7628M47909K11585j29775N1701J18990O4954J76166l37226K5214j20187
$$ -77628 370281 581866 452091 503792 622782 687736 863902 526676 551890 431703
6812D31703J6908k24842K4807M68369k96722k04146j16403J66006j66111K71316
$$ 431703 448611 223769 248576 716945 420223 216077 99674 265680 99569 370885
6802C70885J94636J6923K16594k00146j85493L6577J63282M43447j20516j79019
$$ 370885 565521 582444 799038 598892 413399 449976 613258 1056705 936189 757170
6792G57170K12795o28959q4896J76712K08198K1125j98567m3231j18677J21799
$$ 757170 969965 341006 256110 432822 641020 662145 463578 420347 301670 423469
6782D23469m410J14339j01747j04064k60080K60384n0913l21616k46507J11148
$$ 423469 419059 533398 431651 327587 67507 327891 276978 -44638 -291145 -179997
6772a79997L58610J23169J32016m3947J60801J1531J3118M29544K9691k98839
$$ -179997 178613 301782 433798 389851 550652 562183 575301 1004845 1034536 735697
6762G35697J5747j18698J24516m59183k27181L91656n18r3703l55429J83421j4613
$$ 735697 751444 632746 757262 298079 70898 462554 462036 368333 12904 196325 181712
6751A81712l85542J16833M34699M34796n09631K12785j44842m08665M77878m8555
$$ 181712 -203830 -86997 347702 782498 272867 485652 340810 -67855 410023 361468
6741C61468j10433J86041Q4184J35648j44221J70407P4479l16728Q9078k35094
$$ 361468 251035 437076 521260 656908 512687 683094 757573 440845 529923 294829
6731B94829O2274m17668L5178Q6776M2541K34880N281J70750P3650r8261M5374
$$ 294829 357103 -60565 -25387 61389 103930 338810 344091 514841 588491 490230 535604
6720E35604N13129j85356j79412o0832k30743J91166r7312l76605P5765J29019
$$ 535604 1048733 863377 683965 623133 392390 583556 486244 109639 185404 314423
6710C14423J51953l553J33577l96411J07571j29732K07761K11330J82618J73596
$$ 314423 466376 462823 596400 199989 307560 177828 385589 596919 779537 953133
6700I53133j89256N4371J43852j9393K1106n60215L99703O578k69996O2440j63866
$$ 953133 763877 818248 962100 942707 963813 403598 803301 809879 539883 602323 438457
6689D38457j28297j03650J98624J61113k9298q0649K57986R5345j3215r6171k94088
$$ 438457 310160 206510 405134 566247 536949 456300 714286 809631 796416 700245 406157
6678D06157N9368m2954o2125K76163K16641j15420k51067l02560k9647L16239
$$ 406157 465525 422571 360446 636609 853250 737830 486763 184203 154556 470795
6668D70795R8684k67686n69431J44547K98922l7462j01512K14423K32852l28496
$$ 470795 569479 301793 -267638 -123091 175831 138369 36857 251280 484132 155636
6658A55636k05454M00644L7913p4701m03601l0538L22725K97102K597k2126M29617
$$ 155636 -49818 350826 388739 314038 -89563 -120101 202624 499726 502323 480197 909814
6647I09814j38655j59824J3790l5144K14454p5851k69572q4238K27300k33903
$$ 909814 771159 611335 625125 589981 804435 728584 459012 374774 602074 368171
6637C68171k95535M73K39866j95612O5228J7831J51280o4129k11136N8474K8832
$$ 368171 72636 73109 312975 117363 182591 200422 351702 287573 76437 134911 163743
6626A63743N02780l20841K17353J58649m00681M12397m16750J65052l194o8431
$$ 163743 666523 345682 563035 721684 321003 733400 316650 481702 478508 410077
6616D10077L94566K8145k13968k9045K95087r4522j78237J08563r8352l89560
$$ 410077 804643 832788 618820 589775 884862 790340 612103 720666 622314 232754
6606B32754k27182N3616J64592L57692m24256R7696L24787M2525L311m16195P1218
$$ 232754 5572 59188 223780 581472 157216 254912 579699 622224 625535 209340 280558
6595B80558L67926m37164Q6761L24737l47822J22204j73981m39491L50217L84214
$$ 280558 648484 211320 298081 622818 274996 397200 223219 -216272 133945 518159
6585E18159l91495L2410O16610k93992k79040N08100p9905j61763L19314k47261
$$ 518159 126664 159074 775684 481692 202652 710752 630847 469084 788398 541137
6575E41137p1516k45624j37809R8506j28931K32453k82521K9L64525J03587N5407
$$ 541137 469621 223997 86188 184694 55763 288216 5695 5724 370249 473836 529243
6564E29243J47695k35779m8501k48144J32856L85513l02943l64594J83754N62009
$$ 529243 676938 441159 392658 144514 277370 662883 359940 -4654 179100 741109
6554G41109j5690k63656k88740j76876Q1487k84640n2037M48694N11454n4573
$$ 741109 725419 461763 173023 -3853 77634 -207006 -259043 189651 701105 646532
6544F46532l84442j67487K25300r0685j41361K80504K13490k61631J72322m13716
$$ 646532 262090 94603 319903 229218 87857 368361 581851 320220 492542 78826
6534G8826m2181N47506j14043j89778K57101o9066K03147q6250j31210Q6418l34477
$$ 78826 36645 584151 470108 280330 537431 468365 671512 585262 454052 540470 205993
6523B05993J55378K48896j35767o778P7767l08465q6711J87003J8507m0279K62709
$$ 205993 361371 610267 474500 467722 545489 237024 150313 337316 355823 315544 578253
6512E78253K7484p9297j2011p4543m56318o0721J13697k30103M85506J64828m23126
$$ 578253 605737 526440 514429 439886 -16432 -77153 36544 -193559 291947 456775 33649
6501C3649K94391J86896j94791k11993m0581J32477m9305J58961J31731J18733
$$ 33649 328040 514936 320145 108152 67571 200048 150743 309704 441435 560168
6491E60168K37277o92526J98987l3307J61965L42217k6524J92566k37915k05630
$$ 560168 797445 104919 303906 270599 432564 774781 748257 940823 702908 497278
6481D97278p8892n9132j69484M21959J78918K64472k48120k06026K13087j27224
$$ 497278 418386 359254 189770 611729 790647 1055119 806999 600973 814060 686836
6471F86836l44116o1227j28020L99281l14009J45958K89493l87977K22906L63936
$$ 686836 342720 281493 153473 552754 238745 384703 674196 286219 509125 873061
6461H73061q7097m4124n00310k34593L89088L38931N5832k83855O6628l42823
$$ 873061 785964 741840 241530 6937 396025 734956 790788 506933 573561 230738
6451B30738L36376J97576L3973m34801O5699L76037k48294N5661M8272k80605
$$ 230738 567114 764690 798663 363862 429561 805598 557304 612965 661237 380632
6441C80632j06942k12742O61860m5550m20574M99254k50004P6186J41448l41008
$$ 380632 273690 60948 722808 677258 256684 755938 505934 582120 723568 382560
6431C82560q6936L00147l32099m11741K48513L52959J36437k05027L14510O3696
$$ 382560 295624 595771 263672 -148069 100444 453403 589840 384813 699323 763019
6421G63019k67312J07976j26930j77079k66236L34508L99489r8132J0166q3251
$$ 763019 495707 603683 476753 299674 33438 367946 767435 669303 679469 596218
6411E96218o24015K5171r1997k7675K32521q8359M74374l6509o2217R8129j74411
$$ 596218 -27797 -2626 -94623 -122298 110223 21864 496238 459729 397512 495641 321230
6400C21230k21213J15231M72819J7025m40318K95232J71259j56478Q04K98289
$$ 321230 100017 215248 688067 705092 264774 560006 731265 574787 575591 873880
6390H73880J83800m25918j44920k25100J19539N9922l4829L06303j49482J79960
$$ 873880 1057680 631762 486842 261742 381281 441203 406374 712677 563195 743155
6380G43155j46243l0137J21149K91668l19589J30501K55285k59791k82986l25836
$$ 743155 596912 566775 687924 979592 660003 790504 1045789 785998 503012 177176
6370A77176M61792L67116l23234r240J07055J26339j94493l4482N3204j54804
$$ 177176 638968 1006084 682850 673610 780665 907004 712511 678029 731233 576429
6360E76429P6088J19002r2907k5619K28772k30459M5465L03519j37409k8339k44932
$$ 576429 652517 771519 678612 652993 881765 651306 696771 1000290 862881 834542 589610
6349E89610m5881K09399K53960K22674P5029l7440l09078r5216K6299R5816J12405
$$ 589610 543729 753128 1007088 1229762 1304791 1267351 958273 863057 889356 985172 1097577
6338A097577l4940k305m3205k99517L66530j65797P4325k750J3194K80224J43868
$$ 1097577 1062637 1060332 1017127 717610 1084140 918343 992668 989918 1003112 1283336 1427204
6327A427204m58087J7078j45120J07618O259L7828L09437l00276l20875k16712
$$ 1427204 969117 986195 841075 948693 954952 992780 1302217 1001941 681066 464354
6317D64354K39173K49660K75696r2038j52880J9651M63486J21141k42003O3296
$$ 464354 703527 953187 1228883 1136845 983965 1003616 1467102 1588243 1346240 1409536
6307A409536J23302j87651l5593k01346N6696K02195L1967J36084l83633N19014
$$ 1409536 1532838 1345187 1309594 1108248 1164944 1367139 1399106 1535190 1151557 1670571
6297A670571n65409J51876j01829k18950J50091M137N581O9098J1452l49720J34832
$$ 1670571 1105162 1257038 1155209 936259 1086350 1090487 1096068 1165166 1176618 826898 961730
6286I61730k50486j99791J6198O36291j16563N3242l23424K46070K16270J20938
$$ 961730 711244 511453 527651 1163942 1047379 1100621 777197 1023267 1239537 1360475
6276A360475l09806J17974K08712n68643K91611j36828q971n5238k34514K27579
$$ 1360475 1050669 1168643 1377355 808712 1100323 963495 954524 899286 664772 892351
6266H92351L38627Q7364k85880j36377M32145j93894j76718K61652j45553j71731
$$ 892351 1230978 1318342 1032462 896085 1328230 1134336 957618 1219270 1073717 901986
6256I01986j32051N3613L26925o8763l94599M27755L32p4925m11083K7044r4290
$$ 901986 769935 823548 1150473 1081710 687111 1114866 1115198 1040273 629190 656234 561944
6245E61944J51040M39330L59227l58669J437J58908p7633L89324o68593L51626
$$ 561944 712984 1152314 1511541 1152872 1154309 1313217 1235584 1624908 956315 1307941
6235A307941m4838j52794M4871K1905L71241m48927N49320l04810k85334J75124
$$ 1307941 1263103 1110309 1155180 1177085 1548326 1099399 1648719 1343909 1058575 1233699
6225A233699J05870J10793o1830J08189j96593R8426j44223j68678o4093j86232
$$ 1233699 1339569 1450362 1388532 1496721 1300128 1398554 1254331 1085653 1021560 835328
6215H35328N0210N78465K56946j24052n53501M48570j3293Q9627P3633R3581j94053
$$ 835328 885538 1464003 1720949 1596897 1043396 1491966 1478673 1568300 1641933 1735514 1541461
6204A541461K4990o5236j55994j36782J61295j30820N7905J49880Q1499l01389
$$ 1541461 1566451 1501215 1345221 1208439 1369734 1238914 1296819 1446699 1528198 1226809
6194A226809r8079L42821k76865M82812j06889K69485L56968P9668l79008j75787
$$ 1226809 1128730 1471551 1194686 1677498 1570609 1840094 2197062 2276730 1897722 1721935
6184A721935J13119L9044L29894K96172J70885j47542m76724l87001J59253j7645
$$ 1721935 1835054 1874098 2203992 2500164 2671049 2523507 2046783 1659782 1819035 1801390
6174A801390J78630J37745J81031K58071j32594k32848J14030P2490K97428j45495
$$ 1801390 1980020 2117765 2298796 2556867 2424273 2191425 2305455 2377945 2675373 2529878
6164B529878K61981L24334j65858j26959j35562n8254K0506K07677j9531k81141
$$ 2529878 2791859 3116193 2950335 2823376 2687814 2629560 2650066 2857743 2838212 2557071
6154B557071k02806J1576R914K55744k87953K41459J52551Q4073k35676j01417
$$ 2557071 2354265 2365841 2375755 2631499 2343546 2585005 2737556 2821629 2585953 2484536
6144B484536R3527J39149j28953j06159L82578J68330k02857j084p021M33162
$$ 2484536 2578063 2717212 2588259 2482100 2864678 3033008 2830151 2829067 2822046 3255208
6134C255208k12394J21970p3433r0494J59991m63593n7951L04071l56819J73344
$$ 3255208 3042814 3164784 3091351 3000857 3160848 2697255 2639304 2943375 2586556 2759900
6124B759900o3685J85576m0200n9253M03016j28030P7287J38552N7320M6670J79870
$$ 2759900 2696215 2881791 2841591 2782338 3185354 3057324 3134611 3273163 3330483 3377153 3557023
6113C557023o08223n5249N00238m6462J35727M45073l74198R3494k29689M69700
$$ 3557023 2948800 2893551 3393789 3347327 3483054 3928127 3553929 3647423 3417734 3887434
6103C887434j87234m76146L23702l51586K27884R20980L34928j96706n2144K88552
$$ 3887434 3700200 3224054 3547756 3196170 3424054 4345034 4679962 4483256 4431112 4719664
6093D719664Q6649j21720j18929M9608J43660j8691m22760M0931M42955L31150
$$ 4719664 4806313 4684593 4565664 4615272 4758932 4740241 4317481 4358412 4801367 5132517
6083E132517K0548K80186J29151Q1898l72781k97451L30474M57388K21853J35613
$$ 5132517 5153065 5433251 5562402 5644300 5271519 4974068 5304542 5761930 5983783 6119396
6073F119396J33021K07452K58290n53882J89874J96259M11871K45954K30003M6539
$$ 6119396 6252417 6459869 6718159 6164277 6354151 6550410 6962281 7208235 7438238 7484777
6063G484777J22946K18633J05649j44419K12859Q27831N536L10367M44427l48260
$$ 7484777 7607723 7826356 7932005 7787586 8000445 8828276 8833812 9144179 9588606 9240346
6053I240346P412J86926L48204L1792K23947P9922J98289O03803M16491M19472
$$ 9240346 9247758 9434684 9782888 9814680 10038627 10118549 10316838 10920641 11337132 11756604
6043A1756604L78066L41759L81717Q76242R05630K01977L05971L92873J17704
$$ 11756604 12134670 12476429 12858146 13734388 14640018 14841995 15147966 15540839 15658543
6034A5658543N94203M55884P70206Q85655J230197O14693J106712J314878R61742
$$ 15658543 16252746 16708630 17478836 18364491 19594688 20209381 21316093 22630971 23592713
6025B3592713J490614J132228J444746J598566J699521J420283J386236J347086
$$ 23592713 25083327 26215555 27660301 29258867 30958388 32378671 33764907 35111993
6017C5111993R74828J508555J628658K256874K271556K786025K797644L171837
$$ 35111993 36086821 37595376 39224034 41480908 43752464 46538489 49336133 52507970
6009E2507970L407002K716419K079158J106546M33246O05612J121111R33551R87007
$$ 52507970 55914972 58631391 60710549 61817095 62250341 62855953 63977064 64910615 65897622
6000F5897622J621403K191590K564346K365018K615783K132829K566310K575196
$$ 65897622 67519025 69710615 72274961 74639979 77255762 79388591 81954901 84530097
5992H4530097J857004J598632J060620J519440J301361J430856K266274K853234
$$ 84530097 86387101 87985733 89046353 90565793 91867154 93298010 95564284 98417518
5984I8417518L323888L864661M558664L144592k46800l076301m537032m345959
$$ 98417518 101741406 105606067 110164731 113309323 113062523 109986222 105449190 101103231
5976A01103231l033857k054528j192870n35714j19837P04700N87934P31981j72295
$$ 101103231 98069374 96014846 94821976 94286262 94166425 94871125 95459059 96191040 96018745
5967I6018745j227436k311016k755062k689887k969943k511153k555753k505413
$$ 96018745 94791309 92480293 89725231 87035344 84065401 81554248 78998495 76493082
5959G6493082j666410j760447j443222j690107j596952j842940k918840l694741
$$ 76493082 74826672 73066225 71623003 69932896 68335944 66493004 63574164 59879423
5951E9879423l304819k376442l003937k436430j543102j045906l27552k74309
$$ 59879423 56574604 54198162 51194225 48757795 47214693 46168787 45841235 45566926
5943D5566926l0443M82854Q21719J99847M62702K09837n88077j139341j520529
$$ 45566926 45536483 46019337 46841056 47040903 47503605 47713442 47125365 45986024 44465495
5934D4465495j268905j069506j725854r01831q52805j193383m13635q61366k89757
$$ 44465495 43196590 42127084 40401230 39499399 38646594 37453211 37039576 36178210 35888453
5925C5888453o0732j63222m40348j034270l56326P6262j53260o4881L36818M06356
$$ 35888453 35827721 35664499 35224151 34189881 33833555 33909817 33756557 33691676 34028494 34434850
5915C4434850K84951L59780K62551K77415R41701O51074K83323M05278p6394o92083
$$ 34434850 34719801 35079581 35342132 35619547 36561248 37212322 37495645 37900923 37824529 37132446
5905C7132446m80108j76879n10052j18876l64171M99473J12937M07635K86898
$$ 37132446 36652338 36475459 35965407 35846531 35482360 35981833 36094770 36502405 36789303
5896C6789303k95391J13446O26630K13134N659N00808Q85658Q58101J063447N38210
$$ 36789303 36493912 36607358 37233988 37447122 37452781 37953589 38839247 39697348 40760795 41299005
5886D1299005O57301Q52265N64361Q56836R10645J071436J248553R63356J565655
$$ 41299005 41956306 42808571 43372932 44229768 45140413 46211849 47460402 48423758 49989413
5877D9989413J559437J840183K924335K341631K730590K195698J151833Q77788
$$ 49989413 51548850 53389033 56313368 58654999 61385589 63581287 64733120 65610908
5869F5610908N24064K15350R17496J511628J415669J623929J905366J940082K190299
$$ 65610908 66134972 66350322 67267818 68779446 70195115 71819044 73724410 75664492 77854791
5860G7854791K058911K172736K452568K692299K309608K202378J344609J774589
$$ 77854791 79913702 82086438 84539006 87231305 89540913 91743291 93087900 94862489
5852I4862489J664362K072675K354225K791759L410925K605742J255032j492041
$$ 94862489 96526851 98599526 100953751 103745510 107156435 109762177 111017209 109525168
5844A09525168l778383m342630m850091l928564k686263k164264j427585j281581
$$ 109525168 105746785 101404155 96554064 92625500 89939237 87774973 86347388 85065807
5836H5065807n25645q1828o21576l31148K02219M21428M49955J148210O73100
$$ 85065807 84540162 84458334 83836758 83505610 83707829 84129257 84579212 85727422 86400522
5827H6400522l07686p67237j189479j210034j419872p91555j072768r85524j452842
$$ 86400522 86092836 85325599 84136120 82926086 81506214 80714659 79641891 78656367 77203525
5818G7203525k856998k510414j438564k015751q44331K4471j081495j812363k836265
$$ 77203525 74346527 71836113 70397549 68381798 67537467 67561938 66480443 64668080 61831815
5809F1831815k468364k185164j915195j601873j304146j164922j063425n06703
$$ 61831815 59363451 57178287 55263092 53661219 52357073 51192151 50128726 49622023
5801D9622023j022160n65084j292653j367407k060203k156586j898231j362696
$$ 49622023 48599863 48034779 46742126 45374719 43314516 41157930 39259699 37897003
5793C7897003r57876j373133p51057o98377o23968k71381m66071m37829p52055
$$ 37897003 36939127 35565994 34814937 34116560 33492592 33221211 32755140 32317311 31565256
5784C1565256n91155m60933q93132k15083n1951n71118j93067k94953k76671l75701
$$ 31565256 30974101 30513168 29620036 29404953 29353002 28781884 28588817 28293864 28017193 27641492
5774B7641492m90711l25402m84594n73052l57233l13382m53097l63836k25338
$$ 27641492 27150781 26825379 26340785 25767733 25410500 25097118 24644021 24280185 24054847
5765B4054847l39131m34179l54595l01053Q86548K80435P07502L56419J47650
$$ 24054847 23715716 23281537 22926942 22625889 23512437 23792872 24500374 24856793 25004443
5756B5004443l70982n51017n54801o81353o04382m30004n43231k25347m99817
$$ 25004443 24633461 24082444 23527643 22846290 22241908 21811904 21268673 21043326 20543509
5747B0543509j96418L5799j002009j73763j66367m52842m05435P3451j16018j42128
$$ 20543509 20347091 20382890 19380881 19207118 19040751 18587909 18182474 18255925 18139907 17997779
5737A7997779R2851L28401l8485O2430L6009k10687J67460M36684O12792O72893
$$ 17997779 18090630 18419031 18380546 18442976 18478985 18268298 18435758 18872442 19485234 20158127
5727B0158127j91159M50211M98361o60439p14175m96279r47326p66034l53059
$$ 20158127 19966968 20417179 20915540 20255101 19540926 19044647 18097321 17331287 16978228
5718A6978228p61133o71746m42121m89484j31571k4240j38640q8721K2504n38832
$$ 16978228 16217095 15545349 15103228 14613744 14482173 14457933 14319293 14230572 14253076 13714244
5708A3714244J01363M47230M58019J11619L06405l9132Q8637O35541R28282Q80596
$$ 13714244 13815607 14262837 14720856 14832475 15138880 15099748 15188385 15823926 16752208 17632804
5698A7632804Q17463M60273M88360P23916M11172K35732N61315N39172m24029
$$ 17632804 18450267 18910540 19398900 20122816 20533988 20769720 21331035 21870207 21446178
5689B1446178L41090J75245j97088m55236L57296K15556j56156l76771j05879
$$ 21446178 21787268 21962513 21765425 21310189 21667485 21883041 21726885 21350114 21244235
5680B1244235K98975Q0667Q9570J81549j19485K08769L90782N29528K46563P84565
$$ 21244235 21543210 21623877 21713447 21894996 21775511 21984280 22375062 22904590 23151153 23935718
5670B3935718J001648J361395J254518R06786P03254J044141R47952O08107P4360
$$ 23935718 24937366 26298761 27553279 28460065 29163319 30207460 31155412 31763519 31837879
5661C1837879n11928n22518m36949k87684m42594J945J11989r1957p39183q23706
$$ 31837879 31325951 30803433 30366484 30078800 29636206 29638151 29750140 29658183 28919000 28095294
5651B8095294n04893l23582n44605n87991J34727L16096k9501O21180O63439M57268
$$ 28095294 27590401 27266819 26722214 26134223 26268950 26585046 26555545 27176725 27840164 28297432
5641B8297432O16235R33515K34754k00O703k25660k29199m46942n44l47200l44555
$$ 28297432 28913667 29847182 30081936 30081736 30088439 29862779 29633580 29186638 29186094 28838894 28494339
5630B8494339l3888Q9017q9459k27695j85901k0117j60313j82500j36961j46046
$$ 28494339 28460451 28549468 28460009 28232314 28046413 28026296 27865983 27683483 27546522 27400476
5620B7400476j14149O61000L21249M37548N08631K28815M14439p5115n19667p68161
$$ 27400476 27286327 27947327 28268576 28706124 29214755 29443570 29858009 29782894 29263227 28495066
5610B8495066o92786p02959q84714r36397m14941l25673j50802j54190J51059
$$ 28495066 27802280 27099321 26214607 25278210 24863269 24537596 24386794 24232604 24383663
5601B4383663n9320m12883k66746k87235p92098k15147n18040m75353j059730
$$ 24383663 24324343 23911460 23644714 23357479 22565381 22350234 21832194 21356841 20297111
5592B0297111j26265K22195l57610j17549l27755l0259q94354q60588m12540k68608
$$ 20297111 20170846 20393041 20035431 19917882 19590127 19559868 18665514 17804926 17392386 17123778
5582A7123778m81025k45977m6183l58583r6848J62893q5684P54032L87644L70486
$$ 17123778 16642753 16396776 16350593 15992010 15895162 16058055 15972371 16726403 17114047 17484533
5572A7484533M92881K14125M20455M55769R58917J107733J869068K168953K493282
$$ 17484533 17977414 18191539 18611994 19067763 20026680 21134413 23003481 25172434 27665716
5563B7665716L147000J983978q88095l336820l517621l524375k716601j587336
$$ 27665716 30812716 32796694 31908599 28571779 25054158 21529783 18813182 17225846
5555A7225846j620820j000090q60511p36214o05326n25530o62985m60824N0200
$$ 17225846 15605026 14604936 13744425 13008211 12402885 11877355 11214370 10753546 10803746
5546A0803746j600n85934j17132R7096k22211j47296m58544k82951O4213j9757
$$ 10803746 10802146 10216212 10099080 10196176 9973965 9826669 9368125 9085174 9149387 9129630
5536I129630M89830O36232O4409j10410K9603j60793m56695m29508o77472j01774
$$ 9129630 9619460 10255692 10320101 10209691 10239294 10078501 9621806 9192298 8514826 8413052
5526H413052m37516m53080n6675m54919J63798J5606l26302k14228J27921k74401
$$ 8413052 7975536 7522456 7465781 7010862 7174660 7190266 6863964 6649736 6777657 6503256
5516F503256Q9199r927k66293k79020p5057L99117n0046k82963m89984j60655
$$ 6503256 6592455 6582528 6316235 6037215 5962158 6361275 6311229 6028266 5538282 5377627
5506E377627n5921p8123M42284k7108o87941R7896j11882J59719K42338j74425
$$ 5377627 5321706 5243583 5685867 5658759 4970818 5068714 4956832 5116551 5358889 5184464
5496E184464j50844m4126K06444j84872J83590J14135p8887k66183J96547j78848
$$ 5184464 5033620 4989494 5195938 5011066 5194656 5308791 5229904 4963721 5160268 4981420
5486D981420l67011K38609K79630j01265L74520j7031l07862k15966k80070N90563
$$ 4981420 4614409 4853018 5132648 5031383 5405903 5388872 5081010 4865044 4584974 5175537
5476E175537J61276p3338j99224k50321k71231J75027J06169j34409J00600k53805
$$ 5175537 5336813 5263475 5064251 4813930 4542699 4717726 4823895 4689486 4790086 4536281
5466D536281l64140J79989O32205J60602L45679k31181q7358M0390k36450J58899
$$ 4536281 4172141 4352130 4984335 5144937 5490616 5259435 5172077 5212467 4976017 5134916
5456E134916M681M86043L35052l45878Q1511J11191q9014J89168l35440J85540
$$ 5134916 5139597 5625640 5960692 5614814 5696325 5807516 5718502 5907670 5572230 5757770
5446E757770k24813m18161J75251K41851m94164K78584L48609J32040j93287O6233
$$ 5757770 5532957 5114796 5290047 5531898 5037734 5316318 5664927 5796967 5603680 5669913
5436E669913J34428k13685L09232L3370l85383J29355J28739L04852J78688N8297
$$ 5669913 5804341 5590656 5899888 5933258 5547875 5677230 5805969 6110821 6289509 6347806
5426F347806j69176K17359J6946K1578P7045m47515J36777M52869K6248p16820
$$ 6347806 6178630 6395989 6412935 6434513 6511558 6064043 6200820 6653689 6679937 5963117
5416E963117K57388L47102n1130k19352l1219L82423k18162k10161J54555L0704
$$ 5963117 6220505 6567607 6516477 6297125 6265906 6648329 6430167 6220006 6374561 6405265
5406F405265N7339Q6849L2723n33544J87500L41567j8412j816l4224l29464O6889
$$ 6405265 6462604 6549453 6582176 6048632 6236132 6577699 6559287 6557471 6523247 6193783 6260672
5395F260672K99219R6261L5517J57182j03194j1069p4489j13640M60649j89163
$$ 6260672 6559891 6656152 6691669 6848851 6745657 6734588 6660099 6546459 7007108 6817945
5385F817945Q3492j6835l15120J02132K22582L87491J38845j584q1220J61813
$$ 6817945 6901437 6884602 6569482 6671614 6894196 7281687 7420532 7418948 7337728 7499541
5375G499541O6351o7449J19090N12218J87817J01189K04142m92754R47891L61267
$$ 7499541 7565892 7498443 7617533 8129751 8317568 8418757 8622899 8130145 9078036 9439303
5365I439303L98526Q4745R2367O66876P94651M16507J71789O36125R05270N20919
$$ 9439303 9837829 9922574 10014941 10681817 11476468 11892975 12064764 12700889 13606159 14127078
5355A4127078M2674R1195n9256M36707J70783j57047n24951l42525M15969J30735
$$ 14127078 14169752 14260947 14201691 14638398 14809181 14652134 14127183 13784658 14200627 14331362
5345A4331362k58019M230J47867q3259M00922M29681p3304l8036L48366O76752
$$ 14331362 14073343 14077573 14225440 14142181 14543103 14972784 14899480 14861444 15209810 15886562
5335A5886562Q10484P86479Q62273N61650R06156Q12671q7074Q99941P38559P37050
$$ 15886562 16697046 17483525 18345798 18907448 19813604 20626275 20539201 21439142 22177701 22914751
5325B2914751O4439R5058K62132L45579K04911M37238k17714k34380j71979k62143
$$ 22914751 22979190 23074248 23336380 23681959 23886870 24324108 24106394 23872014 23700035 23437892
5315B3437892k74886j6521n99973j93582k27834l71107j53737q624j63596k71710
$$ 23437892 23163006 23146485 22546512 22352930 22125096 21753989 21600252 21591628 21428032 21156322
5305B1156322j08329J46307L45463J93773O29211K20457k82179O67415O01131
$$ 21156322 21047993 21194300 21539763 21733536 22362747 22583204 22301025 22968440 23569571
5296B3569571K22378J88955L26567L28175m00329k12227j40794J16743j55261
$$ 23569571 23791949 23980904 24307471 24635646 24235317 24023090 23882296 23999039 23843778
5287B3843778m37586n1395l08826l35708N735m17490j88603l62944J26408j87967
$$ 23843778 23406192 23354797 23045971 22710263 22715998 22298508 22109905 21746961 21873369 21685402
5277B1685402J0319N34765K90013K59299N53668J53750O01454J153402J111034
$$ 21685402 21695721 22230486 22520499 22779798 23333466 23487216 24088670 25242072 26353106
5268B6353106M91865n08069l67722k10919n48722k66421o006m64456J16144J77368
$$ 26353106 26844971 26336902 25969180 25758261 25209539 24943118 24937112 24472656 24588800 24766168
5258B4766168P4188M54704K51887J028324R36715P58057R90517J062895J393713
$$ 24766168 24840356 25295060 25546947 26575271 27511986 28270043 29260560 30323455 31717168
5249C1717168L34607M98982L26242Q58355J036339L72980N0588N89094K87696
$$ 31717168 32051775 32550757 32876999 33735354 34771693 35144673 35195261 35784355 36072051
5240C6072051k01074P4289p22257j362586j467189j383861j081443m96220k86932
$$ 36072051 35870977 35945266 35223009 33860423 32393234 31009373 29927930 29431710 29144778
5231B9144778l97499j807M22233K29293R62644Q95666J410602Q19870J334414
$$ 29144778 28747279 28745472 29167705 29396998 30359642 31255308 32665910 33485780 34820194
5222C4820194M30189q67568j040936j081817j853812j016326q35017m27317l0071
$$ 34820194 35250383 34382815 33341879 32260062 30406250 29389924 28554907 28127590 28097519
5213B8097519j39429l4804p64522n39260r41013r59615l71846n25244o58725l06717
$$ 28097519 27958090 27923286 27158764 26619504 25678491 24718876 24347030 23821786 23163061 22856344
5203B2856344L1558P6878l22221M57378J88372k8517K90280N10790q65374j184274
$$ 22856344 22887902 22964780 22642559 23099937 23288309 23259792 23550072 24060862 23195488 22011214
5193B2011214r61225p58024q56323q73035j304612j178801m51016j42830m01459
$$ 22011214 21049989 20291965 19435642 18562607 17257995 16079194 15628178 15485348 15083889
5184A5083889p0202O4070q02211L1057K51193J32n58232k8035K24349N48253m69978
$$ 15083889 15013687 15077757 14275546 14306603 14557796 14557928 13999696 13971661 14196010 14744263 14274285
5173A4274285l97027k24147k31715m69980o79616p7338k38785j31378m6974K09001
$$ 14274285 13877258 13653111 13421396 12951416 12271800 12194462 11955677 11824299 11777325 11986326
5163A1986326l7016p3879K17264j17203Q2195o3195Q1649m58655J393K00178j79197
$$ 11986326 11949310 11875431 12092695 11975492 12057687 11994492 12076141 11617486 11618879 11819057 11639860
5152A1639860Q7444l47996k92161J01176j55174m77677R9376M16364l40489j015983
$$ 11639860 11727304 11379308 11087147 11188323 11033149 10555472 10654848 11071212 10730723 9714740
5142I714740j20116P2403K17454k41386N6110k9952O2532o9183j16151J88773
$$ 9714740 9594624 9667027 9884481 9643095 9699205 9669253 9731785 9662602 9546451 9735224
5132I735224J61680l8670o7570L08354l04632L86277R1871k16453o5613k94020
$$ 9735224 9896904 9858234 9790664 10099018 9794386 10180663 10272534 10056081 9990468 9696448
5122I696448Q7444K18925M93313n9150J72893m20234n63550m29589n29186j22431
$$ 9696448 9783892 10002817 10496130 10436980 10609873 10189639 9626089 9196500 8667314 8544883
5112H544883j41460j29024l0741Q0800j54976k99682n66311j95194r7692m262
$$ 8544883 8403423 8274399 8243658 8324458 8169482 7869800 7303489 7108295 7010603 7006341
5102G006341N790P0605J22115o0978m389J54836L51209k33952m4847j04947k4267
$$ 7006341 7012131 7082736 7204851 7143873 7139484 7294320 7645529 7411577 7366730 7261783 7237516
5091G237516m41588m1240P1295k01631j97868n3229J1013J63054o15505q3011
$$ 7237516 6795928 6754688 6825983 6624352 6426484 6373255 6384268 6547322 5931817 5848806
5081E848806J85518M6798K1539j54553K77952R0268k91745j03231J19277l2329
$$ 5848806 6034324 6081122 6102661 5948108 6226060 6316328 6024583 5921352 6040629 6008300
5071F008300n8959K12586L8024K57632J79485L84190p905K99066N1328K5553M44017
$$ 6008300 5949341 6161927 6199951 6457583 6637068 7021258 7013353 7312419 7363747 7389300 7833317
5060G833317L48970K07642O62656M51055Q02773J034535O63800R6690l05738j30364
$$ 7833317 8182287 8389929 9052585 9503640 10306413 11340948 12004748 12101438 11795700 11665336
5050A1665336N2675K5357j49742l35678o30540l20826o44207q87649p76484K07619
$$ 11665336 11718011 11743368 11593626 11257948 10627408 10306582 9662375 8774726 7998242 8205861
5040H205861j85028n48813n67726M72645k64408m46208j02643O03624M1309m45137
$$ 8205861 8020833 7472020 6904294 7376939 7112531 6666323 6563680 7167304 7208613 6763476
5030F763476l33667l85963Q3813J56948l11188l80492l7789O7587n5456j18627
$$ 6763476 6429809 6043846 6127659 6284607 5973419 5592927 5555138 5622725 5567269 5448642
5020E448642r6691r8736r1764O07549j9126K7919n25690l49611L91995j52961
$$ 5448642 5351951 5253215 5161451 5769000 5749874 5777793 5252103 4902492 5294487 5141526
5010E141526n57583j14844K79941L63339j35116k83268j2515k82086j9724R4499
$$ 5141526 4583943 4469099 4749040 5112379 4977263 4693995 4681480 4399394 4379670 4474169
5000D474169R2948q3602J5326R6045L59904J47389l33147J29636l96136l94552
$$ 4474169 4567117 4483515 4498841 4594886 4954790 5102179 4769032 4898668 4502532 4107980
4990D107980K61254K42146j07112M6020J69446k98045N2707J02999M9652k36377
$$ 4107980 4369234 4611380 4504268 4550288 4719734 4421689 4474396 4577395 4627047 4390670
4980D390670j93250J71100j81257K71340l8141m72502K19644r7211J73706L23853
$$ 4390670 4197420 4368520 4187263 4458603 4420462 3947960 4167604 4070393 4244099 4567952
4970D567952j54238l6504k02816K97896J60646K96798j57688R121K7077K98434
$$ 4567952 4413714 4377210 4174394 4472290 4632936 4929734 4772046 4781167 4808244 5106678
4960E106678J88915m41052k9626o1773K0178K53055K71648k35479r0188K84237
$$ 5106678 5295593 4854541 4824915 4763142 4783320 5036375 5308023 5072544 4982356 5266593
4950E266593J62635j00426l20101Q6567L50375K06700m0989M1917q6335j41512
$$ 5266593 5429228 5328802 5008701 5095268 5445643 5652343 5611354 5653271 5566936 5425424
4940E425424K96670M32537l77215J5752L94559k13616j08875q6796M76935j74065
$$ 5425424 5722094 6154631 5777416 5793168 6187727 5974111 5865236 5778440 6255375 6081310
4930F081310L9394k08122K26779N1394Q6003k67422M4382L10574M0865P5601J24880
$$ 6081310 6120704 5912582 6139361 6190755 6276758 6009336 6053718 6364292 6405157 6480758 6605638
4919F605638M30838R3050O91578j93170k12993K80502l72656P2526J21158M92819
$$ 6605638 7036476 7129526 7821104 7627934 7414941 7695443 7322787 7395313 7516471 8009290
4909H009290J85493K7509J46605R2277L02898R9982J67804J60947K16508K80425
$$ 8009290 8194783 8222292 8368897 8461174 8764072 8864054 9031858 9192805 9409313 9689738
4899I689738K62809j70885j42279J88598O5927O59386N13243J68613k08998N76683
$$ 9689738 9952547 9781662 9639383 9827981 9893908 10553294 11066537 11235150 11026152 11602835
4889A1602835K58061L43206O22146J84889N64920j7763K15384P09948N32183L77659
$$ 11602835 11860896 12204102 12826248 13011137 13576057 13558294 13773678 14483626 15015809 15393468
4879A5393468M60979O48030J21423J63599N37183J20626P54743J023226L28140
$$ 15393468 15854447 16502477 16623900 16787499 17324682 17445308 18200051 19223277 19551417
4870A9551417L41873R70311L97164K23916R56421O16411R55046N44513O37747
$$ 19551417 19893290 20863601 21260765 21484681 22441102 23057513 24012559 24557072 25194819
4861B5194819P81524J239530J210204J051819J503813J329535K135963K560253
$$ 25194819 25976343 27215873 28426077 29477896 30981709 32311244 34447207 37007460
4853C7007460K183024K767365L352343L463531L693348M837874N099280N784298
$$ 37007460 39190484 41957849 45310192 48773723 52467071 57304945 62404225 68188523
4845F8188523O820699Q725113R619892P513075J853001l479126o097735n757502
$$ 68188523 75009222 83734335 93354227 100867302 102720303 99241177 93143442 87385940
4837H7385940l864512j851061m92565N46872J594589L423032M607901N268067
$$ 87385940 83521428 81670367 81177802 81724674 83319263 86742295 91350196 96618263
4829I6618263N103327M338778N782138O395013N570525M423085N926605Q777215
$$ 96618263 101721590 106060368 111842506 118237519 123808044 128231129 134157734 142934949
4821A42934949J1097552R023090L041253o14612J849934O127585R790483J3555531
$$ 142934949 154032501 163055591 166096844 165482232 167332166 173459751 183250234 196805765
4813A96805765J5945607J4669884J4220076J7462137K0514002K2776696K7758059
$$ 196805765 212751372 227421256 241641332 259103469 279617471 302394167 330152226
4806C30152226L6874085L9571645O398265l8820579n6754085m9418057m0799292
$$ 330152226 367026311 406597956 412996221 374175642 317421557 268003500 227204208
4799B27204208l3139250k4452209j8796524j4333618j1527914p997701n700673
$$ 227204208 194064958 169612749 150816225 136482607 124954693 116956992 111256319
4792A11256319m377913l283593j433858j153705K04945J910256L146321L195815
$$ 111256319 106878406 103594813 102160955 101007250 101212195 103122451 106268772 109464587
4784A09464587k90118m778186o353227n262212n368091m352359k982660j356287
$$ 109464587 109174469 104396283 98043056 92780844 87412753 83060394 80077734 78721447
4776G8721447m04147K93118J393305J673290K880088L939295J691591k936863
$$ 78721447 78317300 78610418 80003723 81677013 84557101 88496396 90187987 87251124
4768H7251124p110154p777467p150122o184835n456363m320504l456008l089568
$$ 87251124 80140970 72363503 65213381 59028546 53572183 49251679 45795671 42706103
4760D2706103k064131j735174j544231j785788j471442j498503j587548q68254
$$ 42706103 40641972 38906798 37362567 35576779 34105337 32606834 31019286 30151032
4752C0151032p81424q43123q47063j178709m00580o76657l75100l93396n36515
$$ 30151032 29369608 28526485 27679422 26500713 26100133 25423476 25048376 24654980 24118465
4743B4118465q03895p01619l63146n90580j71562K80730l06274o53935r31941
$$ 24118465 23314570 22612951 22249805 21659225 21487663 21768393 21462119 20808184 19876243
4734A9876243k25731k22267k85495k18119l89178j17148n12124m24657M90134
$$ 19876243 19650512 19428245 19142750 18924631 18535453 18418305 17906181 17481524 17971658
4725A7971658K42889L00774M18912K96578M18943j94714l19707p23266q41470
$$ 17971658 18214547 18515321 18934233 19230811 19649754 19455040 19135333 18412067 17570597
4716A7570597r50072j209489p59093p39405n81821o48134p43889m90580M6975
$$ 17570597 16620525 15411036 14651943 13912538 13330717 12682583 11938694 11448114 11495089
4707A1495089j21964l25685j55296l42100k44845l49155r6596J00077j94237j01770
$$ 11495089 11373125 11047440 10892144 10550044 10305199 9956044 9859448 9959525 9765288 9663518
4697I663518k78880k33513j54200k57943J09362j16664k84586j63938l11620J72122
$$ 9663518 9384638 9151125 8996925 8738982 8848344 8731680 8447094 8283156 7971536 8143658
4687H143658k33313j12542n5848k17279J85988L3348k9767K4031m4993n16420
$$ 8143658 7910345 7797803 7741955 7524676 7710664 7744012 7714245 7738276 7693283 7176863
4677G176863j73504K0820l59230J77639J24202k35041k432K87134J31247k03952
$$ 7176863 7003359 7024179 6664949 6842588 6966790 6731749 6729317 7016451 7147698 6943746
4667F943746J11923L87562o4036m35199l18573L74697N1135J43711L88971k05607
$$ 6943746 7055669 7443231 7379195 6943996 6625423 7000120 7051255 7194966 7583937 7378330
4657G378330k41199L4416m80251L3612j75428j03618J82749N2035L5932k20959
$$ 7378330 7137131 7171547 6691296 6724908 6549480 6445862 6628611 6680646 6716578 6495619
4647F495619j47039K49558J07016l48420L18495j40660k59954L52321M34304l4027
$$ 6495619 6348580 6598138 6705154 6356734 6675229 6534569 6274615 6626936 7061240 7027213
4637G027213J71246L25189j61413l72877j48515L3524j35081j98764O7784l47953
$$ 7027213 7198459 7523648 7362235 6989358 6840843 6874367 6739286 6540522 6608306 6260353
4627F260353L83675j62438l37248M21689l08704q55151P3476p4039O7662k56939
$$ 6260353 6644028 6481590 6144342 6566031 6257327 5402176 5475652 5401613 5469275 5212336
4617E212336l21091J97548L04365j25416l62422j01307N8264j94056O02352J85626
$$ 5212336 4891245 5088793 5393158 5267742 4905320 4804013 4862277 4668221 5270573 5456199
4607E456199k53898K42529m64743K87283q8077J12400r4791L20646j94736J73560
$$ 5456199 5202301 5444830 4980087 5267370 5179293 5291693 5196902 5517548 5322812 5496372
4597E496372J86766K20808M28124j33379m24217m30714L30161J77195K59806R2302
$$ 5496372 5683138 5903946 6332070 6198691 5774474 5343760 5673921 5851116 6110922 6203224
4587F203224L7432k59353k33373L64719p1720m2449L19987j97861p5744L53537
$$ 6203224 6240656 5981303 5747930 6112649 6040929 5998480 6318467 6120606 6044862 6398399
4577F398399j06875n91266J05699K40738M707l15678l84915n551q6674J52945
$$ 6398399 6291524 5700258 5805957 6046695 6051402 5735724 5350809 5345258 5258584 5411529
4567E411529L23479o6464J51352k2463j97777Q353k25876j84447n3939O6281j1713
$$ 5411529 5735008 5668544 5819896 5797433 5599656 5608009 5382133 5197686 5143747 5210028 5198315
4556E198315r5015J42008j89650p7452m9213j26973k5495K13578J45823K52571
$$ 5198315 5103300 5245308 5055658 4978206 4928993 4802020 4776525 4990103 5135926 5388497
4546E388497O1438l87707J46631O531j20752j55298k20869K82966J71775j5520
$$ 5388497 5449935 5062228 5208859 5215390 5094638 4939340 4718471 5001437 5173212 5157692
4536E157692l57401L50410J29482k11307n30273j43259L32149N098J82163J01710
$$ 5157692 4800291 5150701 5280183 5068876 4538603 4395344 4727493 4732591 4914754 5016464
4526E016464l5237l6601L65904L0394l77814N3980l25237j53178K61104k2388
$$ 5016464 4981227 4944626 5310530 5340924 4963110 5017090 4691853 4538675 4799779 4777391
4516D777391K13293L52544k78809o4517P6812L44512M56379K77871N22623l32459
$$ 4777391 4990684 5343228 5064419 4999902 5076714 5421226 5877605 6155476 6678099 6345640
4506F345640j68470L9739j4032J222p658M27762K22686j42830J54083J55177L19056
$$ 6345640 6177170 6216909 6202877 6204099 6196441 6624203 6846889 6704059 6858142 7013319 7332375
4495G332375O23046N9785j3040R77390M30787J61819L45367N29290k6085l36516
$$ 7332375 7955421 8015206 8002166 8979556 9410343 9572162 9917529 10446819 10420734 10084218
4485A0084218l78255j54159k10048l1771K00343j88107N517k0969j7799M24927
$$ 10084218 9705963 9551804 9341756 9309985 9510328 9322221 9327738 9306769 9288970 9713897
4475I713897K78119L61521N08923k11518N7277O03130J04101L20183Q28457O51336
$$ 9713897 9992016 10353537 10862460 10650942 10708219 11311349 11415450 11735633 12564090 13215426
4465A3215426O52245J014884J602917J403614J561320J390293J428309J123602
$$ 13215426 13867671 14882555 16485472 17889086 19450406 20840699 22269008 23392610
4457B3392610O55942j57766j168290j613320j365222j682425j610723r61168j297772
$$ 23392610 24048552 23890786 22722496 21109176 19743954 18061529 16450806 15489638 14191866
4448A4191866j085915k46467r0581k76939k8671n19668M58286N4043K27832J00387
$$ 14191866 13105951 12859484 12768903 12491964 12463293 11943625 12401911 12455954 12683786 12784173
4438A2784173j85161K61710K49080R73903J301984R17889O99534J152723J177422
$$ 12784173 12599012 12860722 13109802 14083705 15385689 16303578 17003112 18155835 19333257
4429A9333257J511210J180551M48506m09926j245857j129173j581300j371260
$$ 19333257 20844467 22025018 22473524 22063598 20817741 19688568 18107268 16736008
4421A6736008n98157j353528j282875j075443k43610l09544m61338j03225j15943
$$ 16736008 16137851 14784323 13501448 12426005 12182395 11872851 11411513 11308288 11192345
4412A1192345L5987l65978m34309k36120j80524O1351m67759j94906J80805k30329
$$ 11192345 11228332 10862354 10428045 10191925 10011401 10072752 9604993 9410087 9590892 9360563
4402I360563L68723k92259K27949k31646k84210j90721p4863l80812M8863P63706
$$ 9360563 9729286 9437027 9664976 9433330 9149120 8958399 8883536 8502724 8551587 9315293
4392I315293j42046j82736J71243l13263m69039j21865k3804L75289r2936p4871
$$ 9315293 9173247 8990511 9161754 8848491 8379452 8257587 8233783 8609072 8516136 8441265
4382H441265k07493K22072M07782K15072k67793J82815j9193R2486L19587j35343
$$ 8441265 8233772 8455844 8863626 9078698 8810905 8993720 8974527 9067013 9386600 9251257
4372I251257M4977K72048M96025J20777K1114j781l1540J43810O04233L67001
$$ 9251257 9296234 9568282 10064307 10185084 10206198 10204417 10172877 10316687 10920920 11287921
4362A1287921N56011M34302N42542L29845M54479M04450M02813O43411P47418
$$ 11287921 11843932 12278234 12820776 13150621 13605100 14009550 14412363 15055774 15803192
4353A5803192J42674J03470k7499p2291l73541m30088m84313j61685l5858l39688
$$ 15803192 15945866 16049336 16021837 15949546 15576005 15145917 14661604 14499919 14464061 14124373
4343A4124373l88379J13679O41928l26186J40690N06155Q00815R21780N53505
$$ 14124373 13735994 13849673 14491601 14165415 14306105 14812260 15613075 16534855 17088360
4334A7088360J47546M77646N81564P20462O34449N22739N70521J128893Q22589
$$ 17088360 17235906 17713552 18295116 19015578 19650027 20172766 20743287 21872180 22694769
4325B2694769J068830O31286N14431J025824O00615M88744Q27745K66648j27682
$$ 22694769 23763599 24394885 24909316 25935140 26535755 27024499 27852244 28118892 27991210
4316B7991210n84024m11639q06469n18596m70085o62387m6839m86714o97319l36937
$$ 27991210 27407186 26995547 26189078 25670482 25200397 24538010 24491171 24004457 23307138 22970201
4306B2970201K82639M67809L73110r7059J32663O40161M41457P39049P00287N60345
$$ 22970201 23252840 23720649 24093759 23996700 24129363 24769524 25210981 25950030 26650317 27210662
4296B7210662M59127P58766J47405r5069P31972P80692L42341P21944Q19443L06445
$$ 27210662 27669789 28428555 28575960 28480891 29212863 29993555 30335896 31057840 31877283 32183728
4286C2183728j60357K10206L05086L5809j19532J9498L00323J86542k1575J883
$$ 32183728 32023371 32233577 32538663 32574472 32454940 32474438 32774761 32961303 32939728 32941611
4276C2941611M10458N67827M27991o6615l44360P260j61588K80343J6695j39823
$$ 32941611 33352069 33919896 34347887 34281272 33936912 33944172 33782584 34062927 34079622 33939799
4266C3939799K84089L93743N9582m10527k63886q2194k23127K37767N46365O85312
$$ 33939799 34223888 34617631 34677213 34266686 34002800 33920606 33697479 33935246 34481611 35166923
4256C5166923K54762N75484O20974O48071N06784M94443M50200N30960P83785
$$ 35166923 35421685 35997169 36618143 37266214 37772998 38267441 38717641 39248601 40032386
4247D0032386O73570J411375J348492J486103J187045J843555J068930J68946
$$ 40032386 40705956 42117331 43465823 44951926 46138971 47982526 49051456 49220402
4239D9220402r40031j542643k140316j186584j177528q74353m08432K26644J50461
$$ 49220402 48280371 46737728 44597412 43410828 42233300 41358947 40950515 41177159 41327620
4230D1327620Q9745k95189P61533N41422K7311M64291j76977j16666N65509J96180
$$ 41327620 41417365 41122176 41883709 42425131 42452442 42916733 42739756 42623090 43188599 43384779
4220D3384779M8373r9438K90422L57173L66638N34139P22029J011139P55926P25002
$$ 43384779 43433152 43333714 43624136 43981309 44347947 44882086 45604115 46615254 47371180 48096182
4210D8096182M74188M57611J244410P56955P32498R66218J081138J433894J650130
$$ 48096182 48570370 49027981 50272391 51029346 51761844 52728062 53809200 55243094 56893224
4201E6893224J356508J347085J828304J640951K032457K357016K469669K988156
$$ 56893224 58249732 59596817 61425121 63066072 65098529 67455545 69925214 72913370
4193G2913370L564374M041798M292232M672390N759729O628734P742500R252540
$$ 72913370 76477744 80519542 84811774 89484164 95243893 101872627 109615127 118867667
4185A18867667J1224817J2698098J4437376J6377749J9107099K1893033K5204801
$$ 118867667 130092484 142790582 157227958 173605707 192712806 214605839 239810640
4178B39810640L0271472L5384427M1783125M2692507K9212117K554104k6295258
$$ 239810640 270082112 305466539 347249664 389942171 419154288 421708392 395413134
4171C95413134m3111361m5487392l9596257l2179796k5494251j9667749j5945269
$$ 395413134 352301773 306814381 267218124 235038328 209544077 189876328 173931059
4164A73931059j3169326j0485308p915082o048125m898168l877834l693322m032446
$$ 173931059 160761733 150276425 142361343 136313218 131415050 127537216 123843894 119811448
4156A19811448m022383l213177l079323k530667k255976m68236k68575J57103
$$ 119811448 115789065 112575888 109496565 106965898 104709922 104241686 103973111 104130214
4148A04130214O16723K017636K664866L905594N110156O080345P252930P177029
$$ 104130214 104746937 106764573 109429439 113335033 118445189 124525534 131778464 138955493
4140A38955493O416955O315333P576182O679989O19974o473438j2245146j3288490
$$ 138955493 145372448 151687781 159263963 165943952 166563926 160090488 147845342 134556852
4132A34556852j2837171j1430139r241286p960066o344852n166686m294445l915974
$$ 134556852 121719681 110289542 101048256 93088190 86743338 81576652 77282207 73366233
4124G3366233l522020k693133k155290j567538j285055j123869q55690j65843
$$ 73366233 69844213 67151080 64995790 63428252 62143197 61019328 60163638 59997795
4116E9997795M92237L50242J56267M35339M42334J219283J687652J891058K198682
$$ 59997795 60490032 60840274 60996541 61431880 61874214 63093497 64781149 66672207 68870889
4107F8870889K641019L497411L508478M332662M153894L663202K057779M95899
$$ 68870889 71511908 75009319 78517797 82850459 87004353 90667555 92725334 93221233
4099I3221233j275839j969425k479719j807678j109646j449289j943059j713805
$$ 93221233 91945394 89975969 87496250 85688572 84578926 83129637 81186578 79472773
4091G9472773j804241j172920K42244R06122O42958r94693l217245n203822n510746
$$ 79472773 77668532 76495612 76737856 77643978 78286936 77292243 74074998 68871176 63360430
4082F3360430n042558m049311l269423k884717k521549k238900j704628j515883
$$ 63360430 58317872 54268561 50999138 48114421 45592872 43353972 41649344 40133461
4074D0133461r00869p77118r21982q59283p42991n29905p03184o80030j067857
$$ 40133461 39232592 38455474 37533492 36674209 35931218 35401313 34698129 34018099 32950242
4065C2950242n11519l01529m72731o83252n36141j12850l25807J550O43321M32217
$$ 32950242 32438723 32137194 31664463 30981211 30445070 30332220 30006413 30007963 30651284 31083501
4055C1083501K54405P29508N56137N22243N43936J462933K78185k77398o94404
$$ 31083501 31337906 32067414 32623551 33145794 33689730 35152663 35430848 35153450 34459046
4046C4459046l58468n26853j484569j034117o19826j149522m51797m40081m18208
$$ 34459046 34100578 33573725 32089156 31055039 30435213 29285691 28833894 28393813 27975605
4037B7975605n63089n29027m42053K12013J50124K83292P5357N8780K15930L131
$$ 27975605 27412516 26883489 26441436 26653449 26803573 27086865 27162222 27221002 27436932 27440063
4027B7440063L37202L67173J12428R12570J422467J049672J305072J438618J759633
$$ 27440063 27777265 28144438 28256866 29169436 30591903 31641575 32946647 34385265 36144898
4018C6144898K020003J878321J949080K274702L100936L701410M555228N060223
$$ 36144898 38164901 40043222 41992302 44267004 47367940 51069350 55624578 60684801
4010F0684801N156039O276042M608198K514468P92220J201766l54976l378319
$$ 60684801 65840840 72116882 76725080 79239548 80031768 81233534 80878558 77500239
4002G7500239n408828n949932n369101m348334l171791k451788k562981k208297
$$ 77500239 72091411 66141479 60772378 56424044 53252253 50800465 48237484 46029187
3994D6029187j696375j533534j457107r34176o87113n10940n79398K5311P93505
$$ 46029187 44332812 42799278 41342171 40407995 39720882 39209942 38630544 38655855 39449360
3985C9449360Q36907N94036P71929J296840K037961K325763J698808l48659j278034
$$ 39449360 40286267 40880303 41652232 42949072 44987033 47312796 49011604 48662945 47384911
3976D7384911j777043j613718o56964r848L79808L65518J166376J753254J438772
$$ 47384911 45607868 43994150 43337186 43327338 43707146 44072664 45239040 46992294 48431066
3967D8431066J736396J826324K022598J612812K331736K892367M116908M578018
$$ 48431066 50167462 51993786 54016384 55629196 57960932 60853299 64970207 69548225
3959F9548225M022535J266876j921581k333576j873114j144033L55146K37949
$$ 69548225 73570760 74837636 72916055 70582479 68709365 67565332 67920478 68158427
3951F8158427j777394l520435m269721l426270l187874k551109k029308q20183
$$ 68158427 66381033 62860598 58590877 55164607 51976733 49425624 47396316 46576133
3943D6576133l96453j36672K13535O53009R41518J337220Q64175J131000J472311
$$ 46576133 46179680 46043008 46256543 46909552 47851070 49188290 50052465 51183465 52655776
3934E2655776J707047K209846K984733K780338L369218M385754M738874N759910
$$ 52655776 54362823 56572669 59557402 62337740 65706958 70092712 74831586 80591496
3926H0591496P314134P595091O488654L371235J999392K752050L135153J586680
$$ 80591496 87905630 95500721 101989375 105360610 107360002 110112052 113247205 114833885
3918A14833885k217443n233539n478110l617042j511733K17411Q59980m28674
$$ 114833885 112616442 107382903 101904793 98287751 96776018 96993429 97853409 97424735
3910I7424735k476280m378722m945474m520272l363316l087334k488425j562128
$$ 97424735 94948455 90569733 85624259 81103987 77740671 74653337 72164912 70602784
3902G0602784q53386j85091j7995J44419P58130J296124J478323J810819J718784
$$ 70602784 69749398 69564307 69546312 69690731 70448861 71744985 73223308 75034127 76752911
3893G6752911J750344J771718J942547J871723K260119K515054L227699L284164
$$ 76752911 78503255 80274973 82217520 84089243 86349362 88864416 92092115 95376279
3885I5376279L047569L310051L155820K756873K617107K828793L353177M390767
$$ 95376279 98423848 101733899 104889719 107646592 110263699 113092492 116445669 120836436
3877A20836436M353068N502893N963940N103174L020963m06211j154833j042250
$$ 120836436 125189504 130692397 136656337 141759511 144780474 144374263 143219430 142177180
3869A42177180k9085N83722J172411J832492J651526Q27874J736034J897390K020733
$$ 142177180 142148095 142731817 143904228 145736720 147388246 148216120 149952154 151849544 153870277
3860A53870277J397141K26099n86900j557250j871171j294393j777460j352467
$$ 153870277 155267418 155493517 154906617 153349367 151478196 150183803 148406343 147053876
3852A47053876j709698j490455m79970l80933M72693q50707k504594m962017o544248
$$ 147053876 145344178 143853723 143373753 142992820 143465513 142614806 140110212 135148195 128603947
3843A28603947n914422n454481m333950l662282l365900k271255k224755k625826
$$ 128603947 122689525 117235044 112901094 109238812 105872912 103601657 101376902 98751076
3835I8751076k351870k812787k497641k572263k893301k519365j981187j831754
$$ 98751076 96399206 93586419 91088778 88516515 85623214 83103849 81122662 79290908
3827G9290908j973551q57949r72737j781447j647654j416192j067293r99818n28134
$$ 79290908 77317357 76459408 75486671 73705224 72057570 70641378 69574085 68574267 68046133
3818F8046133q8901n93554j68037p97194o84112m8277J69381l12872n38046k18618
$$ 68046133 67957232 67363678 67195641 66398447 65714335 65666058 65835439 65522567 64984521 64765903
3808F4765903p8765r67191m99090n47197l96249k69995m52926o5462k61475J07457
$$ 64765903 64687138 63719947 63220857 62673660 62277411 62007416 61554490 61489028 61227553 61335010
3798F1335010M70431R0906O76512J070798N35302Q70907J271640J102074Q02496
$$ 61335010 61805441 61896347 62572859 63643657 64178959 65049866 66321506 67423580 68226076
3789F8226076J622665J582414P74150J193574Q17103J266085J528665J680844
$$ 68226076 69848741 71431155 72205305 73398879 74215982 75482067 77010732 78691576
3781G8691576J859897J552731J978988J369720J817911J565391J256473J499101
$$ 78691576 80551473 82104204 84083192 85452912 87270823 88836214 90092687 91591788
3773I1591788O52748l9923k23230l68967j247529j011438j500850k205870j542562
$$ 91591788 92244536 92204613 91981383 91612416 90364887 89353449 87852599 85646729 84104167
3764H4104167j450929j497663j587720j938960j883787j829326j380762p35997
$$ 84104167 82653238 81155575 79567855 77628895 75745108 73915782 72535020 71799023
3756G1799023r51112q71417j200774j087445p84724j85182L0622j06110M9386
$$ 71799023 70847911 69976494 68775720 67688275 66903551 66718369 66748991 66642881 66692267
3747F6692267Q3474L21989Q25012O86735R2660L37776l84324j44482L55766J7780
$$ 66692267 66775741 67097730 67922742 68609477 68702137 69039913 68655589 68511107 68866873 68884653
3737F8884653k90784o02026m09804m81660j047156j124985q29738j007200k45521
$$ 68884653 68593869 67991843 67582039 67100379 66053223 64928238 64098500 63091300 62845779
3728F2845779j019464o86890p76394m09250l34607n69790o81591l07729k51213
$$ 62845779 61826315 61139425 60363031 59953781 59619174 59049384 58367793 58060064 57808851
3719E7808851o64847l56904m65940j69646k82945m88251l97888m72875l4668K805
$$ 57808851 57144004 56787100 56321160 56151514 55868569 55380318 54982430 54509555 54474887 54477692
3709E4477692K6683m17596l98312j9069K04237L6304j77435M08234L80552k4252
$$ 54477692 54504375 54086779 53688467 53669398 53873635 53909939 53732504 54140738 54521290 54497038
3699E4497038P4843K7589j51006J50548J12442K90326n3258k21351k4550m19298
$$ 54497038 54571881 54599470 54448464 54599012 54711454 55001780 54948522 54727171 54702621 54283323
3689E4283323n83522k66379o03509m29781j94925j57100k03957K24897K33638
$$ 54283323 53699801 53433422 52829913 52400132 52205207 52048107 51844150 52069047 52302685
3680E2302685K99173k7044Q25987J185915O94072J066711R94331Q97539J014211
$$ 52302685 52601858 52574814 53400801 54586716 55280788 56347499 57341830 58239369 59253580
3671E9253580R96542R34381R13581P27098M83023J251810J268380J125706M55385
$$ 59253580 60250122 61184503 62098084 62825182 63308205 64560015 65828395 66954101 67409486
3662F7409486M39660M85116N43601J31169J65443J84626l15753m09513j136763
$$ 67409486 67849146 68334262 68877863 69009032 69174475 69359101 69043348 68633835 67497072
3653F7497072n61431o02166o41674l09215p5795K53232L28574M23256K50230K51054
$$ 67497072 66935641 66333475 65691801 65382586 65306791 65560023 65888597 66311853 66562083 66813137
3643F6813137o84628l07306K86539j40104m9431K55630P5466K87582K19500L88249
$$ 66813137 66128509 65821203 66107742 65967638 65918207 66173837 66249303 66536885 66756385 67144634
3633F7144634N03778L10574O00538M99393O80704J09317m07253k74570n70265
$$ 67144634 67648412 67958986 68559524 69058917 69739621 69848938 69441685 69167115 68596850
3624F8596850r79897n43421l05076r09395p18681n59596p93364q78810r26346
$$ 68596850 67616953 67073532 66768456 65859061 65140380 64580784 63787420 62908610 61982264
3615F1982264k12657q57382r64948n60246l36225l61624J47451P5033k57298L291
$$ 61982264 61769607 60912225 59947277 59387031 59050806 58689182 58836633 58911666 58654368 58657659
3605E8657659J10714P8189L89899K20719j79746J07299K5196k09847k1138n32606
$$ 58657659 58768373 58846562 59236461 59457180 59277434 59384733 59409929 59200082 59178944 58646338
3595E8646338m4064M67020k94296r47811l28015m83860p46235n76068p90996o73410
$$ 58646338 58602274 59069294 58774998 57827187 57499172 57015312 56269077 55693009 54902013 54228603
3585E4228603o71650l72647q10464k95266n77520n68247l58345l03852k65688
$$ 54228603 53556953 53184306 52373842 52078576 51501056 50932809 50574464 50270612 50004924
3576E0004924q93017o03492k74251m09773m66648l14718l56159p12637M1259o86066
$$ 50004924 49111907 48508415 48234164 47824391 47357743 47043025 46686866 45974229 46015488 45329422
3566D5329422m95613m79537o65869m63320l04666n56270p14356q45827n35544
$$ 45329422 44833809 44354272 43688403 43225083 42920417 42364147 41649791 40803964 40268420
3557D0268420n11995o98594k42082n81702p25881m45549j52548m30279p0428n30959
$$ 40268420 39756425 39057831 38815749 38234047 37508166 37062617 36910069 36479790 36409362 35878403
3547C5878403o52745q44273n70079p05650K6226n86705n39839m02267o74085l45989
$$ 35878403 35225658 34381385 33811306 33105656 33131882 32545177 32005338 31603071 30928986 30582997
3537C0582997o15562n50704J55815m56561k49645q09321m46861o43602k83134
$$ 30582997 29967435 29416731 29572546 29115985 28866340 28057019 27610158 26966556 26683422
3528B6683422k59591J09514K96838o18781p58738j03092n3956j08352m16232n44872
$$ 26683422 26423831 26533345 26830183 26211402 25452664 25349572 25295616 25187264 24771032 24226160
3518B4226160l00219O2816n23790p03749l79319m80745j72534o21206m36306m87433
$$ 24226160 23925941 23988757 23464967 22761218 22381899 21901154 21728620 21107414 20671108 20183675
3508B0183675J62215o28711r85301k22685J47357m62329j0468j84512r5704l4255
$$ 20183675 20345890 19717179 18731878 18509193 18656550 18194221 18183753 17999241 17903537 17869282
3498A7869282J38213l29397R3490k1489J45231n24421J499L9695o5003j84035
$$ 17869282 18007495 17678098 17771588 17750099 17895330 17370909 17372408 17412103 17347100 17163065
3488A7163065j69765j19393j58181K54147j51271N4951l55702n83636k81302q2856
$$ 17163065 16993300 16873907 16715726 16969873 16818602 16873553 16517851 15934215 15652913 15570057
3478A5570057p1879J55068K85590p9974L42157k58332j75484j84584j97816m2988
$$ 15570057 15498178 15653246 15938836 15858862 16201019 15942687 15767203 15582619 15384803 15341815
3468A5341815k41249O4424M25548Q8311j86907q0053j5884j91101L7288M07680
$$ 15341815 15100566 15164990 15590538 15678849 15491942 15411889 15396005 15204904 15242192 15649872
3458A5649872L52043R7348k9851O30894J54214K39933K21351J829n7664L48430
$$ 15649872 16001915 16099263 16069412 16700306 16854520 17094453 17315804 17317633 17259969 17608399
3448A7608399L90084q3826k48307R9932O3904J12609J76384K06055k73274J36744
$$ 17608399 17998483 17914657 17666350 17766282 17830186 17942795 18119179 18325234 18051960 18188704
3438A8188704J14079m61441J19272K70393K60812M181J49401L72526L00213L03215
$$ 18188704 18302783 17841342 17960614 18231007 18491819 18496000 18645401 19017927 19318140 19621355
3428A9621355P01099L45893L85403J01033K58184O3692L76074O64157J93319R3826
$$ 19621355 20322454 20668347 21053750 21154783 21412967 21476659 21852733 22516890 22710209 22804035
3418B2804035J17950N05157K4666L49082L40973R8139q0625n2086K1367M91526
$$ 22804035 22921985 23427142 23451808 23800890 24141863 24240002 24159377 24107291 24128658 24620184
3408B4620184L73589m86537L69887N00542P0181L84741P7213O7562k662N60687
$$ 24620184 24993773 24507236 24877123 25377665 25447846 25832587 25909800 25977362 25974700 26535387
3398B6535387J43271j17966j8447K47826J94860o3711O75346M12633m32936k50712
$$ 26535387 26678658 26560692 26542245 26790071 26984931 26921220 27596566 28009199 27576263 27325551
3388B7325551J42804K36458K03491l86845m23907J16071R3641j67651k11218Q4749
$$ 27325551 27468355 27704813 27908304 27521459 27097552 27213623 27307264 27139613 26928395 27013144
3378B7013144l70947r5477m88088l24016L13821l21153k21257p1347k81856l28875
$$ 27013144 26642197 26546720 26058632 25734616 26048437 25727284 25506027 25434680 25152824 24823949
3368B4823949Q8503p85188k86034r1524r30304j95175n5918l49196n95777j90598
$$ 24823949 24912452 24127264 23841230 23749706 22819402 22624227 22568309 22219113 21623336 21432738
3358B1432738J03736n79338l79508K68859K67898k5498k16656l42860M21567L08704
$$ 21432738 21536474 20957136 20577628 20846487 21114385 21088887 20872231 20529371 20950938 21259642
3348B1259642J45694j67795j18995K51091m32566l04708k93091K32811J95642
$$ 21259642 21405336 21237541 21118546 21369637 20937071 20632363 20339272 20572083 20767725
3339B0767725J11882m23722l75674k32853j45839l91109j61829p3245j59927m6300
$$ 20767725 20879607 20455885 20080211 19847358 19701519 19310410 19148581 19075336 18915409 18869109
3329A8869109j84597k01233N8780n78882j96262N00788K82173j65897K868q5663
$$ 18869109 18684512 18483279 18542059 17963177 17766915 18267703 18549876 18383979 18386847 18301184
3319A8301184j46268l20251j74369L78210L43802j29455m53272p0083N01475l20955
$$ 18301184 18154916 17834665 17660296 18038506 18382308 18252853 17799581 17729498 18230973 17910018
3309A7910018k26880L29916N1098J44682q386N9912m66242J51955J29934k90681
$$ 17910018 17683138 18013054 18064152 18208834 18200448 18260360 17794118 17946073 18076007 17785326
3299A7785326j06883L39004j39044n49821J17515m87539r2189k71888l10575M21872
$$ 17785326 17678443 18017447 17878403 17328582 17446097 16958558 16866369 16594481 16283906 16705778
3289A6705778j09385r7996k2360J45394M681K61037m0551K66801L38788J63202
$$ 16705778 16596393 16498397 16476037 16621431 16626112 16887149 16846598 17113399 17452187 17615389
3279A7615389J85460K07415j79459L37948L78002J67581J93781J23872N20140
$$ 17615389 17800849 18008264 17828805 18166753 18544755 18712336 18906117 19029989 19550129
3270A9550129O43268j49304M43695L01883M94455N85247O29567P43144P87222
$$ 19550129 20193397 20044093 20487788 20789671 21284126 21869373 22498940 23242084 24029306
3261B4029306N16614P62091Q37326J212402J033947P31730J194323J352868N66862
$$ 24029306 24545920 25308011 26145337 27357739 28391686 29123416 30317739 31670607 32237469
3252C2237469K02449K54165p04968r24647j316895j479479j540379j557719j734304
$$ 32237469 32439918 32694083 31989115 31064468 29747573 28268094 26727715 25169996 23435692
3243B3435692j157639q69042q03501r48634j164277o73697o73714n52361m35290
$$ 23435692 22278053 21409011 20605510 19656876 18492599 17818902 17145188 16592827 16157537
3234A6157537m15604n13778k48898L22207k27622n06862j04529M26910O63224
$$ 16157537 15741933 15228155 14979257 15301464 15073842 14566980 14462451 14889361 15552585
3225A5552585r6351r68k0584J98728l01121n30589j3255p13195m38567k83526
$$ 15552585 15456234 15455266 15434682 15633410 15332289 14801700 14788445 14075250 13636683 13353157
3215A3353157j09550J79006J16256n30761L6445J65516J8312m69760m14250k59190
$$ 13353157 13243607 13422613 13538869 13008108 13044553 13210069 13228381 12758621 12344371 12085181
3205A2085181j49808K77883l23635k93611R3445k26784k73953N31398j20268K9346
$$ 12085181 11935373 12213256 11889621 11596010 11689455 11462671 11188718 11720116 11599848 11629194
3195A1629194Q8641r5552O25748K48327l75874K1437K5066k57832L98270K48999
$$ 11629194 11717835 11622283 12248031 12496358 12120484 12141921 12166987 11909155 12307425 12556424
3185A2556424L1397K7328q8518P2076P5571k7785j48106j82881K34873l56822
$$ 12556424 12587821 12615149 12526631 12598707 12674278 12646493 12498387 12315506 12550379 12193557
3175A2193557l10784j73429n12268K95426k45640j95190j48287l2078J15406J95475
$$ 12193557 11882773 11709344 11197076 11492502 11246862 11051672 10903385 10871307 10986713 11182188
3165A1182188J84125l93031j06666m02157L20981o133j17046J39413r4473J40716
$$ 11182188 11366313 10973282 10866616 10464459 10785440 10779307 10662261 10801674 10707201 10847917
3155A0847917L1430k58781J7056J51478J99665K27883j70840m307L59674k88530
$$ 10847917 10879347 10620566 10637622 10789100 10988765 11216648 11045808 11041501 11401175 11112645
3145A1112645l56544m88547L7493j39764K00963l14848M6774j56012j28508j67987
$$ 11112645 10756101 10267554 10305047 10165283 10366246 10051398 10098172 9942160 9813652 9645665
3135I645665k23194N41300k71678k504j87121k38506J05963j39712k95468j31647
$$ 9645665 9422471 9963771 9692093 9689589 9502468 9263962 9369925 9230213 8934745 8803098
3125H803098q6352K44711j26165n45371p4877J6043j40613j23909J9145p4969
$$ 8803098 8716746 8961457 8835292 8289921 8215044 8231087 8090474 7966565 7985710 7910741
3115G910741k39937O5006L14463k86178L172J28452n41086n05779K19668l9496
$$ 7910741 7670804 7735810 8050273 7764095 7767267 7895719 7354633 6848854 7068522 7029026
3105G029026L09190R7525k5897r1421m44672K17786l55922j39766J0309J64998
$$ 7029026 7338216 7435741 7409844 7318423 6873751 7091537 6735615 6595849 6606158 6771156
3095F771156l85784m24129J27185J00503n63910K39968J25623n28587N6790J40187
$$ 6771156 6385372 5961243 6088428 6188931 5625021 5864989 5990612 5462025 5518815 5659002
3085E659002k00289l69410l47915J77945K90936l98811n9970K10895o8619l0707
$$ 5659002 5458713 5089303 4741388 4919333 5210269 4811458 4751488 4962383 4893764 4863057
3075D863057O9368j41044l22802K35164m1217o0140J32811j86652j81241l12167
$$ 4863057 4932425 4791381 4468579 4703743 4662526 4602386 4735197 4548545 4367304 4055137
3065D055137j95592l644q5210m8067K75018K73221p6777l66177l01232J45278
$$ 4055137 3859545 3855901 3770691 3722624 3997642 4270863 4194086 3827909 3526677 3671955
3055C671955M5846o6563r2060k39859P824j35964k05279J35142j78857k0448k07134
$$ 3671955 3717801 3651238 3559178 3319319 3327143 3191179 2985900 3121042 2942185 2921737 2714603
3044B714603J9776J70648k0858k97806j61149K9588K39865K40311P0735k30404
$$ 2714603 2734379 2905027 2884169 2586363 2425214 2454802 2694667 2934978 3005713 2775309
3034B775309k67449j05087L15905k67803k24105M4510k25458j36677J96940j21824
$$ 2775309 2507860 2402773 2718678 2450875 2226770 2271280 2045822 1909145 2106085 1984261
3024A984261r8881r8P265o5143J05905J82530l7801K72020n8364l58891Q4248
$$ 1984261 1885380 1885282 1892547 1827404 1933309 2115839 2078038 2350058 2291694 1932803 2017051
3013B017051j87503m02075K95630J31024J51461J93965J82937J3040l29016l83922
$$ 2017051 1829548 1427473 1723103 1854127 2005588 2199553 2382490 2395530 2066514 1682592
3003A682592K10508j12965j29212p3197l55036J8250J87198l9905m350K1899j85103
$$ 1682592 1893100 1780135 1650923 1577726 1222690 1240940 1428138 1388233 1383883 1405782 1220679
2992A220679j16625L97671K038J48814P5672j94421Q461j16472L21598K92844
$$ 1220679 1104054 1501725 1503763 1652577 1728249 1533828 1542289 1425817 1747415 2040259
2982B040259l83111m85375K70766p6518j5085j33567q164k04352j86735K89451
$$ 2040259 1657148 1171773 1442539 1366021 1350936 1217369 1209205 1004853 818118 1107569
2972A107569L89961j12252k03179j04117j88569O53593r071l80499J3098J27461
$$ 1107569 1497530 1385278 1182099 1077982 889413 1543006 1533935 1153436 1166534 1293995
2962A293995j4346O2985k16951O7862k05014R4212J58717K79889M26866j53639
$$ 1293995 1279649 1342634 1125683 1193545 988531 1082743 1241460 1521349 1948215 1794576
2952A794576k80597J79442K6585q2251n8579r3844j96936J90434N92172J55616
$$ 1794576 1513979 1693421 1720006 1637755 1579176 1485332 1288396 1478830 2071002 2226618
2942B226618J66964N3920j62706j13698k32088L69211n8954j72095K79102k80609
$$ 2226618 2393582 2447502 2284796 2171098 1939010 2308221 2249267 2077172 2356274 2075665
2932B075665m3900K39897j00083k62639K0071k22368L13050J84432m80657J43646
$$ 2075665 2031765 2271662 2171579 1908940 1929011 1706643 2019693 2204125 1723468 1867114
2922A867114K62013L01494m43093r7502L46020r2725J52024K28410L70427m5755
$$ 1867114 2129127 2430621 1987528 1890026 2236046 2143321 2295345 2523755 2894182 2848427
2912B848427m201L7360j35728k88615l53719R2911j12747r0941L65J1962j82192
$$ 2848427 2844226 2881586 2745858 2457243 2103524 2196435 2083688 1992747 1993112 2005074 1822882
2901A822882Q7681j5981j37718M3379K74993L3048k33177j94007l12212P6336
$$ 1822882 1910563 1894582 1756864 1800243 2075236 2108284 1875107 1681100 1368888 1445224
2891A445224j05699L29728K23254m29634J78255j5324K52810j30791m7225J27282
$$ 1445224 1339525 1669253 1892507 1462873 1641128 1625804 1878614 1747823 1700598 1827880
2881A827880K40813R7737k86024n08494l25730L6473L4979N6074J31045O6808
$$ 1827880 2068693 2166430 1880406 1371912 1046182 1082655 1117634 1173708 1304753 1371561
2871A371561J3540l37494K219l7668J54203J62780P8717k36727o1108J45333k37193
$$ 1371561 1385101 1047607 1049826 1012158 1166361 1329141 1407858 1171131 1110023 1255356 1018163
2860A018163J03928j8974L93385m60925l5572J57674J3011l94625j65323j71853
$$ 1018163 1122091 1103117 1496502 1035577 1000005 1157679 1170690 776065 610742 438889
2850D38889M0899L1803Q6526j99015O3889m31240P5267M26185K28163r814m06274
$$ 438889 479788 511591 598117 399102 462991 31751 107018 533203 761366 751552 345278
2839C45278k18647J74127K32012M5009O6012l04299K57840j69898N3451L94750
$$ 345278 126631 300758 532770 577779 643791 339492 597332 427434 480885 875635
2829H75635k23305l17209K05982L06027j63813l47807m0062j99128l41106M84769
$$ 875635 652330 335121 541103 847130 683317 335510 295448 96320 -244786 239983
2819B39983j56869J60493K64785k8728Q8145J48787l97821j8313L0144O8003L51852
$$ 239983 83114 243607 508392 479664 567809 716596 318775 300462 330606 398609 750461
2808G50461l69382l23799J95314k4931j20900L12635P1405l02409j9843j43044
$$ 750461 381079 57280 252594 227663 106763 419398 490803 188394 168551 25507
2798B5507k8927j30220l8604K06568r8029j2841L33783J11046N9365j95908K06008
$$ 25507 -3420 -133640 -172244 34324 -63705 -76546 257237 368283 427648 231740 437748
2787D37748J21615j71318k01463j60051r2083O2535L6980k66633N57830m797j72836
$$ 437748 559363 388045 186582 26531 -65552 -3017 33963 -232670 325160 320363 147527
2776A47527l26348j86696P669J88552N8672J00212p4419k32408Q5914j34517k36903
$$ 147527 -178821 -365517 -357848 -169296 -110624 -10412 -84831 -317239 -231325 -365842 -602745
2765f02745K72746J77651J21805K12367K8r0972k7765j82943O6702j35663L6910
$$ -602745 -329999 -152348 -30543 181824 181852 90880 63115 -119828 -53126 -188789 -151879
2754a51879K28977j9629J1910n2235j63175K09813M42012k76221k16316K49419
$$ -151879 77098 57469 69379 17144 -146031 63782 505794 229573 13257 262676
2744B62676k46964N8989j00186k54329p2774L8578M40529j68355O0842M0014j10496
$$ 262676 15712 74701 -25485 -279814 -352588 -314010 126519 -41836 19006 59020 -51476
2733e1476J07615k78364l63708k95351L96838N502L23781J16658j14097N1383
$$ -51476 56139 -222225 -585933 -881284 -484446 -478944 -155163 -38505 -152602 -101219
2723a01219J14902o1073j34291k82681J67822L14069P438j21597j01185j22732
$$ -101219 13683 -47390 -181681 -464362 -296540 17529 24967 -96630 -197815 -320547
2713c20547L39637K32813k91338J81479k1069k62527k17200J66320J88498O3048
$$ -320547 19090 251903 -39435 142044 120975 -141552 -358752 -192432 -3934 59114
2703E9114o1061L31233m14054J05110q2912m02065M11170N9401J56286k58401
$$ 59114 -1947 329286 -84768 20342 -62570 -464635 -53465 5936 162222 -96179
2693i6179k33489o9713P0201L7038M05397J19575j22161n3041J29828O206r7529
$$ -96179 -329668 -399381 -329180 -292142 113255 232830 110669 57628 187456 193662 96133
2682I6133J76095j33758k54909J27720j52314K33700J64055j91328j42959j78576
$$ 96133 272228 138470 -116439 11281 -141033 92667 256722 65394 -77565 -256141
2672b56141j6180j29953J19596J67786j8700J79155P2243n33817J3114M6017K81332
$$ -256141 -272321 -402274 -282678 -114892 -133592 45563 117806 -416011 -402897 -356880 -75548
2661g5548K7121L23257J63426n6422k38279O9645P7099m33897j33008j06623M74773
$$ -75548 -48427 274830 438256 381834 143555 213200 290299 -143598 -276606 -383229 91544
2650I1544K33718m72028k85873M72777p4244j61486L40716r8318q9066k34243
$$ 91544 325262 -146766 -432639 40138 -34106 -195592 145124 46806 -42260 -276503
2640b76503R6200L3021L654L1398N1323R723K55216N229j03651M21116l08117
$$ -276503 -180303 -147282 -143628 -112230 -60907 -51184 204032 209261 105610 526726 218609
2629B18609m23356M2447L12177P8733j98420K77897l31696K76760l03753k32291
$$ 218609 -204747 -162300 149877 228610 30190 308087 -23609 253151 -50602 -282893
2619b82893L38825K857K35412k42268O0651l83029K7358j4608K02582K2960L4160
$$ -282893 55932 58789 294201 51933 112584 -270445 -243087 -257695 -55113 -32153 2007
2608B007R7833n03223O7155R5949K12863p8321J09976J31627M5079r9616j73782
$$ 2007 99840 -403383 -336228 -240279 -27416 -105737 4239 135866 180945 81329 -92453
2597i2453J29516m08229L2374j04045o4896M2910L54430K08480l52042L10676
$$ -92453 37063 -371166 -338792 -442837 -507733 -464823 -110393 98087 -253955 56721
2587E6721j42024j22457J18273j68782K96291J17963k38102k30412k76410L26399
$$ 56721 -85303 -207760 -89487 -258269 38022 155985 -82117 -312529 -588939 -262540
2577b62540j55598k3656L01863j20504J40058J82737J36099K15432k50604j69238
$$ -262540 -418138 -441794 -139931 -260435 -120377 62360 198459 413891 163287 -5951
2567e951J12289k03623j11130k2618l825M10886l34248j63170J68567M22501k27035
$$ -5951 106338 -97285 -208415 -231033 -234858 176028 -158220 -321390 -152823 269678 42643
2556D2643j44187p8019J97048J61924N1075j55092J14992K34126l23640q1359
$$ 42643 -101544 -179563 17485 179409 230484 75392 190384 424510 100870 19511
2546A9511j94076J91306k06773J30459M07920j72409J14823k30031j48362q0188
$$ 19511 -174565 16741 -190032 -59573 348347 175938 290761 60730 -87632 -167820
2536a67820m76677N52479L5065j02592K50698j86139L25652k71466J05278J3335
$$ -167820 -644497 -92018 -56953 -159545 91153 -94986 230666 -40800 64478 77813
2526G7813l26061K77477k55919L68820k62171q5778r7467k540L66411J31375Q0445
$$ 77813 -248248 29229 -226690 142130 -120041 -205819 -303286 -305826 60585 191960 272405
2515B72405m78384R7015J79497j3325m23156k56391j5400J49214K77155P2910
$$ 272405 -205979 -108964 70533 57208 -365948 -622339 -637739 -488525 -211370 -138460
2505a38460j53743k46237K31796j91693K94325O02292j89898l72942l12594K27040
$$ -138460 -292203 -538440 -306644 -498337 -204012 398280 208382 -164560 -477154 -250114
2495b50114j54135N2444M72058m97027J07193J9457J12811L75859J82001l68649
$$ -250114 -404249 -351805 120253 -376774 -269581 -250124 -137313 238546 420547 51898
2485E1898k6431r1586k65808l72706M57333L0936K90150n2741J39727j27999K4582
$$ 51898 25467 -66119 -331927 -704633 -247300 -216364 73786 21045 160772 32773 57355
2474E7355L4909n14108J27641M41904l35254l49907K0686N79616K8915j21419
$$ 57355 92264 -421844 -294203 147701 -187553 -537460 -516774 62842 91757 -29662
2464b9662J81692N4426k61864j17364R9686j80729j53856m1438K89318m7047J97570
$$ -29662 152030 206456 -55408 -172772 -73086 -253815 -407671 -449109 -159791 -206838 -9268
2453i268M1089j73667K38255j07155j41j83712l74724M88364r2750K51661R6839
$$ -9268 31821 -141846 96409 -10746 -10887 -194599 -569323 -80959 -173709 77952 174791
2442A74791J63665K98590k17690l67201k17073o6090J46289o44843j2643J29546
$$ 174791 338456 637046 419356 52155 -164918 -231008 -84719 -729562 -742205 -612659
2432f12659K13801J22944L37281o1891J19843l85033R3204J6807J25663K0337
$$ -612659 -398858 -275914 61367 -524 119319 -265714 -172510 -155703 -30040 -9703
2422i703j78582O9082J53924l61074M2409L38364r9659K11024J51721k66660R9192
$$ -9703 -188285 -119203 34721 -326353 -283944 54420 -45239 165785 317506 50846 150038
2411A50038R6236j13565l20311K29932L39759l56719K30165l18804K72806M71884
$$ 150038 246274 132709 -187602 42330 382089 25370 255535 -63269 209537 681421
2401F81421j76588L00376K43165m52664l65093j29488K51591k8177m51549k01185
$$ 681421 504833 805209 1048374 595710 230617 101129 352720 324543 -127006 -328191
2391c28191K62059l8131L61544M23996l60782j22302M12303K77886J04878K63258
$$ -328191 -66132 -104263 257281 681277 320495 198193 610496 888382 993260 1256518
2381A256518k29423j28543J46151k11562l0947M06239o1254m60639m83554l15557
$$ 1256518 1027095 898552 1044703 833141 802194 1208433 1147179 686540 202986 -112571
2371a12571L41802n7039P0598M56913J09070k55146k08223k15826o7906M241j00076
$$ -112571 229231 172192 242790 699703 808773 553627 345404 129578 61672 65913 -34163
2360c4163L37013L71839J67767p23643r0161N32770j73275k05129Q5773j14622
$$ -34163 302850 674689 842456 118813 28652 561422 388147 183018 268791 154169
2350A54169o7315k99353K63545P9461k03903Q034O899K49493k47657J36765N23550
$$ 154169 86854 -212499 51046 130507 -73396 -65362 -58463 191030 -56627 80138 603688
2339F03688J27777m84004J04748o6382N47406l30092j95660J05988K49607l75176
$$ 603688 731465 247461 352209 285827 833233 503141 307481 413469 663076 287900
2329B87900k78416J33445l11M02554M34858o7623n32824k97144J07777l10558
$$ 287900 9484 142929 142618 545172 980030 912407 379583 82439 190216 -120342
2319a20342K52627l0674k42100O92043l1443m1737P9851P890J24885q7594k77235
$$ -120342 132285 101611 -140489 551554 520111 478374 558225 566115 691000 603406 326171
2308C26171O1897K52210R8365l73972l68058J42005p8283N6976K08632o3649J31310
$$ 326171 388068 640278 738643 364671 -3387 138618 60335 117311 325943 262294 393604
2297C93604p229K07296k34541L18900J40958j32579j40703j6524L91694k21783
$$ 393604 386375 593671 359130 678030 818988 686409 545706 529182 920876 699093
2287F99093q1819N7915k89814K53023j05284j19511j9611K09383j71221l1206
$$ 699093 617274 675189 385375 638398 533114 413603 393992 603375 432154 400948
2277D00948N71378N24431n19720r3169n7038j91152M6977k01755J73069p3822
$$ 400948 972326 1496757 977037 883868 826830 635678 682655 480900 653969 580147
2267E80147J30095K48180P4232J7040m54843K78288P6428K04382R8305j64046
$$ 580147 710242 958422 1032654 1049694 594851 873139 949567 1153949 1252254 1088208
2257A088208K45281k31830k40583l07403j61853L6110K09984j99016M98661l73131
$$ 1088208 1333489 1101659 861076 553673 391820 427930 637914 438898 937559 564428
2247E64428J6973J35423o0382N44991k1979J21002j47958k97451j97948O39377
$$ 564428 581401 716824 656442 1201433 1179454 1300456 1152498 855047 657099 1296476
2237A296476P7465J96520l62703J6801o3295l85331L81079N82535j144l48858
$$ 1296476 1373941 1570461 1207758 1224559 1161264 775933 1157012 1739547 1738403 1389545
2227A389545O5718j47593K11293k39290J71783l09075L79848K95408L7918l44015
$$ 1389545 1455263 1307670 1518963 1279673 1451456 1142381 1522229 1817637 1855555 1511540
2217A511540l99898K73884K60625l1782j82962l8318J37835J57839J10258Q4348
$$ 1511540 1111642 1385526 1646151 1614369 1431407 1393089 1530924 1688763 1799021 1883369
2207A883369J05543L4705L25240k99868O0078O3681K46337K1187o5952L5669L99813
$$ 1883369 1988912 2023617 2348857 2048989 2109067 2172748 2419085 2440272 2374320 2409989 2809802
2196B809802j60007k33375K63242K82182M65000j74473J41316J98652L4973L26588
$$ 2809802 2649795 2416420 2679662 2961844 3426844 3252371 3393687 3592339 3627312 3953900
2186C953900N05511k7150o36791k58061M13859N67022K26075l04924J46394K03388
$$ 3953900 4459411 4432261 3795470 3537409 3951268 4518290 4744365 4439441 4585835 4789223
2176D789223p0663O55998L3929m6486M76383M98976q0808l48214K44102J67277
$$ 4789223 4718560 5374558 5408487 5362001 5838384 6337360 6256552 5908338 6152440 6319717
2166F319717K86570R3141j8992L38369l69163L63496M39238L70870j424K18791
$$ 6319717 6606287 6699428 6680436 7018805 6649642 7013138 7452376 7823246 7821822 8040613
2156H040613L11929K25917L25605O21865M59891m3739J88988J1535P30965L94682
$$ 8040613 8352542 8578459 8904064 9525929 9985820 9942081 10131069 10142604 10873569 11268251
2146A1268251Q55628N47121M02765Q02413Q78256R25399O64625N26211J025480
$$ 11268251 12123879 12671000 13073765 13876178 14754434 15679833 16344458 16870669 17896149
2137A7896149Q60220J514318J465916J347599J785842K213705K323621L191283
$$ 17896149 18756369 20270687 21736603 23084202 24870044 27083749 29407370 32598653
2129C2598653L653370L479354L009926L357435M642967O165625O831786Q060609
$$ 32598653 36252023 39731377 42741303 46098738 50741705 56907330 63739116 71799725
2121G1799725R307797J1160860J3602223J5728369J6951402K1785652K9076828
$$ 71799725 81107522 92268382 105870605 121598974 138550376 160336028 189412856
2114A89412856L6147553J5116178k0369375l8124260l2635790k5652223k1977633
$$ 189412856 225560409 240676587 220307212 182182952 149547162 123894939 101917306
2107A01917306j5890968j2472638r523640p327010n188445m157255l311031k185350
$$ 101917306 86026338 73553700 64030060 56703050 51514605 47357350 44046319 41860969
2099D1860969j341279k208038k980452l662049k208381k297947k338568j736842
$$ 41860969 40519690 38311652 35331200 31669151 29460770 27162823 24824255 23087413
2091B3087413j274165r54285n46104j111656p19449r23876o37080n86465p30094
$$ 23087413 21813248 20858963 20312859 19201203 18481754 17557878 16920798 16334333 15604239
2082A5604239q70527q70554o46901k93410p38677K3020m69764k83552l15950k67431
$$ 15604239 14733712 13863158 13216257 12922847 12184170 12207190 11737426 11453874 11137924 10870493
2072A0870493m83898k78556n00265m05974j24050P805o20134m72281m04455K32978
$$ 10870493 10386595 10108039 9607774 9201800 9077750 9085555 8465421 7993140 7588685 7821663
2062G821663j98816n06117k01658k48953k05728l55449J66453J92789N3933p70724
$$ 7821663 7622847 7116730 6915072 6666119 6460391 6104942 6271395 6464184 6518117 5747393
2052E747393j93123q0681m69867j36288j22337j47096M8465K17835j74942j23033
$$ 5747393 5554270 5473589 5003722 4867434 4745097 4598001 4646466 4864301 4689359 4566326
2042D566326n06328n8815L04440K7247J2401r2957n51068l36412p828J42190l2364
$$ 4566326 4059998 4001183 4305623 4332870 4345271 4252314 3701246 3364834 3357006 3499196 3466832
2031C466832l40927k74893O08518j025j1077N29744n68433l61979n5515j81397
$$ 3466832 3125905 2851012 3459530 3458505 3447428 3977172 3408739 3046760 2991245 2809848
2021B809848p4647J51141j35154l88618n47423k8946N4433L99842L92509M2275
$$ 2809848 2735201 2886342 2751188 2362570 1815147 1786201 1840634 2240476 2632985 2675260
2011B675260m69424l07875q9623j18283P0598L6325o0584L4700J60860J68622
$$ 2675260 2205836 1897961 1808338 1690055 1760653 1796978 1736394 1771094 1931954 2100576
2001B100576m52340l01782K66601K50599m0353k07982M3761j58470k62386J74736
$$ 2100576 1648236 1346454 1613055 1863654 1823301 1615319 1659080 1500610 1238224 1412960
1991A412960N36917m70172r9474q4634j57186N18752l39395o8264j78923j25167
$$ 1412960 1949877 1479705 1380231 1295597 1138411 1657163 1317768 1249504 1070581 945414
1981I45414K85690J93083k2904n81833J20194J10974J22732O3907m13797R4275
$$ 945414 1231104 1424187 1401283 819450 939644 1050618 1173350 1237257 823460 917735
1971I17735o415r4122K89635l42038j37247L15120L16953n7995l39916j24436
$$ 917735 911320 817198 1106833 764795 627548 942668 1259621 1201626 861710 737274
1961G37274k72679J24003n7220L96556l8531k43469j8227K98480J40196j60124
$$ 737274 464595 588598 531378 927934 889403 645934 627707 926187 1066383 906259
1951I06259m02281M32026J10589l08373k50320L21703r4667j56661Q6497K45060
$$ 906259 503978 936004 1046593 738220 487900 809603 714936 558275 644772 889832
1941H89832j07414o65618k89594M96767J19932m60042N42006m5878l66597P2560
$$ 889832 782418 116800 -172794 323973 443905 -16137 525869 479991 113394 185954
1931A85954J35702m9507j15975r2776M283J0117J79943k41526M31062K75723n22350
$$ 185954 321656 272149 156174 63398 67681 77798 257741 16215 447277 723000 200650
1920B00650l6429r4538m7873M6857K23742K52984q6968k14452j49347J62112r6057
$$ 200650 164221 69683 21810 68667 292409 545393 458425 243973 94626 256738 160681
1909A60681j13942L50698M41716l62082n86442L56582p6371M08361j80118m18788
$$ 160681 46739 397437 839153 477071 -109371 247211 170840 579201 399083 -19705
1899a9705J64362N0185k90035q3010L50557J19685K64063R6912l86701k03266
$$ -19705 144657 194842 -95193 -178203 172354 292039 556102 653014 266313 63047
1889F3047l8365J18535O6196J40064k022k04685J286r3338K49563l0647K84083
$$ 63047 24682 143217 209413 349477 347455 142770 144056 50718 300281 269634 553717
1878E53717K00120P3442m92611m08999K09633j20937j3189j8725J58889N98890
$$ 553717 753837 827279 334668 -74331 135302 14365 1176 -17549 141340 740230
1868G40230O9250m08322j26494O5146k59841M77490O7118n6514l5145o8572j32143
$$ 740230 809480 401158 274664 339810 79969 557459 624577 568063 532918 464346 332203
1857C32203q5269O7535j986k69504O1153n4128K37339J81748R8638K86500K17365
$$ 332203 246934 314469 312483 42979 104132 50004 287343 469091 567729 854229 1071594
1846A071594n2508R5114O05038l67653n4147l08017l5860Q8496k99263j13724
$$ 1071594 1019086 1114200 1719238 1351585 1297438 989421 953561 1042057 742794 629070
1836F29070m78390L6524L70366k15862l58837K07361L70912Q0572j70028j07772
$$ 629070 150680 187204 557570 341708 -17129 190232 561144 641716 471688 363916
1826C63916l4043k40211l8326L56219k57112L77564R0443m5085J02981n17745
$$ 363916 329873 89662 51336 407555 150443 528007 618450 573365 676346 158601
1816A58601j12025j9854J08743k8391j551m2759j8750K43104l63891J81408K03864
$$ 158601 46576 26722 135465 107074 105523 62764 44014 287118 -76773 104635 308499
1805C08499n71489M49538j67708N825K23320l08784K77099K15508k66991p8216
$$ 308499 -262990 186548 18840 24665 247985 -60799 216300 431808 164817 86601
1795H6601J1758L171L22245K69443l71899m48076l5248M31951j35969k16475O0483
$$ 86601 98359 101530 423775 693218 321319 -126757 -162005 269946 133977 -82498 -22015
1784b2015r9687j06384L07837L73693M9870r1085j47919k49619O8029q4745K36828
$$ -22015 -121702 -228086 79751 453444 503314 412229 264310 14691 82720 -2025 234803
1773B34803L47778m14553m04589j86624j35783J57752r7824N8996K14845K65562
$$ 234803 582581 168028 -236561 -423185 -558968 -401216 -499040 -440044 -225199 40363
1763D0363J02911k12959L50788J1567k0294l82723l02638O76685L66245k0159
$$ 40363 143274 -69685 281103 292670 272376 -110347 -412985 263700 629945 609786
1753F09786l41769n67563L07372K22304k09890O7875K31568j69274l3232K26682
$$ 609786 268017 -299546 7826 230130 20240 88115 319683 150409 117177 343859
1743C43859m2099n66873O3044j84044L36338J08583l38052K3103p5818O8355R3595
$$ 343859 301760 -265113 -202069 -386113 -49775 58808 -279244 -256141 -331959 -263604 -170009
1732a70009N660J48449R2355l21941k58378L29116K5570P5983l15220J95335k80739
$$ -170009 -164349 -15900 76455 -245486 -503864 -174748 -149178 -73195 -388415 -193080 -473819
1721d73819J88821j3397k25548J39462K9067K71602k18848J1133r6841L12194
$$ -473819 -284998 -298395 -523943 -384481 -355414 -83812 -302660 -291527 -388368 -76174
1711g6174k61584j13415K02701p87k69894M55813q6419j29233J04026K78228k51401
$$ -76174 -337758 -451173 -248472 -249259 -519153 -63340 -149759 -278992 -174966 103262 -148139
1700a48139J38344j02004M8754m22267M8668J2607j41303O17815k04266k52907
$$ -148139 -9795 -111799 -63045 -485312 -436644 -424037 -565340 52475 -151791 -404698
1690d04698j37207J92051J9375L64883O0019K52988K00136m09096n8652K8104
$$ -404698 -541905 -349854 -330479 34404 94423 347411 547547 138451 79799 107903
1680A07903K9512Q5031k2718j41902k69958K96776J80640l60048m8715p7911M47374
$$ 107903 137415 222446 199728 57826 -212132 84644 265284 -94764 -143479 -221390 225984
1669B25984L1806P0237r4486m8771O5970q2526j23662K2551K5005l5059l88657
$$ 225984 257790 328027 233541 184770 250740 168214 44552 67103 92108 57049 -331608
1658c31608L26163n8423q6570K09197n30409J09270M85693r7366k03456J719n7356
$$ -331608 -5445 -63868 -150438 58759 -471650 -362380 123313 25947 -177509 -175790 -233146
1647b33146L813Q1716M8494k34082j7445N4865L22632l08650j90528J72240O09202
$$ -233146 -229333 -147617 -99123 -333205 -350650 -295785 26847 -281803 -472331 -300091 309111
1636C09111p5355k82209K24341j95516q3425L73743m41175k67577k11261K26206
$$ 309111 233756 -48453 175888 -19628 -103053 270690 -170485 -438062 -649323 -423117
1626d23117K02176N06107O5178m01250j01222K37080J09209r8063K68967k54559
$$ -423117 -220941 285166 350344 -50906 -152128 84952 194161 96098 365065 110506
1616A10506k59262l1527k97351j32449K30037K82726j25326k38748L94868M0055
$$ 110506 -148756 -180283 -477634 -610083 -380046 -97320 -222646 -461394 -66526 -26471
1606b6471j127K77973n060n66214n443M13354J14238M65462j13934l65642M30517
$$ -26471 -27598 250375 245315 -320899 -326342 87012 201250 666712 552778 187136 617653
1595F17653l04173R7524o6232j84032k53660q2010K70555J20322M2555L0691L305
$$ 617653 313480 411004 344772 160740 -92920 -174930 95625 215947 258502 289193 292498
1584B92498m45001k0674L60335j97642j82619L09055L85879j19793m55873J613
$$ 292498 -152503 -173177 187158 -10484 -193103 115952 501831 382038 -73835 -72222
1574g2222k2045l9622j83902J7792J00886N01810l17115l4876J35776k35670K4278
$$ -72222 -94267 -133889 -317791 -299999 -199113 302697 -14418 -49294 86482 -149188 -124910
1563a24910Q5210K68121J74462m2658k47292J51468P3841k74615j27691O3871
$$ -124910 -39700 228421 402883 360225 112933 264401 338242 63627 -64064 -193
1553a93k05309j11762p7240r6017j0067Q706K09748J68778J39295M5654j61669
$$ -193 -205502 -317264 -394504 -490521 -500588 -491882 -282134 -113356 25939 71593 -90076
1542i0076K1694l809l27096J74282J12728L4962L06377l12695k7856k60979N2963
$$ -90076 -68382 -72191 -399287 -225005 -112277 -77315 229062 -83633 -111489 -372468 -319505
1531c19505n659K74089L46452l49025p4483j73497L32641J05141P5007k56388
$$ -319505 -325164 -51075 295377 -53648 -128131 -301628 31013 136154 211161 -45227
1521d5227J23017P7445J33974l96379P1706K87298Q0322j93541j12903J80069
$$ -45227 77790 155235 289209 -107170 -35464 251834 332156 138615 25712 205781
1511B05781Q6485m6064j81622J98483j60336l30659m25303K05494K22274J19237
$$ 205781 292266 246202 64580 263063 102727 -227932 -653235 -447741 -225467 -106230
1501a06230J63041j4538j71186K8189L99378K79424m96419K03186J59080m68583
$$ -106230 56811 42273 -128913 -100724 298654 578078 81659 284845 443925 -24658
1491b4658j09716j16733P3542M58825R1160l72508R0099J61720j01694k21592
$$ -24658 -134374 -251107 -177565 281260 372420 -88 90011 251731 150037 -71555
1481g1555Q2634J05202l81856k034K24680r2964j42638K43259K30855Q9270l23826
$$ -71555 11079 116281 -265575 -267609 -42929 -135893 -278531 -35272 195583 284853 -38973
1470c8973l62265k9194J76106J93488q0441M0500k06716j00808N10123k17294
$$ -38973 -401238 -430432 -254326 -60838 -141279 -100779 -307495 -408303 101820 -115474
1460a15474k72863L9669K10635j72425j23520J33198J78356J30447J49261J20945
$$ -115474 -388337 -348668 -138033 -310458 -433978 -300780 -122424 8023 157284 278229
1450B78229k00316J93001Q848J23949j3892n97470K15845K04396O071k5758k0748
$$ 278229 77913 270914 279762 403711 389819 -207651 8194 212590 218661 192903 172155
1439A72155k96795j41187l79856L79545L33649J44789k83223k49656J40779L4108
$$ 172155 -124640 -265827 -645683 -266138 67511 212300 -70923 -320579 -179800 -145692
1429a45692k56480n5474L97115k2464k24079j76411N39978O9037J8750O696M6690
$$ -145692 -402172 -457646 -60531 -82995 -307074 -483485 56493 125530 144280 150976 197666
1418A97666j58357K13463k23560o70r3112j39329j05632L2925K07382k94030L91595
$$ 197666 39309 252772 29212 28542 -64570 -203899 -309531 -276606 -69224 -363254 28341
1407B8341N383K57566K95216k63516m07427j8070K55417J81279k29523K5573k92714
$$ 28341 33724 291290 586506 322990 -84437 -102507 152910 334189 104666 130239 -162475
1396a62475m05222K08069L08811K34441N1628l38627J24052k7465j09490J56151
$$ -162475 -567697 -359628 -50817 183624 235252 -103375 20677 -6788 -116278 39873
1386C9873K74549J24255m35488n08905L57464K2288R15K21702n6705l3186l37663
$$ 39873 314422 438677 3189 -505716 -148252 -125964 -125049 96653 39948 6762 -330901
1375c30901O39418K01562j99799n23860j01397K53483K62716l60509j85413M99178
$$ -330901 308517 510079 310280 -213580 -314977 -61494 201222 -159287 -344700 154478
1365A54478J96132o7040L46278k85450j42527l95826J20082K30327P5632j18121
$$ 154478 350610 283570 629848 344398 201871 -193955 -73873 156454 232086 113965
1355A13965k21140j8146J53332K9372j11688J9979r4386j53514L97899l98625
$$ 113965 -107175 -125321 28011 57383 -54305 -34326 -128712 -282226 115673 -282952
1345b82952L13790J62791l9961K70278l68579l9502j17415J29951O2983K02736
$$ -282952 30838 193629 153668 423946 55367 15865 -101550 28401 91384 294120
1335B94120m29357k15470J94280K94279M16693j63505l42558N300j57680O4673
$$ 294120 -135237 -350707 -156427 137852 554545 391040 48482 53782 -103898 -39225
1325c9225j38518K10516j51292J12388j31867o6255L185J66947K15315k62993
$$ -39225 -177743 32773 -118519 -6131 -137998 -204253 -201068 -34121 181194 -81799
$$ [...]
##END NTUPLES=NMR SPECTRUM
##END=
