##TITLE=1H_EC-3265(2)
 CDCl3,8 sc, 
 26.10.2021
##JCAMPDX= 6.0         $$ Bruker NMR JCAMP-DX V2.0
##DATA TYPE= NMR SPECTRUM
##DATA CLASS= NTUPLES
##ORIGIN= UXNMR, Bruker Analytische Messtechnik GmbH
##OWNER= root
$$ XWIN-NMR		Version 3.5
$$ Tue Oct 26 10:08:50 2021 Russian Standard Time (UT+4h)  she@DPX200
##.OBSERVE FREQUENCY= 200.1313468511
##.OBSERVE NUCLEUS= ^1H
##.ACQUISITION MODE= SIMULTANEOUS
##.ACQUISITION SCHEME= undefined
##.AVERAGES= 8
##.DIGITISER RES= 18
##SPECTROMETER/DATA SYSTEM= spect
##.PULSE SEQUENCE= zg30
##.SOLVENT NAME= D2O
##.SHIFT REFERENCE= (INTERNAL, D2O, 0, 15.7238)
##AUDIT TRAIL= $$ (NUMBER, WHEN, WHO, WHERE, WHAT)
$$ ##TITLE= Audit trail, XWIN-NMR		Version 3.5
$$ ##JCAMPDX= 5.01
$$ ##ORIGIN= Bruker BioSpin GmbH
$$ ##OWNER= she
$$ F:/spectra/data/she/nmr/H-F/1/pdata/1/auditp.txt
$$ ##AUDIT TRAIL=  $$ (NUMBER, WHEN, WHO, WHERE, WHAT)
(   1,<2021-10-26 10:07:19.92 +0400>,<she>,<DPX200>,
      <created by zg, POWCHK disabled, PULCHK disabled
       configuration hash MD5:
       00 E9 B6 7A A2 85 ED C7 34 08 36 98 17 FE 4E 26
       data hash MD5: 16K
       74 75 3C 45 3D 99 66 ED AA 54 DE 97 AC 74 6A BC>)
(   2,<2021-10-26 10:07:23.53 +0400>,<she>,<DPX200>,
      <Start of raw data processing
       efp BC_mod = 2 LB = 0.24 FT_mod = 6 PKNL = 1 PHC0 = -15237.25 PHC1 = 18.00083 SI = 16K 
       data hash MD5: 16K
       E2 19 21 C9 B4 BF B9 7C B1 22 A1 A9 BF 94 56 54>)
(   3,<2021-10-26 10:07:39.65 +0400>,<she>,<DPX200>,
      <pk PHC0 = 3.310524 PHC1 = -3 
       data hash MD5: 16K
       1D 21 C6 71 F6 9C A4 6E DE 97 D9 D0 A3 3D 4A 4B>)
(   4,<2021-10-26 10:07:43.00 +0400>,<she>,<DPX200>,
      <abs ABSG = 5 
       data hash MD5: 16K
       A9 3E FC 4B 6E C5 8B AD 2F 27 07 37 F0 F1 81 C9>)
$$ ##END=
$$ 
$$ hash MD5
$$ 16 38 84 A9 90 CD 33 DC BF 40 CA AD 5D E9 71 24
##$RELAX= 
##$RELAX= 
##$RELAX= 
##$RELAX= 
##$RELAX= 
##$RELAX= 
$$ Bruker specific parameters
$$ --------------------------
##$DU= <F:/spectra>
##$EXPNO= 1
##$NAME= <H-F>
##$PROCNO= 1
##$TYPE= <nmr>
##$USER= <she>
##$AMP= (0..31)
100 100 100 100 100 100 100 100 100 100 100 100 100 100 100 100 100 100 
100 100 100 100 100 100 100 100 100 100 100 100 100 100 
##$AQSEQ= 0
##$AQ_mod= 1
##$AUNM= <au_zg>
##$AUTOPOS= <>
##$BF1= 200.13
##$BF2= 200.13
##$BF3= 200.13
##$BF4= 200.13
##$BF5= 200.13
##$BF6= 200.13
##$BF7= 200.13
##$BF8= 200.13
##$BYTORDA= 1
##$CFDGTYP= 0
##$CFRGTYP= 5
##$CHEMSTR= <none>
##$CNST= (0..31)
1 1 145 1 1 1 1 1 1 1 1 1 1 1 1 1 1 1 1 1 1 1 1 1 1 1 1 1 1 1 1 1 
##$CPDPRG= <>
##$CPDPRG1= <>
##$CPDPRG2= <>
##$CPDPRG3= <>
##$CPDPRG4= <mlev>
##$CPDPRG5= <mlev>
##$CPDPRG6= <mlev>
##$CPDPRG7= <mlev>
##$CPDPRG8= <mlev>
##$CPDPRGB= <>
##$CPDPRGT= <>
##$D= (0..31)
0 1.2 0 0 0 0 0 0 0 0.06 0 0.03 0 0 0 0 0.0002 0 0 0 0 0 0 0 0 0 0 0 0 
0 0 0 
##$DATE= 1635228439
##$DBL= (0..7)
120 120 120 120 120 120 120 120 
##$DBP= (0..7)
150 150 150 150 150 150 150 150 
##$DBP07= 0
##$DBPNAM0= <>
##$DBPNAM1= <>
##$DBPNAM2= <>
##$DBPNAM3= <>
##$DBPNAM4= <>
$$ [...]
##$SUBNAM2= <"">
##$SUBNAM3= <"">
##$SUBNAM4= <"">
##$SUBNAM5= <"">
##$SUBNAM6= <"">
##$SUBNAM7= <"">
##$SUBNAM8= <"">
##$SUBNAM9= <"">
##$SW= 18.0517286264689
##$SWIBOX= (0..15)
0 0 2 0 0 0 0 0 0 0 0 0 0 0 0 0 
##$SW_h= 3612.71676300578
##$TD= 16384
##$TD0= 1
##$TE= 0
##$TE2= 300
##$TE3= 300
##$TEG= 300
##$TL= (0..7)
0 120 120 120 120 120 120 120 
##$TP= (0..7)
150 150 150 150 150 150 150 150 
##$TP07= 0
##$TPNAME0= <>
##$TPNAME1= <>
##$TPNAME2= <>
##$TPNAME3= <>
##$TPNAME4= <>
##$TPNAME5= <>
##$TPNAME6= <>
##$TPNAME7= <>
##$TPOAL= (0..7)
0.5 0.5 0.5 0.5 0.5 0.5 0.5 0.5 
##$TPOFFS= (0..7)
0 0 0 0 0 0 0 0 
##$TUNHIN= 0
##$TUNHOUT= 0
##$TUNXOUT= 0
##$USERA1= <user>
##$USERA2= <user>
##$USERA3= <user>
##$USERA4= <user>
##$USERA5= <user>
##$V9= 5
##$VALIST= <valist>
##$VCLIST= <CCCCCCCCCCCCCCC>
##$VD= 0
##$VDLIST= <DDDDDDDDDDDDDDD>
##$VPLIST= <PPPPPPPPPPPPPPP>
##$VTLIST= <TTTTTTTTTTTTTTT>
##$WBST= 1024
##$WBSW= 4
##$XGAIN= (0..3)
0 0 0 0 
##$XL= 0
##$YL= 0
##$YMAX_a= 5493
##$YMIN_a= -8323
##$ZGOPTNS= <>
##$ZL1= 120
##$ZL2= 120
##$ZL3= 120
##$ZL4= 120
##$ABSF1= 15.75901
##$ABSF2= -2.292839
##$ABSG= 5
##$ABSL= 3
##$ALPHA= 0
##$AQORDER= 0
##$ASSFAC= 0
##$ASSFACI= 0
##$ASSFACX= 0
##$ASSWID= 0
##$AUNMP= <proc_1d>
##$AZFE= 0.1
##$AZFW= 0.1
##$BCFW= 0
##$BC_mod= 2
##$BYTORDP= 0
##$COROFFS= 0
##$CY= -3
##$DATMOD= 1
##$DC= 0
##$DFILT= <>
##$DTYPP= 0
##$F1P= 0
##$F2P= 0
##$FCOR= 1
##$FTSIZE= 16384
##$FT_mod= 6
##$GAMMA= 0
##$GB= 0
##$INTBC= 1
##$INTSCL= 0
##$ISEN= 128
##$LB= 0.24
##$LEV0= 0
##$LPBIN= 0
##$MAXI= 10000
##$MC2= 0
##$MEAN= 0
##$ME_mod= 0
##$MI= 1.114404
##$NCOEF= 0
##$NC_proc= -12
##$NLEV= 6
##$NOISF1= 3.799351
##$NOISF2= 2.8
##$NSP= 0
##$NTH_PI= 0
##$NZP= 0
##$OFFSET= 15.72375
##$PC= 1
##$PHC0= -15233.94
##$PHC1= 15.00083
##$PH_mod= 1
##$PKNL= yes
##$PPARMOD= 0
##$PSCAL= 0
##$PSIGN= 0
##$REVERSE= no
##$SF= 200.13000641561
##$SI= 16384
##$SIGF1= 3
##$SIGF2= 2
##$SINO= 5.538805
##$SIOLD= 16384
##$SREGLST= <1H.CDCl3>
##$SSB= 0
##$STSI= 16384
##$STSR= 0
##$SW_p= 3612.71676300578
##$SYMM= 0
##$S_DEV= 0
##$TDeff= 16384
##$TDoff= 0
##$TI= <>
##$TILT= no
##$TM1= 0
##$TM2= 0
##$TOPLEV= 0
##$USERP1= <user>
##$USERP2= <user>
##$USERP3= <user>
##$USERP4= <user>
##$USERP5= <user>
##$WDW= 1
##$XDIM= 16384
##$YMAX_p= 512921084
##$YMIN_p= -23147612
$$ End of Bruker specific parameters
$$ ---------------------------------
##NTUPLES= NMR SPECTRUM
##VAR_NAME=  FREQUENCY,     SPECTRUM/REAL,   SPECTRUM/IMAG
##SYMBOL=    X,             R,               I
##VAR_TYPE=  INDEPENDENT,   DEPENDENT,       DEPENDENT
##VAR_FORM=  AFFN,          ASDF,            ASDF
##VAR_DIM=   16384,         16384,           16384
##UNITS=     HZ,            ARBITRARY UNITS, ARBITRARY UNITS
##FACTOR=    0.220516191357247, 1,           1
##FIRST=     3146.79421128051, 0,            0
##LAST=      -465.922551725271, 0,           0
##MIN=       -465.922551725271, -23147612,   0
##MAX=       3146.79421128051, 512921084,    0
$$ Real data points
##PAGE= N=1
##DATA TABLE= (X++(R..R)), XYDATA
$$ [...]
9956 385284 386646 520125 512658 340355 222470 426788 344539 550894 859176 580151 602868
9945 602868 94373 -144505 277581 243127 133364 -293284 -118175 -91266 -300379 122686
9935 122686 350444 63128 138866 337876 30769 -188409 -197662 17661 -59729 124399
9925 124399 455468 469902 387135 238222 350075 437399 166840 -25727 74066 10165 84366
9914 84366 192357 67856 -295765 -547127 -195205 19711 -186051 18510 -99935 42234
9904 42234 322198 218501 176029 309602 513050 327181 178664 -206089 265112 655174
9894 655174 48952 -87344 316420 392024 -124542 -288364 -79104 349847 140096 -117087
9884 -117087 -391720 -130657 181553 140573 423572 598119 531098 614248 233220 -63285
9874 -63285 -362206 -499257 -535548 -289403 -29020 47974 -27041 538194 525444 407197 215883
9863 215883 118250 96549 377419 159329 12511 283278 206879 276519 317939 -58276 -243478
9852 -243478 -25673 -103346 -237691 137029 466217 594175 684703 242642 -38574 81221
9842 81221 332210 126959 329861 104618 -123443 -270396 -305522 140078 270359 370229
9832 370229 14204 -94119 445521 671290 858145 836492 198318 146786 117656 413987
9822 413987 357510 -82933 -16428 183609 -99989 -145142 -307823 -299865 396803 -197954 -10880
9811 -10880 30661 -12103 250647 -37746 -227437 118909 290592 30687 -29258 17365 -155696
9800 -155696 -182673 -128259 264082 267175 344970 78953 -222199 -308550 -189401 214660 -27446
9789 -27446 -398911 -395890 -68155 197988 -181411 118588 403788 321538 375205 386162 156838
9778 156838 407479 543645 368778 236808 285578 566547 120515 18893 457396 472440
9768 472440 43804 150146 358048 391670 372862 15899 -306831 -87601 -161791 -225982
9758 -225982 284027 -96288 455902 210633 21303 37507 -301788 -301567 -198776 -93929
9748 -93929 231585 -22502 -232782 -129864 -90696 -14462 -477408 -250914 334363 328144 658391
9737 658391 257538 227925 817171 456628 252552 237052 342644 68422 61168 59368 98628
9726 98628 109559 78469 -33834 238885 179924 -62841 -329878 -331895 -78690 189514 146455
9715 146455 -14920 -449477 -306998 324374 192621 5248 163178 -130392 205556 78407
9705 78407 180574 70546 518770 788178 316453 186591 61909 161679 109176 -311969
9695 -311969 -450692 -324002 -115651 -4528 -103585 -142404 -74353 -82810 -339662 -115773 -338407
9684 -338407 -421052 -346712 -162487 332826 481116 -144491 143323 236339 184769 92855 -85727
9673 -85727 383394 397471 146309 290314 152875 -65304 -335969 -552602 -305890 392417
9663 392417 -279766 -364307 -131204 -64157 488488 133977 -337725 -307852 -390883 -378558 -196153
9652 -196153 -414200 349204 459519 513061 289820 -400486 -139519 188846 -245267 23209
9642 23209 421812 -58772 -196902 -105955 -373929 -36086 -204648 45218 154980 161953
9632 161953 229843 2182 -143088 268602 914812 510210 586508 650894 130891 64379
9622 64379 91402 -115273 -48235 968393 612525 398931 288020 -52089 655255 422765
9612 422765 171103 358166 740055 923725 427566 756112 476349 -22243 -43296 68056
9602 68056 -90261 92704 45745 343223 342406 220693 502837 454051 838229 1226597 814242
9591 814242 593001 746413 64266 29296 351817 566147 40674 203752 -163183 -248748
9581 -248748 -173988 13195 43758 78539 29275 179442 219554 553419 363766 447494 139339
9570 139339 -201073 239437 378247 88898 106951 405578 295891 282713 157394 132251
9560 132251 415367 252665 89055 445501 301048 54613 177740 139888 99906 -86330
9550 -86330 118965 64350 -120034 238437 -81357 -267926 264451 734615 80550 -114485
9540 -114485 322998 449579 240912 37940 256957 299660 -40202 481038 499560 531151
9530 531151 470849 4395 44707 122240 160585 496400 236211 94119 397098 42993
9520 42993 -140674 22447 203495 409881 613156 119295 264301 218543 396510 445113
9510 445113 454192 643164 236903 224468 15382 175337 117880 -113073 -82055 154404 -24106
9499 -24106 226453 376909 7957 324086 3482 -13163 90638 129345 87883 24977 169081
9488 169081 375193 407210 443860 740478 430865 442151 676406 712782 539728 801965
9478 801965 653760 644314 748060 674997 425761 68958 5920 215291 559191 486205 520359
9467 520359 862303 887520 484629 766324 977173 788164 356970 388343 637858 587426
9457 587426 630623 865060 959538 1006640 1146018 1160570 1047439 866664 819082 1319864 1189500
9446 1189500 652353 168797 188084 529129 648333 786544 629701 1071578 1144634 712323
9436 712323 862533 982573 797652 549699 601017 493288 357286 467891 863459 974168
9426 974168 840094 1007924 929179 1129160 1240353 978836 998500 1078340 1359243 1136735
9416 1136735 1214416 1181455 1026647 932622 824446 784016 869665 1208835 990178 1157908
9406 1157908 1194510 645776 572904 798953 330264 347342 427347 572935 477394 705044
9396 705044 800453 1000970 576929 1100952 624310 635212 804248 1018507 1043908 922506
9386 922506 897022 890222 628169 450889 855424 470421 716878 684688 1013303 1040730 1242516
9375 1242516 1183210 1131826 1344017 1228248 1749140 1699616 1447120 1527237 1476747 1383061 1214782
9364 1214782 725750 742164 1484729 1462500 1428517 1385318 1585502 1489746 1414047 1867470 2210038
9353 2210038 2343833 2430312 2395053 2006729 2061001 2263613 2669643 2800349 2455763 2823305
9343 2823305 2866131 2982419 3092815 3270771 3262285 3528888 4075209 4101357 4158098 4322498
9333 4322498 4482604 4554067 4475636 4414086 4300592 4141121 4016542 4495281 4791090 4814560
9323 4814560 4808445 5386876 5373414 5266737 5127817 5052519 5544230 5357879 5102490 5119868
9313 5119868 5467438 5190306 5149055 5206312 5110193 5315080 5216338 5306673 4960378 5281652
9303 5281652 5430974 5719482 6001227 6176845 6456487 6484022 6348622 6466442 6361803 6314804
9293 6314804 6150849 5806267 6008241 5930254 5761371 6109417 6178971 6376315 6335146 6263476
9283 6263476 6231503 6425975 6535752 6056911 5725008 5432391 5390428 5194656 4993508 4852456
9273 4852456 4694731 4785649 4078347 4150146 4127528 4135860 4517204 4019474 3919107 4154896
9263 4154896 4109275 4358602 4478951 4479526 4603117 4595959 4192224 4674191 4668163 4655163 4624412
9252 4624412 4639107 5036298 4780483 4607020 4426866 4509164 4287377 4062132 4055576 4355120
9242 4355120 4718777 4744196 4289467 4482424 4311705 4735641 4685879 4935923 4947343 5008151
9232 5008151 5019087 5084959 4837524 4648861 4462094 4816819 4458564 4256846 4435914 4102410
9222 4102410 3608927 4269451 4116844 3981099 3934656 3850206 3596207 3482420 3835853 3803624
9212 3803624 4020389 3734292 3835468 4367868 4334238 4550306 5006778 4873830 5281625 5435155
9202 5435155 5376263 5794378 5829416 5470042 5636327 6220313 6412868 5994311 5975483 6369383
9192 6369383 6479557 6214951 6173992 6183404 5900743 6256825 6122402 5590968 5990189 5483613
9182 5483613 5273124 5086210 5199221 5267782 5083700 5510633 5162929 5360264 5704544 5528393
9172 5528393 5462074 5454320 5717796 5939845 5700478 5669525 6195528 6282684 6401868 6348616 6856638
9161 6856638 6848414 6715272 6748452 7147879 7274158 7234991 7137441 7291016 7479455 7537558 7597201
9150 7597201 7381537 7301238 7097880 7296392 7557595 7981469 8199814 8360435 8584520 8523723
9140 8523723 8445208 8689985 8690416 9063847 9334946 9504153 10096868 10340484 10067522 10386413
9130 10386413 11170310 11475488 11787061 11860956 12101201 12294057 12730898 13160266 14136558 15051705
9120 15051705 15557678 16257863 17085611 17456007 17923693 18552925 19444386 20417809 21297453
9111 21297453 21945889 22890761 23474766 24441480 24862795 25537469 26781309 28083241 29262927
9102 29262927 30358702 31900138 33459130 35615193 37475080 40549227 43755841 46868495
9094 46868495 51120067 55677075 60749000 66186541 71022339 75577576 81583373 88331855
9086 88331855 94851105 98977273 100078457 100462376 101208595 104390810 108440676 109050503 105346297
9077 105346297 98130229 89070434 80924305 75374549 72127430 69841127 68462938 67526957
9069 67526957 65932535 63295813 61388949 59916221 58873113 59081209 60329044 61619369
9061 61619369 63922713 66919984 70672486 75486236 80940340 86822912 93817856 100366857
9053 100366857 105569161 110806564 116502765 120529919 123750116 126754492 132684533 138220527
9045 138220527 138967215 135997977 131338369 126103239 120355561 111237651 97403167 83573530
9037 83573530 72105513 64247774 58641096 54419597 50972044 48548233 46043210 44108881
9029 44108881 42176439 39530530 36727935 34476337 32632769 31488397 30887408 29874909
9021 29874909 28619909 28073805 27216853 26600580 25645375 24746392 24211013 23489868 23167804
9012 23167804 22898467 22357364 22168468 21633720 21204349 20928011 20434938 19060357 18235435
9003 18235435 17756997 17460359 16917865 16406140 15991741 15343306 15004983 15215724 14489893
8994 14489893 14008000 14369788 14242298 13740838 13350858 14004251 13866704 13886078 13889090 13870301
8984 13870301 13774515 13526562 13164623 13203096 13053760 13330356 13554620 13917813 13517815 13462500
8974 13462500 13734185 13483755 13017531 13177381 13096853 13515280 13129152 12719114 13101316 12460123
8964 12460123 12418068 12738382 13064684 12784930 12723889 13048869 12903777 12672683 13396953 13162640
8954 13162640 12738367 13507980 13810069 14024935 14083906 13856350 13894429 14402909 14546733 14478003
8944 14478003 14489641 14308207 14656706 14959443 15342589 15286016 15787619 16480303 16938060 17056988
8934 17056988 17026165 17404472 17563007 18122896 17935472 17832588 17785840 17979308 17801186 17871072
8924 17871072 18776454 18677907 18937544 19184988 19305946 20152111 20802253 21082169 21621590 22107060
8914 22107060 22498330 22492171 22260226 21880225 21276845 21084796 21418460 21151544 21594393 21554383
8904 21554383 21631202 21859027 22105875 22839106 23579631 23648455 23626366 24253394 24316578 24780087
8894 24780087 24794521 25869078 26152257 26878714 27609725 28600852 29972520 30609704 31596558
8885 31596558 33127676 34541305 36615754 38926480 41177729 43391292 46535162 49529457
8877 49529457 52887297 56315824 60025061 63444383 67064046 71447824 75957653 79466735
8869 79466735 80338710 81572776 82119545 81042048 76598314 71156438 66960422 64349073
8861 64349073 62788126 62367268 62248296 62366313 61700962 60674485 59285298 58770622 59392215
8852 59392215 60171233 61522960 63535510 66010248 70185540 74033649 77728682 82544577
8844 82544577 86870924 91874428 96872684 102815209 110238507 117684244 124670660 131719470
8836 131719470 137589205 141003486 142027429 139610342 133847898 125315402 115649065 108214438
8828 108214438 102966320 99791860 96037975 89995453 83113995 76593061 71989473 67847542
8820 67847542 64670078 61996281 59907596 58475824 58025212 57383199 57697162 58063107 58660451
8811 58660451 60289356 62168690 64257939 66976617 69409585 72077624 75856678 78093364
8803 78093364 79577206 80653769 82507163 85608593 87248990 88627361 88515174 84730563
8795 84730563 79247026 71524431 63825540 57061789 52194761 48559484 45924643 43804869
8787 43804869 42238827 40897011 38572609 36602193 34187615 32451586 30638053 28641888
8779 28641888 27263522 26470385 25454570 24867896 24434784 23706442 22703192 22080355 21670367
8770 21670367 20967796 20738766 20534213 20247568 19628764 19060373 18546746 18594322 18750042 18226188
8760 18226188 17860826 17504968 17325121 17525876 17468216 17829998 18324025 17835719 17993631 18037118
8750 18037118 18248868 18801251 19147013 18800587 19126479 19156956 19603593 20482139 20823734 21662352
8740 21662352 21852397 21957395 22065790 22676215 22859519 23633703 24528209 25356661 25951840
8731 25951840 27079746 28207053 29886019 31141435 32884995 35293516 37745217 40950232
8723 40950232 45004310 49425806 53894956 59381973 66229791 73291810 81526983 90593005
8715 90593005 101436518 111105637 119965273 127232104 139324776 144302462 133473456 115349375
8707 115349375 98245912 85804627 77099790 71856946 66984200 61431514 56271530 52475909
8699 52475909 49016692 46360466 44194583 43173125 41741931 41252114 41291203 41459479 41331711
8690 41331711 41766700 42964491 44842153 46376240 48571466 51132770 53026595 53896745
8682 53896745 55710999 58890534 61406969 64572826 68780801 71687295 71745429 69823831
8674 69823831 66708500 61120918 55231754 49792800 45551461 43505018 41668427 40411785
8666 40411785 39344950 37656864 35768310 33328489 31017847 29497322 28136065 26952284
8658 26952284 26375885 25592455 24757512 24629543 24712266 25453207 25593196 26751622 27987763
8649 27987763 28613719 29522969 29730926 29638904 29474061 29438321 30343323 30514866 29212600 26922901
8639 26922901 25310079 24752347 23729059 22415289 20430055 19004062 17584530 16548558
8631 16548558 15719171 14935011 13943297 13129992 12446786 11738012 11183538 10436006 10047385
8622 10047385 9856759 9254573 9313924 8395704 8414209 7625090 7407512 7344833 7191830 6832996
8612 6832996 6948725 6751665 6531656 6098584 6006442 6119025 6147134 6118482 6438378 5398464
8602 5398464 5409250 4949998 5370759 4601624 4991487 4573539 4760583 4530197 4990458 4880093
8592 4880093 5316275 4157112 4964754 3770350 4540908 3373427 6949489 11274147 2496533
8583 2496533 2889153 2446089 3476154 2797104 3108504 2769068 2860917 2788044 2713514 2697871
8573 2697871 2445777 1918881 1802073 1560941 2145109 1955912 2552881 2657702 2435218 2468743
8563 2468743 2354982 2572280 2269533 2576519 2785919 2349909 2129392 1832907 1999316 1721792
8553 1721792 1678082 1357887 1548618 2066660 2194315 1637081 1466710 1620372 1786653 1431750
8543 1431750 1160815 1475702 1459195 1583246 1546179 1373835 1361719 1381277 896026 1279770
8533 1279770 1410562 1226421 1000587 1490273 1871170 1515603 956909 640923 946075 833387
8523 833387 930741 1217923 1203392 650628 460134 852506 490391 364987 752180 183625
8513 183625 307144 176990 587913 953911 800983 1006162 1170469 1298390 1057013 1153948
8503 1153948 771885 996762 614748 1016162 1051531 793825 828233 976628 64268 388663
8493 388663 839181 1000137 1219160 814369 498909 102420 938261 1160716 897949 680626
8483 680626 906815 1148703 968696 620140 450346 916344 670832 834684 700778 424937
8473 424937 721530 776937 260734 691182 781874 1001145 1117859 848657 996430 1169921
8463 1169921 934813 865506 101125 74163 -25947 167130 210881 536288 497766 701913
8453 701913 482297 461532 872113 947335 781452 546342 816207 664563 867827 1064669
8443 1064669 1069730 1275124 1123233 301345 675876 1031348 881922 155657 -336403 473464
8433 473464 881253 550144 421926 605978 764717 405427 108994 230784 -32175 361079
8423 361079 233128 33681 121052 264713 -31014 -108567 986374 892379 52855 705496
8413 705496 321945 185263 882161 719147 531791 277380 206578 128348 298014 147713
8403 147713 529567 665416 471164 709607 278234 15416 616514 620743 604600 540445
8393 540445 532541 774650 901874 875248 458833 642658 931893 975843 759535 426581
8383 426581 605780 -205759 282022 -272501 -354041 -135238 -116779 619045 684437 573415
8373 573415 478434 117296 417596 627257 367823 28290 247108 633133 1148835 1109215
8363 1109215 704767 430207 276078 421041 23433 279119 369463 865247 710752 1096041
8353 1096041 1880030 1437973 854053 303206 329298 653826 861575 496425 295312 -76886
8343 -76886 200421 657517 903278 1023410 700230 746026 1500149 1440219 658981 461820
8333 461820 569137 89474 -18175 253162 31306 -505866 -303194 24790 569330 362864
8323 362864 -87095 808857 926330 768885 36287 -201785 162774 43991 597815 69267
8313 69267 310518 979462 944664 935504 973116 868342 640820 112473 712171 814163 324153
8302 324153 395023 551196 455966 280360 -76620 43707 556881 903971 824721 465299
8292 465299 548542 799864 535095 375589 581219 438473 427188 -37107 -199330 376805
8282 376805 292125 -438760 444973 201290 -412099 -317185 578594 471632 373729 444095
8272 444095 997018 651149 231260 541770 1012473 744298 1226888 1074231 620812 111863
8262 111863 -10567 499315 613383 1442551 1539861 1165133 1578965 946864 789356 1283694
8252 1283694 833686 468630 1514892 1352231 379706 751663 470050 710302 606925
8243 606925 636273 1043815 311190 620013 415856 15028 519544 795836 1052198 972427
8233 972427 1102813 738111 812754 973974 517777 706813 15299 -162984 793461 976892
8223 976892 -77937 -1087828 -982703 -395042 204415 1309183 739475 1057526 1982104
8214 1982104 1703832 2089730 1695621 809476 1326113 1544889 1437891 2258903 2592733 1976019
8204 1976019 2102210 2502088 3336532 4067951 3881996 5235671 5044037 5100941 4926592 6791566
8194 6791566 3620408 2021184 -20657820 -23147612 -6269071 -6684372 -6014162 -6137851
8186 -6137851 -4808608 -5192256 -4079236 -5236167 -3774979 -2860181 -292240 -54838 321008
8177 321008 465247 11346 -657216 -609588 -317419 -1315431 -1234368 -1349593 -1675070 -958620
8167 -958620 -595090 -172346 -1049331 -1130923 -229802 400409 173338 -565099 22557 775176
8157 775176 -355010 444225 444297 -112380 -709496 -974106 -397612 -780307 -1104980 -1810251
8147 -1810251 -1033032 -1560000 -454798 438927 -345172 -1226313 -712314 -413998 -383586 -1133369
8137 -1133369 -1299498 -1215430 -796813 -276170 -32546 -585422 -249732 -293185 -1166632 -1016965
8127 -1016965 -1311272 -490457 -778944 -881574 -247486 -877402 -731419 -553812 -767493 -1096378
8117 -1096378 -748647 -629940 -1391825 -1348282 -529934 212200 -46377 -1048391 -1375150 -1860092
8107 -1860092 -1929032 -1645541 -1090918 -617816 -743761 -338315 294723 -485528 -220698 -504600
8097 -504600 -440178 -385153 -500846 -80752 -361272 -529785 -492510 -449504 -876956 -600103
8087 -600103 -567283 -652362 -1452578 -993600 -734755 -86461 -136153 111776 656920 -34409
8077 -34409 -328103 -394502 -523276 -392598 73266 -307546 561732 528538 -742821 -914591
8067 -914591 -689854 -601447 -858000 -474501 -58586 999 -347889 -812281 -588577 -385870
8057 -385870 -142065 -6694 -204398 -319876 -426855 -617689 -644383 -534214 -804027 -475477
8047 -475477 -485122 -310873 -609450 -493154 -190835 -152869 -417804 -167810 -292569 -857432
8037 -857432 -49472 -393616 -815778 -42032 -54837 -256895 -118502 -176002 194377 4932
8027 4932 272842 458874 -54363 -370039 -79684 -123582 -363594 -779702 -613637 -472655
8017 -472655 -829698 -740029 -361964 -397374 -362358 -422298 -336544 -255997 -461193 -169418 4865
8006 4865 131072 -577089 -639749 -907757 -426037 -905580 -833686 -640699 -413443 46698
7996 46698 -564886 -782938 -827323 -708332 -1059068 -772181 -750051 -335980 -472856 -546603
7986 -546603 -269082 -323955 -62563 -205943 -96270 -135762 31941 -211231 -970547 -709996
7976 -709996 -913606 -583710 -344598 122737 312384 -112719 -210135 -453616 -373703 -5619
7966 -5619 -226942 -564142 -760208 -688401 -324731 -380500 -768374 -182754 15632 308046
7956 308046 -37634 -52270 82782 -76664 -190913 -259355 -593667 -1175516 -552855 -256583
7946 -256583 -353764 -426157 -18276 -249138 -796352 -420141 -340112 -218768 87676 155250
7936 155250 298319 200011 420118 -120319 -348952 -126717 -324106 -412313 -599817 -881506
7926 -881506 -898067 -703690 -553549 -665323 -575342 -587972 -568071 -489839 -300658 -62333 -392581
7915 -392581 -962182 -906581 -951460 -852303 -1027810 -221239 -262488 -209332 -80645 -118173 -181830
7904 -181830 1408 -103547 -304917 -351279 -89310 -630946 -621657 -20702 -200270 -461184
7894 -461184 -712697 -568065 -238526 -496172 -442767 -328614 -385542 364067 20370 -304350
7884 -304350 19951 422045 91041 -319370 -793997 -917467 -393307 -413342 -411394 -182463
7874 -182463 -122754 -144909 -303034 -366804 -463368 -199188 -505644 -769156 -869529 -475915
7864 -475915 -563389 -525000 -253516 -86417 -402205 9553 -162039 131280 -318036 -235130
7854 -235130 -2605 -272389 -489715 -472394 -365971 -524051 -941052 -726552 -782263 -849967
7844 -849967 -1039849 -626737 -152981 -344999 -140082 -203186 -92732 -214845 -690463 -687477
7834 -687477 -852643 -862771 -648174 -405713 -762710 -568589 -472785 -886130 -1102213 -543721
7824 -543721 -401676 -144808 -485565 -466981 67473 361412 -103551 -311375 -574665 -478591
7814 -478591 -267198 97426 13986 -149859 -191545 -373176 17242 -84077 -534003 -1172953
7804 -1172953 -897908 -1039043 -1185020 -2133637 -3887010 -3672750 7630453 3430586 -1363240
7795 -1363240 -51523 -343135 -411119 -1336716 -601458 -837867 -367062 -470064 -153139 -405831
7785 -405831 -337684 -417493 -274113 -112217 -130584 -127036 58824 -159349 -290114 -307836 102924
7774 102924 -69890 -590204 -68883 253358 -258208 -784754 -793999 -436573 -448315 -309139
7764 -309139 -169069 -154213 -120287 -205156 -726900 -466591 -397284 -36707 -159568 -450453
7754 -450453 -343223 410092 198633 -290668 -374772 -3927 -355515 -424739 -208456 116555
7744 116555 -380784 -294847 10618 -109387 185103 -217131 -288670 -464874 -830592 -910734
7734 -910734 -776266 -489429 -506595 -565597 -729804 -335584 -444446 -692205 -988293 -572274
7724 -572274 -271535 234347 -93116 -474801 -529345 -383 -30633 -187440 345293 337806
7714 337806 433406 -73867 -496246 -145581 -460633 -687529 -853708 -803413 -528346 -520475
7704 -520475 -450640 -615044 -963397 -766499 -313935 -1637 -44824 -38815 196984 143213 -558401
7693 -558401 -631553 -642401 -548477 -210522 -277381 58350 1061 -304894 -23590 -162193 -582262
7682 -582262 -611568 -581138 -230687 -442036 -333558 -68761 -254159 -655579 -198014 162334
7672 162334 -133035 149023 675518 608970 619740 179246 -441757 -595848 -455712 -390406
7662 -390406 86596 -14558 3960 -346219 23960 40903 220084 31708 -410025 -344036
7652 -344036 -446329 -700032 -806657 -206131 -181993 -276449 -372494 -612859 -636488 -741269
7642 -741269 -647599 -732407 -457185 -239444 -155138 -680519 -434803 -250064 -247542 -176065 -51943
7631 -51943 -240064 -127735 134233 -20025 -141778 -324145 -362301 -703848 -1029706 -674456
7621 -674456 490 -224044 -209226 -647601 -666132 -531996 -216697 -205880 -22086 -439
7611 -439 58764 -34609 -3822 92586 129826 146323 -410232 -700247 -614537 -319773 -220290 -388394
7599 -388394 -545964 -224451 -313922 -89691 135621 -7316 -334220 83603 -55675 -314461
7589 -314461 -281995 -466868 -220124 -123363 -365999 -330524 -67069 199929 -119214 -476814
7579 -476814 -536398 -260475 519210 -48375 -119506 -227803 -221986 -162474 -382990 -577575 -789208
7568 -789208 -930584 -496665 -213749 24244 271793 498593 317489 -109007 -335623 -178242
7558 -178242 359846 67398 -227219 -482070 -420833 -513591 -382325 -141094 -442668 -292019
7548 -292019 -153753 16391 -145908 -355407 -135880 -8828 -115388 -144411 16852 359001
7538 359001 575525 263061 280922 240068 237603 191853 -25557 122667 -325138 -362556 71711
7527 71711 56521 -392580 -222687 15281 81192 -1586 -632202 -817994 -206590 -68216
7517 -68216 146397 284258 -67184 216880 294678 -124627 -414340 -231071 -300365 -347069
7507 -347069 -33131 -136049 336283 357505 319970 251061 292741 239227 426355 393641 279284
7496 279284 541487 930342 543168 285322 521332 647815 715704 220361 -57921 -65687
7486 -65687 -265888 -119233 336715 427351 859730 442086 229930 228513 78371 173315 19232
7475 19232 -120467 91752 -227309 -207102 -60258 -17503 33111 159237 179040 256283 -228503
7464 -228503 -152909 344707 426497 438940 458522 155351 518546 462245 -153396 22879 -173233
7453 -173233 -471410 -337590 -156812 98570 -57798 -145544 -29863 -211621 -194302 -38600
7443 -38600 -531766 -259192 -192606 -669832 -728085 -663350 -458036 -195869 -28819 -466 -24403
7432 -24403 165193 260376 34544 -70241 -293909 303413 618988 -90168 -304159 35110
7422 35110 -54011 -61037 144141 -28420 154682 -32855 -183658 -69889 3523 -12335 -6359
7411 -6359 189116 141062 -313090 -462292 -118662 -209383 -189932 -262410 -37595 49742 120513
7400 120513 -60045 -61951 305269 -328068 154276 663845 701565 459000 517812 373606
7390 373606 206682 -72610 -192392 -43079 -337520 -391271 245780 281362 110985 144186
7380 144186 -20520 743712 364144 490569 448411 -10515 -518209 -455351 -139542 10254
7370 10254 -86553 -67695 -297654 -356937 -450533 -35805 -277418 -364770 133621 518569 599287
7359 599287 327832 -83286 225499 13035 -137740 277071 351340 94502 17476 60373
7349 60373 60363 300745 330211 100570 106480 391907 368568 -89464 238184 461760 396233
7338 396233 409588 116368 606224 480022 580448 543966 820852 353533 161567 315851
7328 315851 356392 546854 259283 334900 442366 401004 942792 998569 508940 338695
7318 338695 239291 182448 330665 473495 168963 317221 827714 384406 438088 443659 -261437
7307 -261437 -131786 303912 491565 216485 202828 134731 260257 606918 775207 786882
7297 786882 1032358 775466 367646 527292 252889 95474 15855 155821 506557 560015
7287 560015 205368 398196 538021 780984 360157 655980 490508 430457 478672 490863
7277 490863 835639 1014185 547953 713198 883315 516658 344265 678915 635207 -13897
7267 -13897 519671 333295 733214 697567 518144 506349 508807 573779 674420 898214 718344
7256 718344 650206 558457 1003589 865062 502260 375024 260279 1228444 822808 636156
7246 636156 796057 1015496 776207 325819 826322 663392 497631 477021 1131550 1460190
7236 1460190 727355 655121 890768 726404 487911 736984 822602 778048 378405 645759
7226 645759 750378 513943 649489 838148 868669 1319212 1450755 1187958 996450 1096944
7216 1096944 1430147 1413469 1179535 1099973 1641974 1526987 1227092 1136293 1337786 1266133
7206 1266133 1233682 1684576 2328876 1828634 1679403 1626053 1698540 1449759 1502999 1416050
7196 1416050 1521116 1988211 1985603 1772395 2024757 2441805 2628596 2426314 1997375 1933045
7186 1933045 2457869 2569284 2680806 3179331 3243830 2929394 2665212 3036918 3724723 3937696
7176 3937696 3750456 3797495 3398334 3285401 3760964 3874343 3669795 3542960 3224877 3609994
7166 3609994 3870090 4051893 3982228 3865384 3851098 4311015 4261187 4142789 4221767 4389429
7156 4389429 4583851 4928583 5220315 5124409 5072055 5081827 5078802 5322462 5227373 5096353 4987357
7145 4987357 5279729 5370605 5191948 5657462 6106011 6545500 7064540 7157899 7381567 7311059
7135 7311059 7516990 7901892 8235612 8875770 8597926 8875052 9962885 10393098 10589861
7126 10589861 11285722 12194064 12533383 13161702 13371315 14162987 15604324 16642550 17703197
7117 17703197 18649922 20446627 22049549 24138998 26403734 29096631 31821651 34808221
7109 34808221 38843483 43356348 48286703 54474740 60944801 68616366 77836887 87968345
7101 87968345 99139423 111138945 124036887 136713761 146510621 150121625 145073271 131655512
7093 131655512 113300915 94904310 79517351 68099959 60161429 53417693 48523457
7086 48523457 44151439 40094121 36332738 32233562 29074467 26932283 24895720 22926537
7078 22926537 21341386 20109130 18782041 17673588 16236390 15106668 14783434 13793575
7070 13793575 12878469 12447952 11994847 11377707 10851899 10585564 10192030 9751511 9151038
7061 9151038 8922203 8673096 8003101 8147545 8264560 7970595 7745867 7426898 7362337 6832861
7051 6832861 6452947 6366269 6061438 6418616 6305959 6092999 6095476 6086264 5612220 5875375
7041 5875375 6129429 5850527 5868760 6085570 6100595 6148092 5951786 6394578 6385695 5630890
7031 5630890 5104013 4473198 4282567 4150675 3924997 3645126 3388997 3606138 3589972 3397851
7021 3397851 3143781 3066778 2769703 2504007 2704912 2402309 1901228 1860077 2153102 2188280
7011 2188280 2143255 1891951 1541157 1511215 1513575 1642717 1885958 2094725 2339918 2295427
7001 2295427 2160184 1756599 1964829 1789600 1923781 1524494 1519017 1606338 1475457 1673278
6991 1673278 1426657 1107051 1133954 1462961 1548919 1419290 1012937 943063 784844 779840
6981 779840 800380 1151249 1231474 1001974 1075398 1373185 1160442 662564 557245 396458
6971 396458 761024 785987 538003 774714 666701 565610 346983 789414 953647 628389
6961 628389 752044 914856 919613 842523 425454 129718 794806 417568 155189 165966
6951 165966 401918 621218 377759 351679 350989 183286 331264 518032 710860 732571 807553
6940 807553 772717 842385 611812 509402 584072 871498 1331518 1408450 1347871 1100555 1252162
6929 1252162 694209 596177 626504 1028235 782612 662578 213860 403638 464446 99509
6919 99509 236109 1059091 1293144 973209 910274 646440 287161 216638 588939 619880
6909 619880 630946 606368 447563 419397 876359 464650 550947 465164 84467 130322 155854
6898 155854 -265172 15920 75314 155929 -15414 -145041 -275628 -90163 144604 364755
6888 364755 344880 236288 483568 308190 146437 200868 180298 -66550 -181896 -214763
6878 -214763 -542692 -496286 -157343 -164994 -460194 -605263 -927379 -634562 -385443 -508751
6868 -508751 -335204 -501695 -300960 91460 -332886 -528992 -185381 -146441 -416294 -5496
6858 -5496 33589 131179 167418 -422412 -42483 -16817 -83110 -200317 -9242 -101266 -236164
6847 -236164 233506 335468 23354 2802 -166347 -168976 22675 -314428 -182306 22955
6837 22955 -381512 286880 361139 222686 12583 -253656 -173510 -483009 14263 173343
6827 173343 161276 66703 -436901 -215962 -175517 -362157 -544077 -675356 -298715 74560
6817 74560 101974 -180232 -337983 310172 -348268 -362102 -456521 -505795 -887239 -450346 215234
6806 215234 52131 63645 41667 -113304 -114291 420306 624112 528262 261190 123481 50686
6795 50686 -415947 -399583 -467171 -467634 -279487 13827 256020 287312 227326 -74839 168733
6784 168733 52356 -85832 -127037 -476426 -457866 -33974 41293 -354177 -769467 -249641
6774 -249641 -277514 -460084 -321721 -164375 -395269 311096 669706 41206 44877 -265010
6764 -265010 -177899 -210373 -400297 -562682 -853495 -406146 -510670 -335740 -81426 -137678
6754 -137678 69648 -213340 -539772 -256421 -227319 30897 -216904 -205493 -100163 -276837
6744 -276837 -21411 -75009 -347446 -272784 -200703 -200896 -65369 288594 -182957 349672 303053
6733 303053 -134611 -209063 -251421 192811 476109 -82489 -113041 -291219 -114372 4061
6723 4061 181731 -152764 -186849 60273 316657 92669 115620 390314 -68953 -193478
6713 -193478 -113251 234416 338440 38492 -343247 230760 332983 511973 176807 277765
6703 277765 361621 -59426 87957 131893 -145364 -26137 238180 600908 887642 630717
6693 630717 173131 307005 323767 256897 -156732 -307244 -285802 -247520 -202367 53218 183229
6682 183229 171457 -202469 -184289 499322 718397 -116068 -161488 214469 -31069 -296874
6672 -296874 103988 125530 212279 -76858 -237109 182874 928824 637381 367222 -41133
6662 -41133 79992 144022 -283635 -187299 -85849 83345 -174941 -347631 -19358 -31166
6652 -31166 -161997 84290 -348939 -655707 -716983 -188540 163359 351850 -95469 -41922
6642 -41922 319319 357491 335451 48588 -55312 -260347 -24147 -350259 -977647 -574045
6632 -574045 -184531 -60767 -129525 266312 88982 -484124 -515522 -106219 -93296 -279265
6622 -279265 490106 229362 11388 -125870 -647697 -526875 10916 -121105 90876 -316121
6612 -316121 -732653 -607757 -294207 -395988 -337092 61112 148251 191430 -47835 161530
6602 161530 368552 57677 -327026 127476 119921 91740 -221403 -244233 -17721 -129686
6592 -129686 -271689 -172823 -161210 -545057 -397293 156790 -211165 -323667 -550551 -516156
6582 -516156 -290005 -49151 -277577 -447866 -403814 -31917 -179947 -473306 -401586 -203012
6572 -203012 -70880 322637 -207202 -483512 -168627 -128614 16784 50460 -322635 -406217
6562 -406217 -213135 -165996 -29430 -92217 -296924 55538 -222391 -493349 -114306 -29857
6552 -29857 27693 -190373 279206 -167026 -112505 -66925 154068 -141982 -569754 -1015775
6542 -1015775 -987393 -399427 45509 -2474 -344193 -268873 -351555 -331037 -97943 240833
6532 240833 -160772 -482942 -260216 -513694 -608386 -238287 -558752 -349632 -202336 -109056
6522 -109056 -220987 -278319 -219629 -224993 198266 623901 238410 23824 29437 -38507 -385079
6511 -385079 -178388 117728 -14197 -36512 -77552 -238096 -384533 -192473 148087 -53082
6501 -53082 -162223 -141567 -420910 -454001 -241648 -6787 353538 219186 44074 90477
6491 90477 -26200 75997 -45472 93380 -163653 -494979 -539117 -90822 -456588 -276470
6481 -276470 -25625 -315405 -684446 -1031736 -864371 -421926 -555127 -482427 -365670 -380240
6471 -380240 -221026 -257387 -136501 38046 -164153 -136583 -117399 295177 70957 -292808
6461 -292808 -397503 -33573 306050 -5433 -417771 -448727 -402296 -881627 -502786 -67868
6451 -67868 32740 -84038 -4864 79928 4709 -52407 -7670 243081 416786 392701 358161
6440 358161 186157 6467 -76926 -286745 -226332 90798 -220633 -608050 -283667 -95541
6430 -95541 -97843 -199002 188826 -148143 -365019 -143319 -125719 -486323 -425197 -492765 -661730
6419 -661730 -628604 -867248 -701819 -378499 -243801 151361 -48214 -216749 -170048 -261501
6409 -261501 -199263 408147 519782 -19259 6142 -149689 60779 190357 133226 -110683
6399 -110683 -710242 -474451 -104441 -40161 -138292 -386295 -307882 -122736 -48038 -63189 298820
6388 298820 176152 -12186 86968 133074 -45047 -240470 64530 404986 67590 264632
6378 264632 201643 705992 597947 335467 146497 224971 586349 671546 613999 708211 601188
6367 601188 359178 308979 490433 489916 650529 373194 561334 456904 30257 -102905
6357 -102905 -155832 372795 719601 347494 41186 162156 33761 289840 479724 401448
6347 401448 353542 307054 629683 489535 624564 627744 621211 473201 338392 283476 460079
6336 460079 406137 338561 212725 393009 545582 697193 1013844 737351 485375 718131
6326 718131 102973 344473 712615 528018 776346 588113 728261 775248 427236 262295
6316 262295 671374 653085 695109 274707 938096 1264146 958865 651708 612338 571510
6306 571510 481189 614738 554070 393297 193995 251966 606820 670181 583853 416452 276064
6295 276064 548891 812223 821832 740148 703576 603175 275168 485084 517683 1080161 826541
6284 826541 748958 682565 962411 816410 494670 580464 689749 311208 -292894 -275789
6274 -275789 545773 466261 11495 -7548 12745 254937 757597 663042 286550 181625
6264 181625 340833 365135 440520 1027659 560404 242160 687627 621480 508741 424507
6254 424507 382952 151051 158373 612919 171828 -59222 298275 672440 756617 423953
6244 423953 505912 246903 57549 392128 685713 644928 590110 405743 223493 512066
6234 512066 409788 27487 310551 387778 197493 191551 211214 722665 521023 299109
6224 299109 444905 224966 734534 1011826 328854 987135 833950 1046404 1197414 413615
6214 413615 225905 706124 979960 1027366 1054905 1230603 1262921 1044009 1167012 1148844
6204 1148844 1044450 1036596 939950 1006780 1209287 1533990 1436211 1422169 755238 751856 779272
6193 779272 870484 1055713 1312530 1452914 1147390 624552 749483 1167096 1205931 1326050
6183 1326050 1440086 1573771 1714890 1455414 1684296 1647506 1342279 1237995 1444898 1681813
6173 1681813 961929 1271047 1461374 1410820 1084160 726376 792317 972184 1270931 1271126
6163 1271126 1007710 1016152 982296 1068903 1789742 2004526 1673016 1703149 1615081 1703745 1008601
6152 1008601 1260504 1989746 1639184 1695889 1658116 1673541 1628653 1431438 1451566 1791046
6142 1791046 1596108 1979372 2080263 1984705 2212363 1838622 1543264 1622262 1519090 1185604
6132 1185604 1447659 1735088 1915934 1655390 1442512 1760417 1998543 2016128 2418514 1943344
6122 1943344 2097273 2560691 2159926 2323174 2249335 1745338 1920417 2154061 2169523 2373763
6112 2373763 2750158 2414340 2228871 2576110 2435905 2455371 2651267 2956392 3057757 3523963
6102 3523963 3025960 2773151 3473761 3352397 3333646 3536062 3423869 3901561 4128530 4052281
6092 4052281 4035482 3841598 4050198 3855381 3911741 4255654 3971843 4154927 4622705 4455319
6082 4455319 4880264 5155030 5521233 5292735 5247216 5279166 5300948 5869096 6507823 6500201
6072 6500201 6523807 6835012 6716956 6963434 7014110 6699871 7040480 7425522 7925756 7908828
6062 7908828 8016247 8444946 8204504 8359249 8373257 8524013 8651855 8859033 9158403 9270863
6052 9270863 9326039 9803043 10247148 10254706 10465806 10923190 11046429 11497909 12088592 12432041
6042 12432041 12494431 13202152 13444460 13500743 14020024 14407998 14653427 14913543 15474480 15705792
6032 15705792 16529750 17266113 18332506 19333483 19651507 20337144 20839089 21559371 22623667
6023 22623667 23782260 24748983 25971867 27319297 28452305 30024615 31959429 33891158
6015 33891158 36334628 38474846 40591543 43918224 46761146 50196993 54054931 57999744
6007 57999744 62446423 66904393 69868381 71112090 71917058 71858054 71536791 71635552 72112324
5998 72112324 72530745 72865817 73742034 74989234 76536842 78653849 80892100 83267775 85843563
5989 85843563 88620374 91824653 95526242 99386076 102800887 106507509 110866921 115982078
5981 115982078 121438411 126551588 131713291 135519472 133745247 127510478 119833902 113260506
5973 113260506 108528356 105250619 102753924 100110631 98015675 96336426 94566811 92583526
5965 92583526 89510098 85990374 83093987 80807765 79000067 77550139 76416233 75629453
5957 75629453 74456214 73232683 72167654 71233434 69704091 67483586 65510018 62132950
5949 62132950 57796784 53152850 48973684 45834860 43660126 41635249 39756081 38167328
5941 38167328 37386886 36574392 36249879 35898242 34970588 34010571 33142958 31427821 30378372
5932 30378372 29954471 29426103 28605145 28214799 27662232 27183309 26582277 26296013 25914760
5923 25914760 25525254 25677905 25121604 24927089 24917536 24511199 24448162 24117303 23849402 23979561
5913 23979561 23865182 24023957 23895775 24195725 24367807 24225414 24433692 24993409 24999307 25315034
5903 25315034 25032383 25224994 26008020 26426906 26869824 27250263 27542097 27740194 27687243 28360089
5893 28360089 29039952 29617436 30421737 30991472 32018106 32844624 34094665 35174022 36623322
5884 36623322 37982226 39172331 40634737 42634971 45100104 47466639 50090458 53058470
5876 53058470 56236492 60049229 63962842 67870202 71294307 73680681 75241768 76165885
5868 76165885 76635580 77303907 78335648 79820157 81477130 83281799 85978268 88362838
5860 88362838 91329748 94339817 97766944 101481855 104443075 107183355 109961709 112944711
5852 112944711 116220417 119298929 122316392 125674647 129494616 133210554 135899064 137002351
5844 137002351 134131326 127129541 118963334 112360992 106908400 102529056 99288690 96642627
5836 96642627 94312484 92190248 90219341 88567611 87246357 86060778 85536780 84777567
5828 84777567 84265902 83611099 82846991 82343597 81607913 80892219 80044969 78854151 77481160
5819 77481160 75646195 72754074 68659916 64259614 60292390 57045690 54527626 52388365
5811 52388365 50866837 49848834 47822190 44797374 41742763 38973248 36731290 34985104
5803 34985104 33278760 32706398 31553061 30604238 29266718 27861463 26541340 25587500 24572739
5794 24572739 23171754 22468221 21913015 21187195 20713153 20743256 20130066 19813736 19566813
5785 19566813 19215547 18166283 17721314 16998178 16512265 16053952 15918504 15900172 15327833
5776 15327833 15176844 14416667 14195730 13634767 13217895 13317575 12698040 12675494 12887410 12117568
5766 12117568 11985712 12026344 12212225 11930893 11788611 11994543 12194865 11885980 11810016 12132813
5756 12132813 12200794 11792588 11598758 11009827 10728697 10773454 10430095 10297176 9917149 9716640
5746 9716640 9497676 8947341 8814626 8662979 8150198 8474925 8316848 7971817 7924465 7742436
5736 7742436 7432907 7730870 7838299 7726511 7821627 7971798 7796129 7784596 7765058 8055087
5726 8055087 8138049 8324397 7668101 7417164 7317562 7061354 6646010 6649427 6522562 6187516
5716 6187516 5706134 5617525 5392065 5379640 5530688 5443635 5344004 4908340 5048975 4912581
5706 4912581 4787425 4495268 4790783 5352002 5040243 4940369 5126885 5809540 5483155 4552345
5696 4552345 4561503 4793960 4375132 4116665 3751063 4097755 4153832 3671947 3849767 3573712
5686 3573712 3419249 3293471 3193248 3131470 3018895 2850788 2857087 2993693 3006971 3024539
5676 3024539 2835127 2852292 3150111 3002538 2841406 2721638 2893112 2824938 2754297 2858720
5666 2858720 2861271 2792767 2734846 2539361 2671930 2656222 2910800 3046521 3087783 2866146 2993431
5655 2993431 3150542 3200263 3545963 3333911 3521873 3631615 3789839 3941339 3955592 4295223
5645 4295223 4599345 4995844 4853669 4481364 4703066 4596555 4389428 4283568 4492830 4684251
5635 4684251 4777799 5048420 4847426 4565148 4726946 4765415 4948255 5244322 5779764 5389991
5625 5389991 5332156 5644072 5458773 5583354 6051664 6514714 7125507 6951452 6586898 7175963
5615 7175963 7066156 7260111 6865857 6677483 6826759 6692818 6628436 6188786 5649657 5877509
5605 5877509 5915518 6324724 6341757 6292805 6127786 6124619 5912564 6088967 6053633 5983483 5899778
5594 5899778 5785289 5863923 5696405 5469393 5672424 5441756 5333552 5491041 5376468 5010855
5584 5010855 4855508 5015073 4965500 4977519 5288995 5052612 4759303 5127250 5623532 5701541
5574 5701541 5744218 5963009 6009000 6426962 7275477 7848658 8494950 9151477 9393895 10098627
5564 10098627 11675658 12692167 14079600 15279749 16785191 18737176 18436428 16321323
5556 16321323 13554725 11131945 9272240 7727625 6663888 6366093 5763549 5474530 5200548
5547 5200548 5146960 4885492 4811343 4495437 4490841 4470163 4208482 4004009 4013360 3770378 4092237
5536 4092237 4121294 3845219 3886778 4239051 4473053 4250412 4112840 4102284 3888079 3593653
5526 3593653 3365064 3396728 3331364 3301893 2783879 2264996 2139409 2536470 2561921 2682309
5516 2682309 2509238 2382055 2608268 2171675 1812872 2062688 2376149 2260343 2284812 2001114
5506 2001114 1853517 1714227 1741679 1510993 1014888 1024284 1557120 1438443 1228575 1821374
5496 1821374 1818655 1760533 1862598 1811493 1483223 1667354 2040996 1857958 1594713 1343900
5486 1343900 1211138 1172734 1239904 1605991 1181386 1236310 1183918 944612 876262 1084591
5476 1084591 1346566 1289883 866554 673756 790658 689081 621023 405409 445424 410441
5466 410441 586990 662526 820956 1290747 1095753 744267 978703 1059348 1011373 851361
5456 851361 665961 464547 250608 467211 896287 981887 491054 268157 655593 666229
5446 666229 438994 657954 630475 653327 535333 1071682 896722 595353 927201 657792
5436 657792 403079 91197 144647 -229903 -63685 -189344 -59907 139784 255957 470974
5426 470974 943083 860017 862667 1028532 1130352 873613 606345 748076 509536 589258
5416 589258 883653 851673 896334 823661 1070409 1208032 632872 492903 807236 865578
5406 865578 666040 521807 535702 616284 516859 135373 507628 762122 736951 714300 747842
5395 747842 243004 852184 940599 1154437 1078259 877733 1159192 442537 -383017 -22780
5385 -22780 594409 753964 585202 469704 253579 254856 742353 785168 868175 833718 949610
5374 949610 1036368 846337 1001526 1066288 819500 615469 618437 773726 647086 537848
5364 537848 605889 731499 821478 625574 624690 730684 606543 311509 518831 587724 405243
5353 405243 855729 780939 678859 916972 673683 703411 1012356 793579 1183302 1091415
5343 1091415 1267589 1148100 1283002 1132322 1011568 659758 1042441 1112158 621600 574718
5333 574718 498330 774618 651521 752473 1227396 912319 951743 958563 654729 764460
5323 764460 1094805 974205 1013550 1265562 1261446 1062547 1350913 1015043 1088967 1189474
5313 1189474 1130406 1241774 1211595 1033763 936893 1203332 1245490 1149654 1242986 1292698 1259486
5302 1259486 1252943 1475112 1571377 1439579 1556896 1486337 906760 1156199 1417572 1267201
5292 1267201 1144351 1026392 1558809 1629603 1668848 1922078 1906785 1813184 1857272 1858927 2052510
5281 2052510 1985835 2163804 2373484 2891217 2811451 3561891 3833185 3541106 3434314 4010818
5271 4010818 4430070 4443353 5056955 5418214 5627535 5967086 5978405 5439266 5223590 5432573
5261 5432573 5019466 5145444 5180094 4894180 5115848 5695192 6311692 6410608 6475905 6729729
5251 6729729 7369492 7618961 8462286 8811582 9081001 9512357 9560140 10175384 10476918 10942823
5241 10942823 11104201 11038193 11270216 11219970 10336940 9655082 9466369 9013119 8631415 8433574
5231 8433574 8325810 8236528 7868312 8026189 7968803 8186944 8967831 9339982 9863385 10077303
5221 10077303 10461031 10481524 10084672 9110346 8577429 8865211 8693202 8339166 7923456 7656417
5211 7656417 7264932 7128720 6868769 6745906 6753491 6634830 6321036 5879125 5564866 5849492
5201 5849492 5965214 5779482 6236516 6127303 6117879 5921425 5841385 5753797 5630036 5587166
5191 5587166 5288148 5164498 4979718 4615426 4581364 3617453 3304816 3481576 2857269 3012796
5181 3012796 3327015 2906474 2846244 2711773 2672464 2780754 2487051 2577540 2548156 2429124
5171 2429124 2130815 2406213 2480436 2357003 2120447 1855376 1942721 2020724 2019280 1736408
5161 1736408 1755747 1967528 1963789 2355573 2184076 1750163 1890689 2125932 2413575 2057523
5151 2057523 1922447 1828010 1218943 1434108 1676547 1892782 2029773 1778030 1388615 1442123
5141 1442123 1860090 1812304 1631818 1702859 1424074 1247242 1691092 1422120 1228832 1090817
5131 1090817 854932 1173672 1515540 1573871 1356683 1544323 1604440 1609499 1478578 1323947
5121 1323947 1573281 1694169 2027007 2137678 2339178 2588598 2973747 3359602 3681620 2954864
5111 2954864 2307959 2079936 1844390 1834240 1563674 1539423 1640847 1319907 1482250 1243191
5101 1243191 1215198 1574123 1549237 1602162 1740555 1649086 1074260 1152404 1291227 1409372
5091 1409372 1127417 1025818 936503 886444 1268743 1225920 1406202 2071028 1885415 1519504
5081 1519504 1364289 1221865 1294519 1408107 1484547 1685355 1631854 1736369 1831268 1312107
5071 1312107 1174510 1787090 1869549 1834444 1656313 2094489 2295329 2053280 2152967 2799047
5061 2799047 3216963 3447846 3890626 4609993 5024929 5433799 5628130 6414113 7220113 8020275
5051 8020275 8844928 8848836 8354067 7651919 6978860 6215876 5375796 4783968 4719996 4458380
5041 4458380 3718826 3415870 3328054 2664853 2640507 2722075 2794130 2612895 2606639 2598077 2719935
5030 2719935 2389671 2130399 2041460 2160686 2045279 2258175 2224025 1992354 1967972 1951565
5020 1951565 2131873 2485503 2142376 1715237 1973824 2036811 1825598 1546471 1615632 1278473
5010 1278473 1659025 1770661 1557649 1605499 1672527 1975913 1898435 1864067 1657833 1682298
5000 1682298 1612128 1806144 1840229 1944052 1887602 2248281 2264395 2012680 2079380 2297739
4990 2297739 1603455 1930147 2110111 1972930 2052462 1922737 2019795 2185030 2029934 1703225
4980 1703225 1726808 1793313 1697294 1825893 1643467 1775038 1936163 1513500 1995588 2229235
4970 2229235 1893817 2214257 2298754 2252794 2022881 2130240 2121631 2151320 2372291 2130022
4960 2130022 2309717 2420134 2945951 2142478 2003067 2070467 2106266 2138255 2275585 2322895
4950 2322895 2390827 2726449 2371889 2425121 2291438 2462326 2556563 2522260 2604647 2574938 2815440
4939 2815440 3003565 3010791 2735729 2747456 2958209 2638435 2746436 2910932 2700347 2941947
4929 2941947 3167662 3321396 3037083 3010912 3225282 3924133 3908616 3866587 3769961 3948348
4919 3948348 3849495 4240078 4539509 4555554 4419757 4236826 4705940 4644981 4414918 4600986
4909 4600986 4626739 4918686 4849854 5022581 5086108 5269914 5507951 5763274 6012129 6163437
4899 6163437 6307957 6303046 6393648 6701428 7197267 7378769 7493042 7777587 7721855 7658864
4889 7658864 8081178 8738596 9185619 9542157 9544193 9756549 9681244 10203468 10761537 11351261
4879 11351261 11059092 10940948 11430108 11801992 12191103 12618821 12667157 12907130 13184175 13818286
4869 13818286 13831607 13534259 14012360 14027468 14493502 15294821 15388791 15190396 15575965 15845842
4859 15845842 16454976 17245568 17133636 17072594 18021589 18713513 19335307 19730840 20449203 20995551
4849 20995551 22091542 22981624 23977746 25207831 26274011 27990950 29651744 32095207
4841 32095207 34436687 36636721 39127138 40898204 41940384 41528949 41336394 41238279 42132105
4832 42132105 43172890 44116774 45175840 47155396 48912620 50951391 53060396 56033012
4824 56033012 60062279 64520307 68825400 74902481 81461430 88525819 95981159 105070925
4816 105070925 114117306 121630713 128836736 139168503 152480195 168532771 187011830
4809 187011830 210159010 236949316 266237383 298288535 338242883 378132900 416521795
4802 416521795 453282773 502209236 512921084 451135460 363765738 285352105 232991086
4795 232991086 195943283 169226081 147985883 132617935 119422019 109735691 101015776
4788 101015776 93951165 87423514 82256192 77849056 74148798 70783162 68301901 66566215
4780 66566215 63866876 59656740 55627126 51644486 48576726 45649931 43483927 41061129
4772 41061129 39331554 37428798 35763315 34133363 33340523 32641533 31453206 30493892 29692586
4763 29692586 28338009 27426344 27061455 26510412 25933304 25666662 24869442 23977797 23682316
4754 23682316 23126419 22155540 21705981 21570944 21308604 20658252 20316320 20364436 20126632 20376705
4744 20376705 20406550 20237667 20221867 19921625 19089306 18396594 17583059 16730988 15740592 15109019
4734 15109019 14612401 13746767 13363231 13284337 12703814 12280892 11979285 11899974 11355083 10961944
4724 10961944 10527052 10321008 9891636 9639334 9612307 9596251 9290193 9154856 8875938 8783881
4714 8783881 8525004 8324062 8374206 8193306 7938942 7767101 7752944 7500634 7340230 7158962
4704 7158962 6661197 6631449 6209369 5774958 5495626 5757772 5788141 5119478 5127099 5234997
4694 5234997 4978781 4947997 4768982 4909848 4658177 4540737 4639546 4255444 4259271 4397980
4684 4397980 4406723 4042627 3873047 4052036 3979936 3884057 3881233 3691231 3844251 4080041 3941981
4673 3941981 3856367 3725286 3913608 3623126 3599753 3268095 3667727 3626276 3875897 3724502
4663 3724502 3958561 3810908 3272083 3251792 3234043 3362580 3763261 3754726 3237584 3038635
4653 3038635 3214851 3462591 3009279 3034793 3258443 3356583 3001820 2838213 2976378 3152155
4643 3152155 2943862 3523601 3574301 3102623 2808638 2988413 3083274 3173998 3327594 3295425
4633 3295425 3019695 2899780 2948133 2914262 2701670 2610878 2123451 2630714 2913822 3356388
4623 3356388 3523785 3427673 3329455 3035126 2668979 2852582 2170414 1997588 2108031 2009278
4613 2009278 1915708 1579351 1670976 1930661 2118108 1876441 1589779 2080865 2223998 1960332
4603 1960332 2041278 1917406 2077917 1803342 1886241 1865641 1986279 2034050 1966633 2144226
4593 2144226 2032782 2319829 2273678 2192839 2190854 2280608 2185997 1808702 1872892 1885190 1955444
4582 1955444 1476661 1773346 1506093 1912160 1925441 1726668 1546098 1982447 1896578 1515864
4572 1515864 1426712 1445145 1483978 1339762 1309034 1593973 1549639 1386756 1658621 1595893 1803974
4561 1803974 1463144 1357464 1379217 1418011 1277772 1425811 1806446 1416585 1402704 1875100
4551 1875100 2233026 1777708 1895754 2088924 2278356 2551994 2436317 2337267 2673900 2654998
4541 2654998 2218236 2060259 2268373 2241583 2005054 1966136 2147607 1797973 1852625 2120835
4531 2120835 2225714 2072326 2248575 2532708 2321571 2715668 2464142 2292873 2895607 3031726
4521 3031726 3208133 3833500 3525732 3340635 3006807 2374768 2042563 2219981 2403395 2530719
4511 2530719 2381938 2391007 2184992 2383976 2233758 2573271 2310539 2062957 2362340 2253666
4501 2253666 2298557 2574742 2640599 2317577 2027107 2451709 2802510 3069497 2978678 3527360
4491 3527360 3733138 3815840 3801792 3621840 3756036 4245976 5120795 5501959 5383116 4793742
4481 4793742 4595095 4701907 4795368 4733172 4941231 4481026 4458301 4862877 4948694 5193142
4471 5193142 5603410 5767998 5893691 6000249 6240930 6932584 7232029 7860771 8464117 8992367
4461 8992367 9854041 10604100 10857362 10713743 11295511 11642746 11309816 11311202 10901912 9973195
4451 9973195 9249622 7823094 6839107 6454042 6291641 6013090 6294004 6606069 6981108
4442 6981108 6443663 6120185 6454806 6469859 6648273 6591576 7287715 7793863 7770329 8030479
4432 8030479 8466658 8610007 8874772 9273729 10021188 10736135 10881430 11325414 11056311 10687191
4422 10687191 9817246 9061715 8924152 8371346 7666658 6607809 6115760 6064495 5893741
4413 5893741 5328654 5081977 4989911 4756226 4443461 4694348 4645096 4219806 4057476 4117035
4403 4117035 4001591 4066336 4171509 4039408 3727515 3440551 3728511 3662099 3301463 3209150
4393 3209150 3134878 3512198 3296318 3038237 3145092 3488877 3450741 3557142 3211676 3276833
4383 3276833 3655695 3556705 3873817 3820294 3557854 3416243 3532580 3501318 3368792 3349197
4373 3349197 3733403 3468341 3707849 3924991 3946919 3998728 3955771 3797806 4123033 4170005
4363 4170005 4267205 4722330 4660787 4464207 4605597 4310039 4684715 4881173 4751362 4991595
4353 4991595 5214083 5087276 4968993 5091286 5196478 4969613 4887311 5134598 5324788 5194391
4343 5194391 4990930 4843490 5052790 5365176 5145003 5344491 5188196 5256629 6076218 6170121
4333 6170121 6304885 6578063 6868119 6891496 6764617 6910861 6751135 6812412 7278508 7394769
4323 7394769 7596545 7869240 7571529 7637816 7525008 7361156 7536373 7126873 6970510 7300109
4313 7300109 7329095 6946100 6595218 6886077 7393676 7715086 7950474 8103487 8525324 8795506
4303 8795506 8779776 8866403 9174759 9004078 9429368 9742783 9743191 9738550 10180306 10576032 10538510
4292 10538510 10399007 10137963 10512359 10677780 10740175 10797456 11414564 11420065 11559050 11484244
4282 11484244 12007329 12486507 12491791 12433955 12421518 12684432 13469874 13747661 13916155 14222357
4272 14222357 14328298 14343195 14528069 14457551 14584794 14828075 15118180 15541986 15918054 16038997
4262 16038997 16724507 17095762 17085912 17672459 18107203 18392654 18705347 19236231 19806675 19738866
4252 19738866 19585076 19421923 19272111 19757636 19952699 20748888 21250176 21405008 22264429
4243 22264429 22770925 23518285 24346993 24300598 23342290 22317496 21654756 20724109 20408751
4234 20408751 20473512 20193331 19744867 19790330 19995513 20252706 20163535 20138553 20377021 20998554
4224 20998554 21420030 21546835 21779968 21817327 22223488 23057020 23415459 23832323 24612846 25286366
4214 25286366 26607835 28041431 28912900 29385468 30717376 31979271 33915857 35432144
4206 35432144 37198018 38380066 39938313 41771299 43567105 45778368 47595240 49694485
4198 49694485 52495569 55798464 59317746 63829549 68895842 74308420 80373901 86576215
4190 86576215 94826674 104454014 115508481 127833882 142110501 158673770 176924176
4183 176924176 198447838 223357929 251419506 283182811 318496246 357714444 398586847
4176 398586847 440139578 479549722 496652240 478929321 423951895 353865565 291330936
4169 291330936 244446918 210677472 185493417 165538920 148971034 134995361 123119165
4162 123119165 113144009 104350825 97140641 90895638 85456114 80177684 75703526 71912104
4154 71912104 68458503 66038566 63690593 61387148 59649369 58084421 56087778 54715569
4146 54715569 53921356 53384317 52912294 52644689 52859705 53088690 53718579 54027707 54635894
4137 54635894 53943800 51293274 47736628 44018324 41303687 39175597 36792111 34715752
4129 34715752 33379471 31765318 29945684 28641831 27339934 26331403 25314962 24766145
4121 24766145 24047873 23410847 23318833 22748143 22590507 22598821 21824554 21388393 21067247 20508508
4111 20508508 20293081 20648955 21203429 21107199 21530083 21583027 21671213 22139508 22437646 22946287
4101 22946287 22420462 22442878 22040761 21414602 20337607 19616193 18696525 18232510 18089513
4092 18089513 17873891 17447184 17495314 17690476 17861694 17617342 17535192 17346453 16343494 15765668
4082 15765668 15299909 14922656 14385876 13652116 13287566 12693296 12042618 11943665 11930199 11466548
4072 11466548 11300524 11273033 10855280 10869563 10483532 10236403 10360294 10095964 9654311 9405312
4062 9405312 9494721 9649280 9664251 9352621 8908233 8829842 9121988 8716160 8542081 8977778
4052 8977778 8946743 8778138 8800831 8786562 8494473 8456295 8538572 8494454 8436676 8550306 8485790
4041 8485790 8282116 8404016 9024936 9006769 9051343 9029221 8661575 9052346 9156488 9598311
4031 9598311 9148673 8659056 8644580 9051920 9487714 9047366 9234220 9645690 9696394 9698541
4021 9698541 10272461 10535422 10862549 10825222 11121729 11942540 12286059 12433694 13203684 13984667
4011 13984667 15193884 15842066 15990670 16523660 17293958 17097928 16202599 15397052 14263594
4002 14263594 13535110 13394977 12965107 12484228 13005176 13049906 12772920 12816984 13024463 12682465
3992 12682465 12211313 12523268 12835919 13268963 14212912 14760898 15089679 16008965 17052926
3983 17052926 18158734 19136048 20302081 21438568 22349691 23044660 22775062 21991871 20850976
3974 20850976 20119985 19556953 19421836 19230853 19534111 20018134 20749366 21210177 20903120
3965 20903120 20832789 20819113 21126597 21143004 21264779 21932297 22520157 23685490 25203185 25890840
3955 25890840 27386229 29277991 30908909 32074036 33370187 33809687 32736140 30868161
3947 30868161 29161369 28173467 27336736 27061583 27272337 26882413 26477584 26334635 26689443
3938 26689443 26812632 27054761 27873380 28881899 29173923 29976016 31235740 32211483 33042039
3929 33042039 33955011 35115710 35888903 37408999 38938049 40057886 41108609 41192452 40185469
3920 40185469 39330270 38344826 37910890 37715685 37998947 38643243 39510183 40293265 41676209
3911 41676209 42953531 44270747 45395207 46568840 47974152 48917073 50089164 50948407
3903 50948407 52460715 53996045 55845243 57632060 60147218 62237051 64366862 66777062
3895 66777062 69679565 73292475 77310901 80710267 84212090 88472683 92001280 96198450
3887 96198450 100668415 105423225 110531715 115891413 120541448 125150942 129477871 133804730
3879 133804730 138451651 143963055 150320799 157296277 164030681 171203141 178837122 186276239
3871 186276239 191071028 191651181 189948665 188010244 187854158 189691847 192699040 195205472
3863 195205472 197126396 198832619 200314169 202091248 204524364 206423036 206566947 205017255
3855 205017255 202510442 199274206 195585890 193404612 191160512 188262841 186129097 184183794
3847 184183794 183185308 182338683 180761396 176904788 169367132 159624123 150209247 142499111
3839 142499111 136377799 131021511 126664248 121978415 118199574 115073098 111124615 106731918
3831 106731918 102396341 97960231 93724194 89649143 86070198 83169875 80810298 78643027
3823 78643027 76219594 73469538 70803181 68629553 66008223 63946905 62260478 61066600
3815 61066600 60258461 59057891 57451555 56300288 55173586 54565477 53471697 52460023
3807 52460023 51646166 50220137 49212128 48130042 47312370 46414132 45369064 44924316 45123293
3798 45123293 44823253 44675490 45753738 46909166 48013611 49208364 50486206 52223824
3790 52223824 53945458 55944984 58209105 60798260 63391712 65935508 68554611 69640801
3782 69640801 68665549 65141565 60475228 55530358 50913587 47509317 44453478 41726116
3774 41726116 39682738 38012775 36860012 35912001 34876925 34048324 33409674 32493255 31460591
3765 31460591 30756827 30353672 29632619 28897644 28008221 27261704 26271217 25955819 25370946
3756 25370946 25041206 24341580 23740914 23667256 22940860 22865871 23114938 22804580 22696636 22684620
3746 22684620 22479819 22765740 22752581 22922632 23500044 23192527 22944120 22889414 22546400 22538201
3736 22538201 22622657 22418153 21533519 21015408 20920381 20881870 20493446 20351456 20094510 19628714
3726 19628714 19471854 18599240 18361768 18721347 18177900 17991153 17722580 17666191 17710099 17758184
3716 17758184 17814231 17942763 17684368 17290070 17332346 17620996 17456833 17671519 17417283 17060465
3706 17060465 16968071 16821320 17029377 17115620 17176825 17054258 16932319 17075650 17292937 17319226
3696 17319226 17160162 16956108 16965381 17230871 16933571 17235862 17320650 17379454 17140501 16724019
3686 16724019 16497436 16447611 16428303 16231981 16118590 16563329 16873532 17165086 16908491 17123201
3676 17123201 17498274 17510180 17733864 18036128 18497595 18885984 19079956 19505883 19871630 20272458
3666 20272458 20442409 20737281 20729453 21108955 21879651 21954189 22043948 22306548 22256975 22251495 22412137
3655 22412137 22185360 22153405 21307298 21043379 20531184 20334826 20850881 21063692 21147884 21207043
3645 21207043 21042984 20988886 20502914 20391619 19968974 19905323 19924992 19961418 19639794 19572572
3635 19572572 20247416 20220093 19757791 19654923 19502803 19769268 19999153 20218454 20005087 19813939
3625 19813939 19278248 19028716 18932399 18412335 18077851 17880788 17572376 17386903 16679154 16454705
3615 16454705 16127648 15858013 15635556 15329855 15299905 14624362 14393582 14480780 13920338 13885132
3605 13885132 13869091 13966773 13764536 13455877 13883347 14083293 13972398 13728860 13788723 13567104
3595 13567104 13359914 13656369 13478933 12925619 12552406 12749539 12628357 11905128 11571944
3586 11571944 11625976 12189793 11824785 11322545 10737551 10594562 10182576 9953025 9916153 10231910
3576 10231910 9844922 9328009 9304320 9396779 9104107 9024598 9031165 9051677 9007998 8828664 8888763
3565 8888763 9059018 8960554 8619063 8469258 8668989 8872367 8414659 8117001 8142430 7938894
3555 7938894 7801928 7809691 7834878 7553331 7135147 7201774 7164934 7172178 7558252 7393379 7247402
3544 7247402 6992284 7097665 7222132 7355061 7459550 6927049 6795371 6414465 6440328 6389682
3534 6389682 5992691 5693617 5515068 5611316 5971686 5551611 5460311 5426228 5352725 5652716
3524 5652716 5249531 5350490 5616679 5454837 5304970 5339059 5378553 4931479 5017061 5127704
3514 5127704 4953637 5237778 4882515 4455550 4486083 4453146 4207663 3985797 4188101 3943916
3504 3943916 4034914 3973809 3632363 3444954 3812841 3611128 3927916 3541630 3489676 3700611
3494 3700611 3492038 3485584 3324324 3214532 3138110 3388090 3263774 3516703 3417791 3121859
3484 3121859 3279919 3308513 3193050 3500215 2983587 2540098 3005754 3210053 3125793 2906152
3474 2906152 2476338 2627375 2568925 2850454 2780630 2712762 2310367 2631552 2447260 2456748
3464 2456748 2303030 2375772 2501101 2707500 2865847 2556777 2683430 2549450 2076756 2093250
3454 2093250 2425234 2438300 2396474 2618469 2717969 2631127 2754113 2537716 2232010 2417294
3444 2417294 2222918 2617956 2353307 2212440 2569988 2137100 2211146 2333084 2387616 2080520
3434 2080520 2041954 2276637 2402647 2428321 2586719 2439913 2227491 2408861 2272203 2182351
3424 2182351 2103357 2010508 2031434 2011215 2129168 1929600 2106451 2005339 2399503 2453348
3414 2453348 2294625 2206389 1850562 2026494 2408471 1969573 1929270 2315233 3019637 2814437
3404 2814437 2682196 2282556 2079587 2159515 2279361 2312838 2438562 2304522 2532766 2500602
3394 2500602 2427203 2589522 2134822 1736797 2028527 2127057 1771786 1781536 1965676 1898764
3384 1898764 1428212 1794121 1846037 1339948 1523165 1507864 1711061 1789485 2007977 1765516
3374 1765516 1582321 2069862 2133438 2250396 2099326 2012266 2036635 1800326 1827088 1583078
3364 1583078 1346319 1684266 1945381 2026963 1976043 2025546 2211472 2529873 2039661 1961643
3354 1961643 1959861 1820381 1655321 1362189 1816808 2119285 1702551 1753958 1966525 1962683
3344 1962683 1898229 1505334 1706612 1698782 1885161 2035607 1847704 1669592 1522671 1583676
3334 1583676 1434751 1810408 1622052 1824968 1671317 1522968 1901294 1961044 1619158 2176793
3324 2176793 1986304 1844986 1716139 1910119 2094612 2016867 1775153 1684618 2056335 1844225
3314 1844225 1685618 1884538 1768328 1879163 2133234 1995987 1925962 1765816 1828090 1875509
3304 1875509 2094897 1921989 1546083 1918602 2362280 1874652 1983604 2661295 2654900 2427214
3294 2427214 2411326 2160606 2201527 2506307 2293748 2122889 2659971 2469754 2426879 2022099
3284 2022099 2238263 2802991 2379551 2481886 2461682 2600739 2998635 2976159 2890320 2732634
3274 2732634 2800124 2998930 3190412 3142756 2934600 3146094 3205086 3400173 3839203 4466939
3264 4466939 4420924 4312640 4317088 4675476 4964664 5418202 5331907 5496912 5578895 5849745
3254 5849745 6122350 6058081 6524190 6408922 5781749 5052686 5015842 5038524 4888854 4682896
3244 4682896 4482514 4423247 4117189 3738626 3749392 3709395 3715899 3680792 3675643 3430979 3353615
3233 3353615 2974850 3211642 3345514 3169299 3070044 3172480 3313317 2942146 3034329 2650817
3223 2650817 2709632 3199200 3268072 3187340 2831421 2966564 3441348 3554275 3308930 3299809
3213 3299809 3417411 3533666 3580162 3118181 3697983 3573775 2851114 3052111 2907509 2790363
3203 2790363 2773112 3009110 2987145 3106316 3079480 3336109 3269495 3153588 2977869 2711592
3193 2711592 2859347 3093231 3333410 3605892 3337577 3281690 3042342 2881235 3238661 3334876
3183 3334876 3204271 3009265 3086829 2801987 3023075 3390351 3458869 3445189 3420388 3440584
3173 3440584 3240919 3426329 3488430 3277440 3087265 2896492 3051843 3351812 3636995 3517374
3163 3517374 3199556 3054622 3203050 3216231 3090981 2914604 2666764 2975537 2968084 3061630
3153 3061630 3053093 3087236 3063001 2966101 2807463 2470281 2701918 3079437 2798064 3124965
3143 3124965 3560021 3559834 2773030 2727863 2899901 2467583 2825113 2898777 2890113 2826520 2518844
3132 2518844 2396791 2410588 2472324 2401915 2468409 2352108 2672100 2466352 1997073 2068675
3122 2068675 1996202 1781650 1766410 2340755 2114326 2228540 2195047 2389260 2295691 2243004
3112 2243004 2053545 2293731 2512679 2453582 2137680 2403443 2455216 2190491 1744763 2120305
3102 2120305 2366860 2203299 2139164 2095954 1943102 2282461 1743169 1224874 1629495 1637741
3092 1637741 1567861 1514903 1600207 1351571 1541392 1277923 1082520 1072461 1265515 1050759
3082 1050759 810287 1007014 1327424 1659639 1820454 1425464 1288164 1044858 1118382 1305331
3072 1305331 1263940 1569640 1098697 1138368 1244285 1241858 1527607 1624160 1336911 1040434
3062 1040434 1471816 1282067 1048713 1059497 1167572 1170256 718329 766445 902393 735506
3052 735506 495336 922741 1260553 813702 1024155 906997 634947 640721 645891 502368
3042 502368 306310 421122 712235 936019 549237 612632 562744 558733 618120 503709 473651
3031 473651 572324 684052 460959 477750 779194 506622 183791 361235 -74448 242201
3021 242201 648105 766912 558745 333194 739318 614944 375811 429916 143520 168113
3011 168113 813289 640391 720764 342777 162829 356358 102711 -66840 -166763 -64082
3001 -64082 306022 548104 258760 125047 -54853 -57360 -50306 243860 260993 606043 747800
2990 747800 722203 658643 597291 491381 383100 524950 442867 548898 463035 477195 620743
2979 620743 -86275 153499 613335 645554 587518 516693 643428 774933 241892 418694
2969 418694 527019 496995 736573 762321 693782 217165 145305 82124 373588 668171 313349
2958 313349 36418 87075 486693 670843 644565 687657 580897 492206 658723 268786
2948 268786 229186 451817 701305 819133 537027 600308 560907 445043 651816 722588
2938 722588 392891 350491 293439 -789 158969 481568 773882 636632 697980 737561
2928 737561 253194 807775 935776 1064687 1116413 805688 260001 201108 470052 552788
2918 552788 654465 372712 280579 211167 550099 559669 534667 601583 385416 585016 497121
2907 497121 644847 188659 249159 279432 490215 601322 524246 613629 837205 855708 825749
2896 825749 1029583 869821 713711 787197 780141 601488 382693 398476 717591 830998
2886 830998 770369 506445 569815 706090 263654 504552 379274 554835 716798 699287
2876 699287 516049 626156 799527 500118 294082 482282 559273 717849 821668 355899
2866 355899 292387 116740 104583 477659 -4847 34439 57072 165444 -100997 55070
2856 55070 213617 196351 222452 23598 392001 246682 284503 149633 445673 253983
2846 253983 319769 332119 346519 466200 669980 505375 283615 508106 53854 -392204
2836 -392204 -517670 -9355 -107892 -126398 -71165 -82113 194902 51069 83475 -428069 -331955
2825 -331955 136305 630020 757411 320510 -331057 -388476 36140 220973 -131759 252605
2815 252605 451492 145025 88972 183728 212701 80064 -115857 -476825 -595427 123415
2805 123415 -232718 -378564 -425517 -329634 -60227 5993 236391 -168851 -204733 -175796 -135714
2794 -135714 155346 27463 236783 404575 124961 100495 252832 -10006 413412 101895
2784 101895 170747 -59926 -700266 -555347 -396974 -292407 29106 185216 412229 182056
2774 182056 -35381 199319 22864 -331078 -150447 -216921 -206773 -17348 79443 301787
2764 301787 122046 -71149 -330621 -521351 -576499 -63726 31191 345828 303291 130345
2754 130345 -194734 -170493 -137310 45962 311600 441041 17338 -21223 78743 -78416
2744 -78416 -300583 -68408 -20249 75439 142736 252243 607645 586902 517377 625010 213185
2733 213185 163643 -48627 37881 359109 -169561 -264428 -241698 10134 -110547 132391
2723 132391 369017 -15100 -293517 -173937 53976 -82985 -318004 -547903 -30317 159265
2713 159265 209879 -9386 61668 70864 350036 448781 -77361 -343341 28405 402841 244879
2702 244879 330270 132046 -442324 -451834 157187 -9851 -30601 -77143 -318696 -287946 79812
2691 79812 214782 -224530 -183756 -89139 -202297 -499368 -49290 52572 94471 -27631
2681 -27631 -283949 -248543 58901 -82097 -234594 369153 70593 47120 123625 -182628
2671 -182628 -238052 -500014 -556642 -194972 71012 -48827 -403544 30234 148809 -138494
2661 -138494 -40706 15369 153593 -155142 -159920 284784 136586 -143686 -192196 -60449 343165
2650 343165 192159 128730 510985 375143 221825 190907 54399 -145740 14087 336359
2640 336359 49711 -105990 -124711 -75569 -168772 -302216 -172318 207957 569318 251123
2630 251123 352757 -23685 -353846 -322134 -10301 150061 -118118 -466892 19571 -28885
2620 -28885 6383 115677 310176 103334 -196811 -174459 56001 286083 166503 -168613
2610 -168613 71894 118040 319334 104612 72593 298388 -73564 -124631 53947 333721
2600 333721 505335 246747 -398638 -112690 -10461 -75732 39206 -329483 -223835 -65006
2590 -65006 -385987 -217497 -255465 -547053 -368566 -276296 89109 -130596 -308719 -95757
2580 -95757 -445869 -168018 -293773 -298101 -254693 -67963 -344507 -223950 -85088 -97304 -53097
2569 -53097 311374 521214 579986 282184 -215993 -32614 21566 182772 522610 277099
2559 277099 181838 210184 -282989 -154061 -257969 -29074 516462 381608 164533 187599
2549 187599 241807 -192051 36634 256638 300102 81925 -409142 -47335 -167152 -49267
2539 -49267 -224267 -266608 91736 55916 177831 44579 336110 24797 -242249 -167800
2529 -167800 67245 127865 205647 422478 304011 137163 -91857 -85402 -75482 -90670 -410899
2518 -410899 -531221 -314441 -176390 -425362 -271612 807 -283569 -660135 -152278 97925
2508 97925 -69586 -452238 -727015 -219130 300763 142973 -194216 208439 151030 -227611
2498 -227611 -306890 -209859 -95820 -155926 114049 -239537 -77297 152478 -95998 -303384
2488 -303384 -121426 63711 213239 270739 254572 79989 -143586 23891 -227078 -50316
2478 -50316 149788 242200 211499 389737 -68400 359407 348342 -139405 -133487 318081 133708
2467 133708 48859 194203 62175 314103 291375 111193 -515230 -428223 65504 -5608
2457 -5608 82383 181545 -219423 -178129 -229404 -563941 -283159 -401395 -550487 -70882 183793
2446 183793 -65710 -540707 36140 264894 -174851 104990 246004 -49011 101719 95010
2436 95010 -268890 -279392 -66437 -179367 73232 -39427 -174453 -491981 -578022 -185604
2426 -185604 -294828 -229897 -214615 12066 282176 121420 108765 377458 188154 539038
2416 539038 169364 -198542 -39429 -183974 -67545 29532 183527 157624 320849 321440 -4569
2405 -4569 307 433316 408729 -17457 100285 -218256 -207358 327474 214395 40913 120639
2394 120639 300342 263306 157446 104615 69156 289582 459687 380625 -46870 381018
2384 381018 553335 576810 521481 580559 676050 237442 178351 51849 292626 139317 69229
2373 69229 7145 127514 235658 271634 123888 397693 526768 108278 230701 219157
2363 219157 27854 462073 587715 394444 246951 146091 235898 308165 271349 338169
2353 338169 397564 58450 141207 135936 158363 320587 229611 540679 338738 340586 77512
2342 77512 14969 121725 181173 -64313 208651 146723 176980 705110 590181 611706 338525
2331 338525 90036 120891 -228058 -227171 317568 171294 135018 83385 591785 993370 424118
2320 424118 137381 56256 255181 280205 312610 47509 -325119 -173228 275008 379154
2310 379154 36843 305737 71829 -6068 -124901 -100610 -244287 -117649 249139 319413
2300 319413 407886 254754 57828 44099 90215 409044 246978 95134 473528 366015
2290 366015 -6177 -29092 278569 517513 347194 239257 509474 297672 732580 827625
2280 827625 222333 276223 226208 172211 646969 600380 650596 476996 191407 -128685 -2852
2269 -2852 51288 133192 -74012 29080 78264 130352 4993 -97160 141674 254846 332641
2258 332641 172579 -8732 -283200 -157134 -129037 129025 -24788 408674 94538 216492
2248 216492 193057 316291 519943 329974 230283 395932 278733 435111 414796 340739
2238 340739 465373 8128 -254034 -213737 206195 467162 472334 696751 597900 -14655
2228 -14655 4548 361688 423038 279067 224890 619582 844360 741588 597123 512390 645515
2217 645515 902007 758299 1089254 822309 902488 966301 1182257 1200578 1022577 1036680
2207 1036680 1332591 1574312 1480073 1526778 1811220 1801879 1307736 1888412 1855035 1671734
2197 1671734 1494176 1705367 2077359 1966363 1854104 1850846 2156082 2051820 1859094 1776469
2187 1776469 2245785 2040943 1926640 1841151 2167975 2334050 2492032 2626658 2169284 1932069
2177 1932069 1969556 2348999 2132328 2618772 2637068 2580694 2742222 3121045 3160760 3059784
2167 3059784 2730334 3006665 2791961 2978054 3422236 3650533 4202730 4220099 3836522 3931102
2157 3931102 3599949 3791135 4030943 4389631 4608341 4855702 5130436 5291975 5795164 6000041
2147 6000041 6363449 6575191 7100697 7214068 7491984 7920313 8892264 9245951 9399833 10045737
2137 10045737 10989489 11812591 12418819 13784717 14818134 16009505 17385285 19179207 21330797
2128 21330797 23535568 25948963 28357602 30978908 34806915 38682404 43758148 49638868
2120 49638868 56609821 63801886 73785134 83721348 93203374 102159059 116635717 120191618
2112 120191618 103908375 82469980 64013921 52699272 44737598 38722320 33911845
2105 33911845 30341483 27629340 25566852 23650838 21884771 20056616 19583653 18384814
2097 18384814 16957890 15242259 14400174 13819098 12883032 11819562 11050063 10313248 9970633
2088 9970633 9524227 9141179 8660838 8597551 8191203 7733736 7463445 7020182 6582193 6668742
2078 6668742 6354190 6384562 6326697 6277920 6154098 5993437 5556148 5133174 4801019 4838198
2068 4838198 4962058 4419999 3934905 3814903 3483810 3533165 3447882 3586714 3668278 3573031
2058 3573031 3337856 3030159 2900690 2987757 2795391 2898315 2735246 2625523 2529978 2630866
2048 2630866 2468970 2515732 2290909 2196095 2064326 2118305 2265905 2040120 2062816 2040856
2038 2040856 1940531 2070326 2237702 1813733 1570370 1315529 1519830 1898582 2156197 2180388
2028 2180388 1912288 1553999 1228110 1026215 1560424 1545930 1350817 1634415 2004463 1891263
2018 1891263 1435149 1401430 1380001 1287510 1111568 1223064 1397255 1506695 1154054 1278379
2008 1278379 1579559 1228083 1511368 1168853 825819 992772 1229303 996929 1179673 827469
1998 827469 978663 866650 1244208 980619 684645 963590 1180701 1383736 1170514 1066630
1988 1066630 897598 1053758 1279283 624784 820599 448037 922212 786384 659260 948580
1978 948580 689808 1086621 763333 805372 774531 918197 945738 821286 1220305 1254514
1968 1254514 927419 939723 931427 1017556 865224 834978 633744 643518 650825 912126 631671
1957 631671 345390 554803 573704 633195 815910 557060 664634 199680 -161156 224866
1947 224866 253462 179546 -115358 -380628 -279325 -21888 -296413 -191641 224113 439766
1937 439766 292193 322911 161761 207231 -108947 -46902 -358950 -117820 526253 17046
1927 17046 -189422 -263005 -240709 -482278 -406752 -314199 -272513 -25505 150496 318422 -106920
1916 -106920 -205126 -211018 141582 237405 -2984 -93094 -636284 -341531 -292631 -269521 271689
1905 271689 156587 -115619 -9618 126523 -60195 -107436 -178619 -136491 -375769 -180112
1895 -180112 272633 144401 192456 388446 484516 -63914 44612 918 -205936 -177631
1885 -177631 33715 52967 -382111 -86348 146628 -202921 -204236 -276454 -243215 87792 153801
1874 153801 352918 481010 -50732 185064 408394 359906 278229 233554 319810 297965 78645
1863 78645 -89594 -162599 24262 58578 -49353 91872 172713 59975 225614 28062
1853 28062 -79656 -9795 388187 596049 600654 536529 599481 788127 721149 592605 835376
1842 835376 825806 495252 1115939 791305 299506 814980 700976 342166 -20931 1674
1832 1674 205911 40663 -23617 -138864 -188449 -124118 -107662 134760 14243 -153896 -143347
1821 -143347 21664 329632 154881 -289499 -52547 353566 101992 -110376 -233641 -13365
1811 -13365 -157381 -269164 -222485 81209 337072 270972 -519661 -539149 -273706 -67682
1801 -67682 74056 -164438 -121172 -265028 -487155 -547517 -291105 17521 -302882 -6687
1791 -6687 265996 170257 245161 255346 89385 90028 250258 392962 5710 -225043 -223470
1780 -223470 370588 283664 -70616 -211490 -227174 -207645 -369044 -250541 -3731 54204
1770 54204 -90870 89703 -40377 -290926 -233602 192326 136524 332916 342404 418354 409673
1759 409673 469048 230933 420949 142895 -80437 174837 525121 454330 65490 -131593
1749 -131593 -28052 -287301 -536976 -405091 -356269 -733605 -287363 -294312 -420333 -144706
1739 -144706 -210743 -242978 -480079 -382706 -337493 -197174 -69722 -194538 24461 -56863 -238329
1728 -238329 180116 164714 209383 236154 156748 64440 161012 -1722 -186548 -352769 -175933
1717 -175933 44290 -46216 22035 -128060 -350246 -449270 8394 224862 163845 460685
1707 460685 -132088 -160984 -122299 29573 -156908 -340891 -180487 -297891 -476565 -648444
1697 -648444 -323602 187505 232065 149660 -63843 -368647 -655122 -440810 -57103 -140269
1687 -140269 303491 720508 241420 960 -277966 48313 90971 111771 408636 317542
1677 317542 289488 385912 411164 271312 456591 97553 -101853 279420 -50483 179270
1667 179270 -167245 -267611 31868 317332 387892 -173703 -265426 -437658 -260056 -103394
1657 -103394 -233435 -105269 34029 -285513 167667 398760 99024 300841 372242 203722
1647 203722 241669 264391 216666 378910 448814 60614 284774 258375 318694 398380 237729
1636 237729 449677 98661 -66869 -234562 158654 474646 697652 304975 -19227 429573
1626 429573 478026 146898 30930 164538 327931 184548 -225119 -187583 277166 10445
1616 10445 -411920 -415261 -252390 -37519 159657 410505 339134 238851 -172470 158784
1606 158784 305342 361071 -83613 -349165 -266577 95353 -1583 4305 48189 69655 -178458
1595 -178458 244090 104815 185143 322495 72256 -12240 73868 70124 90872 139198 -22253
1584 -22253 -22196 -137677 -243460 -35640 94782 370745 356617 71981 -327116 -396114 -184348
1573 -184348 -48635 434292 338618 -98239 242578 73309 88097 188775 381103 399971
1563 399971 14776 -146748 147390 257496 107465 232754 -104543 -121698 -65514 -247930
1553 -247930 318913 323686 -184087 -309448 52722 212751 -240879 -157730 31956 390124
1543 390124 -98014 60920 -16641 -79403 48797 -302944 -299817 7148 122003 492888
1533 492888 89244 26201 57844 273912 291310 255552 404511 126868 -20535 -89324 -137631
1522 -137631 -130028 355243 365690 373449 438142 251252 198895 -156421 -122226 -95524 93913
1511 93913 -112973 154046 188395 278996 134627 -145902 -167189 -100210 -376823 -366950 -454401
1500 -454401 -169802 -134238 -178322 -95209 -152690 -377909 -359642 -418755 -408946 -402783 -339602 -168741
1488 -168741 -252614 -320742 -223018 -224091 -38415 216431 -137648 88958 322738 409308 190748
1477 190748 -369055 -657778 -531402 -510345 -909326 -960721 -384415 -238704 -24171 -149864
1467 -149864 -54093 453560 359620 299457 16375 -7607 191242 450400 285114 244815 -87012
1456 -87012 -169126 -226020 -544683 -89739 -288801 -159085 -427726 -114148 202700 -11188
1446 -11188 -24064 -87867 -514518 -181179 180498 261509 46140 334120 427305 331307 124896
1435 124896 124631 -206471 -292565 -279670 -53858 5981 -121002 -68916 323906 450744 433476
1424 433476 297672 -176420 189104 286723 470900 82100 -79322 -66008 -136815 228373
1414 228373 -66023 -258146 -349407 -304113 -255828 -121017 83204 -91567 -128324 -455096
1404 -455096 -206842 203279 480897 818139 503591 146276 2452 113665 -191074 189688
1394 189688 123081 -236778 7160 -69502 -320082 349917 742110 76832 -222474 -745849
1384 -745849 -496720 -48935 -157293 -14796 -22650 75391 155540 262457 -30453 -55823 139591
1373 139591 -76645 252836 462372 333298 -250175 -166748 355027 134818 -362234 -261547
1363 -261547 118622 138868 -391879 -510190 -282578 82004 206203 -79933 92747 225562
1353 225562 202436 -76289 57665 205906 -248306 -216272 -14229 41505 138955 -14410
1343 -14410 149422 -126580 -204536 -547536 -453067 -338895 12753 -210192 -623081 -250940
1333 -250940 -183780 -10930 -31187 130936 -35197 20889 -203452 135510 181474 -322532
1323 -322532 -423327 -500816 -307939 227828 160390 53899 71692 345294 104319 -120674
1313 -120674 -187896 136541 -144993 -86426 187421 -15808 -151070 -78967 -36317 138695
1303 138695 -66433 4148 241072 451771 574162 207480 104033 -121790 13144 -85234
1293 -85234 235396 361705 -182780 -138424 -24217 148758 -147064 -325324 -43426 52922
1283 52922 -334176 -202547 7418 -187854 -534423 -522511 -738994 -347566 7799 -137938
1273 -137938 -305914 -248711 -328171 -276883 -12992 -259478 -497379 -665793 -141358 -20796
1263 -20796 -174143 -169196 -143715 -32409 127418 -239510 119803 -88263 -494355 -524433 -380772
1252 -380772 -294997 -87227 297939 277492 103386 308986 238766 -55418 -108105 115574
1242 115574 95458 302681 79268 -254881 -92595 -272966 102246 133950 -30861 -17722
1232 -17722 -65420 -5249 -40373 -77174 34401 -78339 -268682 -409406 86509 301420 -258989
1221 -258989 -189371 -630777 -681439 -588333 -336626 -135138 -37785 -121846 -408372 -203515 117249
1210 117249 190522 67476 182490 67315 86634 196136 -18902 194402 -182143 -353852
1200 -353852 -108425 -42810 -230303 -89864 -255734 -154639 -254561 -407837 -646136 -665595
1190 -665595 -395908 -428309 -392552 -143361 -264038 -400261 -171832 -388668 -432297 -287671
1180 -287671 -110165 -106376 -449973 -541429 -32229 -157696 -226073 -426480 -454614 -568507 -326793
1169 -326793 -91903 -207699 -410008 -462853 -622145 -182973 -98 -73935 -238577 -223163
1159 -223163 -67490 43388 19034 -190146 -363251 -367981 -70620 -394459 -230018 448866
1149 448866 12405 -210643 53923 -316883 -516579 -258591 -159442 -195597 -274150 -199695
1139 -199695 430307 137196 186583 180233 50950 -182805 -242191 -356832 -237828 -7493
1129 -7493 -285306 59183 146662 32402 -236532 -51320 -430428 -543874 -226752 -141308
1119 -141308 81136 -209945 -57031 -48529 -100493 20980 -103224 -135308 -366386 -56220
1109 -56220 40555 303825 -20623 -469371 -26481 -361091 -523446 9336 250940 454033
1099 454033 29582 -192799 66126 -103100 -50197 -196363 -101167 -92601 -9356 103397 -26743
1088 -26743 -1984 -116928 -363949 -605129 -186427 -145700 -254339 107285 -203099 -321164
1078 -321164 50778 320828 389020 22770 7568 -36087 97090 114097 2884 -104111
1068 -104111 -137725 -279148 -418077 4894 203037 165730 -22022 -219577 -432817 -625541
1058 -625541 -309013 -142564 -142130 -11817 445467 472599 279207 -18182 -463371 -160852
1048 -160852 -138442 -82556 -253556 -323136 -191476 -381122 6440 123476 -316391 -329012
1038 -329012 -121080 -327999 -244186 11763 61384 6421 -213945 -219930 -120615 304944 563557
1027 563557 388044 -130907 -615173 -20010 79183 -357152 -250085 -285212 -221323 -482472
1017 -482472 -267167 35000 170073 232701 232553 234718 201154 -43057 86246 -186347 -237922
1006 -237922 -156612 -591433 -476700 -319451 -223663 -67114 -185348 -101262 280995 96858
996 96858 -157876 -711764 -391652 -220813 -194309 -44722 20819 -11174 45517 198803 -181790
985 -181790 -334736 -32829 97779 77208 -117417 -32716 209146 -118672 28781 -80767
975 -80767 -187166 -336631 -207785 -477371 -412875 -168323 -414371 82662 -71107 -413613
965 -413613 -506228 -441598 -199396 -138923 -388513 -550275 -220560 -289050 -200207 -354538 -417387
954 -417387 99919 364680 -304104 -206059 -113288 -341089 -203698 108531 135598 -43267
944 -43267 -75154 -132827 -400038 -335798 -36316 -36476 -436223 -167046 -606494 -285400 -358381
933 -358381 -397564 -142270 -64962 -156771 -185197 49831 -178075 -190122 -159579 114533 -249892
922 -249892 -127982 -212353 -82848 126958 76693 35450 183294 -134272 -99730 -582095 25740
911 25740 -229271 -871594 -779208 -576141 -554483 -143049 -528023 -653223 74113 231480
901 231480 -412953 -144988 14134 -426801 -692548 -428927 -383720 -118770 188604 31430
891 31430 -37388 -226819 -41958 238105 313768 27321 186220 483832 492623 230530 55450
880 55450 179277 129273 -193641 -164715 597480 370105 -92960 -303755 -255197 44263 -332325
869 -332325 166441 411735 366839 124234 -100209 -239313 -17868 -226890 -42378 -91326
859 -91326 -48312 -139916 -2958 98090 82671 103038 -223093 -537942 -459603 -192521 -193030
848 -193030 218 221059 197812 147879 -138309 -624 -43256 46740 -365840 -523965 -21965
837 -21965 -112812 -40800 -123547 31798 -94131 33366 88911 53932 -7255 -121717 169586
826 169586 -36578 -390454 -184444 33262 61538 257287 -15629 -78837 -72075 129614 255333
815 255333 407312 690385 413431 -141821 -252380 -359131 -712570 -463399 -381800 -166091
805 -166091 -49706 461194 578174 238325 212712 26664 239595 66997 -384081 -47632
795 -47632 -334935 -410751 171255 152210 251011 23677 -27957 -536222 -422004 -179846 31408
784 31408 -26758 40474 337669 38954 247489 372490 188942 -52980 -157283 -188623 -619889
773 -619889 -520196 -42502 -125279 -259487 -651893 -169298 83695 322723 263278 212285 237621
762 237621 -24036 11064 -46758 -7284 -278933 -55312 -280814 -605769 -301133 -254764 75801
751 75801 -100034 -254648 -220623 -96407 -157070 135088 300823 36764 -38105 -62537 -97651
740 -97651 -181603 -120220 -133238 212965 -162810 -103714 324997 -155304 57253 61458 409766
729 409766 -73420 133706 72057 329845 5590 265466 -184547 -11160 553139 595435
719 595435 660086 342986 13371 -473438 -94096 -388062 -337135 -230115 16096 -588583
709 -588583 -264001 290944 -119968 -153350 278756 -135090 150008 321274 364933 176253
699 176253 87048 340172 224137 108468 315523 356997 186756 -166208 146753 351253
689 351253 197324 -229672 -344526 -317802 78692 202477 -194091 164553 216721 -51706
679 -51706 -302209 -400481 59094 229988 94720 -91552 -76870 -260458 -221282 -173768 21475
668 21475 40998 274766 122673 225842 458308 413459 70821 217656 296284 177036 166927
657 166927 159485 98242 251275 -4037 38640 342599 -76203 -28027 21658 343386 420126
646 420126 665611 363827 -217902 -279130 -117557 89582 571094 326902 134131 -38040
636 -38040 78048 267915 6018 -203299 -76150 -180337 -60651 23134 63940 119574 -39736
625 -39736 -222763 -260155 -122328 -24087 173155 282717 265575 272653 39347 205264 97360
614 97360 -429210 -185072 201427 51958 70910 55426 -59639 -44395 238606 -117485 277942
603 277942 278535 -19777 69499 -65691 -69988 383939 321850 -116054 -424761 -33754 132381
592 132381 177626 123603 16271 266039 341919 251299 304096 49204 115491 319035 15425
581 15425 -68228 175255 -36171 -269460 -177554 -174315 -256288 -110240 16180 -79283 -260781
570 -260781 -272081 -34981 -85724 164388 -184142 -254469 -217524 -607505 -410351 -44756 -502234
559 -502234 -390148 -414453 -304469 -18363 -187950 -359443 -139148 -59441 187790 -69813
549 -69813 13018 53579 198303 115998 86561 -106637 37286 178755 57870 173684 130751
538 130751 161233 243129 -181805 -310691 -141042 -294306 45036 152077 86888 278540
528 278540 312051 42420 -177002 -215803 326771 554497 27946 456600 641194 67539
518 67539 41291 140912 -128908 -179724 100050 7512 -161647 257841 87740 7552 232881
507 232881 36778 296262 412460 536133 142570 350458 223900 -34827 316546 512106
497 512106 492091 403529 167890 179652 471262 210021 266255 259053 74616 362 394123
486 394123 241600 65183 -37578 225101 292131 263623 389685 135797 105839 72784 -72111
475 -72111 -17010 212401 274419 216396 163859 441444 260853 290135 166230 -52095 -89115
464 -89115 146697 491745 515669 507399 567763 601684 473259 26470 -151787 -65615 -16721
453 -16721 -106527 292097 129415 -147996 -38181 351469 14588 -146388 -246223 -238468 103382
442 103382 139032 222279 144489 -109509 62958 -153124 -462057 -167547 106269 -85473
432 -85473 -263242 -51804 283985 484940 468512 50640 -90301 79854 350222 464061
422 464061 45235 -207814 -249051 -497601 -504165 164768 118048 -19868 116657 34984 174322
411 174322 241985 -151798 -63965 18023 227083 71358 52232 223981 521264 328206 215660
400 215660 410185 721349 549020 632546 547193 472154 438305 -29486 -53573 -172036 -65751
389 -65751 323652 276240 402844 753350 566051 527446 479498 480176 425581 466539 315022
378 315022 416640 104651 -54529 -48460 400395 611828 173211 123773 276577 172589
368 172589 63754 377587 456479 675485 669078 768167 607169 265197 370463 536757 803974
357 803974 798732 412690 556262 271731 487854 499814 148520 111500 -45292 -25706 207498
346 207498 511423 408595 223842 358405 131648 219512 394153 572227 712548 434698
336 434698 315752 224848 -54800 72987 241287 71899 237314 -82492 100040 210701
326 210701 112821 -180229 -315937 79994 419816 547136 830979 443526 290106 -130137
316 -130137 -294367 280979 306574 184404 56298 236162 587576 665554 10765 151001
306 151001 88315 106988 334785 575444 553220 490385 587232 572469 668171 252940 412608
295 412608 399531 546604 224755 167722 502206 669710 586123 558791 336413 -72844 -346074
284 -346074 109072 125432 29705 171917 365809 718482 304679 305583 293563 588728 438537
273 438537 313501 332890 301902 376552 -57515 146872 446848 333676 435393 48892
263 48892 250291 358681 376300 499961 576756 139542 -118561 272760 362894 262076 379246
252 379246 422206 584833 836177 410050 585359 692729 642816 636806 461786 400183 142725
241 142725 249156 398699 448634 331173 369766 406446 283442 117772 82985 -37887 194967
230 194967 672731 385238 151954 252177 -65742 -349845 -178935 173953 286432 250558
220 250558 534828 772090 907790 931164 631408 922238 901868 765170 941530 820923
210 820923 613464 491250 794186 764814 551778 454268 155879 331240 822257 1010948
200 1010948 1114441 622198 422020 421495 329618 379833 316147 278885 401867 492017 544111
189 544111 399267 532712 453812 -48584 -185124 209817 467728 375146 535851 603842
179 603842 187909 41539 158499 454458 364148 301653 340215 618853 741775 561597
169 561597 200102 461631 554976 293658 629374 442645 509118 551243 478259 345431 259711
158 259711 338320 229579 56793 -175193 7835 85614 220572 -30219 268470 157106
148 157106 127183 182897 83505 153499 252833 532214 457028 267513 -145156 177718 534684
137 534684 431432 476186 687018 363269 278805 376119 492242 134077 97659 376340 484693
126 484693 142600 -14553 57023 169382 137152 229495 86491 247829 78449 490504
116 490504 438189 194970 472883 347565 812737 664294 577567 642475 502548 404248 617586
105 617586 267736 287173 704255 407649 612741 470311 454813 663810 640398 374309
95 374309 314611 414219 581701 668463 748018 482217 521735 439124 557389 394628 267233
84 267233 349511 321428 638599 149483 228442 549012 383197 428931 691172 483578 313165
73 313165 319353 69600 346265 549637 15431 241578 464305 621453 685557 840911 614701
62 614701 294464 319627 303512 156377 582003 520453 646319 413330 145735 203303 393714
51 393714 594277 646435 507926 165736 449037 471124 350211 329317 430785 406111 237945
40 237945 418367 466919 587773 654887 914735 392879 326357 434027 467290 610970 672944
29 672944 712687 554399 817498 799868 581670 546602 790260 648118 537404 238833 320474
18 320474 275498 72602 155643 447719 588438 540329 292607 9011 214771 264410 160599
7 160599 461459 255542 272594 408552 619920 563396 309991
0 309991
$$ Imaginary data points
##PAGE= N=2
##DATA TABLE= (X++(I..I)), XYDATA
16383 -1523420 -1837856 -1876811 -1543010 -1437530 -1264293 -1270924 -1327422 -1198975 -1397814 -1417235
16373 -1417235 -1489528 -1512196 -1376448 -1339668 -1005030 -871392 -806550 -1015825 -1302834 -1308614
16363 -1308614 -1548415 -1196435 -830006 -917377 -999611 -985559 -903861 -1121161 -847672 -737445
16353 -737445 -692160 -830419 -805368 -848325 -715415 -490937 -583546 -243804 79148 -157159
16343 -157159 -177803 -450605 -163033 -186374 -143401 -236595 -253736 84737 -60471 -305088
16333 -305088 -216534 -78206 35131 148062 -197903 69642 535400 518727 193782 233148
16323 233148 146484 -15274 153778 243427 370494 354048 534443 621536 526002 667191
16313 667191 543598 911144 877510 702203 578878 718249 507663 678824 620058 450786
16303 450786 285890 585174 666299 268235 379491 475697 654037 914356 863428 912243
16293 912243 837769 895744 1084638 962006 916429 1209724 1258826 1024960 691207 936432
16283 936432 1319386 1057609 1444076 1207970 1090466 1221575 1428524 1522911 1473509 1658650
16273 1658650 1704403 1475415 1726940 1715142 1636569 1431002 1521146 1760104 1523417 1492093
16263 1492093 1319752 1551719 1719141 1568010 1707435 1743808 1440616 1824619 2019364 1704392
16253 1704392 1752920 1866310 1616081 1721945 1934294 1711633 1948535 1651085 1729117 1711361
16243 1711361 1794840 2391253 2292816 1670786 1389835 1872673 1855824 1945458 2223869 2114488
16233 2114488 2162073 1949581 1954395 2025979 2021247 2218770 2254921 1821136 1834225 2058113 2039462
16222 2039462 2007704 2011284 1864629 2269571 2421130 2361861 2737519 2653632 2554042 2317280
16212 2317280 2425941 2457632 2343350 2325304 2323993 2353508 2427118 2511106 2622039 2546647 2398439
16201 2398439 2355498 2554815 2982389 2591930 2607391 2424719 2650544 2692303 2576337 2418037
16191 2418037 2237175 2783958 2566283 2617042 2725691 3039898 3216348 3173360 2943501 2581892
16181 2581892 2625547 2988705 2743176 2481243 2901753 3292773 3132631 2622777 2963910 2902270
16171 2902270 2883350 2892511 2913654 2823769 2496742 2934171 2929371 2788790 2752988 3040396 3091869
16160 3091869 3322988 2847878 2969969 3286669 3382426 3405566 3137649 2900803 2961585 3054685
16150 3054685 3357273 3084444 3006756 2850770 2580760 2707793 2828579 2750353 2828843 3137973
16140 3137973 3161341 3127415 2969955 2900119 3105044 3364551 3270120 3128004 3074743 3274648
16130 3274648 2983862 3058477 3265391 3244550 3292471 3394681 2997011 3139906 3043573 3228056
16120 3228056 3238846 3229082 3125004 2880552 3025399 3007534 2746679 3044090 3242790 2642344
16110 2642344 2635463 2864962 3138845 3381957 3451400 3563869 2750303 2879971 3312680 3230752
16100 3230752 2917988 2859423 3081969 3344224 3440570 3343446 3190384 2570455 2730089 2765265
16090 2765265 2745196 2845684 3387508 3365707 3159742 3034271 3278443 3521047 3467516 3252034
16080 3252034 3484564 3646035 3525031 3188324 3412962 3414753 3335704 3724799 3558641 3454439
16070 3454439 3336431 3404380 2965424 3168402 3497553 3317495 3524330 3424348 2773963 3167328
16060 3167328 3153323 2799165 3175818 3194933 3336819 3586592 3907359 3751817 3619856 3294209
16050 3294209 3126450 3339179 3047571 3046741 2963099 3013362 3107435 3249113 3451019 3226885
16040 3226885 3314690 3341272 3083777 3058842 3062822 2727635 3033034 3340904 3132633 3078994
16030 3078994 2916133 3332578 3388849 3094631 2906916 3210850 3257618 3568314 3981563 3477311
16020 3477311 3381452 3193087 3147786 3268576 2948819 3115897 3210235 3382783 3250872 3396329
16010 3396329 3263404 3355196 2965147 3297069 3246119 3002339 3316073 2971395 2839791 2987874
16000 2987874 3216772 2730129 3103728 3214920 3410605 3081202 3106229 3430534 3386132 3440296
15990 3440296 3142338 3284783 3517954 3166879 3364482 3494350 3399567 3330138 3469570 3299332
15980 3299332 3461083 3629312 3262182 3219480 3438008 3623378 3437178 3340003 3162286 3393984
15970 3393984 3375475 2989285 3078261 3431129 3040543 2698077 3326992 3357814 3094252 2976146
$$ [...]
##END NTUPLES=NMR SPECTRUM
##END=
