##TITLE=1H_EC-3265(1-3)
 CDCl3
 8 sc, 
 10.12.2021
##JCAMPDX= 6.0         $$ Bruker NMR JCAMP-DX V2.0
##DATA TYPE= NMR SPECTRUM
##DATA CLASS= NTUPLES
##ORIGIN= UXNMR, Bruker Analytische Messtechnik GmbH
##OWNER= root
$$ XWIN-NMR		Version 3.5
$$ Fri Dec 10 11:56:45 2021 Russian Standard Time (UT+4h)  she@DPX200
##.OBSERVE FREQUENCY= 200.131346
##.OBSERVE NUCLEUS= ^1H
##.ACQUISITION MODE= SIMULTANEOUS
##.ACQUISITION SCHEME= undefined
##.AVERAGES= 8
##.DIGITISER RES= 18
##SPECTROMETER/DATA SYSTEM= spect
##.PULSE SEQUENCE= zg30
##.SOLVENT NAME= CDCl3
##.SHIFT REFERENCE= (INTERNAL, CDCl3, 0, 15.7171)
##AUDIT TRAIL= $$ (NUMBER, WHEN, WHO, WHERE, WHAT)
$$ ##TITLE= Audit trail, XWIN-NMR		Version 3.5
$$ ##JCAMPDX= 5.01
$$ ##ORIGIN= Bruker BioSpin GmbH
$$ ##OWNER= she
$$ F:/spectra/data/she/nmr/H-F/1/pdata/1/auditp.txt
$$ ##AUDIT TRAIL=  $$ (NUMBER, WHEN, WHO, WHERE, WHAT)
(   1,<2021-12-10 11:55:31.87 +0400>,<she>,<DPX200>,
      <created by zg, POWCHK disabled, PULCHK disabled
       configuration hash MD5:
       00 E9 B6 7A A2 85 ED C7 34 08 36 98 17 FE 4E 26
       data hash MD5: 16K
       12 F1 E2 72 9F 1E CE E3 DE 7D 18 F1 94 CE DB E9>)
(   2,<2021-12-10 11:55:34.65 +0400>,<she>,<DPX200>,
      <Start of raw data processing
       efp BC_mod = 2 LB = 0.24 FT_mod = 6 PKNL = 1 PHC0 = -15870.73 PHC1 = 10.2008 SI = 16K 
       data hash MD5: 16K
       26 51 55 75 69 9B 56 8C AC CF A5 B8 3D 12 57 2A>)
(   3,<2021-12-10 11:55:50.73 +0400>,<she>,<DPX200>,
      <pk PHC0 = -3.129357 PHC1 = 4.4 
       data hash MD5: 16K
       D5 DE 92 CE D3 41 32 43 74 D6 FE 1A 5A 8F 4B 25>)
(   4,<2021-12-10 11:55:53.68 +0400>,<she>,<DPX200>,
      <abs ABSG = 5 
       data hash MD5: 16K
       65 A3 AC ED A6 51 9E A7 12 8B 41 3D 1F 3E 6D EB>)
$$ ##END=
$$ 
$$ hash MD5
$$ 5B 63 C6 C3 A8 4C 0C 3E 6E E7 84 8D F6 99 63 B3
##$RELAX= 
##$RELAX= 
##$RELAX= 
##$RELAX= 
##$RELAX= 
##$RELAX= 
$$ Bruker specific parameters
$$ --------------------------
##$DU= <F:/spectra>
##$EXPNO= 1
##$NAME= <H-F>
##$PROCNO= 1
##$TYPE= <nmr>
##$USER= <she>
##$AMP= (0..31)
100 100 100 100 100 100 100 100 100 100 100 100 100 100 100 100 100 100 
100 100 100 100 100 100 100 100 100 100 100 100 100 100 
##$AQSEQ= 0
##$AQ_mod= 1
##$AUNM= <au_zg>
##$AUTOPOS= <>
##$BF1= 200.13
##$BF2= 200.13
##$BF3= 200.13
##$BF4= 200.13
##$BF5= 200.13
##$BF6= 200.13
##$BF7= 200.13
##$BF8= 200.13
##$BYTORDA= 1
##$CFDGTYP= 0
##$CFRGTYP= 5
##$CHEMSTR= <none>
##$CNST= (0..31)
1 1 145 1 1 1 1 1 1 1 1 1 1 1 1 1 1 1 1 1 1 1 1 1 1 1 1 1 1 1 1 1 
##$CPDPRG= <>
##$CPDPRG1= <>
##$CPDPRG2= <>
##$CPDPRG3= <>
##$CPDPRG4= <mlev>
##$CPDPRG5= <mlev>
##$CPDPRG6= <mlev>
##$CPDPRG7= <mlev>
##$CPDPRG8= <mlev>
##$CPDPRGB= <>
##$CPDPRGT= <>
##$D= (0..31)
0 1.2 0 0 0 0 0 0 0 0.06 0 0.03 0 0 0 0 0.0002 0 0 0 0 0 0 0 0 0 0 0 0 
0 0 0 
##$DATE= 1639122931
##$DBL= (0..7)
120 120 120 120 120 120 120 120 
##$DBP= (0..7)
150 150 150 150 150 150 150 150 
##$DBP07= 0
##$DBPNAM0= <>
##$DBPNAM1= <>
##$DBPNAM2= <>
##$DBPNAM3= <>
##$DBPNAM4= <>
$$ [...]
##$SUBNAM2= <"">
##$SUBNAM3= <"">
##$SUBNAM4= <"">
##$SUBNAM5= <"">
##$SUBNAM6= <"">
##$SUBNAM7= <"">
##$SUBNAM8= <"">
##$SUBNAM9= <"">
##$SW= 18.0517287032376
##$SWIBOX= (0..15)
0 0 2 0 0 0 0 0 0 0 0 0 0 0 0 0 
##$SW_h= 3612.71676300578
##$TD= 16384
##$TD0= 1
##$TE= 0
##$TE2= 300
##$TE3= 300
##$TEG= 300
##$TL= (0..7)
0 120 120 120 120 120 120 120 
##$TP= (0..7)
150 150 150 150 150 150 150 150 
##$TP07= 0
##$TPNAME0= <>
##$TPNAME1= <>
##$TPNAME2= <>
##$TPNAME3= <>
##$TPNAME4= <>
##$TPNAME5= <>
##$TPNAME6= <>
##$TPNAME7= <>
##$TPOAL= (0..7)
0.5 0.5 0.5 0.5 0.5 0.5 0.5 0.5 
##$TPOFFS= (0..7)
0 0 0 0 0 0 0 0 
##$TUNHIN= 0
##$TUNHOUT= 0
##$TUNXOUT= 0
##$USERA1= <user>
##$USERA2= <user>
##$USERA3= <user>
##$USERA4= <user>
##$USERA5= <user>
##$V9= 5
##$VALIST= <valist>
##$VCLIST= <CCCCCCCCCCCCCCC>
##$VD= 0
##$VDLIST= <DDDDDDDDDDDDDDD>
##$VPLIST= <PPPPPPPPPPPPPPP>
##$VTLIST= <TTTTTTTTTTTTTTT>
##$WBST= 1024
##$WBSW= 4
##$XGAIN= (0..3)
0 0 0 0 
##$XL= 0
##$YL= 0
##$YMAX_a= 116166
##$YMIN_a= -192557
##$ZGOPTNS= <>
##$ZL1= 120
##$ZL2= 120
##$ZL3= 120
##$ZL4= 120
##$ABSF1= 15.71714
##$ABSF2= -2.334709
##$ABSG= 5
##$ABSL= 3
##$ALPHA= 0
##$AQORDER= 0
##$ASSFAC= 0
##$ASSFACI= 0
##$ASSFACX= 0
##$ASSWID= 0
##$AUNMP= <proc_1d>
##$AZFE= 0.1
##$AZFW= 0.1
##$BCFW= 0
##$BC_mod= 2
##$BYTORDP= 0
##$COROFFS= 0
##$CY= -3
##$DATMOD= 1
##$DC= 0
##$DFILT= <>
##$DTYPP= 0
##$F1P= 0
##$F2P= 0
##$FCOR= 1
##$FTSIZE= 16384
##$FT_mod= 6
##$GAMMA= 0
##$GB= 0
##$INTBC= 1
##$INTSCL= 0
##$ISEN= 128
##$LB= 0.24
##$LEV0= 0
##$LPBIN= 0
##$MAXI= 10000
##$MC2= 0
##$MEAN= 0
##$ME_mod= 0
##$MI= 1.114404
##$NCOEF= 0
##$NC_proc= -7
##$NLEV= 6
##$NOISF1= 3.799351
##$NOISF2= 2.8
##$NSP= 0
##$NTH_PI= 0
##$NZP= 0
##$OFFSET= 15.71714
##$PC= 1
##$PHC0= -15873.86
##$PHC1= 14.6008
##$PH_mod= 1
##$PKNL= yes
##$PPARMOD= 0
##$PSCAL= 0
##$PSIGN= 0
##$REVERSE= no
##$SF= 200.130006887823
##$SI= 16384
##$SIGF1= 3
##$SIGF2= 2
##$SINO= 5.538805
##$SIOLD= 16384
##$SREGLST= <1H.CDCl3>
##$SSB= 0
##$STSI= 16384
##$STSR= 0
##$SW_p= 3612.71676300578
##$SYMM= 0
##$S_DEV= 0
##$TDeff= 16384
##$TDoff= 0
##$TI= <>
##$TILT= no
##$TM1= 0
##$TM2= 0
##$TOPLEV= 0
##$USERP1= <user>
##$USERP2= <user>
##$USERP3= <user>
##$USERP4= <user>
##$USERP5= <user>
##$WDW= 1
##$XDIM= 16384
##$YMAX_p= 287119549
##$YMIN_p= -2039448
$$ End of Bruker specific parameters
$$ ---------------------------------
##NTUPLES= NMR SPECTRUM
##VAR_NAME=  FREQUENCY,     SPECTRUM/REAL,   SPECTRUM/IMAG
##SYMBOL=    X,             R,               I
##VAR_TYPE=  INDEPENDENT,   DEPENDENT,       DEPENDENT
##VAR_FORM=  AFFN,          ASDF,            ASDF
##VAR_DIM=   16384,         16384,           16384
##UNITS=     HZ,            ARBITRARY UNITS, ARBITRARY UNITS
##FACTOR=    0.220516191357247, 1,           1
##FIRST=     3145.47137603337, 0,            0
##LAST=      -467.245386972411, 0,           0
##MIN=       -467.245386972411, -2039448,    0
##MAX=       3145.47137603337, 287119549,    0
$$ Real data points
##PAGE= N=1
##DATA TABLE= (X++(R..R)), XYDATA
$$ [...]
9377 2075494 2255313 2143183 2002732 1982095 2167075 2202340 2044352 2334563 2449727 2518563
9367 2518563 2498446 2227314 2287501 2389797 2452082 2573120 2676248 2868002 2971646 3013527
9357 3013527 3037506 3178265 3385374 3311438 3514911 3815238 3780933 3997279 4349727 4743619
9347 4743619 4921127 4833024 4792257 4936774 5017995 5220578 5388478 5617654 5610140 5772010
9337 5772010 5881924 5839991 5987878 6221352 6314041 6501243 6699317 6909201 7204700 7552255
9327 7552255 7761461 7678777 7734366 7906870 8253837 8414923 8434881 8147131 7826706 7715149
9317 7715149 7644766 7518307 7286440 7432580 7698556 7713601 7800319 7783229 7904045 7957647
9307 7957647 8084608 8044011 8218343 8139999 8169878 8188585 7998952 7740995 7696424 7723105 7932339
9296 7932339 7807749 7770980 7964052 8411753 8465081 8234058 8256963 8471279 8719305 8844964
9286 8844964 8792756 8545953 8453830 8299744 7980828 7414706 7010635 6674098 6151427 5975667
9276 5975667 5886084 5837384 5887918 5810223 5452421 5319802 5391208 5267889 5304911 5068905 5046803
9265 5046803 4764483 4659146 4461999 4263100 4219233 4014064 4145793 4049201 3890032 4017058
9255 4017058 3823706 3787109 3818444 3656113 3688714 3775109 3980294 4016005 3936370 4169024 4334038
9244 4334038 4009576 4158826 4306369 4254720 4209450 4087754 4196714 4203962 4262566 4039322
9234 4039322 3977965 3659922 3537471 3252969 3226524 3352890 3282838 3205244 3429518 3426503 3221883
9223 3221883 3141066 3300026 3449886 3439705 3444895 3404527 3672081 3525895 3423109 3552438
9213 3552438 3699628 3985914 4222057 4124947 4130602 4105864 4258480 4469558 4595356 4474951
9203 4474951 4511160 4692970 4822536 4981111 4667571 4749423 4824940 4668237 4276620 4021233
9193 4021233 4098112 4038461 4088585 4091781 4034478 3899398 3961130 3866107 3798258 3605695 3531035
9182 3531035 3774357 3845149 3661429 3631650 3543257 3547918 3800871 3877149 3870298 3832284 3849491
9171 3849491 4091117 4145580 4277547 4246277 4099093 4280801 4475758 4277470 4252201 4243657
9161 4243657 4285787 4428419 4539925 4496915 4395120 4501321 4536492 4809123 4835026 4791810
9151 4791810 4917506 5064546 5125544 5033112 5315212 5571392 5742571 5924812 6054311 6182694
9141 6182694 6367626 6301559 6318838 6560521 6778159 7008616 6904242 7160255 7446449 7682775
9131 7682775 8026781 8060830 8332441 8641303 9195931 9422749 9705443 10471238 10902157 11309239
9121 11309239 11732595 12286335 12898202 13588411 14131546 14631244 14904375 15500439 16142294
9112 16142294 16824883 17243032 17664108 17915153 18402433 18777734 19043772 19798451 20635834
9103 20635834 21288503 22180108 23474369 25079817 26724711 28776646 31354252 33745481
9095 33745481 36096880 38809211 42109466 46145087 49637668 50525785 50779008 52048678
9087 52048678 54239927 57555475 60359071 60213249 58046709 54466229 50340382 47193571
9079 47193571 44802402 43202654 42051850 41546224 40890420 40141701 39085991 38085609 36881689
9070 36881689 35983827 35634102 35583889 36083059 36771670 38186483 39819841 41875238 44770550
9061 44770550 48111706 51095211 53787065 56764058 59907311 62034467 63623480 65652877
9053 65652877 69159382 73894014 76453794 76096953 75507527 74802265 73592197 70498875 64095357
9044 64095357 56702703 50593118 45654342 41627963 38439997 35871202 33707167 32147082
9036 32147082 31173417 30213561 28971635 27541125 26370707 25424485 24940937 24616660 23809937
9027 23809937 23599548 23313678 22948848 22786914 22665927 22298384 21902654 21492563 21279499
9018 21279499 21307024 21128649 21068515 21035657 20810979 20397733 20034718 19371440 18723084 17858143
9008 17858143 17027807 16578446 16184772 15784456 15170720 14810170 14347645 13753695 13256861
8999 13256861 12915636 12397145 12084609 11866928 11733350 11852826 11777919 11588997 11553006 11536360
8989 11536360 11407886 11622429 11616680 11687235 11819715 11725056 11639225 11590169 11865877 11961986 11798698
8978 11798698 11746244 11647668 11529874 11518806 11139489 10822798 10764181 10724124 10811336 10922331
8968 10922331 10799253 10773804 10767875 11064014 11032988 11009657 11008615 11101749 11134306 11118058 11202734
8957 11202734 11083981 11416677 11760424 12115344 12126338 12322415 12547074 12879518 13160070 13453400
8947 13453400 13981676 14377298 14805715 15376185 15426143 15487171 15500610 15707122 15762934 15700786
8937 15700786 15648905 15576040 15641696 15789300 15999116 16018154 15875615 15939598 16459897 17074671
8927 17074671 17558853 18157870 18968998 19861403 20539820 21124708 21093337 20618526 20311291 19800208
8917 19800208 19300343 19050594 18849361 18958093 19209990 19419682 19474213 19614051 19618742 19696145
8907 19696145 19881296 20033885 20334458 20615564 20654969 20760693 20821282 21423919 22089595 22507029
8897 22507029 23018314 23574349 24048858 24715584 25427512 26259243 27351273 28203940 29473945
8888 29473945 30775316 32256915 33914991 35600126 37501232 39201235 40791697 42667358
8880 42667358 45081627 47923330 50032701 51384593 52548452 53703547 54006485 52517845
8872 52517845 49645590 47451300 46046572 45159045 44702095 44725061 45014574 44840829 44484093
8863 44484093 43793159 43430920 43388869 43720104 44739187 45943635 47304405 48868896 50683273
8854 50683273 52620658 55024414 57105972 58922598 61123162 63915193 67099635 70449038
8846 70449038 73992458 78044591 81623043 84342582 86646315 87044076 85011168 80960514
8838 80960514 76033167 71872217 69094689 67510809 66061439 63052762 59429732 56294357
8830 56294357 53760983 51606870 49405541 47300012 45550215 44645483 43959315 43297257 43026995
8821 43026995 43040206 43106600 43294272 43900002 44557909 45247956 46086768 47241899 48808236
8812 48808236 49902027 50281818 50313790 51203331 52617984 53971745 55015513 55895530 55069341
8803 55069341 52883964 49685578 45492132 41945964 39051097 36548655 34944193 33702104
8795 33702104 32834238 31973850 30827111 29636268 28118765 26618244 25290185 24186860
8787 24186860 23379593 22649441 22069433 21408807 20789309 20138320 19711822 19445815 18769956
8778 18769956 18140364 17932642 17419025 16885554 16696652 16656149 16268103 16135309 16244484 15843910
8768 15843910 15637957 15654848 15653517 15551429 15500592 15576609 15604964 15738526 15824049 15906725 15965083
8757 15965083 16002334 16145320 16215078 16566591 16813085 17098998 17333966 17727646 17914477 18212530
8747 18212530 18619077 18979405 19361583 19832243 20200637 20725655 21118161 21424589 21575172
8738 21575172 22058016 22784264 23390681 24317636 25407836 26553251 28133061 29759585 31791488
8729 31791488 33915321 36762254 40392228 44220080 48962810 54578366 60340285 66071985
8721 66071985 72661150 81358400 91545007 104183511 119899513 136841269 133694000 113550879
8713 113550879 97355559 85588712 74936987 64506937 56543726 50245114 45542703
8706 45542703 42021686 39370207 37064070 34921631 33301877 32313930 31715235 31333788 31104973
8697 31104973 31216237 31282719 31819788 32752206 33855985 34080939 34441101 35270762 36683368
8688 36683368 38201497 40433972 42912344 44374153 44911208 44219406 42210926 39137992
8680 39137992 36011477 33655808 31891944 30307601 29267934 28756695 28113752 27028478
8672 27028478 25510278 24410516 23197722 21881428 20878117 20082824 19198091 18571817 18027927
8663 18027927 17603582 17406083 17459224 17749398 18011513 18464513 19193992 19430876 19542539 19530119
8653 19530119 19823794 20297945 20821423 20429959 19548323 18934057 18355468 18090383 17531106
8644 17531106 16658589 15583781 14735937 14099112 13345310 12914704 12425659 11935209 11274982
8635 11274982 10298154 9681987 9337092 8780476 8401380 8033363 7705504 7452043 7121238
8626 7121238 6827329 6652118 6434014 6242953 6327629 6144790 5913200 5768520 5679904 5585673
8616 5585673 5425265 5220625 5385842 5131868 5164378 5321403 5260517 5044292 4868141 4815552
8606 4815552 4857597 4724287 4349535 3990151 3908601 3936667 3970647 3891426 3586922 3237116
8596 3237116 3025535 3115246 2736313 2662248 2820704 2642382 2414645 2458791 2383095 2034447
8586 2034447 2001470 1920594 2026598 2037659 2141356 2393308 2254235 2167013 2151036 2221654 2154395
8575 2154395 1864042 1850110 1927010 1850200 1723947 1592806 1497843 1455784 1393084 1254351 1283873
8564 1283873 1244607 1250836 1428400 1471914 1330200 1228618 1263449 1103022 1154156 1136745 1095550
8553 1095550 1079681 1121893 935053 870017 959474 957042 762304 905190 862666 700576 617010
8542 617010 615208 623421 623296 826192 870513 957335 976291 873111 678476 728736 666456 685925
8530 685925 819478 641022 647740 798373 608357 697517 754289 882468 738279 593591
8520 593591 553108 322352 366946 442533 410001 376830 525285 675608 695800 668500 522717
8509 522717 498155 579220 528535 642101 518672 501938 630055 699958 613907 505399 335513
8498 335513 346887 237447 422726 402399 354067 249394 89794 134532 200086 329995 310309
8487 310309 407116 366003 287185 262398 337650 383935 209141 296218 502103 562331 631577
8476 631577 467222 435954 373478 281129 208147 175739 308328 440893 334875 208329 206674
8465 206674 4343 217351 481690 466422 374019 197266 200686 148962 387232 216399 216736
8454 216736 170853 190979 142337 134974 84935 136711 190401 217678 239047 246859 172748 110993
8442 110993 158708 119660 -15739 28447 119620 98909 162236 161223 24327 -166024 148441
8431 148441 130238 -12853 21945 -108965 -5373 -13162 84783 -229624 -165474 -41031 -63506
8420 -63506 60912 174945 108319 107307 285418 269064 87744 -49868 -32312 -145074 -61014
8409 -61014 64878 -7420 -104438 76388 -147024 -149855 -98491 -165702 -164215 -55847 -213629
8398 -213629 -260726 -225540 -106969 -90218 -124289 -195166 -167680 -151875 -156579 -240519 -182352 -70907
8386 -70907 -120933 -172004 -229422 -59126 -102383 60514 -39192 -60304 -26353 -23599 -143123
8375 -143123 -89426 -83041 -324016 -293972 -145208 -130410 -253422 -132286 -211263 -101835 -45790
8364 -45790 65828 106393 42273 -53240 32968 26943 6366 74832 32109 -28989 -79935 -38266
8352 -38266 1324 -251546 -365701 -375589 -306075 -359732 -356738 -287527 -273174 -238435 -242971 -224327
8340 -224327 -150452 9650 3445 -12961 11216 -24584 -190802 -233523 -211160 -115118 -173022
8329 -173022 -276403 -241326 -325286 -528028 -214678 116278 -77864 -221966 -125941 23467
8319 23467 80227 -142227 -144342 -93708 -28952 -172016 -197556 -334246 -257785 -24024 46868
8308 46868 19882 -117543 -154276 -162688 163173 76209 -71622 -67452 -75298 -86538 -277468 -186469
8296 -186469 11172 -120398 -151929 33966 -1055 119781 162094 -37139 3930 110330
8286 110330 -25842 -49844 12649 99339 80229 -128997 -145514 -176866 79755 -25305 -111367
8275 -111367 -342558 -409393 -258518 -180245 -14498 -236863 -405293 -182622 -56299 -98110
8265 -98110 -62533 -32044 -43738 -310670 -171654 -48192 -153944 -126608 -91185 -136128 -115084
8254 -115084 14465 -77879 -244909 -251752 -254898 -94652 -76749 -118255 50065 30639 -237310
8243 -237310 -138846 54070 16969 43685 119972 360938 388801 108063 -75514 -53224 -88468
8232 -88468 -2631 53796 -104046 -214511 -115667 -252971 -148994 -151248 -195521 -179824 -101745
8221 -101745 9807 -39932 -258627 -301902 -184708 -104350 -212062 -84491 72041 -197792
8211 -197792 -205798 -341959 -293226 -103934 -91095 -152908 54071 64511 -17017 -180162 -156926
8200 -156926 -147551 -221558 -330432 -204574 91304 8437 -26820 495449 -1660172 -2039448
8190 -2039448 -858641 -714727 -575247 -840570 -586282 -436726 -403660 -509995 -360281 -656921
8180 -656921 -717051 -580565 -392885 -340864 -343191 -386424 -348772 -199221 -164625 -340099 -415339
8169 -415339 -483783 -402222 -438125 -352061 -408952 -328182 -387473 -275789 -59804 -177474 -258580
8158 -258580 -366334 -470857 -460025 -523066 -426483 -344697 -274808 -8593 -106231 -391918 -256998
8147 -256998 -238951 -317421 -334461 -503294 -404545 -494499 -340041 -211412 -315440 -271196 -173618
8136 -173618 -178297 -330430 -333837 -400232 -405531 -117476 -195149 -422286 -257097 -191825 -317617
8125 -317617 -189988 -14286 -308622 -472164 -240760 -264898 -398711 -189211 -183775 -282501
8115 -282501 -292170 -524013 -478333 -311210 -335357 -328245 -162868 -55047 -216956 -296505 -209025
8104 -209025 -297941 -323768 -331754 -254351 -413080 -348811 -283618 -278971 -308739 -302089 -266926 -148723
8092 -148723 -162662 -304829 -181246 -288003 -254296 -302421 -300398 -189445 -257895 -301336 -250454
8081 -250454 -168496 -69199 -40440 -142838 7742 -60492 -395365 -371777 -246362 -271863 -360155
8070 -360155 -396366 -204249 -82440 -96678 -98903 -253313 -257283 -98697 -199121 -358519 -168103
8059 -168103 -321937 -412430 -173972 -251274 -96782 59011 -75966 -128166 -8606 -54280
8049 -54280 -332612 -247209 -177760 -126681 -82912 57968 -151622 -266236 -232007 -432096 -325082
8038 -325082 -322581 -326150 -154827 -76344 21331 58427 -11276 -184647 -210100 -110627 -87110 -183968
8026 -183968 -355470 -427630 -427542 -411101 -372482 -312073 -313303 -324203 -300550 -470672 -198597 -151071
8014 -151071 -232043 -30576 52382 -136661 -121113 126523 -41955 -145089 -20975 13769
8004 13769 -18141 -122308 -242203 -304853 -338810 -216063 -356094 -163521 -110825 -178972 -213298
7993 -213298 -362604 -476621 -324353 -143028 -105766 -220071 -87778 -7848 -129829 -272929
7983 -272929 -155401 -115940 -428757 -396607 -300258 -404248 -184498 168242 73395 -72912
7973 -72912 -165428 -40972 -169169 -250214 -130572 -256621 -147607 -99314 -134015 -83682 -142511
7962 -142511 1885 -202170 -300903 -327249 -406804 -184916 -226894 -288615 -315758 -131758 -209733
7951 -209733 -287413 -213761 -127309 -131104 -98393 -259353 -259494 -35430 -76884 -199941 -132965 59640
7939 59640 95135 15871 220311 170060 -57779 -109238 -345343 -411060 -405603 -176403 17399
7928 17399 -182547 -183596 -263855 -242169 -310190 -303632 -402464 -376065 -71769 -39306 -66690 -287291
7916 -287291 -418270 -510207 -381812 -451102 -321919 -121824 -160328 -222370 -326037 -303806 -112263
7905 -112263 -148089 -124691 -250972 -338184 -225318 -71400 -352119 -359430 -327945 -237224 -238390
7894 -238390 -311468 -187952 -211296 -129638 -223142 -145261 -318912 -228226 -96565 -141734 -26193
7883 -26193 -77059 -14410 -57416 -244324 -367220 -111179 -161232 -21085 -47338 -44675 -96006
7872 -96006 -265505 -64071 -339468 -356264 -242449 -295149 -338110 -154250 51519 52593 -37596
7861 -37596 17055 36414 -106237 -73055 9714 -74478 -168756 -319692 -137606 -163868 -87498
7850 -87498 25669 -15117 -146184 -84644 61697 45566 58143 -157219 -36696 -62318 -3739
7839 -3739 14769 43531 132948 -19312 -74990 -3516 -45833 -15159 81645 -154182 -227994 -114897
7827 -114897 -28157 -144548 -155274 -137978 -174380 -101008 -108301 -87782 -173986 -196004 -246096 -215217
7815 -215217 -231550 -302165 -170531 22656 -204481 -294277 -71213 70343 -38879 -177179
7805 -177179 -111392 500 128632 -142980 -442638 -166547 -264127 -384562 -323799 -279650
7795 -279650 -364023 -372012 -486953 -443905 -373308 -204994 -17634 -161512 -134646 -215406 -62901
7784 -62901 -171580 -185536 -353458 -317553 -258647 -428300 -435787 -188958 -123119 -51225 -92914
7773 -92914 -41622 -32126 75663 -64615 -263951 -151136 -195426 -170043 -222480 -336285 -214848
7762 -214848 -264535 -251606 -195790 -108285 -124154 -238171 -156825 -58510 24891 -23289 -45476
7751 -45476 -23219 -178188 -42270 131352 150000 -74305 -252895 -285924 -413935 -248268
7741 -248268 -74320 -41799 -135057 -153251 -202190 -244277 -200602 -291594 -84510 -129487 -167806
7730 -167806 -64749 -122019 -175793 -194410 -65644 -37128 -49119 -38911 -111430 -200485 -112054
7719 -112054 -102149 -26695 -144306 -250708 -227125 19139 -88335 -221481 -150099 17721 -3150
7708 -3150 -216790 -265360 -217686 -32006 -149590 -239331 -180784 -182055 -168088 -276472 -96754
7697 -96754 65207 62662 49987 23357 17659 -18466 -79865 -91833 -137022 20381 -29097 -187304
7685 -187304 -227242 -141702 -132228 90090 -108388 81271 86470 -32980 85392 -23826 57863
7674 57863 195078 -44737 -35847 -82896 -187070 41520 74539 150642 32177 -1857 -38833
7663 -38833 -104547 -99105 -38206 -16 189280 -158432 -275485 179265 123420 -131287 -199737
7652 -199737 -23380 -35189 -220094 -158550 -136293 38600 155322 -13118 104752 79896
7642 79896 16648 178530 -8360 -27166 -134416 -217962 -263993 -222303 -173039 -135107 -47808
7631 -47808 -99012 -180890 -86170 -38178 -48531 -183747 -141122 -116879 -78451 24483 -113782
7620 -113782 -136181 -21206 -104535 -145681 -192759 -181356 -108134 -25763 -32903 54956 322421
7609 322421 140607 -156804 -192734 -102812 -67147 -34913 127817 -41878 -209458 -88618
7599 -88618 -158352 -110180 -1783 -202931 17332 112263 49028 -161659 -198914 -58164 -155387
7588 -155387 1361 33893 -175437 -203677 -211828 -211512 -44814 -22710 -83938 -110499 71098
7577 71098 19480 -221546 -99686 50215 37606 -84990 -261878 -176133 -71109 -287241
7567 -287241 -321475 -135459 -228347 -113211 -21991 -206643 -153553 9648 154187 85912 -74165
7556 -74165 -166872 -124485 -126653 -93889 -103505 -57256 100051 -8761 -77245 4764 -31919 11822
7544 11822 144504 -38914 -16635 64426 -36656 -76328 23914 97799 -21548 -157641 -7295
7533 -7295 -79236 -60459 -107593 -38857 -51865 -160500 -55397 160475 96616 -111578 -185895
7522 -185895 138393 219201 -81211 45751 319698 198372 -23142 -163051 -87535 109500
7512 109500 95090 157182 163223 139649 9920 8704 136380 279930 331473 140909 248338
7501 248338 260123 313755 414597 323533 249927 287320 294840 91438 22481 -83180 65009
7490 65009 19483 103820 15615 -107881 169496 114592 -4487 -123968 -84851 -93379 4700
7479 4700 100850 -178060 -290147 -190211 -165581 -129615 -132828 -67386 75226 -166278 -236338
7468 -236338 -78644 26723 -46117 -237384 -183130 -54018 -7971 -26004 -17389 -1187 -54869
7457 -54869 164893 187211 104270 112888 99464 -156629 48545 102313 -8416 -140675 -12177
7446 -12177 19310 -29339 -55308 -28840 52786 -171035 -47768 21446 -12516 108122 -15667
7435 -15667 -94522 154770 186783 -74190 -182407 -94280 67508 165216 -23178 -196142 -152868
7424 -152868 -61552 -167936 -10442 187844 180501 54100 97493 -14147 -9776 -2865 115968
7413 115968 25988 -89329 -106875 38542 -58934 -142330 -158601 -126532 95068 82966 -5961
7402 -5961 -2596 8142 52735 154892 75794 101794 132411 -72073 -51837 17520 212180 187259
7390 187259 105801 -92017 -138612 -83261 4931 68180 -48341 52537 -55675 63212 267891
7379 267891 142386 -33294 117992 194105 159448 133441 97101 169203 -59023 -173878 -120091
7368 -120091 -141404 -76942 -47929 -170812 -118450 61879 -55273 -41994 13977 62427 -280
7357 -280 -96256 -192829 -189552 18088 582 -40789 187923 110631 173662 111272 90501 2108
7345 2108 39969 53619 13279 22789 117390 -48640 74358 54801 -54601 -81553 -44969 -11075
7333 -11075 131239 101366 -9371 -98492 -117082 71202 65 -57701 -252517 -56223 129282
7322 129282 194021 293813 288534 233198 236808 183382 14022 -27958 51894 -20981 -58228 -12803
7310 -12803 61702 37233 36597 159207 101843 -29706 69209 173198 519371 370447 162154
7299 162154 105402 190617 70408 217411 196458 230755 312249 235983 93522 119261 302408
7288 302408 230469 344526 205304 112930 249434 361011 203799 194631 229251 251298 296618
7277 296618 90399 114694 224785 93819 135306 214750 261583 265747 489808 419834 363062
7266 363062 209116 304273 484201 471672 396528 326505 411755 410380 355768 79357 27150
7255 27150 313866 225975 3564 263220 316870 269043 346986 189639 257834 204661 358877
7244 358877 523147 502981 432427 397818 279663 261219 501498 457142 315731 221361 214809
7233 214809 166974 420715 519471 553731 435831 514159 471317 536556 555888 443742 550731
7222 550731 634991 555281 588994 635364 580870 489858 727605 897387 943641 811081 752109
7211 752109 786465 832191 969160 934814 897544 915461 819438 743082 890678 740806 641223
7200 641223 709250 758069 842148 868246 766611 1040322 1119024 1117013 1084206 1024614 1013805
7189 1013805 1000006 995517 1249135 1228663 1279835 1482628 1469863 1659589 1623278 1745134 1744128
7178 1744128 1736918 1784623 1788036 1763645 1863266 1838588 1864695 1910091 1786911 1969368 2116832
7167 2116832 2214885 2342723 2367103 2500763 2485381 2668062 2732806 2686793 2697350 2773605 2734738
7156 2734738 2807301 3081727 3040533 2954414 2946857 2956942 3184436 3520900 3471140 3483989 3518855
7145 3518855 3731056 3646613 3747311 4005498 4122751 4331467 4668590 4856577 5106807 5282686
7135 5282686 5544311 5666194 5946182 6165446 6353937 6561244 6885438 7440974 7794778 8269576
7125 8269576 8632132 9219408 9973463 10580473 11278853 12294805 13241598 14498877 16204832
7116 16204832 17790604 19447426 21390290 24019347 26980395 30496765 34752969 40088340
7108 40088340 46396123 53937834 62253046 70877111 76822997 78063381 74076834 66119439
7100 66119439 57197902 48912479 42445585 37382144 33262941 30278203 27928372 25507615
7092 25507615 23074951 20744815 18763010 16934728 15337381 13792675 12683700 11888987
7084 11888987 11035465 10468669 10074495 9341217 8912448 8427142 7913534 7626240 7351844
7075 7351844 7108888 6789811 6525714 6354508 5997062 5712933 5570353 5479230 5155199 4977223
7065 4977223 4850544 4664183 4614859 4606946 4455907 4253843 4436172 4507839 4502484 4603404 4715901
7054 4715901 4888158 4745874 4694693 4437538 4200936 3959839 3699631 3505013 3524496 3541461
7044 3541461 3738862 3842415 4035547 4031734 3730343 3324248 3224866 3059418 2554394 2357984
7034 2357984 2289012 2096097 2019163 1961172 2047866 1901856 1863141 1795782 1724491 1548495 1364228
7023 1364228 1385948 1280121 1258700 1220996 1308571 1065291 1321936 1324371 1267624 1173143 1077980
7012 1077980 1171162 1138278 990003 977957 1059535 982886 899631 875962 896476 682258 818796
7001 818796 865649 952402 1024387 1179300 1085620 879986 914609 713227 663838 662653 725089
6990 725089 561637 428550 513771 629895 602178 572587 519880 456329 400922 488669 582334
6979 582334 339390 108842 340152 271474 294141 376790 339293 384941 458023 376714 227931
6968 227931 149490 255219 172850 502747 441458 422199 416561 196722 404740 217955 177647
6957 177647 454641 493766 424222 475605 306433 44977 213528 308144 88576 34789 293752
6946 293752 335612 368705 511955 194226 131845 125268 39091 18919 24658 105767 190507 92859
6934 92859 80354 193569 260696 229505 192936 334079 376208 501866 605764 545452 377027
6923 377027 216767 276582 370828 641941 357534 233317 326365 317171 140797 -12653 171357
6912 171357 327172 467767 293462 362893 330542 119413 -79352 84607 220300 148632
6902 148632 247441 131250 -20965 -6855 -51845 61925 161600 322962 243835 294581 168957
6891 168957 156600 320972 418365 385045 179925 159578 77147 74592 61532 141919 272317
6880 272317 231285 201368 295454 113319 82513 113593 59015 94321 157010 88620 151097
6869 151097 56069 83646 75517 72895 -46591 -93417 18204 29612 85697 -82332 17307
6858 17307 2135 122954 -68903 -63921 4215 -106104 -25942 270606 207864 224539 322314
6847 322314 -86116 -196089 -236374 -103583 -39750 -70933 -110180 79469 59929 159404 -50698
6836 -50698 11214 -74786 83921 171401 242043 400652 360794 -123467 -131901 -5072 -56570
6825 -56570 56823 126262 118002 238319 213003 58426 29759 26466 16440 50695 -18542 124893
6813 124893 119725 -94799 -188309 -132600 -16976 65392 36936 86207 127478 177725 256468
6802 256468 136138 346491 176539 -5773 -85540 188098 177846 115717 52641 37921 117624
6791 117624 110154 182152 309249 90487 -43482 -246343 -264941 12840 62872 74474 179896
6780 179896 75671 167138 37578 -137374 -166984 79287 86970 60110 236478 175550 14779
6769 14779 -21873 -172185 7038 103979 297173 298474 154481 -12012 55392 87850 -28477
6758 -28477 106868 145770 -61961 -186924 -5259 63865 -33279 86190 115356 9396 113486
6747 113486 233488 225517 -67307 -40921 12178 189165 263690 252882 -20625 55759 53385
6736 53385 184575 277412 173956 6148 66958 -8154 -41774 49684 114622 146721 184850
6725 184850 351412 191927 113156 121360 196975 48935 -176463 -47890 11486 250744 336249
6714 336249 276339 390055 249506 369389 387154 344292 316850 421808 498624 622904 647267
6703 647267 674161 492653 452244 461582 618495 332954 166309 169539 125038 179611 281198
6692 281198 295006 336386 467554 393128 165390 41761 127433 86222 -59594 49124 149810
6681 149810 78430 151922 118513 178975 135223 134852 -36203 78188 203035 300064 64301
6670 64301 -57357 120938 277746 418396 474541 524905 437859 225405 220910 461521 311830
6659 311830 96700 193040 123957 223316 381923 538438 487099 308518 206027 97767
6649 97767 236751 210540 97685 393242 150081 90087 115717 28402 134305 253099 506948
6638 506948 457664 131051 273783 130364 63555 247803 194987 183154 212168 317367 235744
6627 235744 202793 426467 443835 293047 285972 265803 126209 245856 181685 43312 168448
6616 168448 215236 253972 315581 450555 431668 397968 204485 19425 -34384 30707 232387
6605 232387 131841 125753 339542 474278 551918 524491 425264 580905 657297 531870 378108
6594 378108 439749 564048 312697 268003 316069 346134 315942 479721 333837 197934 209027
6583 209027 401283 348757 272104 136611 23985 128979 319968 245333 292535 372813 326362
6572 326362 330718 140012 289501 411581 299676 445133 466106 136543 -38083 95504
6562 95504 193156 229730 184598 60883 191230 125702 14026 126351 159971 183742 303906
6551 303906 76142 -139278 15160 -16805 85405 334456 198827 198768 238456 182161 295802
6540 295802 239503 204435 229678 225575 240671 97118 46291 112893 118469 278987 164255
6529 164255 270113 264754 32724 39767 152004 172287 -71197 -4737 122130 267665 324134
6518 324134 85359 45396 21549 -35589 1429 63912 167495 170936 115590 -10525 -121997
6507 -121997 39582 183316 166374 316705 312884 238367 134201 210730 293565 382573 180686
6496 180686 274212 171825 20573 144652 334753 389906 268035 117047 15769 142488
6486 142488 210106 239311 192640 162343 192302 161418 108027 163500 284143 295397 139615
6475 139615 185979 138700 153792 66393 40680 167654 141123 226962 277991 265723 277949
6464 277949 210086 465057 286101 5246 -47644 258401 324406 472864 322861 157984
6454 157984 309222 413746 248667 264916 175442 101288 77660 -123712 186742 112934 117651
6443 117651 197316 189938 349441 445057 281687 54265 124262 165428 304791 177790 108758
6432 108758 112855 -68138 7479 -8711 36994 157061 359223 204069 151283 230481 264468
6421 264468 81361 291168 169758 136397 174776 289999 312150 176200 267752 371281
6411 371281 404667 150564 241593 273684 277603 236532 106860 89021 113988 341053 349857
6400 349857 470735 418886 247922 187862 100798 95840 251479 185381 250669 133402 212758
6389 212758 203374 205060 349925 417067 366246 213726 290410 408405 613804 542791 420921
6378 420921 415835 266603 254702 162832 276055 235841 190376 406545 242702 407821 312839
6367 312839 343694 392149 326387 488094 394136 533336 506344 356838 232449 17379 332292
6356 332292 307967 449891 480947 729526 571161 570462 722674 349596 563948 702931 606021
6345 606021 514295 556786 541941 180711 189215 368644 468759 593804 614407 644296 713870
6334 713870 643453 473131 353088 331577 543321 659088 674062 806205 631292 720664
6324 720664 923633 1092410 803949 686085 628714 707698 702395 606036 581388 637071 597862
6313 597862 571513 586217 702969 673475 755827 962360 726924 458148 484701 637582 646158
6302 646158 549835 484173 621803 422248 401139 450647 682228 675726 708170 630185 479897
6291 479897 270738 310502 317613 509409 591391 484673 313047 403667 344182 380291 446458
6280 446458 304401 222034 379654 369872 496230 514435 476165 512693 318511 202062 323980
6269 323980 413163 440802 537700 536131 615372 644736 427267 305222 474465 516756 512819
6258 512819 424818 295041 202123 331987 384554 510126 458783 565139 524169 686149 507633
6247 507633 379970 481260 586605 600009 484392 609079 511991 437279 710548 552162
6237 552162 586670 647118 663578 728187 600135 684584 541240 460279 588745 765427 737275
6226 737275 808474 698851 719871 854912 745467 843715 813465 746417 685329 741305 775680
6215 775680 819841 905699 832710 994060 1179340 1053577 989554 797054 787315 915267 839923
6204 839923 787848 904923 976598 767314 780190 994390 1041206 1165288 1063616 1068860 1163617
6193 1163617 917241 929150 1152670 1118712 972881 1211371 1133289 1207560 1148263 1101506 1311667
6182 1311667 1218632 1142506 1310346 1240205 1101027 1039170 991874 993132 1099854 1016742 1052721
6171 1052721 1329506 1213213 1153922 1170159 1006948 1196757 1292803 1156481 1194288 1299366
6161 1299366 1273040 1190405 1180850 1209269 1268920 1166012 1072714 1341271 1282285 1180381 1179603
6150 1179603 1183449 1249036 1187625 1131997 1179865 1237633 1257020 1296138 1338851 1534532 1512815
6139 1512815 1448942 1429598 1433687 1447070 1585919 1593491 1553737 1453583 1328929 1442521 1483359
6128 1483359 1335472 1429892 1505129 1529715 1662954 1619600 1549564 1603070 1601023 1439333 1560232
6117 1560232 1595028 1519425 1491101 1495869 1507198 1679582 1821878 1956614 2066417 1959243 1978948
6106 1978948 2024154 2070392 2052684 2245406 2338338 2264395 2079948 2163248 2280493 2146264 2294931
6095 2294931 2372189 2494372 2517102 2524311 2629324 2784085 2855446 2830959 2916945 3082869 3100639
6084 3100639 3304668 3276741 3372275 3601230 3565888 3668366 3666126 3649295 3853918 3947435 4036802
6073 4036802 4137246 4184312 4271680 4352162 4423420 4459386 4824372 4856799 5057124 5273854 5159786
6062 5159786 5161306 5345827 5349099 5524990 5680249 5877014 5797436 6015132 6330424 6527731
6052 6527731 7040933 7196911 7212417 7413272 7588100 7968304 7996920 8176103 8629993 9047691
6042 9047691 9283678 9499745 9753100 10122326 10763474 11265724 11959239 12606387 13110732 13490495
6032 13490495 14093612 14704597 15529219 16406114 17190993 18129311 18832097 19847224 21075591
6023 21075591 22210500 23338630 24803414 26444312 28516674 30916007 33295186 35533372
6015 35533372 36750935 37371499 37731773 37921474 38073749 38178592 38348473 38564000 38832511
6006 38832511 39560563 40518618 41799968 42882064 44130671 45683648 47426703 48712464
5998 48712464 49862821 51241396 52894713 54291423 55948169 58067807 60523365 63726058
5990 63726058 67613625 71167524 71604453 69041360 65324769 62046008 59472695 57329018
5982 57329018 55653086 54331347 53238631 52802597 52190101 51525048 50869287 49915780 48874646
5973 48874646 47583719 46435763 45401979 44303943 43664717 42947910 42146246 41206439 40396956
5964 40396956 39665928 39161203 38401532 36610834 34119196 31475625 29368626 27223325 25533350
5955 25533350 24221418 23451248 22748915 22215145 21629990 21358626 21331555 21386054 21293640 21278649
5945 21278649 20998399 20534858 20210635 19699758 19366135 18793983 18365589 17912646 17250810
5936 17250810 17037843 17047589 16903875 16665355 16479873 16288817 15989308 16041628 15934923 15951949
5926 15951949 15854023 15968472 15915065 15989008 16152651 16114020 16283308 16321659 16470226 16853358
5916 16853358 17042634 16967237 17062301 17290144 17229635 17306577 17396963 17650521 17946279 18062708
5906 18062708 18428691 18612740 19027258 19212116 19388619 19358703 19957750 20489357 20933945 21460772
5896 21460772 22136559 22981627 23780480 24049622 24626528 25156852 25780468 26828692 27698126
5887 27698126 28930238 30201102 31808953 33742960 35845916 37787517 39463770 40261424
5879 40261424 40827607 41394606 41848324 42170869 42617909 43254116 44101504 45067233 46282305
5870 46282305 47783522 49109143 50693203 52640928 54385483 55831641 57240245 58399454
5862 58399454 59673479 60912410 62328937 63943336 65823929 68477495 71000605 72806778
5854 72806778 71910440 68833415 65187746 61811736 58841067 56294418 54183947 52308971
5846 52308971 50908226 49846503 48697995 47734777 46855383 46269138 45994341 45995095 46346178
5837 46346178 46696445 46717523 46638284 46033124 45414420 44742008 43917558 43259935 42315683 40743639
5827 40743639 38879710 36498100 34367191 32764091 31215431 30174157 29597516 29305637
5819 29305637 28783315 27493434 25567567 23750801 22507395 21374887 20322188 19720091
5811 19720091 19183684 18923376 18684741 18189607 17714886 17005080 16380855 15638097 15067306
5802 15067306 14438309 13839506 13586316 13309663 13120163 13081314 13027266 13017547 12894419 12526703
5792 12526703 12100709 11514579 11378315 11085723 10945463 10627162 10494207 10520185 10482926 10327072
5782 10327072 10153517 10066883 9891032 9703484 9646513 9684656 9776584 9647080 9581584 9608038
5772 9608038 9754632 10109246 10383388 10399423 10561977 10894683 11249391 11550614 11664126 11536234
5762 11536234 11621508 11307834 10769708 10548911 10242619 10087371 10109171 9965544 9685155 9377091
5752 9377091 9145794 9009684 8941769 8666971 8459358 8312279 8098222 7875571 7729843 7951469
5742 7951469 8216581 8278384 8319172 8535145 8683279 8986196 9463246 9920087 10119360 10333523
5732 10333523 10311862 10041761 9415582 8661264 8197757 7630620 7188453 6826860 6425414 6105418
5722 6105418 5969789 5662492 5383513 5234775 5274657 5058268 4946842 5106940 4866416 4963931
5712 4963931 5046929 5007773 5011577 5035815 5178050 5306047 5506563 5628414 5557553 5640536 5608592
5701 5608592 5482959 5124110 4783537 4521842 4306076 4291680 4068833 3916622 3760587 3678613
5691 3678613 3696910 3541362 3563508 3516410 3279758 3279725 3399957 3313779 3182984 3344243 3418820
5680 3418820 3390526 3491393 3328526 3233670 3190374 3204336 3320280 3194533 3205373 3367034
5670 3367034 3267560 3161796 3208742 3486873 3492531 3514373 3691468 3843295 3940686 3891029 4056985
5659 4056985 4137583 4273107 4585168 4554071 4702186 5002622 5234411 5499680 5760760 5913014
5649 5913014 6225300 6428116 6329789 6286235 6168599 5941704 5904503 5988378 5983684 5738427 5701660
5638 5701660 5991317 6261812 6535620 6635137 6707156 6967733 7340310 7383263 7823230 8125722
5628 8125722 8527774 8827776 9184174 9609782 9914912 9917505 10034858 9948053 9668343 9704771
5618 9704771 9443018 9305902 8996508 8905078 8845921 8720191 8699988 8625111 8751945 8961083
5608 8961083 8813228 8904762 8698988 8555840 8594303 8294739 8296099 8120764 7843267 7771183
5598 7771183 7656436 7582916 7376642 7132760 6883436 6853505 6567136 6134707 6274524 6373363
5588 6373363 6216909 6157073 6123091 6127714 6141974 6099082 6155819 6185442 6371627 6403226 6628059
5577 6628059 6777956 7010052 7466798 8121398 8890258 9620132 10719116 12071782 12996496
5568 12996496 12107017 10507924 9141273 7973538 6965568 6231269 5502630 5073489 4834740
5559 4834740 4676403 4456167 4169084 4034211 4111454 4015210 3812894 3490849 3492806 3437414
5549 3437414 3224844 3264605 3255275 3367648 3277528 3301100 3630692 3696680 3997077 4179217 3784529
5538 3784529 3544529 3257403 3186242 2859193 2790449 2714760 2613693 2711246 2685215 2527953
5528 2527953 2627401 2659896 2498482 2318997 2263240 2293371 2158218 2154964 2214108 2052049 2042408
5517 2042408 2149948 2069445 2016429 2167820 2041360 1894453 1883677 1935095 1873394 1845998 2045969
5506 2045969 1872121 1872250 1769640 1918274 1847402 1831599 1902730 1952545 2219740 2314541 2174781
5495 2174781 2196642 2430634 2267143 2148348 2086941 2066916 1799441 1839801 1877023 1985983
5485 1985983 1947872 1951703 1973202 2081326 2083691 2069582 2207053 2228916 2112002 2048496 1935970
5474 1935970 2082139 2022788 1807342 1715124 1605893 1791635 1908469 1846653 1777264 1910417
5464 1910417 1876644 1937748 2346479 2334835 2211889 2144568 1871707 2117281 2092880 2037286 2145150
5453 2145150 2128121 2209136 2414094 2199679 2107476 1956202 1913230 1861976 1823275 1826065 1740280
5442 1740280 1790245 1754085 1749181 1554773 1707144 1906873 1997676 1960565 1829773 1750792 1984322
5431 1984322 1839644 1696681 1691595 1684032 1766177 1906235 1966638 2021082 2044159 1778459 1808869
5420 1808869 1843598 1925171 1909198 1916876 1681042 1406966 1281247 1399022 1454514 1595538 1679444
5409 1679444 1563285 1588471 1681208 1634080 1679090 1863819 1744325 1770149 1609846 1541459 1534068
5398 1534068 1612776 1790682 1665555 1627988 1491037 1705887 1769706 1705296 1728141 1684470 1514252
5387 1514252 1553980 1510671 1592457 1491813 1610728 1762513 1779655 1661703 1503518 1485336
5377 1485336 1537291 1547580 1436690 1385240 1391533 1421030 1233481 1358258 1458750 1408674 1363548
5366 1363548 1658565 1790373 1836950 1681558 1483176 1458204 1361643 1299454 1495644 1492580 1364291
5355 1364291 1360663 1322722 1398238 1461615 1617620 1553404 1256160 1353971 1477527 1345038 1377403
5344 1377403 1419580 1512969 1580078 1519745 1453646 1355652 1320607 1311005 1337086 1333095 1263455 1313660
5332 1313660 1490302 1506638 1235462 1215041 1347330 1268512 1323096 1402860 1398839 1398185 1542667
5321 1542667 1585901 1744043 1644735 1463548 1449956 1467124 1657590 1756660 1813666 1863821 1806113
5310 1806113 1899195 1898531 1908874 1910497 1723675 1909203 2096647 2161230 2279929 2113381 1951649
5299 1951649 1854086 1900244 2124841 2218279 2347019 2397008 2262664 2339742 2536334 2479801 2518735
5288 2518735 2635651 2915230 3128123 3262602 3274473 3337048 3665467 4064710 4319533 4599226
5278 4599226 4907281 5099478 5615664 5999320 6093966 5816704 5737614 5762085 5406237 5349588
5268 5349588 5279770 5145800 5266578 5440502 5835933 6002303 6085404 6548175 7082895 7375954
5258 7375954 7874925 8407392 8711283 9179783 9515816 9700872 10019551 10280829 10453731 10564580
5248 10564580 10822790 10884972 11039302 10852402 10134145 9625128 9178810 8837850 8460305 8180445
5238 8180445 8238016 8242093 8332054 8592588 8983330 9552902 10133326 10319169 10658403 10809279
5228 10809279 10512820 10128391 9702436 9240812 9061047 8887442 8628400 8452419 8350575
5219 8350575 8342628 7981862 7591781 7105130 6957220 6785467 6780811 6568565 6496848 6493796 6572605
5208 6572605 6502324 6522066 6891222 6729436 6708193 7065372 6930920 6633454 6250564 5811802
5198 5811802 5236711 5100326 5085082 4567642 4328016 4120404 3944187 3945407 3915150 3746870
5188 3746870 3723952 3680151 3659555 3712774 3842283 3728319 3518524 3521509 3665632 3700188 3558801
5177 3558801 3568335 3563116 3244051 3299818 3216618 2950666 2914535 2832926 2871980 2902181 2864824
5166 2864824 2916328 2882043 2868457 2983470 2882054 2850523 2804107 2825763 3079631 2961553 2930831
5155 2930831 2841075 2704251 2565059 2547685 2476734 2439727 2414419 2248530 2221084 2303091 2409776
5144 2409776 2478738 2334886 2232535 2295508 2406842 2562651 2549675 2529502 2374986 2461339
5134 2461339 2413434 2543438 2424408 2466285 2792037 3018982 2841204 2775778 2826294 3141791
5124 3141791 3287075 3155168 2903431 2585491 2376935 2171527 2125405 1986615 1987279 2151596
5114 2151596 2010218 1972750 1948790 1875991 2004072 2076940 2016712 1997704 1977800 1840260 1664399
5103 1664399 1856015 1856801 1947222 1988798 1739337 1700861 1905192 2100652 1854028 1735966 1807563
5092 1807563 1843161 1946109 1878468 1927759 2119880 2298398 2234035 2138721 2218021 2372502 2394862
5081 2394862 2285560 2294930 2242079 2115639 2034853 2209562 2107125 2284003 2399452 2502300
5071 2502300 2597694 2759807 3033826 3399996 3636266 4159248 4513498 5064272 5435553 6034126
5061 6034126 6732593 6883082 6517524 6026875 5717974 5590937 5560111 5346863 5075139 4818252
5051 4818252 4362717 4006108 3552083 3289226 3040785 2863964 2909969 2746814 2580390 2544624
5041 2544624 2602632 2357544 2202509 2271340 2232440 2012128 1982538 1857716 1831340 1860013 1920247
5030 1920247 1964183 1942871 2027544 2012681 1827596 1731007 1777138 1660809 1706528 1785581 1832703
5019 1832703 1889976 1828786 1732594 1555343 1504661 1485722 1407265 1514457 1431287 1414749 1447905
5008 1447905 1442461 1449938 1513367 1356138 1303797 1358228 1365066 1699108 1519517 1355355 1432487
4997 1432487 1311752 1391518 1488472 1358692 1369609 1284381 1222064 1509396 1578712 1413237 1526438
4986 1526438 1561700 1596766 1462146 1522787 1685690 1607859 1568356 1526593 1514817 1548529 1574952
4975 1574952 1573012 1623130 1601714 1687231 1820727 1900705 2003807 1880628 1872984 1991584 1909808
4964 1909808 1857294 2008178 2101050 2080276 2108556 2010324 2069601 2176919 2136375 2078362 2123440
4953 2123440 2452877 2495290 2470854 2429765 2570822 2734048 2795349 2756940 2535258 2609144 2663303
4942 2663303 2631626 2463784 2555594 2565140 2586688 2675932 2415220 2478198 2698300 2956101 2878571
4931 2878571 2824928 2848113 2886131 2824450 2912904 2764416 2728284 2971656 2989204 2933772 2991845
4920 2991845 2989185 2957663 2975411 3108953 3345698 3403968 3435498 3517788 3640077 4051318 4156139
4909 4156139 4198814 4076389 4338825 4440014 4519996 4530331 4675010 4766773 5035557 5155715
4899 5155715 5203464 5401553 5498111 5590829 5741381 6188474 6390785 6441453 6780822 7036339
4889 7036339 7140221 7368127 7582622 7763244 7976489 8214432 8275317 8525175 8825651 9069885
4879 9069885 9167076 9428086 9577657 9696716 9904240 10145927 10485776 10848649 11272021 11754073
4869 11754073 12196889 12622967 12788879 13287185 13795077 14316087 14720821 15213061 15859902
4860 15859902 16758773 17549085 18627024 19803862 20964468 22548489 24304051 26479761
4852 26479761 29020231 32010083 35499902 38828645 41028420 40231547 37745692 35448457
4844 35448457 33796622 32636264 31998704 32028447 32415127 32901202 34153095 35675370 37260398
4835 37260398 38743607 40698291 43257925 46535122 50166866 54458309 59662214 66525389
4827 66525389 72886703 75306229 76237317 78816269 82886637 88818328 96188566 106633870
4819 106633870 117601130 129928252 145915654 165667880 185234555 207488914 237868532
4812 237868532 277671862 287119549 249189841 206670842 173744115 146524865 122533912
4805 122533912 104064008 89988616 79525366 71244763 65094391 60337262 56633427 53690919
4797 53690919 51894905 51077827 50906376 51515710 53500450 55479405 54774550 51049969 46842758
4788 46842758 42985924 39498983 36060137 33329388 31010377 29507789 28117741 26224927
4780 26224927 24563141 23064957 21909467 20856907 19804354 19159665 18217425 17549378 16994678
4771 16994678 16392950 16122561 15650630 14984084 14553829 14201606 13657549 13314140 12917390
4762 12917390 12403689 12006361 11737496 11471846 11357020 11309622 11003171 10924339 11035525 10988767
4752 10988767 11073320 10865476 10526006 10034570 9722218 9662189 9626046 9470911 9404405 9306461
4742 9306461 9190990 9387584 9954779 10355077 10563709 10533913 10034897 9439213 9047022 8608931
4732 8608931 8296841 7891436 7426578 6982027 6785898 6768886 6992735 6788845 6529123 6440830
4722 6440830 6261456 6030913 5610257 5512230 5555143 5506968 5483071 5465471 5172049 5145967 5187336
4711 5187336 5070209 5014175 4966953 4877424 4957259 4766996 4800997 4709090 4570305 4557000 4189552
4700 4189552 4086371 4069695 3948254 3951143 3920284 3769394 3792832 3714089 3678602 3610766 3632359
4689 3632359 3488933 3562001 3537289 3349470 3320312 3456758 3396793 3317702 3445899 3399366 3202520
4678 3202520 3408544 3512851 3585640 3454702 3558706 3705128 3710851 3702658 3656117 3688563 3726864
4667 3726864 3801672 3875117 3957904 4036953 3944452 3993398 4141126 3967436 3734520 3679863 3545938
4656 3545938 3277524 3148705 3053181 2854140 2733166 2673324 2868283 2970639 3018564 3032429
4646 3032429 2997841 2899381 2856490 3005325 3102556 3175231 3007209 2862148 2878567 2720367 2535621
4635 2535621 2539853 2644363 2761515 2789566 2734720 2735204 2611399 2574106 2439254 2369998 2372478
4624 2372478 2187227 2257194 2037304 2096003 2021599 2057178 2095058 2113751 2090758 2044335 2004625
4613 2004625 2166651 2312109 2291567 2345021 2359957 2310587 2202429 2383215 2356510 2516099
4603 2516099 2626433 2381824 2552399 2591327 2517515 2573839 2771601 2758300 2698986 2867333
4593 2867333 3186166 3312378 3275301 3379290 3621829 3967120 3739788 3336364 3344087 3167935
4583 3167935 3142580 2983738 2638986 2496987 2402221 2393943 2393434 2283938 2302432 2172115 2082596
4572 2082596 1991996 2091783 2185060 1932134 2008567 1924706 1870200 1733166 1917518 1875419 1754830
4561 1754830 1702634 1807522 1886560 1924498 1918903 1767701 1766594 1624269 1758785 1789944 1850844
4550 1850844 1744308 1679490 1828259 1744158 1654812 1827548 1810240 1852929 1823915 1621698 1712886
4539 1712886 1833731 1873681 1957726 2085187 2071202 2040935 2167979 2134616 2133302 2249105 2193063
4528 2193063 2119168 2143973 2058998 2189492 2227793 2172630 2149269 2180435 2058264 2114552 2286735
4517 2286735 2376774 2204796 2333187 2518244 2689591 2735653 2578442 2637650 2951708 2980869
4507 2980869 2993911 3071845 3136697 3107701 3160594 3265323 3364316 3665914 3619352 3788451 3953298
4496 3953298 4339425 4323753 4358057 4210236 4113128 3955007 3887393 3897462 4145949 4146237 4050339
4485 4050339 4055790 4133454 4138187 4358314 4712270 4981077 5045810 5060779 5239141 5385414 5527826
4474 5527826 5955293 6336818 6563811 7123052 7762009 8473929 9148905 9871826 10473532 11272723
4464 11272723 12027784 12012485 11494441 10572581 9735456 8823125 7872998 7290010 6802518 6564642
4454 6564642 6184115 5731318 5659433 5611643 5602060 5725977 5670540 5531340 5877644 6103502
4444 6103502 6305448 6721873 6947507 7320602 7687680 8285034 8772339 9180252 9820685 10815431
4434 10815431 11428779 11670451 11553412 11030457 10295917 9381268 8641338 7906208 7416087
4425 7416087 6836029 6664281 6261523 5829505 5783673 5735602 5838332 5812933 5748592 5676563
4415 5676563 5492612 5372439 5270590 5200187 5135973 4918974 5028088 5169924 5249418 5139383
4405 5139383 5170329 5076644 4720597 4483844 4351102 3959381 4050396 3876440 3863495 3874713
4395 3874713 3899987 3813507 3453603 3520879 3802412 3806147 3659867 3726827 3862884 3897298 3829156
4384 3829156 3735574 3781257 3807590 3692121 3744571 3738840 3770395 3959937 3999092 3957206 4126261
4373 4126261 4338462 4442770 4658929 4770011 4793860 5012058 5161462 5279264 5318882 5605871
4363 5605871 5980262 6259350 6396512 6281432 6173669 6140404 6224004 5928720 5841556 5743851
4353 5743851 5757380 5739516 5730620 5721859 5793346 5902941 6115698 6324121 6543798 6697957 6854580
4342 6854580 7055130 7233480 7614103 7882508 8371178 8445576 8760824 9117253 9359752 9614074
4332 9614074 9943143 10116630 10445220 10814861 10861075 10959428 11025385 10945593 10971562 10882408 10815976
4321 10815976 10877559 10926968 10579875 10301503 9924448 9772633 9750099 9884622 9929783 10068752
4311 10068752 10038173 10078571 10354779 10665327 10898406 11059802 11334959 11480690 11692762 11657788
4301 11657788 11536789 11487081 11631810 11833083 11937382 12048048 12238302 12328666 12351392 12224913
4291 12224913 12117268 12123157 12099058 12244476 12358148 12290614 12327375 12373041 12490483 12680125
4281 12680125 12690156 12742253 12872008 12775144 12749901 12720806 12542982 12695583 12600398 12485168
4271 12485168 12534392 12479116 12402448 12316340 12368718 12310307 12419776 12820341 13233943 13603018
4261 13603018 13573412 13520352 13691763 14056475 14345021 14497500 14891426 15400225 15974955 17027983
4251 17027983 17914305 18748342 20093421 20995636 20998286 20172876 18930564 17865995 17227580
4242 17227580 16847885 16400218 15997688 15620500 15480944 15472179 15375120 15173454 14964874 15119504
4232 15119504 15130969 15221929 15635472 15847075 16169780 16394516 16523186 16861723 17026006 17383299
4222 17383299 17820125 18143239 18660481 19285249 19906635 20440901 21055889 21642940 22073066
4213 22073066 22881231 23652443 24384666 25253853 26315196 27280155 28368815 29452738 30707128
4204 30707128 32203276 33973019 35725486 37881953 40386258 43140831 46314288 50094909
4196 50094909 53870649 58515884 63624633 69617068 76534547 84694754 94306016 105912259
4188 105912259 119645042 136425470 156379417 180451416 209493590 243539442 270473656
4181 270473656 277487760 261503534 230117471 197872451 169674831 145901227 126037481
4174 126037481 110369090 97808063 87549880 79134135 72050352 66180306 61277461 57206088
4166 57206088 54168038 51477922 49404512 47481184 46230765 45194924 44342709 43632128
4158 43632128 43375327 43034538 42514948 41524368 40998375 40906866 41072463 41401307 42344387 43610213
4148 43610213 45430218 47996288 50914706 55026287 57397103 56043261 52963397 49261488
4140 49261488 45688960 41704256 38211319 35017170 32457440 30623471 28635005 26915947
4132 26915947 25244346 23928025 22720868 21748763 21049983 20390539 19987946 19493353 19155936
4123 19155936 19235789 18977584 18679858 18469874 18164048 18057634 17793274 17701674 17705403 17910700
4113 17910700 18157779 18655312 19057298 19479418 20197702 20448016 20367057 19947891 19062583 18183747
4103 18183747 17336621 16524736 16158065 15791504 15398652 15299824 15365010 15518087 15447882 14632033
4093 14632033 13847369 13267775 12624510 12276946 12068043 11683290 11186876 10824196 10824942 10704062
4083 10704062 10716645 10666385 10635753 10539197 10458066 10646868 10564280 10357055 10532444 10664625
4073 10664625 10303960 9910580 9872223 9733331 9520762 9218630 8972475 8814745 8851015 8750575
4063 8750575 8858089 8946868 8644606 8398673 8190299 8327771 8332941 7973428 7974296 8044988 7856124
4052 7856124 7890112 7995965 7993612 8105426 8016541 7972059 8188554 8395151 8472669 8351232 8364499
4041 8364499 8760661 8997314 8878982 8725702 8805386 8825398 9089563 9230548 9222545 9395262
4031 9395262 9742238 10115290 10454437 10926607 11320914 11910385 12569718 13005213 13652474 14253979
4021 14253979 15181866 16175830 17589438 19051799 21054512 23445097 24541642 23619525 21762331
4012 21762331 20096414 18557922 17207195 16233480 15613112 15081078 15013340 14967255 15180082
4003 15180082 15421435 15387102 15590342 15651310 15276136 14858246 14657031 14548820 14555589 14892750
3993 14892750 15061327 15420099 15938616 16696968 17654127 18862595 20188840 20777905 19873182
3984 19873182 18661139 17611130 16647821 15936746 15158217 14791082 14375488 14053334 14111049
3975 14111049 14365496 14636931 14870491 15012825 15200547 15513582 15790559 16060682 16563248
3966 16563248 17569452 18429869 19427189 20882030 22405543 24026745 26260601 28001884
3958 28001884 27498535 25218290 23355994 21708143 20424117 19670812 18796865 18491195 18569599
3949 18569599 18596398 18615376 18792355 19083896 19340050 19702386 20399908 21277251 22067739 22755599
3939 22755599 23489857 24595549 25757711 27244827 28898335 31065298 33898868 36815189
3931 36815189 38326129 37359770 35279131 33415270 31537433 29640110 28182412 27099228
3923 27099228 26819276 26493574 26595078 26926349 27014454 27305509 27534624 27518410 27845946 28181499
3913 28181499 28857033 29443417 29946831 30643064 31272491 32259173 33183058 34344232 35583551
3904 35583551 37143451 38845904 40763994 42224117 43741998 45473137 47282159 49440612
3896 49440612 51996724 54432783 56755478 59026950 61166674 63252001 65368943 67741427
3888 67741427 70424041 73302399 76342893 80252037 84553937 89069899 92622371 94174434
3880 94174434 93835191 92930866 92282730 92377053 93266916 94550185 95587064 96449736 97301455
3871 97301455 98207535 99850888 101199607 102238681 102502298 101608430 100139911 98735404 97496735
3862 97496735 96174813 95054486 93946920 93062984 92649836 92752361 93096623 92625229 89925511
3853 89925511 85605789 80946894 76645144 73062237 70115804 67436823 65090252 63055816
3845 63055816 61313922 59706386 57800355 55902697 53696277 51628817 49442210 47585667
3837 47585667 46049996 44477795 43527559 42656970 41553142 40145487 38784988 37561921
3829 37561921 36458374 35677451 35049290 34291572 34126605 33583755 32924864 32417608 31876511
3820 31876511 31405117 31009308 30656314 30316413 29972444 29089578 28280438 27739368 27012978
3811 27012978 26340304 26133817 25622884 25252044 25051646 24864880 24850974 24904814 24863389 24816682
3801 24816682 24783375 24849311 24897928 25039121 24940414 25051922 25084232 24744896 24562944 24126042
3791 24126042 24071049 24097224 24114963 24082841 24263058 24146903 24128624 24166656 24059070 23788208
3781 23788208 23907801 23856266 23741289 23787055 23772423 23690688 23503126 23484887 23509844 23710978
3771 23710978 23608402 23534456 23417720 23154235 22915761 22659670 22620505 22543537 22339051 22413949
3761 22413949 22395582 22315992 22482059 22730154 22987092 23128191 23508373 24075615 24377574 24987636
3751 24987636 25371435 25797046 25964175 26222668 26461890 26620888 26875967 27140564 27188137 26997757
3741 26997757 26897503 26729495 26769056 26739169 26638976 26540784 26534711 26765149 26926708 27020551
3731 27020551 27265966 27226761 27466871 27545735 27550672 27665917 27878031 28200791 28124095 28239942
3721 28239942 28188436 28100287 28033793 27717101 27419299 27110501 27102196 27090419 26746882 26328761
3711 26328761 26062960 25922965 25699438 25568117 25432210 25427547 25253222 25085131 24907282 24829728
3701 24829728 24754442 24611697 24439951 24191971 24015972 23551130 23448674 23245432 23208376 23148213
3691 23148213 22883099 22843557 22597698 22710040 22844606 23011024 23081652 23246443 23655487 23966502
3681 23966502 24350473 24776346 25324037 25709552 25895530 26263276 26589074 27032960 27319373
3672 27319373 27706236 28256956 28905346 29216406 29309965 29746728 29588147 29547150 29454756 29045250
3662 29045250 28657396 28276079 27859914 27495608 27304267 27222422 27299993 27218979 27245982 27267598
3652 27267598 27421909 27225822 26999124 26773482 26560796 26644020 26489831 26557316 26703601 26691346
3642 26691346 26719488 26826628 26993034 26919854 26958740 26971309 26980828 27084964 26749350 26392189
3632 26392189 25732652 25350257 25046644 24694008 24325497 23844312 23418633 23149992 22771527
3623 22771527 22322195 21800303 21345136 21007186 20371898 19830018 19452461 19146214 18831222
3614 18831222 18838268 18893658 18779875 18729288 18529723 18695190 18806199 18600998 18472158 18339935
3604 18339935 18089624 17803454 17831596 17547311 17226807 16904232 16697684 16532778 16253841 16090413
3594 16090413 15748396 15233159 14963193 14954154 14671909 14550481 14248200 14132861 13965193 13775180
3584 13775180 13351329 13210533 12987904 12719758 12781391 12727625 12659305 12452659 12377349 12278654
3574 12278654 12174576 12041731 12033726 12138891 11962506 11755338 11474555 11325790 11294010 11109563
3564 11109563 11010200 10903165 10744598 10562546 10469467 10250927 10123344 10010474 10095900 9996525
3554 9996525 9884851 9584680 9429572 9344621 9545134 9302391 8965374 8888233 8686809 8355482
3544 8355482 8013522 7866371 7946091 7945185 7735186 7588826 7514604 7352465 7117111 7097565 6914504
3533 6914504 6968109 7137815 7194950 6952399 6818085 6921639 6831621 6764839 6795900 6853930 6653182
3522 6653182 6524289 6526335 6298796 6073609 5960399 5939214 5921458 5587255 5527688 5395503
3512 5395503 5275235 5372156 5299463 5134499 4973670 4849832 4596159 4696634 4615984 4677557
3502 4677557 4581049 4487749 4408727 4554708 4425696 4340612 4366039 4287777 4323217 4223508 4147531
3491 4147531 4211515 4251041 4224561 4201980 4146052 3846181 3758601 3899063 3711677 3840830 3664756
3480 3664756 3640759 3378957 3185350 3364470 3370360 3269323 3145808 3184838 3406745 3271292
3470 3271292 2970123 2903797 2842550 3100551 3147563 2920965 2734631 2859302 2884481 2827305
3460 2827305 3000236 2926410 2845286 3035962 2920512 2834626 2665009 2579987 2675098 2796569
3450 2796569 2888491 2801800 2739444 2803116 3004806 2783884 2807172 2900316 2897863 2930148 2732970
3439 2732970 2750536 2767868 2806263 2656987 2687493 2802008 2895252 2699040 2749931 2675521 2736654
3428 2736654 2639157 2431863 2484176 2407655 2471371 2479582 2586059 2552478 2538425 2455029 2680737
3417 2680737 2575467 2525302 2515607 2493663 2393676 2322600 2537297 2579995 2509483 2613761 2442560
3406 2442560 2550345 2489404 2659134 2693058 2840132 2895654 2889629 2991081 3139989 3301114
3396 3301114 3116110 3078104 2987209 3044565 2780051 2490998 2419353 2412397 2365210 2314743 2298831
3385 2298831 2301718 2189368 1982856 2114416 2350071 2079446 2063031 2177224 2124513 2038425
3375 2038425 2009523 2100252 2144089 1985817 1881438 2124105 2329738 2053186 1781497 1845244
3365 1845244 2038093 2230668 2089405 1971580 2001406 1863903 1823828 2050170 2044273 2018948
3355 2018948 2060139 1968089 1938499 1879081 1992001 1884914 1683941 1773346 1667768 1874267
3345 1874267 1878199 2068233 2089891 1891598 1986146 2050588 2021041 1838658 2057613 1919486 1843475
3334 1843475 1855830 1933132 1959578 1827784 1803839 1664490 1547706 1783658 1820901 1624799
3324 1624799 1667376 1510610 1529644 1718650 1635108 1619643 1645094 1642433 1646071 1869989 1872114
3313 1872114 2027723 2051424 2040384 2157916 2186107 2163208 2329751 2517529 2403804 2152301
3303 2152301 2094696 2163851 2158645 2082779 2176125 2030729 2099256 2190565 2240354 2317456 2477586
3292 2477586 2392842 2385142 2441531 2296509 2538279 2635347 2554910 2451371 2482625 2478740 2594100
3281 2594100 2644183 2800772 2867213 3086220 2930897 3200985 3190065 3167846 3380809 3519527
3271 3519527 3774646 3970347 4102128 4101933 4322244 4603103 5070935 5336252 5343313 5250658 5423049
3260 5423049 5597802 5568787 5752206 5720628 5466454 5267635 5366612 5129236 4771310 4495353
3250 4495353 4353210 4441156 4267684 4222350 4367706 4145584 4046049 4100839 3964085 3874652
3240 3874652 3804532 3947836 4085024 4373772 4457856 4637194 5070312 5495052 5408501 5239828
3230 5239828 5064753 5043971 4943142 4763802 4908540 4964641 5195461 5087407 5069410 5065076
3220 5065076 5131544 5269086 5010351 5058570 5043695 4844540 4778333 4818975 4801682 4663949 4620946
3209 4620946 4634595 4749565 4794652 4749839 4815825 4884873 5087523 5211442 5254007 5116320 5164967
3198 5164967 5185538 5339860 5197983 5312477 5522452 5525576 5623954 5457077 5363683 5558363
3188 5558363 5611405 5384067 5425701 5355819 5373195 5273131 5420084 5366313 5537086 5303498
3178 5303498 5199140 5099654 4979989 5019139 5012396 4745630 4727473 4922105 4673295 4599362 4643591
3167 4643591 4829456 5047318 4924875 4748897 4946433 4886873 4764164 4806458 4723410 4647013
3157 4647013 4438610 4465382 4713036 4725548 4819387 4751506 4744139 4544723 4446323 4477323 4407622
3146 4407622 4401861 4334928 4320849 4319642 4312709 4316856 4319871 4289111 4204835 4238324 3851501 3713092
3134 3713092 3913590 3835848 3807961 3798322 3814159 3656190 3577227 3457945 3356597 3364791 3566579
3123 3566579 3445803 3176436 3202641 3157798 3237715 3335458 3444589 3288475 3107200 3128683
3113 3128683 3070366 3034014 3091567 3096763 3085347 2970752 2918163 2957624 2942506 2767221 2580856
3102 2580856 2472279 2313921 2292935 2313822 2164301 2211132 2228171 2033086 1885053 1852441
3092 1852441 1889943 1910364 1873956 1678794 1778188 1835710 1771848 1745390 1784022 1783789 1832640 1665050
3080 1665050 1604955 1660263 1720549 1762046 1481539 1589118 1524011 1647809 1717304 1508861 1342240
3069 1342240 1417723 1685995 1520071 1392544 1289552 1128920 1277018 1221347 1317714 1225496
3059 1225496 1241514 1204294 1159844 1167017 1021217 965235 996729 976987 795051 783008 721929
3048 721929 908901 1085074 1079877 943424 773768 923638 802397 651674 711966 648209
3038 648209 828718 848325 813330 513102 625082 729244 525861 570291 740350 600292
3028 600292 461534 748972 589180 341792 271575 314348 533505 470237 435533 558448
3018 558448 456341 322618 494151 574604 486396 610766 577627 585631 439562 369083 320189
3007 320189 532818 649756 503198 316806 261070 324864 377620 424026 403441 550072 517340
2996 517340 320635 289388 174247 201456 393837 293160 347097 490457 266787 438173
2986 438173 311155 417470 391942 293466 362397 420812 519260 421669 398535 468715 486029
2975 486029 293103 175519 220930 437449 577046 463726 378743 495025 439623 496567
2965 496567 465061 375100 122159 258762 180032 320338 202711 181473 277185 368880 370218
2954 370218 585832 487441 295211 412224 397936 375734 461733 334177 360679 656373 540935
2943 540935 502997 538801 505313 715337 805434 571662 543694 567496 552133 500056 360763
2932 360763 384237 427611 454919 500484 738902 708969 645923 598073 468991 435257 375116
2921 375116 478062 567500 495907 366111 683567 913103 722321 491347 378151 314440
2911 314440 360758 444091 487562 417023 407812 330130 393537 524133 236829 140506 241127
2900 241127 257654 389021 414328 345307 320110 400957 454228 445881 306758 330972 521011
2889 521011 329827 238054 260724 308699 474646 411735 410034 284443 202590 222026 399135
2878 399135 445269 385448 450594 369928 300785 313830 342552 377920 371504 329757 397134 152129
2866 152129 290947 485941 354479 330027 123033 190405 13704 -138293 -71897 143652
2856 143652 160904 86783 28570 23945 -30785 140826 240435 219486 256166 164512 169052 61853
2844 61853 135324 276113 134013 153884 150253 346330 334047 413833 544395 453473 296325
2833 296325 45950 12283 365920 516676 164736 -28992 -138247 5491 116304 -134815
2823 -134815 -44551 214730 -126217 -276307 27547 100469 118797 107698 179745 74408 -150827
2812 -150827 69342 184581 191726 63566 1283 127552 63131 203314 45674 93316 180952
2801 180952 151273 19683 -1308 58481 115608 5555 -41550 39735 89416 19730 -15295
2790 -15295 -66624 -66224 -39487 26121 -46010 -49649 -24067 -118293 -105973 -45377 -51337 -53326 -25121
2777 -25121 -315551 -193188 -96503 38094 -151046 -64543 -95640 -169322 -39660 -19103 18810
2766 18810 68875 -21276 -11674 191530 317987 53680 -129148 -178222 -100317 -35043 91288
2755 91288 157510 272004 117111 -84554 -61503 146158 72810 209229 149765 159717 304453
2744 304453 300048 273278 155057 92623 117450 205445 243120 -54144 -308387 -227866 -133521
2733 -133521 -92935 -7940 -128986 -221964 -131018 -151838 -99819 -100458 101900 41528 -16177 69750
2721 69750 -28804 14065 60903 -9273 -50186 -73701 22338 64506 -39066 9566 -164470
2710 -164470 -77893 -17600 -29774 -70539 -127834 -123323 -20035 55977 -245289 -20853 -40221
2699 -40221 -104625 40792 46801 -81423 -96922 -11203 -82738 41383 -25503 93668 408696
2688 408696 190060 -194579 -114062 139012 95901 120132 121179 87120 135713 78443 76765
2677 76765 114750 -218431 -258608 -28398 -1215 -18577 78465 85254 -84349 -69400 -70656 -150531
2665 -150531 3111 -151372 -44616 11943 -62984 -191748 -178358 68107 223899 222984 292416
2654 292416 444764 221456 190881 211338 273978 230641 5812 7425 -56773 141992 104152
2643 104152 -70517 18318 171516 226236 172405 39992 -114462 -89642 -48404 -143950 80389
2632 80389 57464 53595 78420 91569 25036 -163847 -138345 5463 13301 -115447 -160284 -8762
2620 -8762 4618 -119903 18989 -104674 -110110 109765 -6987 -72789 -219344 -35393 -130237
2609 -130237 -142357 -39088 -239519 -162726 -41935 -35299 -139707 45301 -3196 -121470 80546
2598 80546 -35130 -7208 -23911 -72133 -83605 -117859 -144456 -163275 -201 -48797 -47418 -23928
2586 -23928 -164574 35823 220181 -12181 -99184 -123418 -44667 99750 -152281 -221470 -8720
2575 -8720 54838 29727 12674 -32443 66376 313914 140642 -32969 76548 37577 107409
2564 107409 82100 -4727 -125338 -62845 11249 17319 41579 142312 130212 7564 -98546
2553 -98546 -289063 -184421 -110371 -93278 -140194 53125 89196 202953 11101 66772 131870
2542 131870 114719 -112557 -28457 77038 149875 -20867 145368 102894 -20903 51542 154695
2531 154695 97557 16866 -88870 83107 122849 14234 40859 -12185 -9614 -4536 -29460
2520 -29460 -80378 -40924 39452 -83269 -125607 -16550 -93103 -224139 -28943 -26960 -122900
2509 -122900 -193014 -256807 -244451 -203527 -230195 -63869 -15827 -214892 -90034 59005 158817
2498 158817 -9849 -179206 -332065 -237004 -198655 -50128 -290603 -197895 56880 1380
2488 1380 -8850 245280 77473 -111636 -36905 123448 195360 64191 -117914 -146688 -29974
2477 -29974 -152235 -11726 -76323 -131155 -134758 -143606 113649 115728 226422 259397 147429
2466 147429 136458 362273 99582 -37929 -7249 69745 60298 189336 64469 -40740 -82742
2455 -82742 -176078 -224188 -61756 6438 -67863 40258 69884 -39828 101265 89688 31829
2444 31829 11164 -69663 132694 168016 163227 -23372 -11545 21553 -56807 -150526 11551
2433 11551 45113 1776 -112414 -236435 21743 31257 107563 146810 80007 47004 34806
2422 34806 116602 104062 256373 -53618 26630 -80707 -79701 96612 132473 116690 150878
2411 150878 55035 -35121 51436 263565 211259 70488 146269 183760 309723 155421 297379
2400 297379 179567 90221 22636 118605 451845 399086 354253 411301 447212 301559 252834
2389 252834 608550 594408 827825 552037 465714 526715 544610 375079 236481 141043 -12362
2378 -12362 157861 240362 97325 125930 160165 160704 346390 173843 180999 118447 19899 -89720
2366 -89720 -103452 56543 149463 42160 -12978 88004 -37475 -104544 -25471 138566 294184
2355 294184 96420 49680 112876 5884 279097 272608 187584 39188 101345 191276 209906
2344 209906 249953 216843 104765 -39233 156754 72767 -73735 -55593 63105 132141 168720
2333 168720 150278 66546 -57963 100589 232075 359424 225397 74670 120844 218674
2323 218674 276596 378912 233828 119658 209792 355818 71222 61865 29900 -14619 83591
2312 83591 144205 120590 119777 156335 205910 178901 130647 248752 218275 222195 133219 219906
2300 219906 313950 287959 264656 259750 224885 241988 304545 352830 327458 403066 412847 388428
2288 388428 310724 231076 317980 258080 405270 314570 415182 158844 28947 106201 335882
2277 335882 440624 232914 301781 230416 128996 134761 127265 303922 466636 232291 164610
2266 164610 485450 508895 329545 347549 527241 588366 686095 547141 449965 512609 466304
2255 466304 364785 346602 480674 561808 488483 318979 397410 451410 279226 204658 300112
2244 300112 386010 377844 512674 644475 610930 623414 520805 625488 458705 497680 620772
2233 620772 654256 701949 776749 624788 586685 699398 478115 375170 351662 464054 642948
2222 642948 720710 784341 644375 808800 925912 953394 1044122 1101400 991696 1028487 1012416
2211 1012416 956770 1054242 1164757 1235820 1083506 1199749 1199154 1160053 1368470 1670609 1857504
2200 1857504 1763100 1752669 1715193 1718931 1844359 2022090 1982060 2168221 2214330 2147568 2142372
2189 2142372 2287255 2375722 2269279 2324564 2625763 2849711 2706974 2725399 2779406 2688584
2179 2688584 2844297 2842917 2996830 3302328 3340512 3387104 3576180 3606921 3594477 3571251 3863278
2168 3863278 3959197 3910844 4022042 3989159 4045178 4122257 4246939 4529016 4712582 4788414 5115352
2157 5115352 5172278 5206623 5617513 5810484 6121078 6352311 6732592 7032610 7452745 7783420
2147 7783420 8472652 8739012 8947776 9491608 10267676 11196845 11943339 12672293 13791475
2138 13791475 14712449 16115912 17957040 19935639 21340757 22773108 24554820 26849101
2130 26849101 29678768 33297358 37814409 43161333 49774666 58365609 67702788 79221617
2122 79221617 93795150 115909720 131364157 116744014 94668748 78984991 66476244
2115 66476244 55269656 45935988 38780146 33538785 29569172 26277830 23922514 21975735
2107 21975735 20465408 19378853 18643623 17390352 15912662 14811156 13708142 12872293
2099 12872293 11988303 11132616 10678902 10149040 9636452 9047754 8736759 8318511 7883246
2090 7883246 7691248 7516950 7137215 6829499 6460397 6105654 6002263 5853481 5733827 5532743
2080 5532743 5309011 5062293 4724296 4621517 4428919 4305288 4296232 4104730 4026713 3822001
2070 3822001 3634990 3402300 3302185 3225060 3212571 3141175 3014529 2923986 2981740 3104588
2060 3104588 2894398 2730491 2561639 2542147 2310857 2165217 2123513 2051132 1955156 1834075
2050 1834075 1873063 1865348 1832104 1875069 1767428 1874118 1853153 1992205 1907069 1898612 1931857
2039 1931857 1756571 1605536 1606661 1503743 1362336 1756626 1842538 1653778 1693702 1409380
2029 1409380 1329384 1386794 1466590 1285963 1065648 1133499 931410 966148 1041351 918244 837321
2018 837321 931346 945567 1093356 1002540 916371 980181 867089 808167 759670 782943 763061
2007 763061 825218 741295 854754 876941 1044471 788087 686305 768424 662309 459799
1997 459799 567866 579445 433965 452068 535387 693435 671849 604673 592699 734759 634389
1986 634389 478764 640126 633909 634856 448726 502163 555890 530611 688278 685645 586382 422180
1974 422180 338181 594063 636322 432949 463006 450270 472009 446546 370579 436018 353005
1963 353005 427556 398998 239846 290805 474160 451491 388497 313768 153473 294412 200529
1952 200529 172861 322319 356809 297559 436111 439935 432696 523491 159540 155977 412094
1941 412094 269210 27757 142764 262607 413826 280734 114015 271312 331874 391539
1931 391539 409332 362255 473223 458137 324905 487897 484932 296353 185896 95720 78098
1920 78098 106667 209031 319022 352571 295866 189888 411541 354902 273277 139396 136759
1909 136759 83045 179675 265259 268453 182723 340326 465192 357439 378545 369911 190344
1898 190344 164235 239949 307047 55193 20993 160101 368948 338430 66431 218987 231901
1887 231901 222574 333407 564552 580071 443894 388132 267970 253024 193674 178272 93552
1876 93552 101077 53315 105509 234353 267779 205923 195888 324409 249556 43775 57083
1865 57083 184932 369843 423339 361956 280697 229597 190067 256026 353882 368859 504403
1854 504403 501635 404355 536456 561937 499557 560586 701625 434449 430578 372412 426869
1843 426869 401819 258877 303175 225023 238870 268937 228660 247061 196121 87137 70901
1832 70901 188602 43773 -8578 72888 211030 98947 125933 186956 101246 278776 151369
1821 151369 27326 -72550 76958 11367 267938 175187 193859 313743 247587 86585 -100439
1810 -100439 -200534 -87348 103323 79735 -60606 -159697 -11719 180488 159494 364838
1800 364838 236397 239735 188743 77009 -16109 33958 36976 -111395 -18008 66767 -170307
1789 -170307 -96814 38825 154970 89837 222251 164623 197858 147731 55990 -4347 -103089
1778 -103089 -91465 -134692 -211341 -134339 79065 -26848 -31423 -59613 129938 160746 114052
1767 114052 13501 153694 223256 28134 2040 -74337 -241504 -78462 54592 -16880
1757 -16880 -135550 -200918 -118585 -53776 -50675 57276 122428 76340 -64165 -102822 -145873
1746 -145873 -166666 -74216 -6579 -25144 75814 -84811 -7226 -46329 -43546 110991 24572
1735 24572 -76 35984 170939 67180 51565 -44607 -155950 -97036 -141616 -26302 96079
1724 96079 21926 -11954 -125342 -60267 73593 21341 -100702 -140307 -263808 -193471 -85401
1713 -85401 -203264 -255556 -247257 -169360 -106814 -73466 -112961 3674 10958 -72269 -36761 -57379
1701 -57379 -79750 -204241 -146335 -348138 -297165 -203661 -274809 -205339 -108154 57967 132258
1690 132258 -88669 -231782 151995 221909 -10472 -97638 -28861 -103058 -55959 -65096 26789
1679 26789 -26987 -13698 25100 13124 61745 133252 -18799 -57828 110616 -5608 -187690
1668 -187690 -100875 -78191 -135469 -13139 -34533 -101120 -15847 62521 198120 -79317 9898
1657 9898 -15647 -246206 -222076 41138 130094 -62329 14023 271439 173042 230971 178261
1646 178261 36653 -77708 -285762 -148728 -82145 -112833 -156843 -4772 -38610 127209
1636 127209 114407 143614 77441 114356 100883 48569 37009 126115 83161 128877 -47584
1625 -47584 -193742 -223701 -192253 -6609 15803 70672 40476 149739 42655 -69742 5909
1614 5909 172017 45995 46109 -36622 -256890 -290768 -137631 -146962 -98772 -94643 -120566 1322
1602 1322 24585 102091 500 71666 175480 -17003 -76796 7894 63313 -11783 -244966
1591 -244966 -328455 -196129 -18752 39467 -14819 115724 2670 61188 -7861 -137811 52962
1580 52962 1365 -250353 -310030 -80516 18555 146413 197356 136800 -139178 -224579 -172781
1569 -172781 -119000 -177867 -172278 24682 69671 -109730 -323220 -206550 -67904 54249 -37783
1558 -37783 38113 55555 11595 28098 -162523 -212087 -262825 -26279 36830 -28786 -221816
1547 -221816 -271661 -5181 105690 -65153 -84820 -181639 81078 -42774 -86620 7864 42186
1536 42186 28590 -122278 -24701 10157 -61606 -47063 70128 -23989 -139910 -260114 -262007
1525 -262007 -55789 33206 -29324 34872 20669 64671 2386 -89130 -227732 -319336 -258539
1514 -258539 -86842 23896 -91345 -97557 -46445 3391 -221670 -377631 -342431 -294964 -192275
1503 -192275 -60722 -195140 -380977 -249956 -261827 -269361 -96541 -117673 -125447 -50648 18673
1492 18673 91636 -36191 -110188 73932 115997 39706 170514 222936 94411 52384 155943
1481 155943 88467 249255 176411 -89860 -61577 93397 -265856 -229712 -134978 -140463 -12694
1470 -12694 -169679 -164593 31781 204655 -99091 -103203 -139682 -269064 -101337 38413 73609
1459 73609 20096 -48981 160781 255175 204370 109702 -143439 -258822 -142043 -29346 -23915
1448 -23915 41310 -3602 -121090 -111987 -319603 -342414 -87401 -106196 -72676 25592 50167
1437 50167 -127876 -41427 -4016 -142449 -212028 -306578 -400375 -82170 122311 28045 -130523
1426 -130523 -77945 -41030 -56213 66484 179083 13451 -179619 -228831 -185589 -87561 -94686
1415 -94686 -130703 -88303 -81792 -3291 -33393 -37995 -241181 -62119 40875 -80348 -176160
1404 -176160 34192 69657 -220949 -245560 -388338 -189179 130799 -117648 -278558 82660
1394 82660 -25628 -201983 -155278 12222 -27990 51793 -38673 52230 343089 197802 111942
1383 111942 156054 166656 -125322 -13830 47400 -178600 23349 -42602 -80 -146034 -327425
1372 -327425 -339505 -71889 -138547 -160644 -313965 -244603 -33560 -50359 -69564 -124774 61842
1361 61842 156119 52493 -4242 51844 128551 32972 22322 58483 -61234 -235215 -160819
1350 -160819 -149339 22864 120210 -146696 -81316 -162403 -40229 -92037 68281 330485 189341
1339 189341 -44822 -34331 38767 27040 -118774 -147933 -134061 -130239 -150030 -192232 -8358
1328 -8358 -168258 -106606 23763 -142090 -228348 -202808 66057 6114 79827 -53620 -16379
1317 -16379 61823 -136250 -238103 -157139 13518 139205 71445 39349 -90738 -36378 4121
1306 4121 -109320 14542 -192615 -306522 -388458 -115817 -145057 -281286 -187644 -84510 55716
1295 55716 42940 -58587 -40099 -58040 -76612 -80166 -16641 -71468 -89853 -40385 -108816 -28419
1283 -28419 -132321 -224691 -129965 -78969 -149947 -391185 -192652 47051 66705 -276831 -24253
1272 -24253 125065 -23490 6193 205357 140846 -121676 -199646 -160723 16612 -67286 20182
1261 20182 116197 118420 66423 39057 -37965 -140683 99233 214024 -54064 -149943 -8168
1250 -8168 -14758 42131 50424 7435 38237 55637 37941 -96194 -71194 7093 -107654 -281883
1238 -281883 -63914 -69480 104400 -68241 -190623 -38337 92350 52822 10410 -49478 -172511
1227 -172511 -150454 -73374 42309 154260 162647 49810 44196 54953 -87932 -252677 -302505
1216 -302505 -175416 -162688 -96410 24639 41774 130792 303361 257703 123737 -55674 -244364
1205 -244364 -314777 -300088 -66650 179087 152429 -92572 -50384 -111652 -18673 9134 5536
1194 5536 -44044 -64865 46951 -32072 -62932 -85837 -136785 -101995 2906 244514 101090
1183 101090 184745 249491 -28020 -127141 161708 55013 -185388 95185 234711 251594
1173 251594 53483 118003 130317 109718 48815 -137435 -20701 170669 33616 -7185 -166404
1162 -166404 -68707 130722 68354 -120073 -51101 -84500 32800 -44333 -78709 107726 -82285
1151 -82285 -220398 -121288 -1135 -131450 -220428 46825 -132370 -11388 56560 -60799
1141 -60799 -41307 -177525 -212411 -112004 -10002 -35931 -115281 -24532 -83323 -156510 -309843
1130 -309843 -308396 -130307 -107915 -161466 -103362 -81749 -239315 31673 -193543 -114131 -122827
1119 -122827 -229494 -189391 -101812 15078 -48372 -170405 -66267 -156669 -158526 -209728 -116704
1108 -116704 -100362 133263 268980 4209 -136705 -133117 -130743 -180044 -117499 -83395 -208902
1097 -208902 -67713 18076 114962 63091 -6611 -56821 8971 2631 -100477 -151030 -135132
1086 -135132 107507 145377 14174 -72275 -74078 -186306 -227785 -176103 40732 97313 31505
1075 31505 135148 8023 22243 -13280 -53315 -167259 -56573 204028 93873 -39396
1065 -39396 24360 -82938 -169138 -244935 -144911 -35581 23804 71898 -88686 -83157 49432
1054 49432 142967 -18622 -132003 -108310 -52909 -74080 119060 176409 175700 48304 -68666
1043 -68666 -185489 835 -36105 -49444 83618 53203 37290 96528 229465 234976 -35030
1032 -35030 -225303 -257632 72538 33475 -74727 -142039 -239999 -82355 144494 187591 90272
1021 90272 -43652 -65239 29505 295818 383471 150754 -61014 -23241 -80515 -32650 90597
1010 90597 -181786 -240365 -221866 -65804 59498 65604 -50571 -173456 -262351 -187523 4264
999 4264 148988 109002 15307 6987 -138893 -117319 137840 240983 43620 247419 211550
988 211550 144090 113132 164643 223747 200807 -31988 -237980 -404 101733 118393 159503
977 159503 79736 -110093 244727 244009 -7551 -77333 -9943 -189644 -92297 -464 116512
966 116512 -50304 -184813 130314 268336 -10743 -77969 -23331 143647 204799 191171 -131696
955 -131696 -132938 -39762 -151010 -66325 -95209 -146095 -117122 -15708 -47265 86533 72703
944 72703 49986 -109235 -31717 32404 239150 58839 -43725 -78162 -100946 -48400 147907
933 147907 -11498 26544 120253 123373 53376 -720 104981 140658 137158 34885 187761
922 187761 -13614 -151630 -30399 -6244 93051 47432 -34606 -74232 -147973 63572 151591
911 151591 81391 9278 130692 287167 117112 -6863 -3766 152622 105200 140164 101349
900 101349 -44156 49180 59337 127385 23491 -102248 -249405 -161340 -140789 13929 -23150
889 -23150 -15881 -11672 -120724 -172217 -171716 -204966 -34688 -134871 -84587 -102196 -44331 19375
877 19375 -66941 -54366 -173125 -153514 8304 -39325 -142222 -21273 34091 145778 -33605
866 -33605 -31715 -78565 -12058 188343 17098 68285 213502 -47898 -95855 -17473 109624
855 109624 108987 133653 -72347 -162842 -29056 -62369 236916 59399 -43962 34345 -54659
844 -54659 -54831 67701 -2648 169500 7134 -112555 170837 183430 53631 -38631 155444
833 155444 258890 142620 -157084 -21332 -9745 -83995 -180053 -74804 99745 -1193
823 -1193 -248196 -273940 -356707 -295358 -177458 26369 10967 -30508 150560 -18898 -210521
812 -210521 -159996 -244615 -188792 -91707 186413 212636 -20404 44364 -65931 22525 -68528
801 -68528 166268 47468 -44451 130752 162148 97915 87076 143787 73981 -31844 80610
790 80610 111626 -22473 59456 -71725 57885 -28757 -135196 -98263 -214246 -353443 -327139
779 -327139 -77936 -20638 31607 -1272 -20845 16583 48092 1327 36707 -3298 -158810
768 -158810 -20945 52636 -38467 96029 95370 -47997 140147 196591 102165 269253 254089
757 254089 117186 110371 121083 152462 -86845 -98851 118749 66753 85709 7838 7046 202126
745 202126 180205 164568 74319 98027 74429 142189 106381 -89447 -231709 -218402 102397
734 102397 143306 -26751 -18641 27443 102155 131652 2408 93398 130110 110567 340658
723 340658 365518 243407 110317 87997 39869 94564 58518 109371 -60807 44848 160784
712 160784 50757 2564 115131 190286 -69724 -64612 -24902 -16557 -5008 -99436 55419
701 55419 16241 -213613 -15713 154587 236033 128154 33835 33960 168795 111119 116695 118320
689 118320 102666 17760 43758 64540 22708 -25200 -11433 -77732 -63547 -88450 -53642 -37327
677 -37327 113149 83672 52054 -31243 -144889 -123375 -19907 -95018 82735 192836 38355
666 38355 -65633 -62483 119737 -6627 -27603 134842 71441 95963 131321 149184 119319
655 119319 175256 -15463 -114431 36941 -98025 -146602 -95341 111675 107443 -5446 -103267
644 -103267 -117811 2263 -48855 -199491 131060 93352 -73632 -120228 -169961 -152936 45399
633 45399 167931 273215 255102 10164 92048 143724 -98747 -96381 -61989 171292 144146
622 144146 65654 -160934 -160816 -5957 184860 53855 89539 126138 -64296 -134721 103960
611 103960 124720 93202 127180 126862 79387 45697 77012 46688 15236 -203705 -132101 -116959
599 -116959 -191399 -113688 -17526 -92311 -42014 -33953 -61367 -15223 -80809 -137994 -330567 -321103
587 -321103 -54957 -87420 -344824 -342565 -7414 22177 72833 106778 148154 -32074 -232063
576 -232063 -232227 -69516 -266037 -197651 -102829 -111483 -10547 -116247 -96146 62199 103469
565 103469 -42000 -64096 -75756 -31150 -22748 -102661 -187483 -180157 23492 -100814 -117832 -86703
553 -86703 -63558 -140235 -127804 56232 96946 87193 33930 131807 159930 145794 55998 -11262
541 -11262 179980 -79003 -83116 -34951 -149979 -40743 -46296 55345 135713 39580 131978
530 131978 -17893 228608 66864 136004 108220 -14735 -5083 -29355 66738 -80804 -233051
519 -233051 -37436 5408 -37033 -104602 -129705 83566 190964 138740 208274 171929 75212
508 75212 196562 96243 -107868 -214159 -25855 -74100 -57506 -173448 103 -41206 49585
497 49585 -99987 -14568 -30348 -214388 -163077 -221640 -93659 -78714 -176946 48939 -100039
486 -100039 123807 194281 116026 187602 222416 190716 204235 8405 -9619 8410 75479
475 75479 114374 210529 177788 33145 -64546 47049 106534 53043 -10819 -40798 -58794 -110667
463 -110667 -112474 47847 112750 11267 47589 -52602 -49911 209865 -2055 -173995 -49793
452 -49793 121527 30675 41203 28168 3377 32841 -24796 2335 37999 -18773 -269985 -144672
440 -144672 -324394 -205978 12072 71193 -157094 -51960 -252624 -139082 -183069 -312059
430 -312059 -113614 68960 -71068 120643 75000 -4479 48330 66691 -22978 -91518 -51799
419 -51799 -42505 -200529 -232870 31233 66081 -2160 80156 9222 -5678 16819 -39408 -130709
407 -130709 -21197 80535 108985 65906 47002 156110 -76678 -144814 -104782 -13144 -279916
396 -279916 -146265 89909 -22285 -31135 57919 -119219 -244788 -171258 42548 -67356 -219098
385 -219098 -54386 45014 39925 -53218 -61286 -54116 -35277 193134 159650 201885 42420 -140729
373 -140729 -113769 -224490 -185354 -236944 -258554 -40080 -74938 -106869 -76221 -41033 -70335
362 -70335 -162318 -130505 -47180 22324 52156 25655 -153068 -166808 -220881 -143915 -58974 22251
350 22251 38453 -106135 -140516 -306798 -69048 152765 22579 211745 163788 -97421 -148400
339 -148400 60244 -28407 -229988 -105709 15260 52771 -149162 -114662 67155 142338 186450
328 186450 243674 94733 -114798 -1168 -163145 -180867 -26904 -55793 -82975 -82036 -106019
317 -106019 -176211 -190090 -118216 -115186 129708 166451 22137 -49483 -81376 -50241 -58432 -77876
305 -77876 12480 169454 111134 121158 55089 -89735 -132120 -15244 30077 -6488 -100318
294 -100318 -202753 -143006 -176326 97984 95309 -95065 -110244 -137230 -200503 -58433 107672
283 107672 135221 -6905 -118233 89192 -78396 -148867 24317 112331 -88921 102545
273 102545 135461 -43369 -27502 -37728 -18161 63238 -11234 -87336 -123330 -41255 -125424 -239520
261 -239520 -106055 -133206 -139410 -164821 -73205 -130576 -207020 -224462 -119077 -105000 -100746 -49540
249 -49540 -206687 -59415 -96496 -109058 -64496 -130504 -185429 -76922 -322973 -381830 -43534
238 -43534 48893 22337 -122248 -96739 -139569 -97567 -33023 -37627 -31539 -113569 -251431 -233995
226 -233995 -132773 -81912 925 102294 21068 37235 105107 48377 -14617 -110085 -153778
215 -153778 -55896 -19177 -229814 -165604 -122002 -66297 -118291 82415 -20528 -163166 -12038
204 -12038 -55991 -10531 -110588 -64852 -93582 -214264 -99526 -61611 -71865 -114068 -206021
193 -206021 -72645 143741 54732 -27605 38956 41918 15943 7400 -59721 45060 -15945 -212674
181 -212674 -284391 -121343 17041 -122601 -163799 -100808 180959 181880 176216 202797 47784
170 47784 -92193 -261890 -116288 42927 -73338 22344 -96578 -75850 -347548 -310823 -137763
159 -137763 -66391 -158368 -297138 -154191 -115588 -233418 -229825 -166831 -84851 -87534 -340738
148 -340738 -164241 36832 -123239 -30535 3095 -91699 18052 -28025 -4778 111509 47180
137 47180 39702 -34693 36968 -56782 -254910 -106057 -31407 10058 79496 39344 -84931 -45726
125 -45726 48160 -166630 -94758 -200494 -194085 -75425 -21315 -152101 -249558 -160200 59721
114 59721 -10078 -55465 -565 -129624 -17998 -38602 -201565 -208524 73233 80022 28908 -206216
102 -206216 -68477 79996 -6129 -23164 66027 79823 -47532 -256011 -255126 -49488 10861
91 10861 -17647 -168646 -194875 79381 -23782 -153642 -236225 -203475 -121329 -11577 -44942
80 -44942 -6044 -168247 -67738 6732 -125956 -95749 -163813 -67444 -59611 -26146 -137881 -121203
68 -121203 46123 129105 19208 -87021 -17405 103074 -48304 -7422 -56342 -239973 -229547
57 -229547 -203048 -102399 -156095 -161308 -242190 -160745 -121536 -101760 -108386 -89951 -93138 -51237
45 -51237 15695 -157981 -281414 -113092 -71018 -97575 -175834 -196794 -126769 -144906 -147814 -58675
33 -58675 -39933 -151303 -104741 -169333 -67651 -138793 -43311 6595 -174296 -150805 -188654 -34023
21 -34023 -42832 -125555 -94407 -52506 -112551 -183883 -151396 -192867 -67772 -176830 -154323 -129644
9 -129644 -54851 100119 -18511 72757 41617 -58938 -120445 -75572 -32124
0 -32124
$$ Imaginary data points
##PAGE= N=2
##DATA TABLE= (X++(I..I)), XYDATA
16383 -1050402 -931221 -1045482 -1042207 -1127858 -1169404 -1005761 -985681 -906764 -910545 -776208 -896951
16372 -896951 -852973 -934189 -830805 -881339 -1099412 -954186 -834371 -924236 -1009591 -788867
16362 -788867 -778291 -791990 -689417 -597565 -417328 -512645 -607745 -416383 -464287 -438563 -379788
16351 -379788 -398263 -427481 -491278 -379345 -274473 -281719 -296356 -351914 -306265 -274481 -267521
16340 -267521 -133412 -256980 -352224 -179102 -170193 -244461 -85195 -10593 -72459 -157547 -8151
16329 -8151 1923 -54801 -68010 -11136 32033 -22264 71978 107112 -81484 -87169 23410 107054
16317 107054 331031 387344 365610 253018 298666 429010 404684 388020 349570 243193 270399
16306 270399 254139 381967 425025 463654 521190 541993 635969 641648 705172 612922 609157 774764
16294 774764 825812 784148 715069 702465 708961 550504 587222 705463 713823 737309 638759
16283 638759 641885 669222 721282 726253 822060 948759 847454 828194 835442 1170946 1191924
16272 1191924 1072336 1119736 995780 987757 1004228 1049672 978066 1029537 1232502 1213456 1070450
16261 1070450 1140091 1047129 1078515 1046335 1119853 1104505 1073099 1076305 1187190 1164209 1122582
16250 1122582 1177255 1272525 1463852 1514742 1554048 1691478 1589864 1404199 1448656 1453557 1469247
16239 1469247 1426874 1496012 1487080 1491169 1639167 1541215 1431196 1533801 1475211 1361740 1569662
16228 1569662 1597999 1392659 1297850 1286662 1424648 1426934 1367291 1471558 1646672 1778928
16218 1778928 1735233 1907900 1841765 1792508 1835977 1850594 1769718 1731054 1815710 1919026 1865084
16207 1865084 1754713 1591449 1700160 1767438 1653665 1509194 1572046 1507060 1555091 1662062
16197 1662062 1712096 1704682 1706912 1778987 1768175 1994096 2033387 1752232 1756135 1853435 1771693
16186 1771693 1753588 1826369 1609844 1703244 1969086 1975997 2008110 1946516 1980012 1767857 2052592
16175 2052592 1956981 1954835 2047465 2017531 1867432 1835483 1916665 1982493 1780240 2080293 1913416
16164 1913416 2010909 2088066 2056359 1996595 2059534 2065390 1928987 2038572 2127305 1907866 1972665
16153 1972665 1937144 2030416 2194651 2141361 1903744 2108878 1962604 1927771 2185822 2131724
16143 2131724 2185424 2079322 2112588 2022369 2161044 1967109 1967459 2097586 2084108 2064769 2078081
16132 2078081 2074300 2156778 2023609 1961669 1911943 2049955 2031088 2116538 2099816 2051040 2238534
16121 2238534 2352355 2105327 2142174 2056838 2084789 2344044 2191733 2140360 2149643 2222443 2213723
16110 2213723 2241555 2238546 2341255 2120963 1997687 2179393 2416242 2451426 2213956 2209040
16100 2209040 2059679 2165852 2196615 2165984 2019318 1985598 2184549 2320843 2129768 2016111
16090 2016111 2030450 2270799 2230668 2140256 2017151 2067898 2242643 2260979 2090557 2198820
16080 2198820 2198394 2124367 2109727 2214870 2160422 2325647 2348863 2236981 2242561 2190905 2152050
16069 2152050 2245426 2418521 2276701 2142789 2080900 2248661 2366367 2293003 2162106 2101773
16059 2101773 2025236 2140363 2229469 2287216 2228137 2399944 2271521 2126704 2313397 2255795
16049 2255795 2499775 2408201 2110557 2214534 2194871 2193235 2254361 2002209 1936098 2130486
16039 2130486 2231313 2353262 2381294 2421403 2263861 2125970 2242411 2427383 2190852 2153144
16029 2153144 2206964 2111807 2090543 2093534 2114018 1947062 1912847 2236752 2336099 2173642 2053522
16018 2053522 2034515 2133500 2193387 2275610 2151757 2125101 2117290 1938220 2041417 2200890 2199919
16007 2199919 1981294 2159989 2063417 1987807 2021078 2118293 2066848 2080724 2250262 2313058 2188845
15996 2188845 2350907 2352334 2217506 2095194 2133590 2176238 2231350 2301329 2147920 2180266 2497353
15985 2497353 2408138 2279131 2253910 2154193 2126331 2269797 2347276 2183699 2169906 2307695
15975 2307695 2258113 2154163 2324076 2363973 2343420 2322962 2473944 2413879 2226334 2130553
15965 2130553 2334515 2291455 2279134 2222120 2226441 2197516 2290394 2307703 2408018 2333928 2360541
15954 2360541 2494244 2482219 2200852 2263813 2396512 2423637 2330331 2327751 2384731 2381182 2338805
15943 2338805 2426423 2414532 2306646 2161816 2215235 2395279 2203748 2198837 2089067 2220269
15933 2220269 2412684 2356040 2297967 2280996 2261129 2342545 2235380 2500153 2454919 2286243
15923 2286243 2417209 2373798 2413554 2432147 2377862 2256948 2101312 2105349 2144706 2308294 2328317
15912 2328317 2137033 2140968 2253809 2236312 2306769 2226462 2331332 2234175 2322842 2246424 2222961
15901 2222961 2194964 2186683 2425862 2369098 2370384 2413864 2366039 2401233 2336305 2224591 2175070
15890 2175070 2256653 2248804 2234995 2448883 2283244 2127923 2025310 2168734 2279741 2449963
15880 2449963 2347589 2292080 2311854 2334682 2271401 2196945 2284427 2218410 2209103 2055289 2070549
15869 2070549 2165703 2131405 2166677 2080403 2082754 2290588 2387705 2474696 2542143 2481939 2441567
15858 2441567 2252606 2284887 2324099 2419980 2261726 2330465 2434974 2348358 2382844 2336771 2388096
15847 2388096 2458733 2348806 2329082 2242155 2292919 2178776 2091349 1972755 2150818 2406632
15837 2406632 2451105 2445620 2427243 2477896 2311336 2292679 2215209 2309785 2284615 2097403 2024793
15826 2024793 2147338 2212016 2292059 2197025 2196634 2208558 2193934 2172184 2055027 2170248 2345316
15815 2345316 2295343 2269834 2138904 2367607 2466706 2208563 2215925 2273743 2232710 2319290 2392697
15804 2392697 2390203 2477774 2495208 2232510 2228698 2331970 2286517 2242658 2359222 2211284 2173139
15793 2173139 2330382 2296260 2154579 2139286 2304881 2370560 2244919 2295191 2372714 2403630
15783 2403630 2420280 2311899 2427037 2349399 2330732 2254861 2307131 2264483 2258872 2168248 2159713
15772 2159713 2248489 2172417 2246734 2208051 2325671 2293990 2341683 2396063 2326006 2425598 2212103
15761 2212103 2107522 2291203 2398293 2388161 2132605 2035672 2066287 2284214 2383281 2423459
15751 2423459 2338625 2330402 2414078 2218594 2339904 2487951 2454006 2562659 2425866 2150227
15741 2150227 2075409 2073103 2168025 2266824 2227665 2232743 2370105 2244129 2366391 2286283 2225589
15730 2225589 2115683 2107013 2231465 2287424 2231432 2085569 2081668 2062019 2191497 2387018 2290296
15719 2290296 2235901 2117748 2084629 2085844 2301445 2333877 2270124 2318926 2223043 2408247 2354775
15708 2354775 2243638 2361067 2437138 2354770 2478127 2353735 2159702 2226156 2265000 2221354
15698 2221354 2173824 2173454 2315379 2394755 2382890 2401909 2386364 2338483 2159255 1953400 2116343
15687 2116343 2289835 2083012 2217350 2063101 1882845 2145169 2151437 2223427 2145312 2279149
15677 2279149 2438344 2223211 2097626 2190448 2487476 2602423 2509276 2434797 2338793 2501619
15667 2501619 2352976 2227297 2170712 2332594 2317955 2203116 2177729 2228082 2240658 2195439
15657 2195439 2239621 2394658 2546380 2339010 2313074 2422957 2280274 2308719 2429638 2275944
15647 2275944 2364505 2455282 2373113 2349575 2253553 2217429 2349520 2221225 2338458 2329155 2311854
15636 2311854 2355313 2235891 2033593 1967789 2157856 2391557 2379423 2278144 2109355 2259822
15626 2259822 2170827 2082287 2356430 2499669 2302630 2183614 2235434 2372971 2507871 2342719
15616 2342719 2430753 2190165 2249455 2362414 2467760 2524462 2499487 2390109 2374550 2447401
15606 2447401 2338336 2473071 2480140 2354873 2093691 2048322 2063960 2132523 2352463 2397029
15596 2397029 2485564 2272252 2450989 2323645 2142057 2345290 2398394 2448098 2513029 2449307
15586 2449307 2262839 2389158 2420890 2196407 2110974 2314140 2331205 2327659 2322953 2249599 2231781
15575 2231781 2330673 2335108 2463013 2495684 2649897 2502412 2444560 2374170 2269404 2280081 2346905
15564 2346905 2475926 2446181 2363354 2160914 2089664 2286714 2502823 2432823 2452547 2531243
15554 2531243 2504544 2451299 2382821 2201228 2193751 2165181 2130227 2485646 2386651 2291694 2205963
15543 2205963 2152069 2287762 2294677 2240782 2318921 2311621 2343442 2494496 2414461 2203420 2361774
15532 2361774 2367793 2283047 2340194 2438869 2485216 2412412 2448158 2071815 2043483 2112560 2127354
15521 2127354 2260823 2358949 2212731 2176248 2184646 2243021 2331618 2381163 2388225 2553902 2177505
15510 2177505 2114712 2117077 2164461 2123314 2204595 2425378 2403334 2527818 2688789 2533991 2235731
15499 2235731 2251942 2502140 2603103 2494512 2486332 2547410 2457917 2413837 2367837 2292073 2354212
15488 2354212 2253059 2251746 2376634 2282437 2254579 2149421 2045727 2256617 2345230 2346201 2312086
15477 2312086 2244238 2356590 2325992 2388453 2436462 2422287 2498422 2388541 2252329 2149385
15467 2149385 2273136 2348310 2280558 2217178 2204083 2183220 2310510 2126632 2245889 2502796
15457 2502796 2702309 2451899 2286609 2217890 2289246 2440319 2432415 2292594 2325459 2439932
15447 2439932 2441556 2271140 2391534 2395836 2353535 2231096 2128514 2286700 2312522 2194024
15437 2194024 2302290 2442432 2270514 2251256 2198553 2232194 2181015 2112757 2086449 2264714
15427 2264714 2422964 2391090 2521589 2507138 2296801 2307711 2231922 2139163 2194116 2289998 2298022
15416 2298022 2535222 2560672 2497003 2293174 2130838 2349414 2333943 2289447 2390846 2266813
15406 2266813 2544142 2638232 2453538 2365404 2476453 2573961 2659685 2642602 2436617 2179374
15396 2179374 2375416 2437330 2409844 2594947 2396475 2387298 2373921 2321844 2493219 2440412 2418017
15385 2418017 2356309 2423015 2585085 2318552 2400942 2478023 2382727 2266536 2316221 2233979 2488991
15374 2488991 2504991 2529697 2654683 2626275 2435233 2213702 2248245 2376170 2286338 2282580 2316682
15363 2316682 2462435 2380499 2339592 2477477 2437515 2261685 2309373 2366549 2412764 2445025 2447884
15352 2447884 2484265 2455467 2585061 2541866 2578357 2642358 2411358 2371063 2401623 2336415 2420822
15341 2420822 2431821 2442205 2501670 2518189 2497963 2516370 2510672 2577301 2325442 2410722 2448387
15330 2448387 2385902 2458481 2440190 2566124 2696335 2560724 2630563 2672841 2684672 2609079 2599397
15319 2599397 2496360 2507685 2420136 2225067 2345157 2442957 2463110 2413420 2348481 2583066
15309 2583066 2681368 2603588 2638968 2486781 2302505 2375400 2364761 2328896 2227730 2446723
15299 2446723 2578118 2622485 2223372 2117948 2408394 2459644 2546098 2531490 2615627 2610239 2534436
15288 2534436 2456277 2443363 2484877 2492924 2466918 2465608 2594061 2610077 2499772 2483346 2492003
15277 2492003 2364577 2305846 2402172 2448180 2409570 2452564 2460610 2307412 2215114 2088231 2271570
15266 2271570 2367315 2236560 2211313 2392462 2371860 2349750 2509360 2427384 2261445 2134774
15256 2134774 2194849 2195623 2347632 2315809 2277111 2411590 2497456 2433341 2301427 2285555 2224071
15245 2224071 2273624 2218509 2256866 2348750 2314677 2290432 2478954 2578971 2516431 2533700 2677386
$$ [...]
##END NTUPLES=NMR SPECTRUM
##END=
