##TITLE=1H_EC-3265(1-2)
 CDCl3
 8 sc, 
 10.12.2021
##JCAMPDX= 6.0         $$ Bruker NMR JCAMP-DX V2.0
##DATA TYPE= NMR SPECTRUM
##DATA CLASS= NTUPLES
##ORIGIN= UXNMR, Bruker Analytische Messtechnik GmbH
##OWNER= root
$$ XWIN-NMR		Version 3.5
$$ Fri Dec 10 11:50:27 2021 Russian Standard Time (UT+4h)  she@DPX200
##.OBSERVE FREQUENCY= 200.131346
##.OBSERVE NUCLEUS= ^1H
##.ACQUISITION MODE= SIMULTANEOUS
##.ACQUISITION SCHEME= undefined
##.AVERAGES= 8
##.DIGITISER RES= 18
##SPECTROMETER/DATA SYSTEM= spect
##.PULSE SEQUENCE= zg30
##.SOLVENT NAME= CDCl3
##.SHIFT REFERENCE= (INTERNAL, CDCl3, 0, 15.7171)
##AUDIT TRAIL= $$ (NUMBER, WHEN, WHO, WHERE, WHAT)
$$ ##TITLE= Audit trail, XWIN-NMR		Version 3.5
$$ ##JCAMPDX= 5.01
$$ ##ORIGIN= Bruker BioSpin GmbH
$$ ##OWNER= she
$$ F:/spectra/data/she/nmr/H-F/1/pdata/1/auditp.txt
$$ ##AUDIT TRAIL=  $$ (NUMBER, WHEN, WHO, WHERE, WHAT)
(   1,<2021-12-10 11:49:15.43 +0400>,<she>,<DPX200>,
      <created by zg, POWCHK disabled, PULCHK disabled
       configuration hash MD5:
       00 E9 B6 7A A2 85 ED C7 34 08 36 98 17 FE 4E 26
       data hash MD5: 16K
       8C 29 F2 8F 01 02 F1 EE A5 67 1C 18 AB 78 99 B5>)
(   2,<2021-12-10 11:49:22.68 +0400>,<she>,<DPX200>,
      <Start of raw data processing
       efp BC_mod = 2 LB = 0.24 FT_mod = 6 PKNL = 1 PHC0 = -15870.06 PHC1 = 10.2008 SI = 16K 
       data hash MD5: 16K
       FE E4 D5 2C BB 7F 4F 2E 3A 24 6D 4A 79 B5 DB 9C>)
(   3,<2021-12-10 11:49:36.48 +0400>,<she>,<DPX200>,
      <pk PHC0 = -0.6694251 PHC1 = 0 
       data hash MD5: 16K
       85 BD B7 88 07 81 1D 55 C2 D0 F1 19 80 F4 8E 09>)
(   4,<2021-12-10 11:49:39.57 +0400>,<she>,<DPX200>,
      <abs ABSG = 5 
       data hash MD5: 16K
       F3 FD 3C 85 6E 02 C7 B3 7F A6 DB 60 DF DA F6 21>)
$$ ##END=
$$ 
$$ hash MD5
$$ 98 ED A4 65 C8 CD 7E 5E E7 EC D6 48 53 66 CD D2
##$RELAX= 
##$RELAX= 
##$RELAX= 
##$RELAX= 
##$RELAX= 
##$RELAX= 
$$ Bruker specific parameters
$$ --------------------------
##$DU= <F:/spectra>
##$EXPNO= 1
##$NAME= <H-F>
##$PROCNO= 1
##$TYPE= <nmr>
##$USER= <she>
##$AMP= (0..31)
100 100 100 100 100 100 100 100 100 100 100 100 100 100 100 100 100 100 
100 100 100 100 100 100 100 100 100 100 100 100 100 100 
##$AQSEQ= 0
##$AQ_mod= 1
##$AUNM= <au_zg>
##$AUTOPOS= <>
##$BF1= 200.13
##$BF2= 200.13
##$BF3= 200.13
##$BF4= 200.13
##$BF5= 200.13
##$BF6= 200.13
##$BF7= 200.13
##$BF8= 200.13
##$BYTORDA= 1
##$CFDGTYP= 0
##$CFRGTYP= 5
##$CHEMSTR= <none>
##$CNST= (0..31)
1 1 145 1 1 1 1 1 1 1 1 1 1 1 1 1 1 1 1 1 1 1 1 1 1 1 1 1 1 1 1 1 
##$CPDPRG= <>
##$CPDPRG1= <>
##$CPDPRG2= <>
##$CPDPRG3= <>
##$CPDPRG4= <mlev>
##$CPDPRG5= <mlev>
##$CPDPRG6= <mlev>
##$CPDPRG7= <mlev>
##$CPDPRG8= <mlev>
##$CPDPRGB= <>
##$CPDPRGT= <>
##$D= (0..31)
0 1.2 0 0 0 0 0 0 0 0.06 0 0.03 0 0 0 0 0.0002 0 0 0 0 0 0 0 0 0 0 0 0 
0 0 0 
##$DATE= 1639122554
##$DBL= (0..7)
120 120 120 120 120 120 120 120 
##$DBP= (0..7)
150 150 150 150 150 150 150 150 
##$DBP07= 0
##$DBPNAM0= <>
##$DBPNAM1= <>
##$DBPNAM2= <>
##$DBPNAM3= <>
##$DBPNAM4= <>
$$ [...]
##$SUBNAM2= <"">
##$SUBNAM3= <"">
##$SUBNAM4= <"">
##$SUBNAM5= <"">
##$SUBNAM6= <"">
##$SUBNAM7= <"">
##$SUBNAM8= <"">
##$SUBNAM9= <"">
##$SW= 18.0517287032376
##$SWIBOX= (0..15)
0 0 2 0 0 0 0 0 0 0 0 0 0 0 0 0 
##$SW_h= 3612.71676300578
##$TD= 16384
##$TD0= 1
##$TE= 0
##$TE2= 300
##$TE3= 300
##$TEG= 300
##$TL= (0..7)
0 120 120 120 120 120 120 120 
##$TP= (0..7)
150 150 150 150 150 150 150 150 
##$TP07= 0
##$TPNAME0= <>
##$TPNAME1= <>
##$TPNAME2= <>
##$TPNAME3= <>
##$TPNAME4= <>
##$TPNAME5= <>
##$TPNAME6= <>
##$TPNAME7= <>
##$TPOAL= (0..7)
0.5 0.5 0.5 0.5 0.5 0.5 0.5 0.5 
##$TPOFFS= (0..7)
0 0 0 0 0 0 0 0 
##$TUNHIN= 0
##$TUNHOUT= 0
##$TUNXOUT= 0
##$USERA1= <user>
##$USERA2= <user>
##$USERA3= <user>
##$USERA4= <user>
##$USERA5= <user>
##$V9= 5
##$VALIST= <valist>
##$VCLIST= <CCCCCCCCCCCCCCC>
##$VD= 0
##$VDLIST= <DDDDDDDDDDDDDDD>
##$VPLIST= <PPPPPPPPPPPPPPP>
##$VTLIST= <TTTTTTTTTTTTTTT>
##$WBST= 1024
##$WBSW= 4
##$XGAIN= (0..3)
0 0 0 0 
##$XL= 0
##$YL= 0
##$YMAX_a= 109361
##$YMIN_a= -182463
##$ZGOPTNS= <>
##$ZL1= 120
##$ZL2= 120
##$ZL3= 120
##$ZL4= 120
##$ABSF1= 15.72266
##$ABSF2= -2.329189
##$ABSG= 5
##$ABSL= 3
##$ALPHA= 0
##$AQORDER= 0
##$ASSFAC= 0
##$ASSFACI= 0
##$ASSFACX= 0
##$ASSWID= 0
##$AUNMP= <proc_1d>
##$AZFE= 0.1
##$AZFW= 0.1
##$BCFW= 0
##$BC_mod= 2
##$BYTORDP= 0
##$COROFFS= 0
##$CY= -3
##$DATMOD= 1
##$DC= 0
##$DFILT= <>
##$DTYPP= 0
##$F1P= 0
##$F2P= 0
##$FCOR= 1
##$FTSIZE= 16384
##$FT_mod= 6
##$GAMMA= 0
##$GB= 0
##$INTBC= 1
##$INTSCL= 0
##$ISEN= 128
##$LB= 0.24
##$LEV0= 0
##$LPBIN= 0
##$MAXI= 10000
##$MC2= 0
##$MEAN= 0
##$ME_mod= 0
##$MI= 1.114404
##$NCOEF= 0
##$NC_proc= -7
##$NLEV= 6
##$NOISF1= 3.799351
##$NOISF2= 2.8
##$NSP= 0
##$NTH_PI= 0
##$NZP= 0
##$OFFSET= 15.71714
##$PC= 1
##$PHC0= -15870.73
##$PHC1= 10.2008
##$PH_mod= 1
##$PKNL= yes
##$PPARMOD= 0
##$PSCAL= 0
##$PSIGN= 0
##$REVERSE= no
##$SF= 200.130006887921
##$SI= 16384
##$SIGF1= 3
##$SIGF2= 2
##$SINO= 5.538805
##$SIOLD= 16384
##$SREGLST= <1H.CDCl3>
##$SSB= 0
##$STSI= 16384
##$STSR= 0
##$SW_p= 3612.71676300578
##$SYMM= 0
##$S_DEV= 0
##$TDeff= 16384
##$TDoff= 0
##$TI= <>
##$TILT= no
##$TM1= 0
##$TM2= 0
##$TOPLEV= 0
##$USERP1= <user>
##$USERP2= <user>
##$USERP3= <user>
##$USERP4= <user>
##$USERP5= <user>
##$WDW= 1
##$XDIM= 16384
##$YMAX_p= 357964152
##$YMIN_p= -518456
$$ End of Bruker specific parameters
$$ ---------------------------------
##NTUPLES= NMR SPECTRUM
##VAR_NAME=  FREQUENCY,     SPECTRUM/REAL,   SPECTRUM/IMAG
##SYMBOL=    X,             R,               I
##VAR_TYPE=  INDEPENDENT,   DEPENDENT,       DEPENDENT
##VAR_FORM=  AFFN,          ASDF,            ASDF
##VAR_DIM=   16384,         16384,           16384
##UNITS=     HZ,            ARBITRARY UNITS, ARBITRARY UNITS
##FACTOR=    0.220516191357247, 1,           1
##FIRST=     3145.47137603491, 0,            0
##LAST=      -467.245386970871, 0,           0
##MIN=       -467.245386970871, -518456,     0
##MAX=       3145.47137603491, 357964152,    0
$$ Real data points
##PAGE= N=1
##DATA TABLE= (X++(R..R)), XYDATA
$$ [...]
9426 688526 583116 620952 670993 717064 842247 842015 879708 812207 770778 820683 874587 797582
9414 797582 715339 605732 641079 693975 685092 740903 667829 785182 817787 767825 776701 842692
9402 842692 857493 745516 866830 811486 914554 948315 899527 917837 728073 622899 687157
9391 687157 950901 842423 623922 673331 699318 936463 849381 649269 651728 839381 767628
9380 767628 850853 874709 1079063 1240213 1131838 1297619 1173974 1123216 1156257 1158176 1158264
9369 1158264 1229364 1242335 1139738 1399248 1443607 1408684 1413711 1359862 1407561 1473865 1532859
9358 1532859 1473602 1663298 1902026 1732723 1769261 1890987 1984485 2164662 2378705 2400160
9348 2400160 2462313 2564065 2532341 2636879 2628050 2820457 2877110 2905750 2816079 2670476 2816312
9337 2816312 2907795 3017509 2801385 2778511 2889842 2939387 3113489 3168424 3307535 3427942
9327 3427942 3382241 3339577 3338439 3297801 3394011 3494674 3263345 3336918 3338461 3367663 3381907
9316 3381907 3301153 3431951 3495528 3718338 3748189 3767268 3989663 4198425 4317070 4266485
9306 4266485 4004497 4155005 4321067 4425883 4256865 4254088 4300935 4246126 4243415 4143100 3939837
9295 3939837 3948083 4033756 4067175 4014950 3934151 3701181 3772882 3902842 3882893 3973075 3739397
9284 3739397 3636477 3708467 3591275 3348565 3262193 3144214 2954390 2971508 3159164 3148118
9274 3148118 2965553 3094704 3140686 3052490 2984756 2984973 3137623 3034882 2985168 3033459 3107797
9263 3107797 3227578 3230156 3209084 3017964 2894376 2943021 3182078 3064554 3099273 3054251 2948694
9252 2948694 3062698 3038989 3088965 3089341 3133419 3199371 3244824 3259623 3283798 3429108 3647518
9241 3647518 3602664 3657361 3658630 3676662 3785248 3623881 3417553 3319001 3266554 3084849 2958902
9230 2958902 2891680 2776335 2898221 2759945 2828254 2804693 2885781 2876498 2832756 3068087 3229516
9219 3229516 3006034 3027587 3023597 3137490 3400144 3385250 3646683 3827551 3921525 3928255 3899731
9208 3899731 4071399 4243857 4336522 4388672 4627335 4803236 4746774 4637145 4660232 4447116
9198 4447116 4347335 4266679 4134050 3937792 3738550 3646974 3555713 3627355 3717006 3757195 3748940
9187 3748940 3704763 3710860 3481291 3305641 3346177 3435657 3566154 3374299 3322772 3543023 3745647
9176 3745647 3568958 3624877 3941886 3841199 3614165 3795713 3646381 3616763 3874695 4077840
9166 4077840 4139209 4102660 4109696 3996809 4035573 4072026 4012188 4197003 4276314 4452756 4630591
9155 4630591 4526334 4597168 4755160 4603315 4780132 5018171 4995930 5078358 5326880 5221225
9145 5221225 5212823 5310475 5378343 5627198 5644688 5757645 6181760 6274152 6298909 6480444 6903711
9134 6903711 7048298 7147223 7323151 7599924 7909234 8012638 8378702 8690605 9148898 9463293
9124 9463293 9820035 10229964 10646721 11285726 11691762 12101918 12639175 12947676 13388008 14087085
9114 14087085 14897580 15553636 16040582 16801607 17626065 18216363 19240041 20328519 21559555
9105 21559555 23034572 24774668 26697990 29043902 31974637 35328565 38761218 41965982
9097 41965982 45211403 49097641 53832017 58758295 62131717 62885119 63046155 64008905 66303561
9088 66303561 69884221 71650500 70122033 66291558 60286945 54122567 49259623 45833540
9080 45833540 43945660 42977812 42717280 41634255 40131063 38741839 37338710 36488266 36353690
9071 36353690 36811682 37533441 38581506 40059769 42272699 44977268 48078732 51902851
9063 51902851 56373286 60822868 64862417 68937179 72753196 75412916 77500304 80606807
9055 80606807 85350625 90112037 91574479 90521857 89340788 87031714 83692933 78259730
9047 78259730 69294071 59805884 51559551 45081705 40234516 36536442 34132563 32202717
9039 32202717 30655131 29557379 28273844 26642875 24931001 23291381 22082263 21271183
9031 21271183 20352211 19691033 19199939 18638296 17945130 17438651 17275753 17107611 16575386
9022 16575386 15961810 15752185 15440052 15230672 14991851 14686040 14487616 14279663 13758174
9013 13758174 13363030 12899060 12579415 12107694 11753336 11344977 11085171 10864472 10577336
9004 10577336 10286316 9984995 9758040 9554468 9393635 9225047 9198228 9228939 9178786 9154973
8994 9154973 8990891 8977574 9049392 8951979 8998146 9122089 8984121 8969915 9163493 9202162 9519607
8983 9519607 9551850 9587858 9533028 9443301 9419010 9378940 9407389 9304840 8933782 8866581 8863145
8972 8863145 8691940 8571864 8677122 8695395 8460727 8481547 8361388 8299402 8278061 8484478
8962 8484478 8511880 8498374 8704359 8659066 8713926 8678823 8630391 8640817 8765475 8938494 8861538
8951 8861538 9056220 9085116 9250536 9695132 9750997 9955574 10455292 10542660 10515280 10853963
8941 10853963 10884298 10934053 10982579 11261647 11530577 11367507 11362590 11580542 11567123 11586914 11800360
8930 11800360 11953335 12043590 12285735 12923723 13511078 13738916 14197272 14774235 14820970 14503976
8920 14503976 14120964 13705057 13264116 12945824 13098875 13077016 12955741 12948192 13277544 13523460
8910 13523460 13697704 14051520 14396428 14730470 14832617 14931080 15117183 15238981 15450335 15824912
8900 15824912 16423654 16825316 17242167 17849292 18284422 18951839 19744946 20484283 21499773
8891 21499773 22626993 23903490 25367124 26877587 28840879 31017959 33254826 35430433
8883 35430433 37499163 39921774 42556590 45651420 48914103 50903403 52204324 53734029
8875 53734029 54343056 52793433 49441881 45866615 42877864 40743031 39746756 39418450 39494523
8866 39494523 39568033 38915370 38063232 37086529 36733024 36875913 37541770 38552027 39963108
8857 39963108 41607828 43605538 46090248 48610906 51478064 54194181 56984764 60433444
8849 60433444 64668556 69298488 74268707 79847563 85677940 89680391 92637509 94210031
8841 94210031 92544837 88086850 81820473 75486697 70481747 67093961 65164257 61868898
8833 61868898 57199878 53044179 49039489 45789040 42993904 40639399 39128601 37888668
8825 37888668 37133440 36284807 35999602 35961580 36305452 36783101 37586150 38698300 39962392
8816 39962392 41695470 43750684 46105464 48415409 49528030 50273056 51486081 53162803
8808 53162803 55087822 56817320 58477730 58417264 56008068 52255005 47113662 41605040
8800 41605040 36969719 33497026 30797497 28960944 27664800 26745440 25687949 24375597
8792 24375597 22889208 21371587 20144917 19124824 18550670 17907324 17201455 16585250 16189760
8783 16189760 15683533 15199399 14717869 14224013 13942275 13898961 13597724 13261535 13045499 12989349
8773 12989349 12557635 12173398 12120303 11989542 11800464 11841085 11774471 11518566 11533037 11444991
8763 11444991 11488192 11664952 11687098 11593469 11682120 11773163 11699021 12067696 12078057 12293188 12503352
8752 12503352 12966335 13222283 13317819 13329585 13656972 13988296 14196234 14260828 14770201 15186615
8742 15186615 15617972 16168668 16716600 17204751 17730445 18573398 19407562 20294960 21527292
8733 21527292 22684221 23978813 25511105 27457310 29812455 32805095 36039293 40148158
8725 40148158 44819358 50305545 55469026 60536507 65871367 72295369 79741004 89415113
8717 89415113 98749039 107800454 107956483 94023801 80756517 69146283 59069306 50923891
8709 50923891 44973650 40330757 37056186 34610958 32708224 30997464 29830853 28917410
8701 28917410 28276047 28082351 28295438 28535054 28986784 29988119 31314494 32841540 34289474
8692 34289474 34883801 35719536 37085425 38994373 41345967 44312670 47041244 48312036
8684 48312036 48537665 47009827 43624727 39234361 35283722 32259198 30017746 28440807
8676 28440807 27159684 26331576 25520244 24146175 22765128 21207917 19818422 19046910 18371713
8667 18371713 17677749 17292907 17015857 16446497 16306410 16344166 16555481 16967779 17499087 18206443
8657 18206443 18989912 19307556 19547581 19599577 19614912 19970722 20438371 20125656 19004246 17957303
8647 17957303 17014393 16308773 15545705 14574851 13298029 12284180 11439200 10730038 10155950
8638 10155950 9544977 9125677 9104111 8653127 8023471 7617262 7361907 6964705 6717518 6372050
8628 6372050 6171615 5969262 5561860 5291793 5300068 5099806 4776639 4823346 4686730 4606621
8618 4606621 4659711 4362937 4418177 4163152 3937602 4107526 4126796 3970387 3922786 3829918
8608 3829918 3750179 3711268 3604656 3500137 3261544 3193968 3134457 2977974 3005783 2921788 2845111
8597 2845111 2586260 2458697 2544073 2514518 2450867 2372762 2317566 2199800 2207632 1998029 1982682
8586 1982682 2062307 1888158 1882493 1811931 1865002 1655858 1709188 1792054 1746964 1668497 1585860
8575 1585860 1655660 1718329 1652758 1506290 1439650 1503836 1401858 1324350 1235764 1050260 1152094
8564 1152094 1280168 1299094 1140907 1127026 1360097 1383752 1214827 1192770 1315439 1108878
8554 1108878 1216532 1260337 1055565 949091 1031966 927659 779232 912794 859130 798659
8544 798659 725310 695040 773686 936950 853902 598481 746398 766850 715602 742069 513504
8533 513504 758276 642959 705202 762605 674386 739869 772295 798573 793480 832448 604163
8522 604163 889120 851593 500283 651607 648208 800683 640534 613256 522144 490133 683856
8511 683856 802822 643629 657023 577196 749342 709510 519613 509897 556460 525904 483976
8500 483976 499123 424596 225615 338169 543996 552117 636968 550181 650657 603721 530824
8489 530824 407763 428039 472372 501969 437103 228352 438228 501124 617075 614803 599683
8478 599683 645651 736516 643467 804252 570774 464593 542876 643871 630165 595588 638782
8467 638782 449952 315980 250938 429903 269304 409584 484390 284975 232288 329348
8457 329348 280528 150743 49558 216437 87143 224962 357900 348013 374114 441429 343167
8446 343167 323405 165858 350591 389045 144476 212365 343412 254966 391992 330413 201794
8435 201794 176100 81820 286159 420262 302771 239477 223382 23312 91280 -2066 98124
8424 98124 96925 143409 58279 83450 37379 -97178 -14794 -96893 -113411 -54058 -11841 50609
8412 50609 64975 85884 114245 141183 100584 25483 230150 191992 16426 21830 -121185
8401 -121185 -157665 -94197 -103012 -75901 -145451 -67169 -82215 -189130 13046 -175892 -367411
8390 -367411 -86500 -87501 -31312 64857 114282 107522 197794 -17782 187677 186606 112420 76381
8378 76381 105198 -26448 -98783 -152531 -139056 -39107 -135930 -88539 -221414 -83067 70076
8367 70076 -171903 -133599 -75891 92433 249163 239563 150121 -97251 99342 123061 100375
8356 100375 117071 -38086 -48418 200233 145476 24857 54533 87542 98065 65259 148631
8345 148631 158822 49710 -5107 -97464 75928 -4784 -48318 2061 46816 -79218 74537
8334 74537 309250 320304 97822 161974 206226 100290 26273 14919 21311 104812 -12081
8323 -12081 -83808 61110 194426 -26698 -1795 177812 46751 -15075 143064 323829
8313 323829 156899 127259 53311 -10636 -89893 116812 58963 16155 -369 35390 55893
8302 55893 -100158 57857 62954 68771 -52035 -159403 -87198 -166410 131907 12411 -73669
8291 -73669 -57780 68532 -16851 -103059 34445 13052 -83812 -356099 -209122 23146 -262611
8280 -262611 -354637 -157901 -165704 27372 29827 7715 45151 108203 -111603 -32001 -260465
8269 -260465 -289685 -79789 -18341 75662 41973 -89097 95544 314960 91604 70608 60318
8258 60318 -29704 17953 -21170 -56777 -158305 6224 75631 -11832 68109 53191 -204397
8247 -204397 1896 218526 113415 248034 257870 210554 73719 161593 244666 255441 113983
8236 113983 229543 -42899 8737 85597 -42866 -157856 -164910 -15817 26859 9783 -80437
8225 -80437 -33158 -160166 -126098 -131560 -268796 -202736 -190430 -409230 -349766 -201484 -77829
8214 -77829 -155222 -318564 -278236 -282303 -119663 -16075 24050 -112985 -25432 198197 228274
8203 228274 135335 -184019 -183270 -111097 -78055 -29178 -118577 -223489 329113 199326 675059
8192 675059 1474754 275754 71252 -58186 -68632 -39246 -918 117768 74268 326241
8182 326241 165694 140585 293709 133565 -96572 -64018 -7724 -71764 -245838 -74235
8172 -74235 -81689 -43301 -116802 -44908 -31219 -268938 -235422 40086 121997 70813 -251722
8161 -251722 -266852 -134354 -137927 -156662 -279853 -56428 -11857 -183009 -259089 -106909 -256154
8150 -256154 -244396 -92905 -159569 -133548 -23568 -21143 -29411 -270724 -61870 -138204 -252330
8139 -252330 -250163 56284 134429 -35059 -46858 -157435 -45049 18744 148171 147906 62542
8128 62542 -121744 -57587 -23094 -4765 -101044 -222256 -139653 -156747 -207538 -274613 -233149
8117 -233149 -12711 -42882 -180197 -165188 -40053 -199078 -202786 -95537 -119334 -15125 -109785
8106 -109785 78850 163813 -119634 -107225 1045 13101 149679 101198 -31795 151867
8096 151867 23006 -117825 -47164 137105 -112209 -353207 -171684 -152941 36581 151004
8086 151004 -95259 -279260 -315265 -237084 -132094 -36649 22408 -19476 -218526 -163222 -233325
8075 -233325 -312027 -417607 -449425 -355949 -150679 -165387 -193196 -206715 -132996 -94918 -99213
8064 -99213 -160574 -317999 -266469 -351085 -265093 -98089 -125009 -72159 -28637 -31634 47197 121864
8052 121864 -70518 -58373 34024 -226084 -293825 -111445 40652 -4221 31591 104605 60994
8041 60994 -7895 -59015 -133989 -154095 -154823 -78841 -52984 -205971 -212060 -151871 -129419 -131932
8029 -131932 -255704 -125243 -83142 -174547 -187141 -342704 -227392 -51247 -73996 -97002 49896
8018 49896 23124 32729 -116029 -128296 -125420 -12804 77827 -138424 6659 -4356 -266525
8007 -266525 -153974 -261060 -414678 -272046 -159519 5686 -121223 -291263 -297588 -17732
7997 -17732 133446 21563 -143374 -169960 -162961 -270213 -121837 -55967 -237431 -251414 -310124
7986 -310124 -262161 -92166 120951 37194 -28997 5596 177722 114671 -193994 -420659 -435400
7975 -435400 -276549 -32863 -94115 21446 -7394 -73461 -142806 -94376 -19727 -37130 -195531
7964 -195531 -172409 -71943 -58200 -39045 -72152 33334 -70311 -74032 -79205 -45572 -127457
7953 -127457 -333630 -54469 101856 82868 82800 255611 -39116 2796 -4776 -128265 -139664
7942 -139664 -167268 135091 -50798 -46308 -255779 -252097 -165515 -358403 -76082 -74589 26634
7931 26634 44756 -36514 -145517 -261940 -96528 -205932 -259912 -84590 -40687 -113808 -119072
7920 -119072 -176402 -51606 -66400 -171239 -190655 -24215 190820 101159 84716 107269 -128951
7909 -128951 -90230 -144528 -46684 -244648 -248232 -70165 198606 152175 -197794 -118676 64874
7898 64874 29701 135807 132058 -119971 -71469 2235 26375 96458 -66565 -63742 -101347 3696
7886 3696 12217 -156546 -239631 -224156 -159455 -80266 -62414 -35286 13496 122739 241262 97292
7874 97292 -103362 -59116 -9943 -171770 -252618 81992 201360 101305 -175592 -314477
7864 -314477 -209457 -126033 25540 90682 131151 -62629 -85322 -96731 68459 79457 24383
7853 24383 -60177 98255 190076 83368 -93281 -63157 112981 70470 -48085 -177827 -227708
7842 -227708 -124075 -93039 -207211 -324764 -184565 -88532 -89010 -133685 -175107 -62390 -83110
7831 -83110 64064 -6635 -73637 -200356 -42354 83882 -78637 -172075 -6201 128909
7821 128909 -63448 -28244 127449 152711 231623 48561 88371 -63376 -30762 -125161 -141611
7810 -141611 -183769 -40202 -57796 -168429 -132858 -33780 4252 459773 599462 59670 89980
7799 89980 97658 135624 48726 190013 4700 247793 45267 -79890 -11668 -145853 -260478
7788 -260478 -323339 -103687 -23239 -12909 84166 67488 189721 5913 92721 -27107 -124669
7777 -124669 30276 -129927 -78148 76840 -1222 42956 84877 21554 -105140 -201840 -23947
7766 -23947 -86045 -120671 -94713 -49740 -140562 -136437 31637 -40692 77824 -140743 -293984
7755 -293984 -167757 -83389 -38223 143271 86181 54678 -69977 -137531 133181 75659 -136745
7744 -136745 -227396 -195892 -151178 -56456 102019 145564 125276 -88191 2635 79557 217367
7733 217367 64198 -78191 62494 -22886 -94290 -19204 106905 262004 219166 75393
7723 75393 -77529 -34666 -13238 102594 130174 43198 -65217 -207391 6095 102313 174685
7712 174685 -11116 -70807 -111908 -291787 -278506 -191992 -7747 70495 -55379 -22094 -70491
7701 -70491 -227879 -390208 -140413 -62814 -12447 -369659 -176736 -19631 177426 33110
7691 33110 -165787 -161817 -104512 28560 21156 -19983 53974 75185 -1220 -27635 27600 205970
7679 205970 199064 -8469 225300 230788 41443 -61452 218181 196875 131988 103869 64353
7668 64353 38572 -217 151856 174661 71806 108968 86740 -4661 -52708 -210765 -26748
7657 -26748 6950 -4719 -125919 -92469 -234012 -49360 126193 -24077 -149071 -107080 -209652
7646 -209652 -167377 -246013 -67360 -62956 -123757 -94238 -117330 103527 -22942 -14705 -25509
7635 -25509 -97403 -117035 -185558 -164853 -178515 -80028 -232335 -174201 -13549 -21588 -21443 27807
7623 27807 89217 77310 -255858 -387470 -301309 -284422 -192817 -60238 -34529 164084 202870
7612 202870 68465 -39510 63652 -23481 -160613 -33811 22575 -63897 -34395 -45778 -174562
7601 -174562 -76573 -293718 -218880 -350595 -383771 -279983 -193458 -117316 -15636 7574 128749
7590 128749 -6414 -177288 -257085 -281797 -213323 -320774 -272096 -218985 -107800 -12460 55121
7579 55121 -152270 -74200 54297 144836 227053 54316 -15441 127020 5755 -100591 -157901
7568 -157901 5294 -19072 -263396 -220137 3006 -29496 -87159 -227846 -239007 -132951 -234797
7557 -234797 -147226 -37920 -159144 -344793 -265564 -171091 -108334 -152005 18130 -36848 53395
7546 53395 60456 -222203 -238249 -115349 -157560 -227722 -30193 100385 59523 86203 7413
7535 7413 -37953 19963 73928 -117071 -116381 92148 86486 9593 -194933 -329793 -115523 30589
7523 30589 98861 -19758 -27628 33032 -58966 -104489 -118465 -135032 127519 367137 350703
7512 350703 234829 117827 201142 172868 197154 283804 327860 334025 391767 317810 418253
7501 418253 638942 693421 337674 344083 310931 386434 254017 97681 228 110932 217613
7490 217613 211848 40427 146359 166379 206811 143774 -598 62106 24499 -15366 2156
7479 2156 85651 -38205 100627 -44438 -25720 -4126 36675 210992 174809 -772 212891
7468 212891 206050 71119 -28489 155616 199968 19093 -159979 -69628 -23147 19436 -74086
7457 -74086 -126918 126818 121402 191695 153375 -12836 7574 171911 -24828 -189742 -240956
7446 -240956 -171147 90401 156644 124590 190027 214662 57554 207298 135241 284088 263303
7435 263303 123737 95424 206247 342111 172971 11938 15548 156962 174301 70688
7425 70688 -77935 -76466 -75319 -89875 -119729 49306 115018 207755 123628 -32730 129558
7414 129558 113926 47749 19737 -75667 -153016 -189395 -26293 -57681 -177425 -131372 15470
7403 15470 119684 230637 122212 76372 98597 91766 113552 252312 144669 106034 102184
7392 102184 28021 -66017 98226 109630 -44718 43897 -93168 -62429 -150492 140968 207098
7381 207098 157573 66102 -37169 -49197 95109 96990 169011 143006 89213 7062 24879
7370 24879 -8890 -43917 -50521 17136 135658 156120 202731 124105 110959 183664 162411 -124254
7358 -124254 -217312 -150410 7819 7027 37210 112425 63175 98916 23692 136074 103301 102908
7346 102908 28861 -54952 138103 114128 165901 46536 15710 -23056 -161476 -71046 177352
7335 177352 111565 256318 318144 192367 289706 393361 187164 262196 199578 141640 104458
7324 104458 172222 82342 -866 103555 141905 170028 234879 346556 230759 274251 467205
7313 467205 367216 199430 217568 249563 358825 415829 346570 228530 230259 278371 426296
7302 426296 390029 192008 261986 191715 89302 196883 497407 452297 503994 331797 313939
7291 313939 390863 371796 316962 230607 280456 388636 574007 519688 426262 361859 261817
7280 261817 318057 420523 338992 423810 418162 401251 501719 361546 303091 256024 299888
7269 299888 486613 345549 131619 378303 490661 562927 548353 295864 413765 501406
7259 501406 547504 476724 414490 539642 700963 598227 444574 240201 305155 253762 323557
7248 323557 456730 548784 592333 509941 567247 742086 549878 605197 631970 687003 792419
7237 792419 594695 802740 848269 536385 508953 487436 571726 609078 656329 752582 614451
7226 614451 505565 559216 545358 606361 729040 771467 945654 1048236 894852 772116
7216 772116 851955 749653 690284 855119 943466 1133260 876243 729402 922600 1096347
7206 1096347 842629 909724 987439 977402 1017016 1153332 1414064 1190611 1172162 1341203
7196 1341203 1222223 1223444 1396082 1309332 1381311 1672682 1560195 1513280 1494998 1507560 1703786
7185 1703786 1931851 1960740 1856760 1876949 1835218 2019427 2148040 2098125 2222397 2291406
7175 2291406 2405889 2574552 2576544 2621486 2619083 2570080 2558997 2657429 2763449 2796514 2694563
7164 2694563 2980743 2964525 2959104 3077799 3188202 3281503 3380542 3333629 3257544 3147505 3521781
7153 3521781 3644282 3542832 3605191 3678142 3951746 4265755 4422588 4326968 4445579 4610039
7143 4610039 4936473 5263167 5632074 5774681 5984785 6399969 6553738 6947351 7473571 7830163
7133 7830163 7996684 8469372 8791590 9360302 9737085 10386954 10843995 11488490 12357901 13195369
7123 13195369 14339608 15419466 16775787 18268490 19774170 21807843 24259107 27060520
7115 27060520 30296194 34252332 38721506 44266515 50612963 57600229 66141421 75866982
7107 75866982 86606871 96329495 101588301 100538421 93144727 80588364 67349502 55363788
7099 55363788 45841571 39107898 34122200 30727996 27697281 24980583 22607105 20352387
7091 20352387 18512796 16860670 15648154 14452128 13522124 12683338 11911779 11109302 10486358
7082 10486358 9922619 9558225 9133723 8629077 8242227 7985592 7741478 7418616 7097145
7073 7097145 6968104 6761625 6529795 6390061 6189938 5991861 5663290 5461392 5243836 4984980
7063 4984980 4998729 4869407 4696154 4369462 4205103 4119677 4037149 4038912 3995032 4182182 3978661
7052 3978661 3966970 4052200 3930749 3902473 3737247 3681723 3705138 3809151 3873066 3848683 3794223
7041 3794223 3670109 3552959 3302268 3136164 2992060 2839522 2668254 2469351 2350200 2465437
7031 2465437 2378095 2119152 2080786 2011220 1717840 1712811 1813351 1733594 1821530 1680729 1643789
7020 1643789 1899330 1775572 1891712 1781662 1591594 1557526 1166433 1067172 1348645 1244860
7010 1244860 1283210 1066469 995833 1126220 928771 984636 850795 910457 897396 824797 959380
6999 959380 978309 1095881 952753 927140 786177 695516 829544 806763 658500 772057
6989 772057 1046853 787893 928928 865057 932676 748989 647480 777092 554647 632984
6979 632984 927550 806063 742083 623323 623854 767005 604497 567406 600723 697110 547694
6968 547694 527373 558571 572308 367801 531935 680724 503023 584775 683586 642931 604964
6957 604964 382647 404306 452646 462720 374617 318187 352185 338080 321422 279344 255726
6946 255726 133016 209944 395437 404040 223177 314927 274850 276427 401221 384896 279854
6935 279854 167819 183603 233635 242502 322809 299877 77509 162513 252824 145454 260246
6924 260246 261593 105156 180485 264519 217653 341272 456449 364002 105962 26211 152101
6913 152101 230899 359194 334825 292675 64946 111582 256116 302429 252032 16810 164667
6902 164667 232586 235822 25014 185629 288268 287563 354472 220396 207004 34430 -82207
6891 -82207 100694 181165 270623 149984 -37172 225812 341997 339767 269604 167339 121573
6880 121573 153758 243749 230129 92417 89208 85178 -9422 -28356 23254 -13548 72159 203409
6868 203409 339779 131750 211032 212804 80667 15072 -69845 -69238 -23172 133294 137767 116562
6856 116562 38203 87834 136944 305143 224835 226915 53698 126042 53419 -33206 23307
6845 23307 118510 195623 158394 228954 475852 338948 134802 133677 5049 -46007 -195660
6834 -195660 -110996 152887 -46965 -170778 -114058 -123394 234389 344669 340003 353028 93000
6823 93000 13361 166072 82819 183404 153459 -77376 -8359 67824 6205 100293 72524
6812 72524 -22496 -18542 -49140 57270 202185 -116534 134201 102170 187110 172747 268443
6801 268443 305745 356362 375461 124566 191352 93648 38932 219806 294769 258054 405284
6790 405284 338036 202279 132533 -101968 51212 -77155 16958 169274 97172 280799
6780 280799 310687 178468 -108334 -38668 70930 134971 -82274 212482 367556 220024
6770 220024 165920 255969 421792 215567 153095 82277 133394 69216 -18723 72571 126451
6759 126451 186576 -30803 -65682 101312 326076 223063 5549 79230 145419 160336 133141
6748 133141 107525 237200 347297 364378 125260 -1194 -164304 14219 21058 163059
6738 163059 194570 193396 325004 154552 220816 206617 16065 95340 92799 35425 -19929
6727 -19929 74501 132178 82050 88215 155944 57968 -51037 -52676 -27948 -35122 -176571 -153677
6715 -153677 -23218 80756 220704 156380 77313 253833 275010 176717 253250 232140 445323
6704 445323 548936 422193 388922 354974 410097 331676 227957 155519 387103 185272 131448
6693 131448 365759 42846 13201 215580 230297 51844 17444 141918 45807 105431 159025
6682 159025 -11670 -56504 34332 69743 7263 58544 190252 334608 191886 62640 186105
6671 186105 357813 236416 -35937 -12471 7866 120015 103793 -165329 26739 174644
6661 174644 124698 209766 166280 98772 89356 82664 115358 159892 165895 58174 -111177 185937
6649 185937 215767 25524 -1408 35880 26474 73019 154511 430070 352426 402214 338789
6638 338789 347988 220637 113339 -19515 115522 95342 29605 86861 61348 7996 75058
6627 75058 135197 221358 317779 25651 -112766 171177 19487 91814 -16925 20055 167862
6616 167862 263115 320712 340492 317260 251605 230820 83291 149071 12041 -20591 99061
6605 99061 78233 -38231 -69164 9734 143916 194076 232925 216041 150641 6221 27946
6594 27946 62398 110916 59712 -72994 31227 22045 -74609 -79437 -84115 55163 -131176 -230056
6582 -230056 -117884 114936 109892 293895 165733 53565 147218 106927 -176473 -57353
6572 -57353 -24438 -38637 -39434 82648 341295 308045 170871 231449 45706 202920 168537
6561 168537 170984 31646 -45548 -42824 5681 123827 94130 155751 43293 -62026 -14706
6550 -14706 -22478 -119789 -36709 23608 173157 196872 83352 18772 65560 99840 178518 197399
6538 197399 118327 108739 177193 286338 43413 42764 106587 131173 99242 136112 -84128 -15376
6526 -15376 126705 100725 187996 163962 111360 127814 201543 108882 205358 148890 -2216
6515 -2216 -85646 70178 183992 121648 -16636 86161 -40286 46994 -8059 -74421 -131034
6504 -131034 -82711 -209363 11570 104104 1272 -56451 87409 118347 53851 19377 111600
6493 111600 239635 45408 -3056 -54960 771 123094 81625 -224662 -230028 -56539 -12819
6482 -12819 145419 206389 195583 219389 272630 199264 72830 -70310 -77189 69701 28918
6471 28918 65024 -58780 -151710 -170322 26154 179314 180188 50879 20771 171008 230981
6460 230981 163375 154118 238651 203715 276541 13532 80398 154540 -68579 46718 237519
6449 237519 410286 381820 125776 35633 -32271 60857 172483 193695 41758 170152 221933
6438 221933 165495 126284 161935 212970 328449 247967 126320 100661 -176752 -158629 -68336
6427 -68336 -96727 99689 180625 -25806 83249 102283 -44778 188325 305656 229919 223723
6416 223723 335863 240395 17562 319678 254354 162888 95155 220649 179987 214840 309457
6405 309457 164264 257798 320957 301969 353011 334127 253950 49095 -138550 -59202 29660
6394 29660 212106 108976 76518 -55851 1242 120222 117492 236739 59238 280270 346268
6383 346268 144679 2952 -127404 95777 146249 215673 232491 203947 89179 228222
6373 228222 178669 228785 240752 126873 253991 279740 324719 204742 259911 235061 204545
6362 204545 283618 549332 269987 272258 392095 487597 353484 196437 264430 509600 460481
6351 460481 601564 584610 461950 326969 287766 232625 186808 356212 458209 666062
6341 666062 463341 430135 521633 441805 503453 492884 563819 637356 717674 630741 483818
6330 483818 600471 759404 805615 768002 726115 550390 647833 887157 773298 834869 945711
6319 945711 724664 586995 453175 552708 469009 432554 616452 735670 625169 783008
6309 783008 683384 822070 775977 615459 600710 640597 617106 707075 563168 520814 626682
6298 626682 698352 663942 607170 690617 608940 581502 248010 286025 637264 705704 527703
6287 527703 444448 497197 641602 446462 383355 438657 402398 363459 359997 447130 543997
6276 543997 494913 399704 299238 437568 437161 394475 509602 568939 520871 392699 359883
6265 359883 363760 397471 475959 568955 723860 645757 584762 362140 354564 562060 479748
6254 479748 600799 681672 740288 607662 729687 643015 597750 291026 540007 449500 331280
6243 331280 456815 401938 419998 559907 544074 533040 672869 759122 761103 499857 587913
6232 587913 494308 846967 957356 856557 924555 857302 636811 797678 828567 817798 870787
6221 870787 916251 773893 787892 777256 766376 868655 898700 679402 761512 1051560 1073152
6210 1073152 1012609 909316 970466 1099102 1031334 982303 961676 825529 1245880 1103028
6200 1103028 1089487 1230426 1310881 1090673 1197856 1302772 1128485 1273086 1191124 1353484
6190 1353484 1333132 1509769 1677763 1656136 1507357 1596927 1668012 1425994 1400034 1204557
6180 1204557 1460462 1473310 1430169 1415904 1333432 1297568 1213424 1334218 1329437 1519303 1524080
6169 1524080 1431625 1281231 1259652 1543876 1656063 1621025 1594114 1621142 1702551 1632284 1612221
6158 1612221 1571673 1624027 1494412 1561848 1620793 1681442 1750764 1607364 1502248 1431508 1423110
6147 1423110 1324894 1181472 1318029 1437849 1595230 1707257 1621428 1601779 1507084 1479899
6137 1479899 1573195 1799267 1905267 1737861 1755872 1843887 1814851 2011213 2122284 1984248
6127 1984248 1975597 2081537 2193395 2139021 2160938 2020125 1873172 2108706 2173658 2065679
6117 2065679 2272592 2314708 2242409 2025899 2108353 2403314 2412654 2415706 2434930 2571547 2606848
6106 2606848 2683714 2677663 2702495 2592494 2890209 2996903 3064838 2782782 3010397 3142784
6096 3142784 3063851 3146986 3154728 3312508 3326168 3373865 3633165 3694573 3609336 3863817 3955127
6085 3955127 3953440 4199015 4290429 4284045 4387447 4590591 4767635 4953710 4852418 4883111 5278683
6074 5278683 5553974 5722588 5607454 5632743 5577977 5803649 5941051 5958788 6063533 6162285
6064 6162285 6128923 6218889 6611764 6803605 6833558 6856941 7035619 7328999 7582646 8081403
6054 8081403 8375649 8423432 8511614 8847974 9105281 9590519 9768859 10163157 10699129 11264510
6044 11264510 11714690 12208352 12822877 13191220 13231183 13407600 13677992 13958293 14507629 15279878
6034 15279878 15872859 16192146 16826201 17659638 18548484 19661528 20617582 21626245 22862747
6025 22862747 24045362 25571127 27483527 29591551 31752687 34436624 37529770 40793865
6017 40793865 43651377 45700604 46639423 46926587 46968721 46999094 47063582 47281135 47180182 46998132
6007 46998132 47079082 47404551 48048944 48951776 49997462 51775069 53505431 55694043 57967495
5998 57967495 59894445 62393144 64968306 67403366 70291170 73602130 77459123 82292828
5990 82292828 87217262 89620410 87456549 82555629 77083413 72612667 69391949 66863404
5982 66863404 65058361 63435490 61779490 60511601 59258804 57633946 55958050 53841787
5974 53841787 52293845 50786892 49609619 48845081 48079501 47574943 47182442 46797601 45960989
5965 45960989 45240619 44727979 44149891 42565719 39927631 36769043 33621985 30795612 28383846
5956 28383846 26434406 25190374 24230641 23592027 22821246 22291637 21592057 20923226 20458025
5947 20458025 19997502 19539704 19075379 18698389 17944044 17670123 17318405 16836601 16674141
5938 16674141 16431933 16533797 16246667 15882067 16034078 16059547 15826786 15703238 15435412 15167883
5928 15167883 14861468 14588920 14760439 14707725 14605881 14573607 14593231 14903157 14927809 14870840
5918 14870840 14976011 15131588 15251108 15454072 15899403 16042928 16236071 16398497 16663842
5909 16663842 16927411 17207359 17461698 17743317 17871167 18368245 18963521 19268417 19689636
5900 19689636 20289972 20887138 21302016 21979278 22784400 23611224 24430009 25302565 26329577
5891 26329577 27616473 28939111 30516441 32448834 34660674 37015653 39579979 42387848
5883 42387848 44920868 46710649 47813245 48463252 48517512 48749830 49469558 50262235 51155119
5874 51155119 52196226 53387567 54761371 56350863 58332782 60307082 62433115 64773699
5866 64773699 66486265 68346022 70599823 72731346 74814311 76964670 79428401 82350303
5858 82350303 85609462 88393821 89343886 87155617 82776400 77635477 72726634 68767964
5850 68767964 65618755 62959534 60980825 59223487 57595033 55999778 54638746 53476340
5842 53476340 52571511 51959518 51834077 51724669 51691646 51866926 51624960 51448911 51010369 50581075
5832 50581075 50030667 49388948 48272823 46402177 43625268 40674822 37861918 35391158
5824 35391158 33863427 32673115 31889165 31630186 31544386 30943342 29189057 26979008 24634547
5815 24634547 22893501 21490270 20296319 19534470 19119133 18346321 17367686 16540494 15892934
5806 15892934 15427989 14718799 14055242 13946851 13623070 13028854 12492590 12152925 12158743 11901172
5796 11901172 11700704 11772551 11581787 11313034 10909931 10680620 10572551 10239791 9895846 9712383
5786 9712383 9504455 9275490 9090519 8931066 8644600 8556889 8543627 8277486 8101956 7795745
5776 7795745 7740672 7741791 7694685 7778364 7819927 7652454 7713564 7785680 7759562 7664468 7783664
5765 7783664 7805458 7837010 7679269 7396698 7174560 7151653 7003987 6787529 6700810 6583948
5755 6583948 6371974 6344005 6070367 5643274 5508507 5349976 5055674 5148898 5121083 5100116
5745 5100116 5145719 5072839 5104301 4960933 5003742 5039015 4817191 4932499 5071258 5365075
5735 5365075 5399492 5067929 5021993 5165309 4901590 4650753 4359147 4015432 3962249 3767994
5725 3767994 3649909 3478330 3499337 3272351 3158909 3066108 3298664 3184635 2856633 2701593
5715 2701593 2922506 3010732 2786760 2588867 2579913 2686998 2769336 2945865 2900324 2927949 3193420
5704 3193420 3157629 3036698 3146783 3154402 2958461 2722610 2431795 2270546 2485026 2399722
5694 2399722 2484989 2369034 2211742 2148304 2117044 2062747 1908941 2030392 2160535 2127215
5684 2127215 2131289 2134514 1932867 1859677 1943108 2070258 1912016 1813906 1883541 1900087 1815067
5673 1815067 1864779 1997335 2089410 2157247 2088183 2098442 2084508 2114729 2131754 1991028 2106587
5662 2106587 2210183 2341505 2287340 2404819 2545996 2405989 2369809 2502557 2751398 2818028
5652 2818028 2785018 2847528 2911909 2820751 2928260 2930822 2883185 2917771 3000736 2958466 2880181
5641 2880181 2811575 2831045 2924368 3048774 3264311 3325290 3297081 3307822 3153768 3243113 3466258
5630 3466258 3535118 3730728 3989475 4149281 4198873 4367069 4340340 4063178 4269654 4182402
5620 4182402 4079899 4151874 3948565 4039024 3971409 3887201 3976644 3954619 3807896 3750790 3852042
5609 3852042 3906621 3997848 4077573 4207555 4162380 3901849 3857347 3840549 3827918 3723263 3830512
5598 3830512 3832530 3568316 3497944 3318279 3362348 3288787 3011484 3433281 3590372 3638907 3521684
5587 3521684 3679181 3773733 3860949 4164675 4212917 4593611 4722132 5002206 5530321 5869817
5577 5869817 6361961 6991233 7696242 8473348 9711905 10986726 12151129 13788786 14136935
5568 14136935 12546021 10332049 8432607 6840222 5772687 5170242 4637579 4107498 3810630
5559 3810630 3597866 3359765 3154026 3007318 2935896 2889386 2601976 2430581 2593670 2623184
5549 2623184 2376686 2388389 2305730 2284333 2475895 2332966 2436143 2616199 2713409 2644714
5539 2644714 2557837 2366488 2154820 1972661 1782863 1543618 1473067 1549886 1504853 1513960 1605666
5528 1605666 1506152 1423920 1433511 1437859 1604903 1715649 1589180 1438215 1452795 1322896 1052881
5517 1052881 1147922 1093856 1081837 1197190 1072421 1046798 979298 1201700 1037448 1015868 1081878
5506 1081878 966305 1027138 868439 953962 883267 827461 727868 999076 1031747 846715 953845
5495 953845 1071126 889788 812822 851749 819266 885275 697612 637982 850150 799967 647067
5484 647067 763965 793192 627151 588183 702803 764666 724550 665946 755693 949514 891175
5473 891175 770894 910647 714882 514460 527680 516099 436473 517114 526428 627116 476048
5462 476048 483696 390308 521790 548627 451214 587675 493769 391470 575708 644985 587611
5451 587611 489884 678699 532061 512177 598740 636690 704180 572334 544019 512335 439631
5440 439631 478037 465327 517364 637354 635609 545689 410575 450564 208814 291008 562082
5429 562082 540511 407014 431083 515470 590652 511545 571908 699991 480670 360385 419087
5418 419087 556946 528406 387699 378725 339426 491980 366359 445481 688379 665817 555654
5407 555654 409627 451442 446711 511850 485856 508523 690001 470219 465184 431066 510123
5396 510123 533448 728531 696370 466582 444348 650717 652691 548673 471617 590017 628024
5385 628024 610373 683782 546617 440876 689057 732940 569361 699037 559779 719464
5375 719464 643038 579601 595271 424488 353910 401912 472915 709325 800915 799760 761343
5364 761343 742740 733474 688973 984055 841830 559203 625623 699130 805506 867169 669264
5353 669264 641032 764826 863647 916290 848186 681780 709180 548072 426464 450489 527961
5342 527961 508122 679362 773911 804533 852687 788632 661983 717123 877676 874506 794249
5331 794249 945719 721446 672125 686385 708039 693807 566764 641123 724719 790175 868842
5320 868842 1024431 814144 797831 790530 678914 701338 917426 851267 664064 771236 733517
5309 733517 693235 662609 637055 912301 867373 828441 714013 798855 668601 728300 811700
5298 811700 1036347 1131286 902537 1040618 996262 988717 1067248 1128158 1458296 1295945 1274980
5287 1274980 1210539 1358916 1360622 1391609 1457871 1563730 1661208 1701376 1795229 1949863 2093135
5276 2093135 2327343 2613691 2451002 2531955 2304753 2227163 2271553 2319267 2403571 2403482 2400867
5265 2400867 2670051 2719257 2629093 2711847 2764201 3149817 3354442 3533661 3750938 3717862
5255 3717862 3929888 4177796 4320406 4483026 4633088 4688498 4508054 4413737 4427110 4463863
5245 4463863 4168307 3996423 3634774 3379871 3295610 3241686 3037001 3149818 3265335 3301875
5235 3301875 3528312 3677667 3941712 3985079 4277794 4548835 4462920 4151100 3975296 3722726
5225 3722726 3635420 3587287 3611117 3595295 3577111 3576102 3425823 3408874 3319594 3131017 2992108
5214 2992108 2812008 2691619 2805959 2825994 2680299 2676337 2608491 2582855 2896840 3080518
5204 3080518 3030363 2744358 2582829 2341956 2208242 2212656 2149179 2087961 2068303 2166841 1815912
5193 1815912 1729734 1591469 1558592 1605875 1641193 1790141 1656009 1563504 1536868 1695564 1902223
5182 1902223 1759703 1678417 1701602 1623325 1443392 1487542 1353437 1345638 1493449 1450579 1513535
5171 1513535 1527375 1392092 1482567 1522194 1487133 1420756 1587366 1674841 1594025 1696260 1808740
5160 1808740 1644377 1622113 1521786 1309385 1259572 1229059 1303262 1387718 1297809 1263761 1219064
5149 1219064 1105264 998822 947926 1031583 1269307 1354600 1362976 1282367 1326313 1363543 1500485
5138 1500485 1607262 1719129 1812528 1728509 1748199 1827641 1922762 2120794 2195770 2281307 2586224
5127 2586224 2630147 2879775 3049119 2609887 2565829 2459476 2168744 1958212 1758959 1676346
5117 1676346 1652434 1556998 1462354 1329159 1154765 1277339 1310494 1389216 1478552 1477718 1478003 1533278
5105 1533278 1423992 1357152 1239572 1188232 1301802 1313797 1357767 1493484 1476441 1533480 1543482
5094 1543482 1379526 1277678 1457383 1413396 1464502 1695162 1572387 1437805 1679369 1445589
5084 1445589 1586171 1544834 1560395 1870036 1897250 1967414 2036415 2218060 2075928 2249795
5074 2249795 2523933 2644763 2785326 2791356 3078997 3650230 4072571 4452923 5031660 5490506
5064 5490506 6165559 6917074 7648574 8250640 8343408 7851824 6857715 5936213 5342522 4728167
5054 4728167 4536716 4141712 3845074 3406626 3211727 3116999 3071544 2912903 2671401 2708934
5044 2708934 2535863 2465305 2498054 2481492 2352843 2452208 2464839 2282839 2301500 2346410 2281847
5033 2281847 2395034 2564760 2821523 2968666 2933093 2706546 2338661 2246955 2114135 2086618
5023 2086618 1967512 2022427 2093780 2082050 2006768 2051325 1974723 1819865 1685825 1704160 1804733
5012 1804733 1663788 1521193 1306845 1439505 1499373 1428580 1457404 1620440 1615697 1563128 1552348
5001 1552348 1596721 1836811 1901600 1870079 1652343 1565402 1676869 1784295 1936159 1775840
4991 1775840 1823216 1836091 1952332 1844199 1903607 2039830 1728136 1668362 1712686 1738012 1620068
4980 1620068 1742274 1675363 1640513 1890709 1774823 1737267 1590954 1727488 1706066 1649674
4970 1649674 1781533 1810434 1791927 2053667 2008268 1967378 2063808 2024449 1888737 2074539 2122775
4959 2122775 1997776 1774579 1908232 2077660 2337035 2411764 2443000 2547661 2453268 2387709
4949 2387709 2489787 2611921 2686332 2583682 2537948 2568934 2747530 2823486 2647087 2765375
4939 2765375 2713180 2715312 2773536 2955148 2924221 2860632 2981516 2877866 2963286 3116666 3171196
4928 3171196 3121347 3148488 3146051 3233988 3178208 3048064 3225787 3300618 3281200 3317474 3442969
4917 3442969 3569166 3613555 3839964 3969970 3835004 3765621 3829154 3959968 4119284 4219282
4907 4219282 4243554 4309400 4361758 4472550 4824300 5049081 5257114 5499893 5507863 5527202 5733708
4896 5733708 6033065 6229018 6279268 6621350 6569522 6662602 7087771 7253775 7401309 7627049
4886 7627049 7709524 7903962 8067077 8432579 8623352 8781864 8935828 9062885 9241711 9413000
4876 9413000 9781090 10073691 10239714 10330894 10613987 10697458 10816128 11111889 11430733 11686051
4866 11686051 12082888 12277408 12507772 12947348 13157834 13529952 14256798 15093829 15842994
4857 15842994 16467258 17413258 18530850 19820404 21132544 22819282 24675299 26838908
4849 26838908 28992215 30836518 31656869 32442367 33002619 33976604 33868989 33067241 32340255
4840 32340255 31921997 32325377 33099326 34432991 36479839 38255488 40345392 42607050 45137302
4831 45137302 47718741 51455320 55538804 60554071 65425843 69706712 74412888 80726602
4823 80726602 88773565 99030303 110990083 125777849 142912174 163685195 187150501
4816 187150501 212692567 240396413 275849725 316862731 357964152 352213451 297149742
4809 297149742 242375490 191949191 152935900 125117135 106451351 92979369 83109134
4802 83109134 75000602 68131124 62155467 57610553 53277514 50044899 47312585 45407384
4794 45407384 43844278 42936812 41717961 39776760 37101645 34930054 32750034 30441454
4786 30441454 28752150 27511335 26180075 25159035 23808603 22532365 21497815 20586043
4778 20586043 19695918 18960477 18328313 17835552 17300229 16947063 16566515 16241887 15925052
4769 15925052 15168248 14566937 14317263 13961999 13727348 13564042 13341280 12972020 12810777
4760 12810777 12727881 12413116 12411863 12445180 12557176 12552539 12279608 11955487 11341691 10856573
4750 10856573 10347784 9844617 9482669 9077376 9050170 9048084 8883240 8798270 8633055 8462102
4740 8462102 8391290 8199426 7990392 7624621 7606009 7473647 7322379 7009703 6761217 6686207
4730 6686207 6838753 6632542 6551754 6248854 5799077 5675054 5601853 5243160 4927992 4820123
4720 4820123 4660303 4441539 4269910 4245965 4494453 4291432 4011159 3820846 3887133 3963212
4710 3963212 3933748 3727460 3634728 3727549 3580302 3424353 3553440 3376192 3286201 3339935
4700 3339935 3209119 3134769 3053406 2886420 2948788 2761870 2621462 2554252 2640515 2586351 2561546
4689 2561546 2652748 2716139 2764968 2509862 2521861 2564881 2487726 2477598 2577845 2391954 2171813
4678 2171813 2159157 2038105 2239830 2239349 2334932 2326635 2315823 2201506 2290733 2330125 2318141
4667 2318141 2284209 2266341 2128245 2204205 2047760 1969420 2157416 2151514 2203460 2161902 1920430
4656 1920430 1665433 1819911 1990814 1924004 1765125 1928233 1960973 1929386 2016653 1914468
4646 1914468 1956083 1896120 2032709 2164867 2259259 2006306 1862637 1847074 1906054 1984438 2006960
4635 2006960 2106907 1893824 2078514 2305153 2274704 2362266 2256125 1948220 1841232 1635122
4625 1635122 1622169 1508753 1396900 1624492 1805304 1628474 1472589 1350515 1380260 1332897
4615 1332897 1435808 1458039 1274415 1452485 1468510 1432643 1544532 1429458 1550624 1546214
4605 1546214 1601623 1767321 1747029 1524140 1493839 1533091 1656194 1514877 1552595 1657982
4595 1657982 1632440 1538113 1364741 1379425 1461500 1335665 1451572 1639134 1502306 1287340
4585 1287340 1251361 1350088 1253347 1453853 1395042 1271093 1251907 1225936 1336144 1141277 1178503
4574 1178503 1221855 1268327 1073897 1131092 1247539 1343838 1510913 1555523 1365199 1328347 1195800
4563 1195800 1318291 1386263 1438631 1499259 1506939 1609004 1719316 1592333 1363340 1528506
4553 1528506 1591601 1723254 1663604 1659079 1809137 1728202 1707737 1985614 1917432 2003876 2218537
4542 2218537 2282991 2354641 2440257 2381545 2412118 2682905 3043558 3428510 3782945 3846927 4108456
4531 4108456 4437914 4690496 4466880 4079613 3596292 3114702 2880315 2688552 2414973 2199614
4521 2199614 2152954 1980632 2016672 2088376 2041085 2214093 2052982 2033642 2222063 2317606 2249788
4510 2249788 2191716 2394831 2265939 2123703 2324171 2544079 2476373 2675883 2686339 2669940
4500 2669940 2925912 3253076 3305857 3666813 3746197 3969131 3971236 3719196 3516498 3413235
4490 3413235 3385102 3315035 3240022 3258345 3182952 3228253 3432357 3491997 3835992 3854528 3871936
4479 3871936 4062714 4332451 4496095 4497357 4715515 5089990 5489800 6141289 6311891 6612508
4469 6612508 7250755 7540311 7676016 7942690 8366913 8707083 8611769 8072014 7524960 6789568
4459 6789568 6208950 5736021 5278676 5035303 4752153 4716607 4911100 4856093 4789421 4986148
4449 4986148 5109880 5215379 5552213 5785727 6251849 6725081 7029093 7707216 7994008 8178803
4439 8178803 8216817 8112054 8061952 8210300 8220849 8332986 8396248 8182673 7442388 6736125
4429 6736125 6098543 5603208 5236158 4940890 4627720 4408682 4233503 4216443 4109869 3943504
4419 3943504 3764053 3876616 3722156 3534047 3394344 3300863 3228111 3193001 3093332 3025730
4409 3025730 2908841 2827791 2862208 2901894 2787052 2621327 2748665 2924525 2914310 2910004 3018918
4398 3018918 2898774 2797583 2833866 2724579 2738106 2740101 2516197 2514473 2804303 2694482 2460412
4387 2460412 2530204 2723760 2851101 2575236 2796779 2799504 2703055 2621620 2670412 2763286 2804156
4376 2804156 2956711 3029120 3099328 3056815 2834145 2849324 2958112 2996009 3107638 3070895 3197999
4365 3197999 3296034 3478676 3653374 3696132 3718741 3542884 3458666 3410928 3475115 3441001 3600222
4354 3600222 3509104 3397475 3348634 3408944 3574679 3848701 3805378 3886367 3967055 4003260 4231237
4343 4231237 4440041 4451607 4791218 4865910 4949215 4889818 4816537 4947324 5099050 5496018
4333 5496018 5574245 5560569 5493771 5307758 5521719 5670024 5660645 5621042 5579132 5528938 5403752
4322 5403752 5464498 5353445 5481108 5626582 5489647 5626178 5822221 5756128 5831135 5965125
4312 5965125 5931573 6154736 6197019 6285100 6428516 6541802 6718734 6876230 6942937 7131052
4302 7131052 7386949 7407366 7337651 7511988 7393755 7268138 7493468 7833835 7814231 7787694
4292 7787694 7811023 7880864 8163179 8339793 8490935 8530884 8935941 9205677 9545372 9845425
4282 9845425 9959588 10035623 10082158 10292163 10465798 10636659 10795800 11074236 11194661 11622146
4272 11622146 12051277 12405892 12837158 13279333 13941565 14560647 14511348 14457139 14586360 14536516
4262 14536516 14763866 14516204 14145192 13682771 13662017 13595525 13794712 13943047 14340912 14684856
4252 14684856 15320444 15831396 16390344 17047087 17077076 16926781 16405935 15504609 15085950 14516185
4242 14516185 13936422 13812134 13509024 13591269 13637214 13586677 13529123 13642861 13891311 14118972
4232 14118972 14231758 14533528 14679968 15105298 15620930 15842768 16110247 16713151 17410952
4223 17410952 17931286 18327934 18883265 19555696 20471100 21221337 22107744 23354226 24277572
4214 24277572 25185162 26055642 27169465 28233705 29404211 30794350 32602841 34323831
4206 34323831 36322961 38259725 40273453 42740142 45748228 48725944 52475843 56723324
4198 56723324 61251952 66392644 72849027 80243855 89121890 99668031 111852761 126402013
4190 126402013 143449579 162890765 185096746 210309565 240481947 275334240 312776645
4183 312776645 336614220 333389694 303077822 256187565 211302288 173813004 145629117
4176 145629117 125110792 110168276 98456574 88606395 80135054 72783855 66829295 61851915
4168 61851915 57494305 53831058 50681182 47874732 45189276 42900900 41004030 39618905
4160 39618905 38510977 37293020 36247387 35293647 34478972 33577500 32766385 32347703 31797909
4151 31797909 31658128 31902129 32000518 32599804 33354987 34008955 34088084 32556610 30298534
4142 30298534 28172809 26092801 24185328 22701182 21362548 20124909 19218248 18593071
4134 18593071 17987816 17395964 16810903 16362673 15926570 15724358 15253915 14893449 14494727
4125 14494727 14278556 14160511 13924368 13487051 13304155 13258599 13315958 13172404 13115829 13217262
4115 13217262 13504471 13790876 14013608 14029830 14283864 14631906 14817143 14910294 14533688 13658602
4105 13658602 13002652 12505164 12160880 11667108 11426336 11185904 10945382 10787193 10724215 10754706
4095 10754706 10442771 9997685 9552705 9134226 8779236 8484562 8224189 8109315 7933268
4086 7933268 7718653 7322547 7232834 7261998 7001499 7058720 6899158 6718146 6752872 6739959
4076 6739959 7000869 6805178 6719886 6516998 6423069 6136141 6194377 5996201 5845174 5708522
4066 5708522 5559396 5591684 5552481 5474886 5568915 5581550 5605567 5563309 5554169 5669419 5517696
4055 5517696 5391065 5470664 5506243 5467989 5449328 5601778 5646682 5646255 5691864 5730463 5761107
4044 5761107 5846720 6037686 5971055 5947043 6207970 6119816 6003765 6083373 6181310 6094635 6259420
4033 6259420 6309329 6288336 6358413 6340032 6371013 6618808 6864174 7006371 7245786 7376592
4023 7376592 7753629 8205818 8589580 9163819 9583281 10159427 10939885 11522607 11685294 11194787
4013 11194787 10517501 10026551 9507850 8951181 8426405 8404448 8354561 8239021 8248231 8212105
4003 8212105 8608981 8632575 8713653 8627578 8912731 9267081 9500084 9630681 9974920 10780713
3993 10780713 11261352 11983252 12543658 13089554 13884007 14770026 15403236 15500982 14637064 13784224
3983 13784224 13100245 12560711 12147495 12255525 12335735 12716724 13088561 13083353 13300927 13281186
3973 13281186 13276539 13045094 12914132 12943308 13427853 13920738 14105875 14441599 14724182 15518475
3963 15518475 16303355 17157414 18482474 19619273 20271982 19908885 19054273 18308056 17910890
3954 17910890 17544481 17478468 17817459 18077890 18055645 17894515 17762776 17892442 18165347 18524643
3944 18524643 19160158 19652381 20060336 20306125 20875154 21411685 21629558 22303939 22908330
3935 22908330 23648842 24676617 25940557 26944040 27211990 26886493 26236596 25728058 25531617
3926 25531617 25335091 25633696 26084326 26848066 27811395 28806676 29661201 30230625 30738477
3917 30738477 31505664 32106594 32809608 33487077 34499868 35566672 36639813 37592447 38905066
3908 38905066 40377073 42117539 44031472 46328751 48935927 51464919 53989216 56206363
3900 56206363 58474731 60966555 63890391 66851050 70158580 73271986 76390495 79609801
3892 79609801 82707459 85619058 88590427 92001056 95832587 100036104 104696026 110227657
3884 110227657 116067860 121176680 123466284 123017150 121485396 120127240 119903851 120955534
3876 120955534 122707890 124128548 125479148 126553480 127854708 129330370 130744495 131698295
3868 131698295 131622735 130381138 128257697 126013277 124074358 122335212 120742790 118923311
3860 118923311 117522965 116728026 116476813 116613027 115977695 112754735 106917029 100168096 93789979
3851 93789979 88681165 84601961 81160960 78187746 75693271 73254009 70694921 68043361
3843 68043361 65173372 62374374 59494060 56604904 53827591 51396921 49386488 47898594
3835 47898594 46559001 44976567 43167613 41392978 39594450 38009995 36819203 35813002
3827 35813002 34945165 33801680 32976021 32036490 31046060 30372121 29722731 28957374 28376347
3818 28376347 27799799 27275478 26471081 25371585 24552476 23626297 22906408 22169108 21792007
3809 21792007 21556644 21140618 21030655 20814504 20671668 20640331 20297285 20020322 19731652 19658324
3799 19658324 19626204 19688966 19630367 19384559 18853472 18207618 17852412 17522969 16923932 16634694
3789 16634694 16295563 16057548 15954296 15647350 15449913 15390976 15289540 15023283 14983534 14793886
3779 14793886 14784064 14814395 14585538 14534632 14231525 14024286 13643759 13383328 13381937 13071731
3769 13071731 13002161 13053402 12739130 12476332 12177038 11985985 11771546 11836375 11890700 11851567
3759 11851567 11786976 11709980 11749655 11814183 11833326 11877458 12172208 12257488 12557386 12590726 12775002
3748 12775002 12889185 12974584 12765587 12916836 13005158 12858429 12911892 12908326 12894106 12664677
3738 12664677 12510375 12583514 12690536 12928022 13127037 13435411 13466101 13713189 14019229 14520776
3728 14520776 15328825 15997444 16964183 18043242 19302658 20705662 22150957 23777396 25581003
3719 25581003 27639537 29749014 29822261 27938119 25269741 22499852 20033393 18071873
3711 18071873 16681181 15800760 14769952 13996214 13610156 13384026 12989707 12652678 12180023
3702 12180023 11778781 11509929 11467804 11235454 11089661 10748881 10534974 10363735 10213030 10238330
3692 10238330 10241493 10311654 10127561 10213617 10266944 10195272 9914980 9995557 9994066 10300612 10527411
3681 10527411 10664715 10826192 11054635 11039955 11168566 11252622 11412874 11506188 11578097 11937304
3671 11937304 12161571 12437558 12352489 12358162 12343256 12297459 12396132 12084372 11929378 11985187 12053887
3660 12053887 11671915 11693561 11598299 11600889 11470978 11465796 11403923 11451963 11628705 11455589 11264786
3649 11264786 11168835 10967649 11008455 11028711 11064493 11367945 11310966 11212890 11147539 11080544 11100132
3638 11100132 11215643 11153721 10989122 11091625 10865066 10678922 10757487 10643644 10241576 9985814
3628 9985814 9987550 9777281 9603909 9343071 9185942 8958757 8784070 8450788 8418599 8285611
3618 8285611 8074784 7806827 7591802 7629928 7512137 7462936 7504388 7584113 7631566 7490880
3608 7490880 7430969 7493428 7432512 7483905 7481362 7287498 7309888 7197789 7223452 7294104 7197484
3597 7197484 6705290 6492546 6285917 6576440 6276638 6173472 6006070 5956896 5912789 5689445
3587 5689445 5632980 5768359 5665136 5442771 5165337 5023891 5011485 5066231 5070471 5018413 4876504
3576 4876504 4743935 4817398 4806338 4797664 4816432 4973395 4967801 4957204 4734437 4671803 4368370
3565 4368370 4459152 4606088 4607745 4488300 4543954 4574363 4408479 4288412 4335590 4259057 4207701
3554 4207701 4003669 3821056 3987424 4072494 3967945 3853832 3716163 3491128 3335555 3445413
3544 3445413 3551995 3484876 3254569 3129192 3089071 2908897 2765946 2785368 2947460 2965947
3534 2965947 3046730 3079692 3051144 2962096 3026023 2801426 2772303 2840727 2811619 2928823 2885676
3523 2885676 2965471 2654863 2513794 2635987 2769433 2567639 2549044 2583647 2535379 2308209
3513 2308209 2216674 2071202 2165193 2218187 2048018 1958372 1824741 1708555 1737887 1712523 1848174
3502 1848174 2133186 2118548 1946847 1741652 1713484 1950781 1938525 1908655 1865354 1742589
3492 1742589 1653996 1639532 1597170 1568184 1647334 1747140 1813778 1708416 1783192 1833093 1788369
3481 1788369 1772107 1812194 1767738 1853555 1594013 1621264 1382490 1265389 1607036 1441403
3471 1441403 1397394 1450712 1428358 1375296 1442192 1525464 1561728 1552265 1302914 1356360 1569884
3460 1569884 1566208 1627762 1823563 1868813 1853839 1710025 1693201 1660838 1747788 1713782 1716874
3449 1716874 1755945 1915482 1859922 1839354 1918010 2102619 2384126 2491561 2699135 2951434
3439 2951434 3267098 3292217 3102298 2670307 2461748 2330961 2312320 2240121 2006646 1821756
3429 1821756 1913857 1832610 1960454 1902546 1681054 1816807 1976993 1833341 1754127 1714409
3419 1714409 1943213 2253084 2441378 2495089 2452727 2517578 2755166 2958039 3329026 3592890
3409 3592890 3957819 4598103 5071616 5237112 4816150 4167695 3668247 3091643 2521264 2518017
3399 2518017 2609954 2195159 2203657 2147738 1993475 2033452 1744166 1870955 1678090 1666617 1774554
3388 1774554 1854529 1848889 1786104 1632143 1569767 1818456 2028337 1730673 1885661 2112916
3378 2112916 2350988 2507456 2559999 2796583 3073859 2872361 2496612 2243710 2025205 1853288
3368 1853288 1752873 1710239 1633580 1544951 1443328 1645824 1677387 1367086 1376287 1201624 1130505
3357 1130505 1419211 1337328 1258581 1226761 1402864 1247192 1061654 1085345 1104724 1172698 1194285
3346 1194285 1149539 1270075 1375746 1226025 1191710 1371195 1373197 1414935 1395893 1370806 1448785
3335 1448785 1253458 1226585 1281193 1290104 1389725 1332634 1265062 1140897 833231 843332 892993
3324 892993 929414 764584 856846 934513 888837 1225837 1168990 1240236 1280252 1157625 1090263
3313 1090263 1191677 1245605 1265226 1298933 1337472 1308706 1318278 1469968 1561349 1436692 1418140
3302 1418140 1302405 1163231 1171701 1054049 1157668 1352334 1118815 1092984 1198439 1304513
3292 1304513 1267379 1159833 1099774 1096270 1181828 1298517 1373581 1280846 1356340 1433122 1257305
3281 1257305 1577056 1765554 1714923 1792360 1841776 1974126 2154107 2071395 1754417 2163036
3271 2163036 2279045 2232349 2393357 2578278 2728645 2920042 3054482 3202876 3471395 3464940
3261 3464940 3409071 3626072 3551118 3185427 3196499 3408395 3215475 2888160 2882837 2803742 2713133
3250 2713133 2687073 2666389 2412686 2225044 2278161 2227573 1944331 2080140 2039932 1883675
3240 1883675 1810219 1672372 1786699 1881790 1803515 1633040 1948900 2174101 2043995 1953981
3230 1953981 2275383 2217640 2322354 2225362 1993086 1925411 1926200 1914188 1934632 2152942 2250553
3219 2250553 2161451 2007265 2040971 2248233 2267837 2194192 2281696 2045126 1699708 1636202 1527372
3208 1527372 1659683 1673359 1549923 1833908 1933166 2001425 1929393 1951834 1954761 1832763 1569385
3197 1569385 1694295 2006690 1960126 1946791 2111314 1974873 2034622 2076760 2001174 1956895 1962592
3186 1962592 2056390 2110865 1952475 2028679 2108709 1890286 2123917 2034974 2039505 1862915 1658679
3175 1658679 1553536 1634097 1910091 1963637 2024942 1948100 1716407 1648115 1579548 1511030 1606104
3164 1606104 1800848 1851555 1776990 1623292 1652615 1900394 1665828 1438348 1561575 1718727
3154 1718727 1663438 1749069 1669890 1543705 1597662 1714155 1717879 1696038 1687714 1509282 1539352
3143 1539352 1668973 1497422 1532612 1674423 1577202 1456431 1355844 1288778 1280604 1452865
3133 1452865 1514083 1607164 1348457 1309553 1272099 1228780 1283401 1282948 1222882 1127155 1167122 769210
3121 769210 793344 847592 1042816 1081801 1181962 1102144 1095606 1031076 1217529 1187920 1085858
3110 1085858 1076645 1132983 1079389 981098 1022612 1105332 1361069 1018750 886465 931456 944149
3099 944149 764117 645360 655055 704065 571654 714518 827809 730879 681728 333918 461972
3088 461972 804073 668546 633711 623807 782288 696028 715360 709702 588390 540688 689528
3077 689528 604383 647465 501594 532085 551847 473405 634963 633237 672066 722401 621584
3066 621584 569013 446134 317772 316832 461477 693607 687592 504735 294382 440285 393841
3055 393841 207118 173657 232193 103504 122739 253692 338822 246178 328725 448921 462109
3044 462109 353379 210463 63610 31926 219630 225326 191919 215241 281371 201741 219715
3033 219715 223127 159440 233777 165990 136251 85611 -87035 25670 -48646 118045 349622
3022 349622 429588 372862 429734 383656 342145 312462 278104 177063 170415 -54125 312580
3011 312580 226053 -10297 358805 261499 168007 2762 36804 52646 201354 304104 338392
3000 338392 195551 322447 381052 245942 56357 144181 249039 256472 159628 247807 192296
2989 192296 268430 248864 286937 157349 330591 348030 214257 253201 326819 377725 57960
2978 57960 34147 130108 160894 27184 117915 349500 212748 17048 -7257 54378 237748
2967 237748 200700 107403 188242 97296 119595 127031 35926 6607 83979 213463 249693 285283
2955 285283 306643 135732 147251 152681 174044 206610 181462 196910 210669 222975 357522
2944 357522 321382 333385 364043 325197 334286 367599 155227 197449 309349 193300 374946
2933 374946 406165 465234 341465 343501 471968 557699 375056 393513 504909 581091 400565
2922 400565 481751 332026 413498 633465 446369 366356 312944 153363 317724 220570 229847
2911 229847 275276 166651 277755 273362 322110 457758 407152 224249 88109 -872 212669
2900 212669 394850 420054 152070 117930 197732 213678 347452 294080 314248 222162 269550
2889 269550 192510 165025 140069 163982 57632 81703 149703 224239 300014 188238 293436
2878 293436 -26061 62060 161702 154861 161539 219618 32624 -51289 -194279 -124367 142929
2867 142929 218541 174530 108623 67657 132201 61927 156944 209707 210470 325847 225128 74916
2855 74916 -290 -37026 -257861 -289819 -53696 163336 258236 142547 38142 142039 311333
2844 311333 360301 172750 224901 -23979 -232766 -250112 -195143 -219157 -299463 -178426 137413
2833 137413 107076 -28750 -47774 43344 -131826 -150223 -188683 4477 87666 237030 277014
2822 277014 99979 141376 78371 39427 -58317 -113607 -88601 119003 -21220 154449 401072
2811 401072 181069 -111189 -72674 13164 -56528 -33011 -86536 -52278 -11945 -2279 191182
2800 191182 194969 140467 108322 217888 54650 30246 320838 118364 133576 190795 32644
2789 32644 3647 -2889 -51855 -168304 -172782 46743 55427 37394 27487 -43005 69562 32264
2777 32264 49058 16430 114293 -37211 -76640 -90390 -82145 -34949 39728 76621 -50339 -138420
2765 -138420 -89002 66551 110609 53109 130290 267664 258158 18904 67165 149044 192600
2754 192600 72357 89734 181109 14367 -106103 -71719 -48094 -67754 64749 100759 -51491
2743 -51491 -288789 -12748 35616 -179207 -323845 -231698 -185036 -265595 -278866 -65268 81755
2732 81755 105869 344016 107079 425 140332 1443 -140688 -129401 172042 59641
2722 59641 -28111 19035 8356 -67136 -55872 101153 616 14215 -47116 -10611 -87624
2711 -87624 -403674 -518456 -385381 -246445 -86628 -6363 45027 -42460 -62559 -141914 -238501
2700 -238501 -212714 -133126 -63845 -173954 63034 -42785 -308800 -8983 55294 -26446 -105062
2689 -105062 -12698 -84322 -181513 -273644 -70036 -117245 -166938 -61845 -108298 -91666 -128717
2678 -128717 -6108 -44424 -51191 -84948 -114418 -87951 -11234 -37156 -35305 -203178 -272520 -197369
2666 -197369 -68622 -155181 -18187 -51837 -12624 59740 204652 131223 25192 -52080 -84577
2655 -84577 47752 -24550 -36535 -69880 -237499 -173670 -21746 -64527 -13522 162839 -2001
2644 -2001 -70244 179172 103618 -95618 -68323 -15936 156833 15836 -87336 50116 -17853
2633 -17853 216 170849 118777 -85954 -132677 -77939 -9406 87679 -50949 140616 222790
2622 222790 -8758 10636 36421 132454 -130313 -290183 -222647 -101566 -138183 -167278 -370581
2611 -370581 -278692 -191663 -84005 2907 -99754 -67166 -1164 -142381 -138336 -92474 -104117
2600 -104117 -210553 -87476 -63792 71830 64096 -141992 -161397 -74093 10925 -33142 -2411
2589 -2411 3382 18780 125647 202424 -86897 -47513 -145602 21189 43465 -50105 87517
2578 87517 73666 -137978 -69701 -68029 -100806 19989 -75850 -120605 -50782 67342 71637 20880
2566 20880 -127737 -88770 -142983 -270181 -152602 -117299 -120514 -77460 -2218 -22083 -99005
2555 -99005 11840 -77862 -100805 80885 -7428 42196 -47106 -2313 25496 41035 48742 76838
2543 76838 -106371 -2120 129525 -134419 -91077 -60767 8059 80643 27307 -65876 -51176
2532 -51176 1639 11081 -196156 -255091 -155334 -114096 45358 152491 141412 251851 114315
2521 114315 124518 -148090 54786 129714 300373 211299 198207 149576 177291 214011 119056
2510 119056 27006 -45667 -152241 -245572 -177397 -40925 98161 -92903 -17467 35973 -51027
2499 -51027 123809 211361 249183 60982 -120963 -297836 -37849 -138985 -78020 49978
2489 49978 36799 -2288 -71319 -15507 -293615 16252 102210 160300 192737 -7607 -54395
2478 -54395 45594 44343 108785 28624 -31639 69884 131207 124605 121305 8258 -84053 -235786
2466 -235786 -55593 -30544 174735 222808 149982 107961 225732 147641 195857 209117 183293
2455 183293 17053 53949 -51610 12676 2800 4765 88501 -22755 69823 36226 -81408
2444 -81408 -119833 -15853 17063 33380 105908 71011 -81046 -71942 -12458 26930 132733
2433 132733 293075 285464 145578 195075 59194 200065 75950 123798 240762 -34751
2423 -34751 -32700 -55345 98351 231184 206170 297186 143980 136775 28704 132342 211519
2412 211519 166037 170230 129373 106988 171715 212587 58282 8578 -57314 75749 209455
2401 209455 225951 142147 281021 399960 516217 686537 640334 567090 535641 392779 369755
2390 369755 428929 414341 371826 584030 767519 491696 323740 528268 543726 608724 505712
2379 505712 437421 302495 304483 118776 213874 214607 152224 255788 259160 208694 362539 384101
2367 384101 186569 263208 276837 318429 245754 152400 198026 35923 148083 213930 273915
2356 273915 262709 333489 264613 85217 -80620 159637 176928 219213 192158 95427 136286
2345 136286 190590 209119 78472 154428 180786 238722 237708 -32375 148550 196179 325544
2334 325544 263092 130445 319224 459098 385463 201063 225633 211118 252816 257514 472483
2323 472483 476261 210753 209643 259273 409542 344685 251669 306489 263488 207803 264990 380174
2311 380174 267548 314029 338204 246220 180084 186926 177374 355355 470520 727402 457130
2300 457130 278995 424678 377887 306056 181289 165196 240117 282282 448670 188881 184350
2289 184350 373229 346363 411165 432308 325400 449913 215556 176997 218036 353446 520555
2278 520555 305742 51559 231767 327597 402633 484466 402285 475985 612344 586103 482309
2267 482309 490334 573694 577410 518372 284392 335966 468902 494821 538832 589938 608305 749129
2255 749129 732167 515648 587900 577167 459066 391262 498798 690768 602576 447116 559673
2244 559673 804268 749828 827454 837772 746568 792047 717878 857020 1004244 807257 723667
2233 723667 1049792 1056069 868457 925115 716477 618900 838813 885962 927165 974968 997181
2222 997181 917841 900927 981241 1042810 1208737 1353824 1429597 1481806 1276599 1310106 1319958
2211 1319958 1301504 1176234 1400864 1498634 1631413 1711421 1672739 1664359 1484015 1841907 1988041
2200 1988041 1859498 1843632 2038880 2138952 1916327 2013590 2237509 2248526 2364896 2530430
2190 2530430 2605292 2676292 2710417 2694386 2564011 2620585 2738604 2938449 3145824 2944555
2180 2944555 2833811 2849652 3107972 3148909 2869443 3145639 3111655 3204923 3273321 3397982
2170 3397982 3524122 3468487 3652550 3860118 3876278 4094327 4237817 4341793 4396540 4433322
2160 4433322 4645670 4914360 5377142 5750386 5782767 6164674 6426833 6761111 7095891 7463209
2150 7463209 7664768 8141919 8531999 9081946 9556274 10295952 10731469 11355497 12285645 13225451
2140 13225451 13964777 15184651 16488653 18067261 19874959 21504460 22834098 24703746
2132 24703746 27029567 30147667 33664957 38100145 43343160 50101716 57658094 66067101
2124 66067101 75422389 87693675 102158219 120396522 126705562 107458370 87259204
2117 87259204 68928260 54308329 44076593 37254053 32399877 28755469 25964695 23541509
2109 23541509 21609215 20028530 18797803 17923940 17028236 15800458 14239007 12903252
2101 12903252 12134113 11371836 10711601 10253620 9849728 9275238 8839552 8422202 7899106
2092 7899106 7545475 7189062 6885731 6698788 6368575 6164639 5749262 5626391 5498974 5410468
2082 5410468 5292814 5114681 4897440 4700789 4417201 4395772 4097412 4159348 3873904 3789966
2072 3789966 3805269 3860895 3740153 3479717 3364671 3525166 3311879 3112899 2982123 2743686
2062 2743686 2734621 2685841 2504370 2370292 2340301 2470825 2586345 2598965 2307247 2325747 2234337
2051 2234337 2082192 1944802 2016989 2071026 2001565 1955673 1966578 1677640 1611914 1786462 1964187
2040 1964187 1965317 1957334 1875239 1709373 1602271 1572377 1556057 1597489 1327555 1249632 1377987
2029 1377987 1369370 1189706 1175023 1228930 1175023 1203323 1102169 1040820 1114735 1164079 1124409
2018 1124409 1135700 876508 699128 552598 640920 824443 774496 795053 890930 946516 894204
2007 894204 646127 780844 680680 686315 629849 621441 625990 620540 724235 712645 600784
1996 600784 576010 566659 615411 634230 573916 637249 594986 666240 561859 594318 482622
1985 482622 586952 517112 751866 592677 601331 616361 430959 570708 346222 586368
1975 586368 663239 695818 470698 413614 435618 376264 381276 225374 120613 234272 153271
1964 153271 88506 262280 219693 141699 432709 566425 546002 614359 522006 492030 565327
1953 565327 478435 469176 645378 702434 463257 268278 126641 155101 291080 313415 119211
1942 119211 172557 233615 258795 301836 340585 256889 303213 331139 265942 254855 320568 199393
1930 199393 230385 235237 -19021 174709 296696 215962 188433 181758 87647 33142 -13217
1919 -13217 -47350 288324 410774 311612 260553 216206 210872 215370 229106 110749 230723
1908 230723 238703 220250 121830 87114 245884 172365 101226 64978 1695 -91481 -97781 133299
1896 133299 228857 142985 170101 260096 46868 47253 -16746 -116682 56126 78004 -111996
1885 -111996 60971 208791 141454 218056 127607 54589 63971 124701 74359 22314 163392
1874 163392 232232 171351 375191 335229 155521 83290 19768 117200 319395 302718 382659
1863 382659 324135 146804 252551 542203 535813 259217 460422 494824 457969 359352 312693
1852 312693 418868 302003 532358 566769 346909 248983 243362 334106 226260 13534 185376
1841 185376 289259 86692 57724 123479 112461 395 -62657 118976 1046 -198810
1831 -198810 -86367 -132491 -220426 -225819 -59859 28905 193362 94354 189947 277085 24242
1820 24242 250298 134128 25185 -191511 -194233 12849 -245027 -136886 24438 -16366
1810 -16366 -258972 -37416 -132582 -214089 10742 -27703 -81620 18313 -102554 -76423 9168
1799 9168 77941 -63779 -284167 -41618 127174 -65068 12976 -30132 -177368 -202683 -99187
1788 -99187 13992 -25642 -196914 -154833 15448 21261 -95226 -194220 -15712 126440 161024
1777 161024 184080 97509 117435 113001 -111993 -104841 -65471 -55822 -1526 24149 187090 7196
1765 7196 -153832 77039 45172 77359 38405 -69813 -25609 90850 147072 79499 68242
1754 68242 -32868 -104632 -28756 -62507 19016 -747 -11826 37343 120927 34477 30497 -16787
1742 -16787 -137235 -112812 67913 35353 130963 103132 -163963 -219793 107416 -9290 22632
1731 22632 46301 87152 66514 -65531 3654 -39379 165321 -3660 -5877 5036 26387
1720 26387 120755 -31420 -58115 41601 42397 125709 4052 41310 170913 -3661 -63738
1709 -63738 -22929 -134548 -204990 7826 170003 101513 199922 220453 -1111 -89520 -165973
1698 -165973 -3007 122140 156100 -57938 -75391 -18101 185743 297672 -5858 3781 -74985
1687 -74985 120391 224683 -218367 -52599 -76135 -130848 -68944 16173 2563 -132872 -70438
1676 -70438 -12383 -13375 -81356 -130022 -10451 -26694 -59592 -49483 -105752 33627 -13089 -159854
1664 -159854 -368988 -122675 -153716 -134182 -105093 -215978 -57424 90167 -41203 -94000
1654 -94000 -162779 -132583 191357 215847 186597 -20490 -54520 -27349 -92610 14300 147513
1643 147513 298158 75732 12615 -68584 -87626 -63460 -187685 -140908 -126085 -46000 -170900
1632 -170900 -35542 -75237 -12036 -55642 -36832 -47534 -189596 -34087 -100868 -5187 -30497
1621 -30497 20616 63410 -174643 -72113 -44402 -138767 -129172 -221221 -52879 -22704 -39923
1610 -39923 37386 61036 -43250 -147487 -186999 -98306 -19313 -110444 -173452 -176428 -150032 -10429
1598 -10429 -85093 -125206 -28696 217319 177658 160780 122693 34483 -96587 -124952 -54491
1587 -54491 103643 -9973 -28869 -186841 -90859 41850 188688 21823 -15217 146118
1577 146118 28649 14961 -377 -96655 -108070 -62952 -171777 -173926 -55709 42995 -116368
1566 -116368 -17393 79958 -110375 -240139 -99147 -6825 -2179 -179728 -15270 -82418 -219610
1555 -219610 -274569 -175540 -16524 -130510 -368485 -151779 -74604 -67745 -222114 -281470 -78337
1544 -78337 -32670 -174713 -104906 -36967 -180205 -287791 -387681 34233 111949 -115781 -112508
1533 -112508 -115175 40860 -49086 -122177 39869 63469 158384 125203 45612 -42765 -38420 -83237
1521 -83237 -70834 -109030 -141743 -127894 -151569 -295066 -317641 -154460 -267924 -95900 -12927
1510 -12927 45245 34375 94064 100607 34903 -55612 25725 -41642 -242165 -164539 -47278 19925
1498 19925 -75418 -177054 94415 106238 -46637 -220174 -266570 -200080 -2850 76422 16336
1487 16336 -22355 -70532 -8390 62555 105606 2427 -82884 -185295 -208615 -19541 -57654
1476 -57654 -170652 25214 -143831 -62919 90161 49125 -40964 -133021 23052 132741 19919
1465 19919 30439 171341 3333 54587 -82390 -147757 -292843 -399797 -176757 -96742 -4244
1454 -4244 131786 250397 156501 -40131 -140141 -218757 -210187 -98531 -138859 -180800 -74174
1443 -74174 -17803 -93735 -57216 65265 -114154 -134565 -82190 -122022 -156570 -199746 -143726
1432 -143726 -111331 26668 47185 34029 -34273 3573 -31704 -57996 25785 46593 -32579
1421 -32579 -179716 -14317 54927 -117616 -16401 -96067 -11240 -37987 -53811 -42047 -49017
1410 -49017 -146084 -10994 -9864 -112084 -127218 -227244 -274889 -129074 -214636 -116042 26324
1399 26324 -96836 -214128 -344901 -141789 -12985 -52842 4725 -57530 4082 81013 28744
1388 28744 30128 103043 -79182 -21235 59482 133834 126565 -6963 -175448 -204347 -108732 66927
1376 66927 22387 -4306 94741 66762 1220 -148781 -138645 -12205 114649 -689 -49007
1365 -49007 174180 177043 111526 19426 -141867 -61926 92905 137508 -68455 -17875 19560
1354 19560 35913 -7856 3340 92738 217901 57818 115671 146094 -18880 -14802 15016
1343 15016 -18736 115310 43445 -24408 118821 40297 -105558 -19683 115832 104175 34267
1332 34267 -101120 -87033 -166242 -83524 -77547 -104502 -169917 -67583 110814 53872 -15728
1321 -15728 30025 -15463 -217446 -6269 -87393 -113193 -47716 -145565 -152486 -39569 37015
1310 37015 140976 -66100 -47617 -75633 -173923 -246252 -196678 -233278 -286313 -103872 -96781
1299 -96781 -75889 62368 94738 -97204 -50598 144748 85055 45536 54064 -8520 131461
1288 131461 192267 78657 3272 -4737 164948 -41765 59073 -31865 -132680 -170646 -247112
1277 -247112 -326397 -156740 -68748 -293126 -287967 -62518 -65782 -117800 -52559 -185665 -304797
1266 -304797 -69534 3704 -52906 -101515 -220890 -314304 -4444 105539 51832 80322 -85190
1255 -85190 -125373 -9896 48211 -80623 -14631 58505 128214 -253 15780 -55923 31533
1244 31533 95616 52684 -34177 -14397 -181380 -264346 -45910 64924 -49590 142606 -24256
1233 -24256 -1803 95114 -47717 -153518 -64865 -117477 -110860 -221850 -215449 -4845 50217
1222 50217 67171 14801 -5855 138539 52053 -50922 55256 27733 42415 20666 -203246
1211 -203246 -196496 -116287 20332 94680 44369 -156794 -204543 -51574 59565 -144949 -193487
1200 -193487 -60387 -122737 -159340 -213022 -314709 -104675 -20984 -83176 -194814 30811 85307
1189 85307 96590 46747 7485 3369 -20940 78109 59412 -53225 -30776 98323 158622 157900
1177 157900 46354 11187 18612 7817 69767 -86142 -247101 -105003 51111 167009 117512
1166 117512 89747 -74722 104733 232107 174368 189314 115914 -35344 -53324 103243 154340
1155 154340 19686 43326 -53687 27460 -56967 39604 -35651 104611 12760 -140706 -93174
1144 -93174 -83015 53744 -139404 -190465 -106269 -130133 -119519 -199815 78480 104972 27055
1133 27055 -128883 -73347 -84014 -42367 -142574 -86934 -72224 93502 45932 -15014 67234
1122 67234 -174612 131425 191979 -7337 109945 -49049 -75103 -44865 112978 65568 87330
1111 87330 346503 71670 28408 -111403 -194910 44785 -23718 133943 106982 26454 174240
1100 174240 116162 100685 -12181 -111078 -120223 69183 -92731 22450 161538 319265 266547
1089 266547 291277 76082 102069 120735 -25208 -165942 -133644 -124096 -161802 -131548 612
1078 612 86813 -47565 12241 46457 30521 -100840 -63421 -122181 51619 -104428 -58512
1067 -58512 -238617 -105121 84301 30148 -12389 -107938 -140462 -210400 -224287 -178824 211224
1056 211224 137587 99540 168489 240011 98533 73292 56029 61378 93432 118401 -31717
1045 -31717 -92263 32729 140616 -9005 25502 -155097 -204406 -194741 -150209 -209399 -295829
1034 -295829 -221361 -123089 -172946 -98757 99732 76524 20335 186 188807 183032 20757
1023 20757 -63494 119239 107188 -20152 24055 80209 112455 -87794 -67761 -20127 -85906
1012 -85906 143875 49321 15591 -144341 -274247 -120928 -54175 -42608 50110 122675 67341
1001 67341 55068 161146 36167 -11485 -7429 107453 72265 25434 85643 71492 110585
990 110585 35124 -28188 -180992 -234972 -110592 84565 137949 174146 97662 172 -72762
979 -72762 -210372 10439 93323 85833 145273 167842 199474 146359 55652 -32624 -29921 -22191
967 -22191 82847 92903 -11533 -77812 -140940 -93220 -60404 6813 -89938 -118469 -38015 68205
955 68205 238796 206837 217630 19461 115801 189330 247878 300467 26048 -83655 7072
944 7072 158894 156630 113729 -20929 -195990 60935 176194 4482 -84214 -86984 115687
933 115687 32195 11257 -45248 -137018 -118009 -140360 -73430 198063 14345 -50286 7467
922 7467 -20956 60050 -9360 16977 -39926 166944 86036 -103598 -80330 5234 -76528 -20480
910 -20480 217123 236744 57097 26543 36342 31684 -12845 -74318 -75152 -273658 -180496 81601
898 81601 85531 4270 153862 117998 4809 178478 48768 -241293 -67123 -35623 -20200
887 -20200 -108907 -224265 -154820 2515 -67599 -94681 -172731 -143814 -26710 205546 141813
876 141813 199739 177478 -84921 -1140 -200284 -104672 9670 -148922 -163131 -36690 107921
865 107921 22850 47186 59781 -23124 -95105 -150127 -189969 -253079 -96530 220817 200654
854 200654 -47993 237 -24963 27403 -15272 -133381 -96754 -246849 -140482 -92136 -130653
843 -130653 44580 29049 234510 306493 135504 -84365 -78396 5175 31456 -22770 -95043
832 -95043 -60816 -1881 -74499 -162695 -63655 50708 197927 98892 -145182 -262056 -254688
821 -254688 -135281 -48332 -6305 76910 -39172 79307 19321 -11190 88427 99172 97655
810 97655 62518 -111735 -236251 -260077 -32501 204509 98173 179130 -144968 -121758 -86001
799 -86001 -73809 -82935 4654 70802 59601 99833 5190 -130045 -32090 493 -2258 82021
787 82021 302905 44967 -97636 13999 146640 91379 7656 171425 63784 5760 -57682
776 -57682 -108315 -24190 -149001 -222284 -188393 -107770 -120082 -211086 -313376 -210100 -104814
765 -104814 -105995 66692 112461 103211 -134844 -181026 -44432 -124652 -131635 24570 108749 27734
753 27734 -83783 -107055 -71775 -109161 -60820 145551 123287 183646 115019 -95179 -134256
742 -134256 -44914 54666 71432 40088 -77217 59533 -20790 -102330 22586 88784 -17507
731 -17507 7551 -110108 -239249 -24428 -7723 -61490 -132539 63616 198540 -71108 -118895
720 -118895 83430 55263 -10894 38688 255515 231450 156186 -123119 -38240 -84207 138614
709 138614 96536 187020 184569 44995 12793 -92394 -231575 -110817 -250596 -204499 -9052
698 -9052 21666 -82129 75643 140609 30391 -130703 -312508 -234082 -165319 17374 -152463
687 -152463 -125420 -1339 -153500 22821 -74292 -116600 73743 5966 106575 28921 83238
676 83238 174588 194175 205431 -105857 -67324 64263 -3641 132482 114767 273043 128190
665 128190 -21184 -3656 -66122 -181140 -47908 257070 154372 -23494 144752 175961
655 175961 29165 -74134 30902 -38685 82582 -8872 20394 -162273 -84428 89214 10095
644 10095 -61064 -57052 -155589 -99654 10769 2055 137563 146220 60011 71848 -90201 -154377
632 -154377 -125595 -128319 -196519 -153637 -112396 -81378 8092 182164 109950 124944 -9147 -45287
620 -45287 34373 11617 80964 -28428 -215172 -125486 -10518 -184835 -31387 178010 -36413
609 -36413 -56496 194676 154901 90370 50789 16141 -109706 -9243 18568 139984 110511
598 110511 -117613 -274325 -168923 -204636 -145228 3020 83858 -199951 -250280 38663 41458
587 41458 -115208 -31072 -31392 -148680 -226393 -237482 -172590 -159597 -35369 143713 107257 48933
575 48933 107962 117487 34280 105829 -32797 10390 -105761 -71080 103419 70996 52549 23724
563 23724 118366 -17858 81618 43050 183036 143161 115778 152887 29855 116635 368734
552 368734 190909 -56084 -34006 42749 140446 70420 32318 14320 227882 269923 283268
541 283268 214670 57548 65391 202073 261167 264994 178842 140066 116855 -62468 27935 -51288
529 -51288 -13148 -27615 -28370 -156654 -357823 -260329 66929 170964 112321 -1036 -163772
518 -163772 -46865 71794 43977 117278 296246 318330 289472 306324 232201 175555 -75346
507 -75346 -68535 -5069 -131271 -17966 43741 77984 -30393 -97305 -34706 76493 79459 52681
495 52681 5812 -63686 -115047 -13006 -20650 13780 -88762 -44479 -8435 9013 -63703 31676
483 31676 -55742 -16350 -196519 -390184 -270289 -171485 -89870 -104072 -150500 -21365 229214
472 229214 16226 -104049 -71330 145397 282604 247460 145245 96485 153357 60231 -75086
461 -75086 -37129 -56270 113442 142479 233897 113684 26158 12285 -8445 143660 -15788
450 -15788 -49841 22905 -143371 -210050 -142695 145281 182946 201673 172052 264716 226148 31542
438 31542 -36163 -201122 -87592 50897 -46213 -134946 -122968 -38733 131397 8617 54728
427 54728 170409 134094 71414 -14424 63689 167636 70043 72568 106131 91889 -22297 -86811
415 -86811 -22006 146165 -184843 -134622 -10474 1949 -134040 -166535 38426 -153301 -103090
404 -103090 -173883 -70699 84518 52159 -107528 -74122 -126792 80169 -143178 -283258 -22608
393 -22608 143140 108354 -43578 208471 325656 124940 -83458 -251794 -401317 -277104
383 -277104 -43894 -113941 -311989 -182587 -209285 -210058 -144915 -115033 -129807 -209030 -341697
372 -341697 -390663 -130605 -190059 -42832 -102057 -193845 -247010 -56439 -4777 -67372 -202503
361 -202503 -254815 -229585 -258950 -87894 -30412 17500 77365 10622 41221 314441 174293
350 174293 114255 19872 250525 25470 -94225 -200660 -235852 -291292 -227045 -159617 -128807
339 -128807 -76370 -221513 -137783 -310026 -106416 -142246 -144740 58374 -46378 22208 54079
328 54079 -109644 -180174 -173089 -295287 -135896 -132575 -93553 85720 121530 255820 117391
317 117391 48827 31662 -63716 -33430 132357 146187 41889 4996 -27117 -85773 101543
306 101543 142854 -82887 109413 -131378 -202891 -111901 -355191 -232505 -133149 -20491 10545
295 10545 19496 4545 -85303 -110234 -91000 -92545 -88453 45523 -29353 -24353 128018 -21582
283 -21582 126822 -29823 -157097 -136269 -31232 108360 35827 38419 -134749 -218461 -242321
272 -242321 -305184 -487563 -479662 -178408 -124940 -87493 -147823 -72958 -204989 -201308 38391
261 38391 -9865 -58028 -45115 226557 47195 -29712 -68897 -174258 -167596 -110732 -137178 -137234
249 -137234 -180699 -196842 -227753 -216377 -191932 -214678 -37536 35213 -142642 -315004 -297064
238 -297064 -175472 -185318 -236649 -194115 -78556 -14279 -71721 -16519 141340 -76304 -262235
227 -262235 -98763 -39299 -131562 -119840 -72635 -80705 -231504 -334957 -81963 -53662 -168311
216 -168311 -257863 -147484 19056 68096 178217 -50824 -167384 -94582 -164731 -42644 -160813
205 -160813 -191934 -187816 14568 125856 4819 -72145 -59343 -83328 -79995 -97447 -50802 -55529
193 -55529 -306328 -246642 -139339 -131732 -204715 -193336 -104474 59582 141879 56619 161102
182 161102 101715 -133635 24691 6357 -60727 67505 104432 15611 13756 163048 188898
171 188898 100521 21149 -57867 42839 -43117 -11675 157242 -9164 29777 173180 165914
160 165914 70979 -145331 -127385 -102350 -151261 -119040 -245590 -144121 -194872 -127165 -28970
149 -28970 57154 -104731 -194350 18836 -52053 -125553 -35787 -27005 8012 12616 85799 -67998
137 -67998 -152094 -209097 -295422 -325877 -400077 -199677 -221192 -284795 -204957 -279365 -233287 -34712
125 -34712 -2163 115431 13871 -160815 -56019 112002 42756 -3407 -5882 -178124 -169606
114 -169606 -182445 -139521 -68647 -102034 -61843 -139451 -118855 -249283 -196789 -256248 -220964 -125838
102 -125838 -48333 38845 -11458 -144708 -79436 45659 64180 458 102297 100592 -139945
91 -139945 -56238 -147920 -171124 -82066 -32808 9305 86036 68985 22964 125453 212156 89442
79 89442 12385 24938 27183 -49581 -5445 -19302 104187 149505 65663 30 33553 -19342
67 -19342 -85635 -89358 -131123 -125816 -217794 -160995 -103498 -68590 -72455 -118108 -89270 -91835 -191193
54 -191193 -251856 -206497 -95380 -185551 -150114 -166891 -184455 -50619 67861 98125 -5816
43 -5816 -185370 -233678 -75247 -10201 16891 -30027 -49108 -83041 -79667 -55856 -80152 -175647
31 -175647 -237237 -101949 -112472 -65311 -73854 -44802 -81352 -195316 -117191 -42205 110063 -31823
19 -31823 -151893 -137367 -48345 78826 -163163 -274559 -247019 -175886 -62044 61378 7645
8 7645 84481 68616 -70539 -82635 52591 34515 -61436 139861
0 139861
$$ Imaginary data points
##PAGE= N=2
##DATA TABLE= (X++(I..I)), XYDATA
16383 -1180789 -1100408 -1048747 -1098271 -1002982 -977491 -990879 -827196 -952886 -936511 -936028 -972285
16372 -972285 -899433 -900418 -907233 -751978 -828868 -815062 -715611 -772838 -800944 -843310 -784322 -765280
16360 -765280 -596696 -529250 -569557 -505289 -403849 -298051 -275631 -327352 -317368 -372965 -358929
16349 -358929 -346442 -273772 -150631 -161418 -163637 -182424 -118534 -174142 -171330 -150575 -37949
16338 -37949 -98000 -117494 -31385 -45300 -90537 -152773 -33460 40922 90665 101240 47007
16327 47007 124380 86120 70207 68708 168169 214196 107154 170521 169513 135322 150132 202423
16315 202423 120795 169377 257331 339951 308651 289451 224338 332000 550932 405224 357279
16304 357279 344198 382424 482593 390254 523318 519344 564457 524034 464861 407017 532214
16293 532214 573700 563268 586525 589844 637168 725118 603004 567736 751757 613555 721213
16282 721213 882157 938199 985763 836547 808025 906244 875869 826573 989146 1063365 926521
16271 926521 937124 917750 987782 986998 1003975 1008003 1062294 980037 920725 1063565 1077035 1070402
16259 1070402 1031648 973217 1109086 1272415 1251667 1278224 1224859 1182643 1248977 1165880 1114017
16248 1114017 1338983 1392133 1141334 1193200 1203882 1227368 1251428 1266970 1167763 1230401 1291055
16237 1291055 1292535 1259562 1389223 1383317 1353250 1491177 1655012 1722823 1692260 1668546 1577769
16226 1577769 1479204 1338651 1449869 1586833 1585340 1660108 1525013 1569583 1490074 1495804 1662621
16215 1662621 1731344 1725651 1677068 1800281 1624863 1477308 1616057 1640247 1492769 1693523
16205 1693523 1654174 1376039 1467962 1523123 1552557 1631919 1647029 1614076 1471004 1467085 1680394
16194 1680394 1601667 1584308 1731513 1923617 1837545 1854035 1947166 2011138 2119118 2008030
16184 2008030 1895095 1856002 1841749 1785101 1636968 1861844 1860436 1656983 1612108 1603584 1791016
16173 1791016 1773228 1893393 1897634 1904133 1690379 1805473 1760018 1771894 1778659 1661493 1692757
16162 1692757 1778322 1849610 1973028 2059771 1912635 1782083 1843452 1732898 1806192 1785765
16152 1785765 1839105 1939185 1976689 2146387 2121003 2048466 1950290 2003922 2005190 1966533 1877052
16141 1877052 1866531 1865974 2056061 1818185 1921707 2073349 1828782 1943894 1938903 2064734
16131 2064734 2000676 2212430 2247255 2177685 2242049 2117558 1959369 2018453 2040082 2255895
16121 2255895 2121781 1894035 1834815 1885162 2191266 2264699 2103911 2084220 2116750 2101379
16111 2101379 2116364 2090494 2280560 2274071 2457971 2225469 2213902 2305522 2103723 2033763 2055168
16100 2055168 2068045 1937116 2035774 2084161 2025454 2037856 2093118 2081705 1986480 1844548 1953078
16089 1953078 2015637 2111728 2135442 2058795 2250883 2115213 1974730 1992539 1971134 2045313 2170468
16078 2170468 2104835 2098299 2164695 2269808 2188995 2088463 2161807 2067048 2003071 1958937 2098000
16067 2098000 2095959 2118570 2172087 2026051 2337365 2243315 2158640 2215819 2185877 2146679 2152783
16056 2152783 2234452 2246565 2215747 2213682 2151011 2323943 2328673 2251831 2195840 2119664 2087272
16045 2087272 2059475 2028083 2237559 2322434 2165603 2227915 2101980 2037907 2070180 1835352
16035 1835352 1971424 2114948 2047285 1903317 1956094 2076178 2158395 2278813 2298452 2122141
16025 2122141 2093856 2216441 2289793 2291695 2056444 2103061 2062858 2156147 2112620 1927847 1850625
16014 1850625 2156749 2188050 2089891 2056005 2023400 2067209 2035742 1873830 1853879 1740009 1949842
16003 1949842 2138184 2214426 2245448 2183693 2025356 2211075 2356836 2204884 2108502 2139559
15993 2139559 2319819 2105624 1904692 2052663 2078296 2165674 2223976 2284941 2284460 2223509 2160435
15982 2160435 2169146 2223092 2165290 2102490 2078916 2154568 2043302 2208524 2390785 2524844 2522315
15971 2522315 2383804 2332901 2220037 2289552 2317679 1985671 2150641 2341835 2278090 2176168
15961 2176168 2161731 2047422 2136179 2310929 2368950 2178623 2137553 2253730 2419691 2144042
15951 2144042 1965613 2055717 2111919 2225851 2266413 2118757 2022238 2248492 2080009 2135613
15941 2135613 2187515 2192086 2280194 2220999 2238617 2221628 2279030 2108548 2130822 2168408 2269228
15930 2269228 2118025 1959613 2033742 2095788 2063595 1904926 1921586 1934324 1974122 2007188 1940253
15919 1940253 1960488 2053408 2202984 2126968 2103621 2087157 2234677 2298556 2017984 2082173 1979097
15908 1979097 2082498 2077537 2215808 2233216 2357874 2412977 2234096 2203552 2282054 2319234 2149779
15897 2149779 2254119 2265818 2161260 2218866 1966427 2072402 2083705 2191052 2239651 2256535
15887 2256535 2156179 2130254 2161031 2050494 2130377 2151247 2115352 2143382 2475196 2292605
15877 2292605 2178392 2241444 2018199 2082294 2117530 2050020 1904730 2151349 2200721 2154839
15867 2154839 2283755 2325685 2488569 2304135 2077999 2243150 2406943 2430447 2493719 2541333
15857 2541333 2460703 2411834 2050825 1914055 2279806 2298260 2256670 2250004 2094688 2202370
15847 2202370 2138672 2175996 2160451 2143015 2098363 2105099 2034708 2125053 2373659 2431952 2341830
15836 2341830 2108868 2040877 2002286 2300597 2257261 2251873 2368733 2410245 2506935 2347182 2162798
15825 2162798 2254132 2177535 2200390 2112312 2164030 2182958 2175291 2229890 2351108 2274941 2359256
15814 2359256 2296499 2286323 2370457 2136747 2071710 2100582 2260586 2286392 2287970 2347487 2342121
15803 2342121 2320731 2114611 2125620 2214587 2319022 2290592 2377023 2173777 2211299 2224917 2264763
15792 2264763 2213195 2259379 2253417 2178124 2303707 2104185 1931465 1930064 2125648 2006340 2113547
15781 2113547 2275791 2345064 2174455 2053946 2228837 2347357 2138382 2037181 2201056 2178381
15771 2178381 2226164 2199835 2261233 2547139 2462008 2224160 2112906 2104729 2161462 2229071 2305598
15760 2305598 2305485 2335913 2205511 2083516 2209318 2200516 2169308 2059879 1919750 1974430 2039040
15749 2039040 2170128 2222137 2142605 2194095 2196850 2469098 2502883 2283628 2339323 2531109 2579267
15738 2579267 2365802 2188340 2105033 2095306 1986775 2109974 2272505 2428344 2304137 2172601
15728 2172601 2220546 2189510 2286037 2260209 2188047 2352407 2208405 2154062 2141357 2199325 2138345
15717 2138345 2162405 2310414 2328345 2525538 2378768 2295729 2320023 2550303 2429981 2289480
15707 2289480 2173755 2272724 2246054 2281795 2074312 2180400 2164186 2210197 2223288 2209163 2298075
15696 2298075 2357758 2228416 2179051 2284565 2068276 2116564 2166232 2343406 2332250 2294729
15686 2294729 2135848 2050824 2240312 2257250 2100836 2165034 2201407 2212017 2188115 2183022 2165357
15675 2165357 2203146 2135655 2213490 2347516 2235099 2142533 2098548 2238632 2299852 2287678 2233449
15664 2233449 2187300 2294709 2468068 2391986 2192355 2017750 1909828 2086302 2236208 2310571
15654 2310571 2184033 2134828 2292971 2323808 2335546 2081764 2062644 2190861 2280031 2182040
15644 2182040 1979257 1991364 2105888 1922314 2118916 2180980 2087738 1976133 2151019 2340487
15634 2340487 2211580 2192103 2050499 2193526 2033316 1975533 2228067 2115522 2072122 2201801
15624 2201801 2244411 2125455 1979785 2096052 2196138 2152410 1888070 1999719 2172481 2275178
15614 2275178 2141401 2156558 2176698 2283171 2296905 2379312 2199047 2079789 2160473 1850227
15604 1850227 1988128 2096165 2068925 2079531 2138155 2171804 2286279 2228791 2152534 2257647
15594 2257647 2389829 2496519 2315846 2352115 2279281 2158599 2219498 2265520 2457137 2436883
15584 2436883 2416892 2584705 2338529 2342605 2313288 2325519 2327929 2202628 2219622 2301172 2269357
15573 2269357 2165941 2095652 1926846 2063418 2223015 2008546 2300491 2282553 2152971 2307748
15563 2307748 2250252 2186530 2077548 1897701 1935675 2061080 2186790 2129025 2196410 2118538
15553 2118538 2053501 2148376 2222473 2352341 2390653 2402964 2580122 2493713 2434973 2403884 2272067
15542 2272067 2404786 2489674 2397823 2271839 2148956 2219837 2302827 2160451 2105108 2098851 2138376
15531 2138376 2089825 2280254 2173096 2246365 2208977 2100856 2011972 1976022 2167770 2317503
15521 2317503 2179213 2141108 2220161 2287704 2332417 2413099 2260814 2140879 2093133 2243414
15511 2243414 2185696 2332556 2358240 2336970 2439815 2433409 2397104 2374045 2238257 2118485 2240304
15500 2240304 2355999 2207492 2119464 2371683 2495822 2550578 2416238 2284959 2331551 2371475
15490 2371475 2187585 2277472 2378932 2188572 2291706 2354598 2190756 2285553 2335821 2234966
15480 2234966 2195665 2310078 2248212 2170519 2228415 2360336 2343010 2142554 2367735 2464052
15470 2464052 2295849 2220645 2199445 2237861 2279837 2375413 2544168 2317170 2350320 2406749 2334064
15459 2334064 2244423 2424202 2337838 2222234 2263676 2333591 2185341 2262780 2385731 2323066
15449 2323066 2401823 2467664 2613785 2474578 2378999 2451591 2484401 2352274 2304094 2196918
15439 2196918 2166139 2398175 2597384 2410903 2091109 2010503 2223477 2137101 2267602 2289339
15429 2289339 2225167 2277851 2262582 2295116 2285962 2273529 2349073 2306450 2491123 2509096 2331969
15418 2331969 2062847 2298464 2339470 2212865 2212825 2204802 2166682 2240284 2344087 2385904 2337058
15407 2337058 2317318 2200557 2307648 2487505 2329355 2252114 2266645 2127657 2111608 2048979
15397 2048979 2212409 2299030 2302853 2403661 2272291 2361776 2324040 2329725 2154450 2173189 2155298
15386 2155298 2225644 2270695 2266457 2342449 2345865 2313857 2359292 2222709 2245992 2412116 2424252
15375 2424252 2703756 2736817 2448834 2322081 2276258 2319194 2449699 2417436 2312742 2352569
15365 2352569 2301166 2306306 2275053 2288252 2417071 2182482 2246592 2357737 2394141 2369461 2267350
15354 2267350 2253834 2252941 2352792 2340647 2325334 2372516 2455162 2407340 2280130 2248681 2378882
15343 2378882 2333135 2193982 2315473 2428537 2194571 2216812 2233001 2152060 2319623 2406042
15333 2406042 2332205 2232108 2368596 2393482 2299908 2413485 2425551 2447406 2467751 2366875
15323 2366875 2370781 2306270 2443725 2497680 2471056 2461762 2353588 2417847 2468737 2258645 2181129
15312 2181129 2410284 2482951 2425447 2352977 2199312 2156978 2250386 2319992 2400358 2237937 2256669
15301 2256669 2217261 2165422 2173448 2120863 2232948 2308735 2275459 2314353 2248798 2217458 2257501
15290 2257501 2142229 2248991 2424356 2406239 2441852 2443678 2621496 2575929 2445263 2195946
15280 2195946 2274391 2307518 2196202 2239640 2229579 2348843 2456863 2386617 2398903 2300674 2098603
15269 2098603 2215634 2166239 2263041 2496677 2432986 2397179 2522137 2415911 2340351 2392038
15259 2392038 2516023 2535729 2341693 2449637 2541144 2558504 2321499 2282246 2199460 2052985
15249 2052985 2249221 2063222 2061342 2107663 2179059 2068027 2288313 2205928 2218298 2431384
15239 2431384 2352195 2332088 2385983 2154312 2125239 2271040 2527921 2540161 2434576 2182150
15229 2182150 2240741 2230161 2303195 2436684 2225605 2130026 2216551 2338438 2179347 2133476
15219 2133476 2187770 2315626 2313916 2358464 2388427 2341335 2199891 2294219 2594855 2418356 2233852
15208 2233852 2137965 2091236 2289871 2465649 2229533 2169266 2341673 2292914 2208448 2215987 2350028
15197 2350028 2343936 2220706 2240068 2403639 2334728 2503635 2327265 2409274 2604219 2744669
15187 2744669 2632485 2446255 2316353 2329969 2408998 2350687 2438184 2520742 2345497 2254922
15177 2254922 2412548 2362850 2227458 2341486 2294373 2440709 2302153 2220969 2253184 2141046
15167 2141046 2189262 2308832 2418187 2428653 2416879 2310742 2212372 2082704 2245551 2387417
$$ [...]
##END NTUPLES=NMR SPECTRUM
##END=
