##TITLE=1H_EC-3265(1-13)
 CDCL3
 8 sc, 
 13.12.2021
##JCAMPDX= 6.0         $$ Bruker NMR JCAMP-DX V2.0
##DATA TYPE= NMR SPECTRUM
##DATA CLASS= NTUPLES
##ORIGIN= UXNMR, Bruker Analytische Messtechnik GmbH
##OWNER= root
$$ XWIN-NMR		Version 3.5
$$ Mon Dec 13 10:42:24 2021 Russian Standard Time (UT+4h)  she@DPX200
##.OBSERVE FREQUENCY= 200.131346
##.OBSERVE NUCLEUS= ^1H
##.ACQUISITION MODE= SIMULTANEOUS
##.ACQUISITION SCHEME= undefined
##.AVERAGES= 8
##.DIGITISER RES= 18
##SPECTROMETER/DATA SYSTEM= spect
##.PULSE SEQUENCE= zg30
##.SOLVENT NAME= CDCl3
##.SHIFT REFERENCE= (INTERNAL, CDCl3, 0, 15.7182)
##AUDIT TRAIL= $$ (NUMBER, WHEN, WHO, WHERE, WHAT)
$$ ##TITLE= Audit trail, XWIN-NMR		Version 3.5
$$ ##JCAMPDX= 5.01
$$ ##ORIGIN= Bruker BioSpin GmbH
$$ ##OWNER= she
$$ F:/spectra/data/she/nmr/H-F/1/pdata/1/auditp.txt
$$ ##AUDIT TRAIL=  $$ (NUMBER, WHEN, WHO, WHERE, WHAT)
(   1,<2021-12-13 10:41:05.21 +0400>,<she>,<DPX200>,
      <created by zg, POWCHK disabled, PULCHK disabled
       configuration hash MD5:
       00 E9 B6 7A A2 85 ED C7 34 08 36 98 17 FE 4E 26
       data hash MD5: 16K
       91 4A 02 44 A5 7B 47 A0 12 42 D4 BF 18 9A F6 E5>)
(   2,<2021-12-13 10:41:07.90 +0400>,<she>,<DPX200>,
      <Start of raw data processing
       efp BC_mod = 2 LB = 0.24 FT_mod = 6 PKNL = 1 PHC0 = -15870.79 PHC1 = 11.2008 SI = 16K 
       data hash MD5: 16K
       8E 25 26 46 CC 1A 13 5C C9 A5 AB BF BD C4 4D D0>)
(   3,<2021-12-13 10:41:26.34 +0400>,<she>,<DPX200>,
      <pk PHC0 = -0.2857208 PHC1 = 0.7999998 
       data hash MD5: 16K
       64 35 E2 84 AE 74 67 D5 49 67 51 77 94 4C D2 C7>)
(   4,<2021-12-13 10:41:29.60 +0400>,<she>,<DPX200>,
      <abs ABSG = 5 
       data hash MD5: 16K
       59 2F 8A 7B E6 56 C0 CE 16 81 5A A8 51 4A DC D8>)
$$ ##END=
$$ 
$$ hash MD5
$$ 93 57 CA 48 3E 2B F5 3C 88 21 82 1B AD 83 2D 48
##$RELAX= 
##$RELAX= 
##$RELAX= 
##$RELAX= 
##$RELAX= 
##$RELAX= 
$$ Bruker specific parameters
$$ --------------------------
##$DU= <F:/spectra>
##$EXPNO= 1
##$NAME= <H-F>
##$PROCNO= 1
##$TYPE= <nmr>
##$USER= <she>
##$AMP= (0..31)
100 100 100 100 100 100 100 100 100 100 100 100 100 100 100 100 100 100 
100 100 100 100 100 100 100 100 100 100 100 100 100 100 
##$AQSEQ= 0
##$AQ_mod= 1
##$AUNM= <au_zg>
##$AUTOPOS= <>
##$BF1= 200.13
##$BF2= 200.13
##$BF3= 200.13
##$BF4= 200.13
##$BF5= 200.13
##$BF6= 200.13
##$BF7= 200.13
##$BF8= 200.13
##$BYTORDA= 1
##$CFDGTYP= 0
##$CFRGTYP= 5
##$CHEMSTR= <none>
##$CNST= (0..31)
1 1 145 1 1 1 1 1 1 1 1 1 1 1 1 1 1 1 1 1 1 1 1 1 1 1 1 1 1 1 1 1 
##$CPDPRG= <>
##$CPDPRG1= <>
##$CPDPRG2= <>
##$CPDPRG3= <>
##$CPDPRG4= <mlev>
##$CPDPRG5= <mlev>
##$CPDPRG6= <mlev>
##$CPDPRG7= <mlev>
##$CPDPRG8= <mlev>
##$CPDPRGB= <>
##$CPDPRGT= <>
##$D= (0..31)
0 1.2 0 0 0 0 0 0 0 0.06 0 0.03 0 0 0 0 0.0002 0 0 0 0 0 0 0 0 0 0 0 0 
0 0 0 
##$DATE= 1639377664
##$DBL= (0..7)
120 120 120 120 120 120 120 120 
##$DBP= (0..7)
150 150 150 150 150 150 150 150 
##$DBP07= 0
##$DBPNAM0= <>
##$DBPNAM1= <>
##$DBPNAM2= <>
##$DBPNAM3= <>
##$DBPNAM4= <>
$$ [...]
##$SUBNAM2= <"">
##$SUBNAM3= <"">
##$SUBNAM4= <"">
##$SUBNAM5= <"">
##$SUBNAM6= <"">
##$SUBNAM7= <"">
##$SUBNAM8= <"">
##$SUBNAM9= <"">
##$SW= 18.0517287032376
##$SWIBOX= (0..15)
0 0 2 0 0 0 0 0 0 0 0 0 0 0 0 0 
##$SW_h= 3612.71676300578
##$TD= 16384
##$TD0= 1
##$TE= 0
##$TE2= 300
##$TE3= 300
##$TEG= 300
##$TL= (0..7)
0 120 120 120 120 120 120 120 
##$TP= (0..7)
150 150 150 150 150 150 150 150 
##$TP07= 0
##$TPNAME0= <>
##$TPNAME1= <>
##$TPNAME2= <>
##$TPNAME3= <>
##$TPNAME4= <>
##$TPNAME5= <>
##$TPNAME6= <>
##$TPNAME7= <>
##$TPOAL= (0..7)
0.5 0.5 0.5 0.5 0.5 0.5 0.5 0.5 
##$TPOFFS= (0..7)
0 0 0 0 0 0 0 0 
##$TUNHIN= 0
##$TUNHOUT= 0
##$TUNXOUT= 0
##$USERA1= <user>
##$USERA2= <user>
##$USERA3= <user>
##$USERA4= <user>
##$USERA5= <user>
##$V9= 5
##$VALIST= <valist>
##$VCLIST= <CCCCCCCCCCCCCCC>
##$VD= 0
##$VDLIST= <DDDDDDDDDDDDDDD>
##$VPLIST= <PPPPPPPPPPPPPPP>
##$VTLIST= <TTTTTTTTTTTTTTT>
##$WBST= 1024
##$WBSW= 4
##$XGAIN= (0..3)
0 0 0 0 
##$XL= 0
##$YL= 0
##$YMAX_a= 143087
##$YMIN_a= -228156
##$ZGOPTNS= <>
##$ZL1= 120
##$ZL2= 120
##$ZL3= 120
##$ZL4= 120
##$ABSF1= 15.71934
##$ABSF2= -2.332509
##$ABSG= 5
##$ABSL= 3
##$ALPHA= 0
##$AQORDER= 0
##$ASSFAC= 0
##$ASSFACI= 0
##$ASSFACX= 0
##$ASSWID= 0
##$AUNMP= <proc_1d>
##$AZFE= 0.1
##$AZFW= 0.1
##$BCFW= 0
##$BC_mod= 2
##$BYTORDP= 0
##$COROFFS= 0
##$CY= -3
##$DATMOD= 1
##$DC= 0
##$DFILT= <>
##$DTYPP= 0
##$F1P= 0
##$F2P= 0
##$FCOR= 1
##$FTSIZE= 16384
##$FT_mod= 6
##$GAMMA= 0
##$GB= 0
##$INTBC= 1
##$INTSCL= 0
##$ISEN= 128
##$LB= 0.24
##$LEV0= 0
##$LPBIN= 0
##$MAXI= 10000
##$MC2= 0
##$MEAN= 0
##$ME_mod= 0
##$MI= 1.114404
##$NCOEF= 0
##$NC_proc= -7
##$NLEV= 6
##$NOISF1= 3.799351
##$NOISF2= 2.8
##$NSP= 0
##$NTH_PI= 0
##$NZP= 0
##$OFFSET= 15.71824
##$PC= 1
##$PHC0= -15871.08
##$PHC1= 12.0008
##$PH_mod= 1
##$PKNL= yes
##$PPARMOD= 0
##$PSCAL= 0
##$PSIGN= 0
##$REVERSE= no
##$SF= 200.130006666075
##$SI= 16384
##$SIGF1= 3
##$SIGF2= 2
##$SINO= 5.538805
##$SIOLD= 16384
##$SREGLST= <1H.CDCl3>
##$SSB= 0
##$STSI= 16384
##$STSR= 0
##$SW_p= 3612.71676300578
##$SYMM= 0
##$S_DEV= 0
##$TDeff= 16384
##$TDoff= 0
##$TI= <>
##$TILT= no
##$TM1= 0
##$TM2= 0
##$TOPLEV= 0
##$USERP1= <user>
##$USERP2= <user>
##$USERP3= <user>
##$USERP4= <user>
##$USERP5= <user>
##$WDW= 1
##$XDIM= 16384
##$YMAX_p= 289354940
##$YMIN_p= -543173
$$ End of Bruker specific parameters
$$ ---------------------------------
##NTUPLES= NMR SPECTRUM
##VAR_NAME=  FREQUENCY,     SPECTRUM/REAL,   SPECTRUM/IMAG
##SYMBOL=    X,             R,               I
##VAR_TYPE=  INDEPENDENT,   DEPENDENT,       DEPENDENT
##VAR_FORM=  AFFN,          ASDF,            ASDF
##VAR_DIM=   16384,         16384,           16384
##UNITS=     HZ,            ARBITRARY UNITS, ARBITRARY UNITS
##FACTOR=    0.220516191357247, 1,           1
##FIRST=     3145.69143279906, 0,            0
##LAST=      -467.025330206719, 0,           0
##MIN=       -467.025330206719, -543173,     0
##MAX=       3145.69143279906, 289354940,    0
$$ Real data points
##PAGE= N=1
##DATA TABLE= (X++(R..R)), XYDATA
$$ [...]
7113A7528780J978950K304711K861662L473972L951017M511911N263016O160362
7105D8034381P069997P930224P652851O086725J765028k873708o825941r226546
7097E9613011q748840p249389n190057l431908k265775k141651k416102k171954
7089B5997335k386059k478675k331195j786697j408833j366525j004003p90966
7081A2444382p00968n10728p56258o03980k76528n92632l89876n0989k65909k82856
7071H013658k38148k49615j96866l98327l20509k36146o8210k38794r4609j56807
7061E815627r7352r8578k07115M90m3838K07223J81184J51587O4045p9101J31352
7050F025524j51757j70130k69769l54322p3192p7415k4935L5153J99866O5811
$$ y = [17528780, 19507730, 21812441, 24674103, 28148075, 32099092, 36611003, 41874019, 48034381, 55104378, 63034602, 70687453, 76774178, 78539206, 75665498, 68839557, 59613011, 50864171, 43614782, 38424725, 34992817, 32727042, 30585391, 28169289, 25997335, 23611276, 21132601, 18801406, 17014709, 15605876, 14239351, 13235348, 12444382, 11743414, 11232686, 10476428, 9872448, 9595920, 9003288, 8613412, 8562423, 8296514, 8013658, 7775510, 7525895, 7329029, 6930702, 6610193, 6374047, 6305837, 6067043, 5972434, 5815627, 5718275, 5619697, 5412582, 5413072, 5369234, 5576457, 5757641, 5909228, 5973273, 5894172, 6025524, 5873767, 5703637, 5433868, 5079546, 5006354, 4928939, 4904004, 4939157, 5139023, 5204834]
7040E204834K3213j14866r7941k01890r6990m81430m23211k31642l58073j62463
7030C059541k24887j17117m20455j85451J38789K9515j51573j09533L2002p6237
7020A974594k63166p9789l5480j539J1295j28860O2824O2817k5408q8423j03049
7009A385816p483q6527L7308j6158q9860o4722l0511l7814q0513K5013J41002
6998A175551r34k5109j07548j6666N0863j76630M9262r3316J72503o468j9495
6987A002013j82911j63217O8163J50835q3519j56184N9060R2310L9254j64598
6977F61206j41430M7091j61263L677J90739R203j08027q51K9865k1362J38549
6966F47397j5092m8309j59801N8326m978J37667R1158m0412j22628k64677l6181
$$ y = [5204834, 5228047, 5113181, 5015240, 4813350, 4716360, 4234930, 3811719, 3580077, 3222004, 3059541, 2834654, 2717537, 2297082, 2111631, 2250420, 2279935, 2128362, 2018829, 2050831, 1974594, 1711428, 1631639, 1596159, 1594620, 1605915, 1477055, 1539879, 1602696, 1577288, 1488865, 1385816, 1378333, 1291806, 1329114, 1312956, 1223096, 1158374, 1127863, 1090049, 1009536, 1034549, 1175551, 1174617, 1149508, 1041960, 1025294, 1076157, 899527, 948789, 855473, 1027976, 1021508, 1002013, 819102, 655885, 724048, 874883, 791364, 635180, 694240, 786550, 825804, 661206, 519776, 566867, 405604, 409281, 600020, 609223, 501196, 500345, 530210, 508848, 647397, 632305, 583996, 424195, 482521, 477543, 615210, 706368, 665956, 543328, 278651, 242470]
6955B42470J67537L17126P8681j52369k58356J9670J20963j06899m5694Q6752
6945D69881L8061m1727j30625r9627L97743R2330k75950j74204n1437M8874J78363
6934D51682K14902k22528j93069J25958j288J77492P7146j87403p8699J92326
6924E56519j50227j987q5602j11794K7780M4722p0n3154L7468q07M2957N2376
6912C58181J7524k4441j7708n2701M0036j24J85811k22189k87303Q8717P5844
6901A61647j17467M7841J25688J62988k55107k70942P2272L19425J26062k17019
6891A55388l07433J37441K19799j02945N5189r5230J04544q3867J66676J33149
6881C82711J08873r1933p607L0393j72842R6633n2154j71077K8196j78981P5782
$$ y = [242470, 410007, 727133, 805814, 653445, 395089, 414759, 535722, 428823, 383129, 469881, 507942, 466215, 335590, 235963, 633706, 726036, 450086, 275882, 224445, 273319, 451682, 666584, 444056, 250987, 376945, 375657, 553149, 630295, 442892, 364193, 556519, 406292, 404305, 318703, 206909, 234689, 279411, 279341, 226187, 263655, 262848, 305805, 358181, 375705, 351264, 333556, 280855, 320891, 320767, 506578, 284389, -2914, 85803, 161647, 44180, 92021, 217709, 380697, 125590, -145352, -73080, 246345, 372407, 155388, -152045, -14604, 205195, 102250, 157439, 62209, 166753, 82886, 249562, 382711, 491584, 399651, 392044, 422437, 249595, 346228, 294074, 122997, 151193, -27788, 47994]
6870D7994L1218K0745J7341J72200q9052j54733K8913O8989J4451j74395J80159
6859A63830k2352j11694l8708J47849j8719K725n1924M3300O1970Q986R0029j50475
6847A24817j90355K34205R6881p222j23773P0660K11j32794R1545L9684k6664
6836A77195j55513m3155Q8198K8300Q4551r63j51218K9093K6220J75778k5547
6825B32939j07607J27350k07319Q3708N1938k2602j92322j00079K11142J44228
6815B21376k3211Q4669P0722m968k3155j39112R6579l7542R0781J9283r3158k17581
6803D4683O5002P9255N5771J75492n778m1076j3243q0774j09509J22573O908r5574
6791B03730O983N6830j8095k8214j32197j32938K3468r4274J5177J02168k5607
$$ y = [47994, 79212, 99957, 117298, 289498, 200446, 45713, 74626, 143615, 158066, -16329, 163830, 141478, 29784, -8924, 138925, 120206, 122931, 71007, 114307, 176277, 185263, 275292, 124817, -65538, 168667, 265548, 258326, 134553, 205213, 205424, 72630, 164175, 203859, 177195, 21682, -21473, 66725, 95025, 179576, 178613, 27395, 56488, 82708, 258486, 232939, 125332, 252682, 45363, 129071, 181009, 158407, -33915, -133994, 77148, 221376, 198165, 282834, 353556, 348588, 325433, 186321, 282900, 245358, 336139, 355422, 262264, 44683, 109685, 188940, 244711, 420203, 414425, 373349, 360106, 279332, 169823, 292396, 299304, 203730, 210713, 267543, 249448, 221234, 89037, -43901, -20433, -114707, -99530, 2638, -22969]
6780b2969P9295j15446J51803q8976K9871O2738K6843l8878l0156K9322j0184
6769G3263l1534P3849l649J40993J42211k45617j03011j29774J04693O8734r6146
6758e988j9611P1661j34757L4919M3111j2607Q711Q4746J45412J0606k28944M2799
6746D0058R5799q0214j3056M8383m9006n1513r2341R7898O0905j20545J57366
6735I3734j5194J3426P2945p5092J12654J07707M1179Q2448m4064j39249j72105
6724G8389j33576P404K9390J12347K02275J45902j24014j86906K11198N1856L8877
6713D33142K41402n4037j82649j65440K72543N4785j3452K6846K29565j09472
6703G33233P3902L44302N5035l872m2162J76663K9487j29744j42699M5678j43818
$$ y = [-22969, 56326, -59120, 92683, 3707, 33578, 96316, 123159, 84281, 54125, 83447, 73263, 41729, 115578, 111929, 252922, 395133, 149516, 46505, -83269, 21424, 90158, -5988, -25599, 46062, -88695, -53776, -10665, -23272, -14561, 70185, 215597, 226203, -2741, 40058, 135857, 55643, 42587, 90970, 41964, -9549, -101890, -3992, 56913, -63632, 93734, 78540, 91966, 164911, 89819, 202473, 310180, 351359, 433807, 389743, 250494, 78389, -55187, -47783, -18393, 93954, 296229, 442131, 318117, 131211, 342409, 394265, 433142, 674544, 620507, 437858, 272418, 544961, 599746, 586294, 613140, 842705, 733233, 807135, 1151437, 1206472, 1202600, 1160438, 1337101, 1366588, 1236844, 1094145, 1139823, 996005]
6692I96005J62486N6735k78604q5911q9880j08995j11559j39958O3766j08349
6682C55736r1922o9334J32836q7536j71021M5123m1156M6937K136J47598m0853
6671B28544p8128Q8248j87591Q8402m5596o1445K21437q325Q2943r9070n4088
6660A75331j64583m7792Q4014n056m2527K1911r3025O982j43345K01414j0225
6649a6901n5616J59835M3814j49015m9306J92733N3617p9239J14597o4021k37699
6638h7201P7477J32250k5072O073K0236j23105L8307P5920Q191q7223Q8530l7608
6626H6775r3939J62176k1184j77143K60145N1204L0938k82820j78806J62900J15229
6615A15475j62940J13308Q8331j00994p0758K7511j09442K49423K9526N4141O7356
$$ y = [996005, 1158491, 1215226, 936622, 850711, 760831, 651836, 540277, 400319, 464085, 355736, 263814, 194480, 327316, 239780, 68759, 113882, 72726, 119663, 121799, 269397, 228544, 150416, 238664, 51073, 139475, 93879, 32434, 253871, 245546, 328489, 229419, 175331, 10748, -37044, 46970, 41914, -613, 21298, -71727, -64745, -208090, -6676, -16901, -72517, 87318, 131132, -17883, -67189, 125544, 179161, 99922, 214519, 150498, -87201, -9724, 122526, 97454, 103527, 123763, 658, 38965, 114885, 123076, 35853, 124383, 86775, -7164, 155012, 133828, -43315, 216830, 268034, 298972, 16152, -162654, 246, 115475, -47465, 65843, 154174, 53180, -17578, 9933, -99509, 149914, 179440, 233581, 300937]
6604C00937K7382p7296l17437m7127K12896k17030J43730K06742j869p5553p8645
6593G6730J37357j3395J06465k67357l6702J54307J14451o7294J68836k08419
6583A64979q871J0927p1533M964J63028o7875j56456R745J01815j46464j92930
6572a88671J20544R3328p3234l0365K13120j47721N3385J17793O3625j6077m7878
6561A57849L8332l16883J32917K67402n0890l3456j44847J78086m1540k201j1290
6550A73479M7508Q303r8731j58325j02079J73336n8415P4819L3126j01560m0374
6539d8913n9299n9058K61733Q6242r1673K42294r6589l20867j07310r9203Q4045
6528b08598K2705M1689J54462N4194M7250K04283n0051k32492J28509R214Q4312
$$ y = [300937, 328319, 251023, -66414, -113541, 99355, -117675, 26055, 232797, 230928, 155375, 76730, 214087, 200692, 307157, 39800, 3098, 157405, 271856, 204562, 373398, 164979, 156108, 167035, 95502, 100466, 263494, 195619, 39163, 48908, 150723, 4259, -188671, -68127, 25201, -48033, -78398, 134722, -12999, 40386, 158179, 221804, 205727, 157849, 196181, -120702, 12215, 279617, 228727, 195271, 50424, 228510, 186970, 184769, 173479, 220987, 229290, 130559, -27766, -129845, 43491, -14924, 59895, 93021, -8539, -48913, -108212, -167270, 94463, 180705, 89032, 331326, 234737, -86130, -193440, -292643, -208598, -185893, -144204, 10258, 64452, 111702, 315985, 265934, 33442, 161951, 171165, 255477]
6517B55477N090k27895L8638q1561N0726R0255r2313n533M8668J16453j37450
6506F0555L769K21162q1893J7077r9875j51030k695J48740O1454J41320j07393
6495B11191n2926j52306l3849L18326j46102j68101J41712J08250j01159Q2352
6485B07388Q3915l676k86086J5838J45466k21048m067K03932J19588p1743P9342
6474B68849J16931j25264k29950m3880J41981j94116N4365J1507J57644J2430
6464A70497o4307j45265l3135J04405j8769O4250m2769q3220N4996Q7136P8893
6453A72712J45532j22834J2934j03761N2093J5623r9070l6169J2030Q4831K031
6442A35952j40117J13670J08989m4357j44327L4888N4792N0289o2885K2718p4026
$$ y = [255477, 260567, 32672, 71310, -10251, 40475, 130730, 38417, 32884, 81552, 198005, 60555, 64324, 285486, 203593, 220670, 120795, -30235, -32930, 115810, 177264, 318584, 211191, 158265, 5959, -27890, 290436, 144334, -23767, 117945, 226195, 125036, 207388, 291303, 287627, 1541, 17379, 162845, -58203, -62270, 141662, 261250, 189507, 268849, 385780, 260516, 30566, -13314, 128667, -65449, -11084, 423, 158067, 170497, 106190, -39075, -72210, 32195, 13426, 77676, 34907, -48313, 6683, 93819, 172712, 318244, 195410, 208344, 104583, 156676, 172299, 73229, 37060, 49090, 133921, 135952, -4165, 109505, 218494, 174137, 29810, 64698, 119490, 169779, 106894, 129612, 55586]
6431E5586j3303J51801p0059l09059K32097K16576k1117K457k57858k0343L18048
6420B84826o6056L134J07345n8807q7912k6840R0220o121j44896q3091j39327
6409a27525N3196J88008j11416j5007p2536k827r3811J72924K0395J26442R5481
6398B33324j21638p8737j1398R0984L2527m8787m4399J90222J34246k45101J41866
6387B73109j58065O5982p8677J4364j10648O5885J57668J6694r3987K6836J12493
6376B91654p8713K25893R1943j69594j88643o3834J1360Q5690L1279j40437j98669
6365a02071K03605K25523P4478q3235Q7845j27493m5927J24314j07316O0424J22221
6354D32368j04029p2512j15470k73469K30617L09899n41j22040J55746j67980
$$ y = [55586, 42283, 194084, 124025, -185034, 47063, 263639, 242522, 244979, -12879, -33222, 284826, 218770, 221904, 329249, 270442, 182530, 155690, 245910, 239789, 94893, 11802, -127525, -74329, 113679, 2263, -12744, -85280, -88107, -181918, -8994, 11401, 137843, 233324, 111686, 32949, 21551, 112535, 145062, 96275, 51876, 242098, 376344, 131243, 273109, 115044, 181026, 102349, 116713, 6065, 71950, 229618, 246312, 152325, 179161, 291654, 212941, 438834, 530777, 361183, 172540, 108706, 120066, 205756, 237035, 96598, -102071, 101534, 327057, 401535, 318300, 406145, 278652, 232725, 357039, 249723, 310147, 432368, 328339, 255827, 140357, -133112, 97505, 407404, 406863, 284823, 440569, 272589]
6344B72589L2266N3562m5361J40851j25633J00653O57p6072N7199L3076J6493
6333D60280n1426K30346Q812k00350J00224M7006r2369j15965o1392L20828j09364
6322E36630n7900L34669p4732l2680m0789j56396p9870N3433K9370P5462l23633
6311B63564Q6276K24792k06820k11272L5199l1232J89270m6042j01350J40718
6301C43103K59867j55155k8246J4486k2049P8497L320J95811o0413k54582l0308
6290C44331k18098J35340K24003k8767m3519J70960j1488j97185K3044L0830j17248
6279C12203P0862j57686J82657n7537O3142K15960j21598j07975n405R2520p3629
6268D13514K5154M4180J07614j81766j57794J27004M7900O877j17903o6732J13121
$$ y = [272589, 304855, 358417, 313056, 453907, 328274, 428927, 429584, 353512, 410711, 443787, 460280, 408854, 639200, 648012, 447662, 547886, 594892, 502523, 386558, 325166, 645994, 536630, 478730, 813399, 738667, 705987, 665198, 508802, 428932, 482365, 511735, 587197, 263564, 349840, 574632, 367812, 156540, 191739, 160507, 349777, 303735, 202385, 343103, 602970, 447815, 419569, 434055, 412006, 490503, 493823, 689634, 629221, 374639, 344331, 126233, 261573, 485576, 456809, 413290, 584250, 572762, 375577, 398621, 429451, 312203, 383065, 225379, 408036, 350499, 413641, 629601, 508003, 400028, 394623, 487143, 413514, 438668, 482848, 590462, 408696, 250902, 377906, 425806, 432683, 314780, 248048, 361169]
6257C61169R9975j30346j37959J70236n3344M3439k4348p6737o7214L33397n6305
6246D61963k9210o7308M5266J5978o7571L9196N040p96J07200r5864j3137L34642
6234G35399j53019L7718K77821j65686j71639j01188O7188j34755Q514O9748P2942
6223E43043M7069r7152L1175R9864j84213J37054K04335J31109j30501o6744j37701
6212E77338J94034J98696k65079R956r2484r3967J1463j4791K7673Q2919L1284
6201F67042J40998j21163K05694Q1059j79858q3439P1379r1474j26912J58084
6191G21410L03829j78075O1337Q0138N0679j06497k24765J05627J59427j4598
6181I58512j54811M277Q1146j13129Q7797J61960k37386n5680Q7336J74232K44126
$$ y = [361169, 461144, 330798, 192839, 363075, 309731, 353170, 328822, 252085, 184871, 518268, 461963, 432753, 365445, 410711, 426689, 359118, 398314, 403354, 402558, 509758, 413894, 400757, 735399, 582380, 620098, 897919, 732233, 560594, 459406, 526594, 391839, 400353, 470101, 543043, 590112, 492960, 524135, 623999, 439786, 576840, 781175, 912284, 781783, 715039, 577338, 771372, 970068, 704989, 714945, 622461, 528494, 539957, 525166, 552839, 635758, 667042, 808040, 686877, 892571, 973630, 793772, 710333, 781712, 690238, 563326, 721410, 1025239, 847164, 908501, 988639, 1039318, 932821, 708056, 813683, 973110, 958512, 803701, 807978, 889124, 775995, 863792, 1025752, 788366, 732686, 820022, 994254, 1238380]
6170A238380j21864j29127M843j7978J38863L3139L120j29178j11507N5927K59994
6159A224612n0953r5975K3176M6506R8223n8069k51297J14267N47Q0793J4344
6148A146174r7275L6994J05585J82558k39968j40458J70344n3406o8087O0953
6138A103414K8752K7769L9919J04737Q5964p7339j37832K8960K3674j671Q3777
6127A310124J52377m5226j00602p8705L60697m774j2972N5263q5509J4401J1965
6116A577039K16995M8481j84801q9745r357O804J63319J2580N7655l0730j14410
6105A653830K65595R3983K33697J43250o0755L4426j29444k11797R3800J72744
6095B289329L9109O2645m969j82041J20415J46847j10523J26244J2330J14481
$$ y = [1238380, 1116516, 987389, 992232, 974254, 1113117, 1146256, 1149376, 1020198, 908691, 964618, 1224612, 1173659, 1077684, 1100860, 1147366, 1245589, 1187520, 936223, 1050490, 1051037, 1131830, 1146174, 1048899, 1085893, 1191478, 1374036, 1134068, 993610, 1163954, 1110548, 1042461, 1103414, 1132166, 1159935, 1199854, 1304591, 1390555, 1313216, 1175384, 1204344, 1228018, 1226347, 1310124, 1462501, 1417275, 1316673, 1237968, 1598665, 1593891, 1580919, 1636182, 1550673, 1565074, 1577039, 1794034, 1842515, 1657714, 1567969, 1558612, 1565416, 1728735, 1741315, 1798970, 1768240, 1653830, 1919425, 2013408, 2247105, 2390355, 2329600, 2364026, 2234582, 2022785, 2116585, 2289329, 2328438, 2391083, 2386114, 2204073, 2324488, 2471335, 2360812, 2487056, 2499386, 2613867]
6085B613867K8679P4752J72963J11189J26095O5481J74010r6738o0926K36155
6075C445527J25434O0048J95283J26656P2565Q3292J44518l3652K69546k795k4922
6064D461500K45072L6506J47158J78452K32801n6887j1207N7110K34208M66481
6054E991194J61702j17633R9676K69696N07873K14695J33164K9482N8029L22216
6044G670094J31374M25767J81844K17912K94363K71587M10126M69529M25568M31524
6034A0929688O00970M85661N63648O39260O62751P46130Q66326P87581P39110
6025A7021125J073862R90919R13218J032306J216902J375346J220748J236828
6017B6081254J546233K049117K383054K499153J998841J466958P49260L67854
$$ y = [2613867, 2642546, 2717298, 2890261, 3001450, 3127545, 3193026, 3367036, 3270298, 3209372, 3445527, 3570961, 3631009, 3826292, 3952948, 4025513, 4108805, 4253323, 4219671, 4489217, 4486422, 4461500, 4706572, 4743078, 4890236, 5068688, 5301489, 5244602, 5233395, 5290505, 5524713, 5991194, 6152896, 6035263, 6134939, 6404635, 6912508, 7127203, 7260367, 7289849, 7347878, 7670094, 7801468, 8227235, 8409079, 8626991, 8921354, 9192941, 9603067, 10072596, 10498164, 10929688, 11530658, 12016319, 12579967, 13219227, 13881978, 14628108, 15494434, 16282015, 17021125, 18094987, 19085906, 19999124, 21031430, 22248332, 23623678, 24844426, 26081254, 27627487, 29676604, 32059658, 34558811, 36557652, 38024610, 38773870, 39141724]
6009C9141724J35K25919L50595O47053M18063N00059R46628J261425J231653J367396
5999D6090650J473328J326665J557786J458532J637706J600394J631800J521243
5991E8298104J393594J834474K267643K632529L153631K783693J203879j745812
5983G1821735l452841l656833k872267k129807j312517p92934o61313l96924k12825
5974E6333474k81004m33858q87570j535810j384694j382931j117723q79257q82213
5965D7548414q48473j067583q08457j192228j075053p69697j283502j483269k270589
5956C6749563k471942k315259k106780j557170j239513q35540o79963o18928k91759
5947B4632709k7844J06075L6965p5767P8087j29173q04720q48465m69325l37872
$$ y = [39141724, 39141859, 39367778, 39718373, 40365426, 40783489, 41283548, 42230176, 43491601, 44723254, 46090650, 47563978, 48890643, 50448429, 51906961, 53544667, 55145061, 56776861, 58298104, 59691698, 61526172, 63793815, 66426344, 69579975, 72363668, 73567547, 71821735, 68368894, 64712061, 61839794, 59709987, 58397470, 57604536, 56943223, 56546299, 56333474, 56052470, 55618612, 54731042, 53195232, 51810538, 50427607, 49309884, 48430627, 47548414, 46699941, 45632358, 44823901, 43631673, 42556620, 41786923, 40503421, 39020152, 36749563, 34277621, 31962362, 29855582, 28298412, 27058899, 26223359, 25543396, 24924468, 24632709, 24604865, 24710940, 24747905, 24672138, 24750225, 24621052, 23816332, 22967867, 22498542, 22160670]
5937B2160670k51228n10094n76038l73478l56043m65914j08456J9083j54077r9221
5927A9285204l66784k93658j23208O9188N7032J47648j42291Q4645J09462L58644
5917A9185882K33068k40343J79620K78369K04400q6439K16521J77443q8917K43993
5907B0303597P8544R5845N87569M22471O5418L31286K13075R6958J94082L52474
5897B2741319L92749M56628O11134N83248N74954O10851P61148P12582N22805
5888B7967418M56920M68201P53973J277370J242671J499200J619051J992002J828221
5879C9105027K115495J585323Q87730O50239J78531N11263O39473M29145P48090
5870D6850316J250994J302627J406185J468404J581733J692114J627155J841623
$$ y = [22160670, 21909442, 21399348, 20823310, 20449832, 20093789, 19627875, 19519419, 19538502, 19384425, 19285204, 18918420, 18624762, 18501554, 18570742, 18627774, 18775422, 18633131, 18717776, 18827238, 19185882, 19418950, 19178607, 19358227, 19636596, 19840996, 19754557, 19971078, 20148521, 20059604, 20303597, 20382141, 20477986, 21065555, 21488026, 21553444, 21884730, 22097805, 22194763, 22388845, 22741319, 23134068, 23590696, 24201830, 24785078, 25360032, 25970883, 26732031, 27444613, 27967418, 28424338, 28892539, 29646512, 30923882, 32166553, 33665753, 35284804, 37276806, 39105027, 41220522, 42805845, 43693575, 44343814, 44522345, 45033608, 45673081, 46102226, 46850316, 48101310, 49403937, 50810122, 52278526, 53860259, 55552373, 57179528, 59021151]
5862E9021151J677124J429040J285385J082206J205752J322156J593408K019653
5854G0635875K259895K110372J519732p09314k583957l566982l647090l425984
5846F2592547k618679k055760j536740j250584r93820q68080p67506l85443k24392
5837E1891543m2449k5630L90538O107j28615j21230q37955r42293p95692r71895
5827D8422429q13954r00824j118053j688711j821817j896347j723657j216251
5819C7242815p07766n77609l98735j012736j787869k229399k297398j596332j267846
5810B5367125p18106p15059l99761k82930l81292k67468o14855p52575r43561
5801B0291518r33149q91263m23565l54379l94965k52741k14152O2825l02579k46197
$$ y = [59021151, 60698275, 62127315, 63412700, 64494906, 65700658, 67022814, 68616222, 70635875, 72895770, 75006142, 76525874, 75816560, 73232603, 69665621, 66018531, 62592547, 59973868, 57918108, 56381368, 55130784, 54136964, 53268884, 52501378, 52115935, 51891543, 51849094, 51823464, 52214002, 52220109, 52091494, 51970264, 51132309, 50190016, 49394324, 48422429, 47608475, 46707651, 45589598, 43900887, 42079070, 40182723, 38459066, 37242815, 36535049, 35957440, 35558705, 34545969, 32758100, 30528701, 28231303, 26634971, 25367125, 24649019, 23933960, 23534199, 23251269, 22869977, 22602509, 21987654, 21235079, 20291518, 19358369, 18467106, 18043541, 17689162, 17294197, 17041456, 16827304, 16890129, 16587550, 16341353]
5791A6341353o2482l49330o18204l00514n32929m11831l3923j59446l41741o3530
5781A3467423M3369L9233M8951k49291j88663p2303J62915Q4391J24474j68901
5771A3291598K9075K19752L43994J77911K08830K43220K21304M67272M60897L42211
5761A6006064k5466k57306n11857l65670l07654l70345k77564j72598n04329j47907
5751A3065368k55194j00756l60607k84414j09217k79586k08700j70957l8967j25850
5741A1131120J09792j15754J79993K08584M27302K93217K70406M81805N38454
5732A3524919M02377J86029p9236k99152m41618q36403r82925q09800o21397p61098
5722I281696k77561l76117m41154j53650l79021o2514j28944l12977j06041k00551
$$ y = [16341353, 16278871, 15929541, 15311337, 15010823, 14477894, 14066063, 14032140, 13872694, 13530953, 13467423, 13510792, 13550025, 13598976, 13349685, 13161022, 13088719, 13251634, 13336025, 13460499, 13291598, 13320673, 13540425, 13884419, 14062330, 14271160, 14514380, 14735684, 15202956, 15663853, 16006064, 15980598, 15723292, 15211435, 14845765, 14538111, 14167766, 13890202, 13717604, 13213275, 13065368, 12810174, 12709418, 12348811, 12064397, 11955180, 11675594, 11466894, 11295937, 11256970, 11131120, 11240912, 11125158, 11305151, 11513735, 11941037, 12234254, 12504660, 12986465, 13524919, 13927296, 14113325, 14034089, 13734937, 13293319, 12456916, 11473991, 10664191, 10042794, 9281696, 9004135, 8628018, 8186864, 8033214, 7654193, 7591679, 7462735, 7149758, 7043717, 6843166]
5712F843166J52213L54961l66620j59828J44932n7272K21160K39067J69170J82623
5702G723572Q1041P5964j44089q4130l03163o33642m84823l65940k15526k47042
5692E402222j65109J50246k34235k16340J55297k93148j48359k11157J6512J00431
5682D556360J3120j08094k3831k40151J86713K43444j85964N8546k0772J01494
5672D580865k07375o7958J23119J8275l8451J50290J38655J44623j45903J90757
5662D886897J38966l23J81506J97606Q7741J59902K79216K29967K55636K1185
5652F438299L77328K83110M59990L28877R7743M6067o0142K52730R348k18360
5642H014990m2112k05277K07288J16013m6937L6744K53474L58344K63772L97633
$$ y = [6843166, 6995379, 7350340, 6983720, 6823892, 6968824, 6911552, 7132712, 7371779, 7540949, 7723572, 7804613, 7880577, 7736488, 7652358, 7349195, 6715553, 6230730, 5864790, 5649264, 5402222, 5237113, 5387359, 5153124, 4936784, 5092081, 4798933, 4650574, 4439417, 4455929, 4556360, 4569480, 4461386, 4437555, 4197404, 4384117, 4627561, 4441597, 4500143, 4479371, 4580865, 4373490, 4305532, 4428651, 4446926, 4408475, 4558765, 4697420, 4842043, 4696140, 4886897, 5025863, 5025540, 5207046, 5404652, 5492393, 5652295, 5931511, 6161478, 6417114, 6438299, 6815627, 7098737, 7558727, 7887604, 7985347, 8031414, 7971272, 8224002, 8233350, 8014990, 7972878, 7767601, 7974889, 8090902, 8043965, 8080709, 8334183, 8692527, 8956299, 9353932]
5632I353932K96792K39175K33816L32151L52480N61534L04867O45637O09145K57503
5622A3187032K92426J28852p5720j0561j45825k82137q9825m00608j83708j61704
5612A2258222l2386P775n6372j64798K91976J04373j509l4545j47918k43886m50202
5601A1530730n0980p1907j25659k98893k4829j47711k32103n07778k03869j57580
5591I709421j99095j30105l65180j88439j62942L896J2408j61217l1600O169K16833
5580H710149L480k7252J05391L14293J03562K35732L45696M58528P51263Q44553
5570A1845395R43291J332026J614189J587229P46019q14490j843523k223624j998318
5561A1188194j536187j073264p32515k73359k70887l21180m81232k87313j18907
$$ y = [9353932, 9650724, 9889899, 10123715, 10455866, 10808346, 11369880, 11674747, 12320384, 12929529, 13187032, 13479458, 13608310, 13532590, 13522029, 13376204, 13094067, 13004242, 12603634, 12419926, 12258222, 12225836, 12233611, 12177239, 12012441, 12304417, 12408790, 12407281, 12372736, 12224818, 11980932, 11530730, 11479750, 11407843, 11282184, 10983291, 10958462, 10810751, 10578648, 10070870, 9867001, 9709421, 9510326, 9380221, 9015041, 8826602, 8663660, 8667556, 8679964, 8518747, 8487147, 8493316, 8710149, 8713629, 8686377, 8791768, 9106061, 9209623, 9445355, 9791051, 10249579, 11000842, 11845395, 12788686, 14120712, 15734901, 17322130, 18068149, 17253659, 15410136, 13186512, 11188194, 9652007, 8578743, 7846228, 7572869, 7301982, 6980802, 6499570, 6212257, 6093350]
5552F093350l05327k59822o4061k22676j13545p6521N0543q014O5144P5597j46592
5541E088076K7684J32151p1754K00536Q650l61910p9441l97067k67476j6147j09821
5530D153481j96350k31766j18358J3389M9023j32301l3079o1999L9250J60024
5520C641314J8861k41275j87391j42048k9405o7815o6160p9191p5172K9533j4136
5509B787115k19363R3910N4839j83514J24086K9639K8920m9367m5520N5881O4820
5498B741446R390l0149J30039J25742p3831P6770p1862J8409j31026r6053N0902
5487B749777j12615j70243K22008J02315k67119r7673K7754P0291m6054R8309
5477B576750J76778J50881q7596l00662j54244K28903J86076j23175k24852n4429
$$ y = [6093350, 5788023, 5528201, 5464140, 5241464, 5127919, 5051398, 5101941, 5093927, 5159071, 5234668, 5088076, 5115760, 5247911, 5176157, 5376693, 5385343, 5023433, 4943992, 4546925, 4279449, 4263302, 4153481, 3957131, 3725365, 3607007, 3620396, 3669419, 3537118, 3504039, 3442040, 3481290, 3641314, 3660175, 3418900, 3231509, 3089461, 3060056, 2992241, 2926081, 2846890, 2771718, 2801251, 2787115, 2567752, 2661662, 2716501, 2532987, 2657073, 2686712, 2715632, 2666265, 2620745, 2676626, 2741446, 2750836, 2720687, 2850726, 2976468, 2902637, 2979407, 2907545, 2925954, 2794928, 2698875, 2749777, 2637162, 2466919, 2688927, 2791242, 2524123, 2426450, 2454204, 2524495, 2478441, 2576750, 2753528, 2904409, 2816813, 2516151, 2361907, 2590810, 2776886, 2653711, 2428859, 2374430]
5467B374430J91682R4753o7317L7562l061r220K23690R7382j5859J29763n6698
5456B997107k21992J0468K30750J03171k81423n2148o9710L7298K45221j42083
5446B856659l0581m412N0710K5071O4597o972o0080p215j93660L2001k06724j5204
5434B504190L5275J24389J47676P5840p5682k31982R2142n2627Q4598r0866N726
5423B618679k5010j61435n0264n1373J32388O2803o1993j16210k3961O627j36720
5412B193531J58004m684j10354M8499n6989r921l181j6165N6349J70410K04060
5401B629559k48193l08432J04508p624J01744j25662j21138J96054J14068n9181
5391B275703j6137J86925k30216j35516J18467J07507l25460L318Q6307J0709
$$ y = [2374430, 2566112, 2660865, 2593548, 2631110, 2628049, 2618829, 2842519, 2939901, 2924042, 3053805, 2997107, 2775115, 2785583, 3016333, 3119504, 2838081, 2785933, 2716223, 2753521, 2998742, 2856659, 2826078, 2821666, 2872376, 2897447, 2962044, 2955072, 2894992, 2887777, 2694117, 2726118, 2519394, 2504190, 2539465, 2663854, 2811530, 2887370, 2811688, 2579706, 2671848, 2619221, 2703819, 2612953, 2618679, 2593669, 2432234, 2381970, 2330597, 2462985, 2525788, 2463795, 2347585, 2323624, 2330251, 2193531, 2351535, 2346851, 2236497, 2284996, 2228007, 2218086, 2214905, 2198740, 2255089, 2425499, 2629559, 2381366, 2072934, 2177442, 2169818, 2271562, 2145900, 2024762, 2220816, 2334884, 2275703, 2259566, 2446491, 2216275, 2080759, 2199226, 2306733, 1981273, 1984591, 2070898, 2081607]
5381B081607J61066P2112k31922j06378R8011n9751J99534l6415j16527P6851
5371B138188l2332m6087P1340k0893j38990j5878J25376l1032O2715k06r0857
5360B021344j12275K0178m2532O0490k8244n9515j98791K39645N8006k21471R4908
5349A831743N2380O8158j12359M5090l5668o5868j8403M4568J42923j61987K7160
5338A817737K4039J02217K800k62556J04632p6206k3507J88578m3836p0702J3765
5327A776961M3024J97128J2608k44004M0594Q2484J67071J07887m8420m105L6697
5316B167925p7822J34621J7744j19484r2709P8625L1346J02894k0060j22661K08921
5305B309340J89578L1369J6387P0483j882J25385O4998J8651k7841p2534o3584
$$ y = [2081607, 2242673, 2314785, 2082863, 1976485, 2074496, 2014745, 2214279, 2177864, 2061337, 2138188, 2105856, 2059769, 2131109, 2110216, 1971226, 1955348, 2080724, 2049692, 2112407, 2112201, 2021344, 1909069, 1929247, 1886715, 1947205, 1918961, 1859446, 1660655, 1900300, 1958306, 1736835, 1831743, 1884123, 1952281, 1839922, 1885012, 1849344, 1783476, 1765073, 1809641, 1952564, 1790577, 1817737, 1841776, 1943993, 1946793, 1684237, 1788869, 1712663, 1689156, 1877734, 1833898, 1763196, 1776961, 1819985, 2017113, 2029721, 1785717, 1826311, 1908795, 2075866, 2183753, 2135333, 2131228, 2167925, 2090103, 2224724, 2242468, 2122984, 2030275, 2108900, 2140246, 2243140, 2223080, 2100419, 2309340, 2498918, 2530287, 2546674, 2617157, 2615275, 2740660, 2805658, 2824309, 2796468, 2723934, 2660350]
5294B660350J78579J60179K2381J7448Q2211j88687K12167J72554Q0791J83251
5284C581224K17433L03429K17631L20311K07482K25862K52804L90312O08532M96767
5274F821787M54883L57159l5418j02421j01451l23085j08136J56804k37110r3559
5264F789453J49319J40799L79261L39896M25889M60110N14727P13020O03671M94143
5254A1010288N62557K80036L95124L34898L87733O13608K16515L19888J82742
5245A4303389Q0869N0574l93070n65119p75518p41583m44134l61712l32120j33091
5235A0688485K22387Q9333L85944N04390N89859P96099L79434M26108L10387m07072
5225A3985354n96481p21411q17772m71725k12587J0299j04289j52023j27038k29898
$$ y = [2660350, 2838929, 2999108, 3021489, 3038937, 3121148, 2932461, 3144628, 3317182, 3397973, 3581224, 3798657, 4102086, 4319717, 4640028, 4847510, 5073372, 5326176, 5716488, 6325020, 6821787, 7276670, 7633829, 7598411, 7495990, 7394539, 7071454, 6963318, 7120122, 6883012, 6789453, 6938772, 7079571, 7458832, 7798728, 8224617, 8684727, 9199454, 9912474, 10516145, 11010288, 11572845, 11852881, 12248005, 12582903, 12970636, 13584244, 13800759, 14120647, 14303389, 14384258, 14434832, 14041762, 13476643, 12701125, 11959542, 11515408, 11153696, 10821576, 10688485, 10910872, 11000205, 11386149, 11890539, 12480398, 13276497, 13655931, 14082039, 14392426, 13985354, 13388873, 12667462, 11849690, 11377965, 11165378, 11175677, 11071388, 10919365, 10792327, 10562429]
5215A0562429l82815n19631n71580k22672j60391r7482q5574L9487J58752L6118
5205H756641J08663J70995O6143J9389K3764j67453l81050n70236m73858l37583
5195G215415m79309m18207m28710r4530r6714j27959l52502j40310j09153q525
5185D959496R2643k53408j8151l4349J00708J46242o7806j95144j90325n6462
5175D483444K0359q9350j63083j83640o2866j39266J19373j47979k74403J98382
5165C760971M0481J07888q4290j05250m9359k9866p3780L9264K19266q3579j94150
5154C547596N6043K18924j66897q5382k2445j90190l9020j36032j25829j32781
5144B923987J94018Q7301p4868j28905j90140K10508K3242R3338j06915R2679
$$ y = [10562429, 10179614, 9659983, 9088403, 8865731, 8705340, 8607858, 8522284, 8561771, 8720523, 8756641, 8865304, 9036299, 9102442, 9121831, 9145595, 8978142, 8597092, 8026856, 7552998, 7215415, 6736106, 6317899, 5889189, 5794659, 5697945, 5569986, 5217484, 5077174, 4968021, 4959496, 5052139, 4798731, 4780580, 4746231, 4846939, 4993181, 4925375, 4730231, 4539906, 4483444, 4503803, 4414453, 4251370, 4067730, 4004864, 3865598, 3984971, 3836992, 3562589, 3760971, 3801452, 3909340, 3825050, 3719800, 3670441, 3640575, 3566795, 3606059, 3825325, 3741746, 3547596, 3603639, 3822563, 3655666, 3570284, 3547839, 3357649, 3318629, 3182597, 3056768, 2923987, 3118005, 3205306, 3130438, 3001533, 2811393, 3021901, 3045143, 3138481, 3031566, 3124245]
5134C124245L9276r7821J23240N4507k3595m1697j32698J23836P0796J84924K99501
5123C724514Q4468j34201R7131k66633k01823j31989j10626j03383K3674j60424
5113B820708j07517q9332j55224j16196j72254n1443m4286J826p7948j1271R4454
5102B091517R1677R3580J39582m8508j24080N6995Q8298L2123j41060j23447j5105
5091B141572J22264Q2690N0466Q5719K5309m993O2578K8166j29402p4555j830
5080B387984r6988J3027N0286K2964J45518R2747o351j70229J42933K70987K06062
5069C058940J15588K13435K94403L23694N16721N95419L20290N99094O01075O86158
5059G324817P41459O70616m294m70580o97824n26685k75125o1483k45150j15523
$$ y = [3124245, 3163521, 3065700, 3188940, 3243447, 3219852, 3178155, 3045457, 3169293, 3240089, 3425013, 3724514, 3808982, 3674781, 3771912, 3505279, 3303456, 3171467, 3060841, 2957458, 2981132, 2820708, 2713191, 2623859, 2468635, 2352439, 2180185, 2128742, 2084456, 2086282, 2008334, 1997063, 2091517, 2183194, 2276774, 2416356, 2367848, 2243768, 2300763, 2389061, 2421184, 2280124, 2156677, 2141572, 2263836, 2346526, 2396992, 2482711, 2508020, 2503027, 2565605, 2593771, 2464369, 2389814, 2387984, 2290996, 2304023, 2354309, 2377273, 2522791, 2615538, 2609187, 2438958, 2581891, 2852878, 3058940, 3174528, 3387963, 3682366, 4006060, 4522781, 5118200, 5438490, 6037584, 6638659, 7324817, 8066276, 8736892, 8732598, 8262018, 7564194, 7037509, 6762384, 6700901, 6455751, 6340228]
5049F340228m72655o56883m78290m14216k99963k42157j28061j39243j60307k10758
5039C137695j05820n5037j44808M2783q4375q8554J42175j36756k22929j09581
5029B374793o6654L8671J76920l3796m12415k5868N8724m2713R4841Q3022R9882
5018B345407j14051m0947k03023j61760N7989M128m8760J5769k36910J74273l1641
5007A760474l48850L9846J82262R9287j04470j74864J93337j64259o0598K87952
4997A710117P2728N7663r7747P8085j8814q8245R6017J7104j25450o0372n698
4986A635388p0086r1183p2561J08717J80743j85846J02481Q2195k23617j00882
4976A365349L854K11872J3769j15832J62500J34757n7264M6508N0369N3967R4903
$$ y = [6340228, 5867573, 5210690, 4732400, 4318184, 4018221, 3776064, 3648003, 3508760, 3348453, 3137695, 3031875, 2976838, 2832030, 2874813, 2790438, 2701884, 2844059, 2707303, 2484374, 2374793, 2308139, 2346810, 2523730, 2489934, 2077519, 2051651, 2110375, 2067662, 2162503, 2245525, 2345407, 2231356, 2190409, 1987386, 1825626, 1883615, 1887743, 1838983, 1854752, 1617842, 1792115, 1760474, 1411624, 1451470, 1633732, 1733019, 1628549, 1453685, 1647022, 1482763, 1422165, 1710117, 1782845, 1840508, 1742761, 1820846, 1802032, 1713787, 1809804, 1826908, 1701458, 1641086, 1635388, 1565302, 1474119, 1401558, 1510275, 1691018, 1505172, 1607653, 1689848, 1466231, 1365349, 1369203, 1581075, 1594844, 1479012, 1641512, 1776269, 1719005, 1765513, 1815882, 1869849, 1964752]
4965A964752m5898J19411P7690N6871J01001O2462N6422m0770l8535N6845m0259
4954B329992J26691J12607L7062k34921o6m0225J67974J10440K4104j9092K03693
4943B818259M5100j32873l7126o2445q4627J85821J68180j60806K34048L4764
4933C008295L0167k21841P7052q9997O6276J43158p4891K73998m2232J1604q5283
4922C096306j63760J77429N7566N4953K24184K59635j33762k28036K72341K71180
4912C888036N6446J23699J12755J61202M7561M0035k3440N8468J02026J26298
4902D693086k3147J97462K32982J61791j6569J43169K56483K80995p822J61656
4892F080086J67433Q2931J48372J54102N7160L06646J98915L87570L00677K49276
$$ y = [1964752, 1918854, 2038265, 2115955, 2172826, 2273827, 2336289, 2392711, 2351941, 2313406, 2370251, 2329992, 2456683, 2569290, 2606352, 2371431, 2371365, 2331140, 2499114, 2609554, 2633658, 2614566, 2818259, 2863359, 2730486, 2693360, 2630915, 2546288, 2732109, 2900289, 2739483, 2973531, 3008295, 3038462, 2816621, 2893673, 2803676, 2869952, 3013110, 2938219, 3212217, 3169985, 3181589, 3096306, 2932546, 3109975, 3167541, 3222494, 3446678, 3706313, 3572551, 3344515, 3616856, 3888036, 3944482, 4068181, 4180936, 4342138, 4389699, 4429734, 4406294, 4464762, 4566788, 4693086, 4669939, 4867401, 5100383, 5262174, 5245605, 5388774, 5645257, 5926252, 5918430, 6080086, 6247519, 6330450, 6478822, 6632924, 6690084, 6996730, 7195645, 7583215, 7883892, 8133168]
4882H133168J25848M36686P8219K39582Q1578J42175L48067K36297K43145M43759
4872A0508524L35478K55100K50673L84139K35841L72724N77286N20144O70145
4863A4110054L59306N04425O67143O71945Q24046J084075R40170J058225J428162
4854B1647551J830863J827989J947406K621343K822698L407459L804310M574773
4846D4484392L938971K100322o57510l706914m008647l035767j771900q07465
4838C6535482m2573K85382Q37156J331165J541709J842069K126542K577353L065408
4829E0099693L432536M375845N564231O166984O690453O744880L300791P92263
4821H7167676J249194L165769O476147R184739J1435858J3286726J4639076J6787470
$$ y = [8133168, 8259016, 8695702, 8773921, 9013503, 9095081, 9237256, 9585323, 9821620, 10064765, 10508524, 10844002, 11099102, 11349775, 11733914, 11969755, 12342479, 12919765, 13439909, 14110054, 14469360, 14973785, 15640928, 16312873, 17136919, 18220994, 19161164, 20219389, 21647551, 23478414, 25306403, 27253809, 29875152, 32697850, 36105309, 39909619, 44484392, 48423363, 50523685, 49866175, 46159261, 42150614, 39114847, 37342947, 36535482, 36492909, 36778291, 37615447, 38946612, 40488321, 42330390, 44456932, 47034285, 50099693, 53532229, 57908074, 63472305, 69639289, 76329742, 83074622, 86375413, 87167676, 88416870, 91582639, 98058786, 107243525, 118679383, 131966109, 146605185, 163392655]
4813A63392655J8359862J9550464K0345627K3747061K4249501J7372892j9700370
4806B67317692m3063675m1691069l5371314k3913431j6990830j1803772q941748
4799H5541853o823493n552139m250820l080825k004209j249743K04431R02214
4791F3687269J935663K332998K507044n5134l925527n868761o236888n734354
4783D8642310m281993l604353k683360j916975j865514k007047j725845j940048
4775B8617175j702757j391447q13435j125353r41296p94058p46714q76493m83953
4766A9741669n99811n26061m69658m32143m92281l22377n70965l96705k47924
4757A5683744l0906n27737k37276k16434P004o7627m1500l8013r3829l31612j62741
$$ y = [163392655, 181752517, 201302981, 221648608, 245395669, 269645170, 287018062, 267317692, 224254017, 182562948, 147191634, 123278203, 106287373, 94483601, 85541853, 78718360, 73166221, 68915401, 65834576, 63830367, 62580624, 62785055, 63687269, 65622932, 67955930, 70462974, 70407840, 66482313, 60613552, 54376664, 48642310, 44360317, 40755964, 38072604, 36155629, 34290115, 32283068, 30557223, 28617175, 26914418, 25522971, 24709536, 23584183, 22642887, 21848829, 21102115, 20225622, 19741669, 19141858, 18615797, 18146139, 17713996, 17221715, 16899338, 16328373, 15931668, 15683744, 15652838, 15125101, 14887825, 14671391, 14678395, 14610768, 14569268, 14531255, 14437426, 14105814, 13943073]
4746A3943073k08804j02361k2736k6616K76497N46076M34542K68453J92993k58272
4736A5042845p38945m71018p07248o01241m47709m4744O4551K08993j7407M7221
4726A2335298k44571o46658n12890o14865n60178n25063l91123m29021l57811
4717H053118k91478k86663k9485n5395j52164J6244j70378k42396j27723R7297
4707F810977l40446K5982q5686j19625p4984j24918j00230j05453l30050j86794
4697E368773L4531j45550l12204q6630n1037K375m6007p7883o9211j38436K5082
4686D503803J81947j91404k11770M5667P3765j50384M7643J18563J34823q4290
4676D468363o4422J9759m2898N1582j3024N1404J6979j25320J42606J54316J9721
$$ y = [13943073, 13734269, 13631908, 13609172, 13582556, 13859053, 14405129, 14839671, 15108124, 15301117, 15042845, 14303900, 13832882, 13125634, 12524393, 12076684, 12031940, 12096491, 12305484, 12288077, 12335298, 12090727, 11444069, 10931179, 10316314, 9756136, 9231073, 8839950, 8410929, 8053118, 7761640, 7474977, 7445492, 7390097, 7237933, 7254177, 7083799, 6841403, 6713680, 6810977, 6470531, 6496513, 6410827, 6291202, 6216218, 6091300, 5991070, 5885617, 5555567, 5368773, 5403304, 5257754, 4945550, 4858920, 4807883, 4810258, 4764251, 4686368, 4617157, 4478721, 4503803, 4685750, 4494346, 4282576, 4328243, 4402008, 4251624, 4299267, 4417830, 4552653, 4468363, 4403941, 4423700, 4380802, 4432384, 4419360, 4470764, 4487743, 4362423, 4505029, 4659345, 4679066]
4665D679066j99698J99573J55478j39505N5676j85341n9682m1293m42172N3458
4655D075560k9382j87627K607N2924J65050P901l6087O2220K8928k429M5235J08956
4643D293856J25606J4874o4651J61421J60202k91756k65228M2821j27113k02496
4633C847536j01049M4973J05812o8099k77142k8436o9511j19778j42418j56596
4623C035292j36879k1310m8934j84802K29031L7055q8004j09513J3018N3111k01473
4612B576592o5399K8601L2777O2362J91526L3223k7917J10219K16487K5692L8598
4601C222761j93133J31355J34926N5245m7022J11830O3128l7405K5523N2472R7337
4590C617017L54079J46725J63267J94186k73145K26624J4922k48820p5836l04559
$$ y = [4679066, 4479368, 4678941, 4834419, 4694914, 4750590, 4565249, 4505567, 4464274, 4022102, 4075560, 4046178, 3858551, 3861158, 3914082, 4079132, 4087033, 4050946, 4113166, 4142094, 4139665, 4184900, 4293856, 4419462, 4434336, 4369685, 4531106, 4691308, 4399552, 4134324, 4177145, 4050032, 3847536, 3746487, 3791460, 3897272, 3829173, 3552031, 3523595, 3454084, 3334306, 3191888, 3035292, 2898413, 2877103, 2828169, 2643367, 2872398, 2909453, 2821449, 2711936, 2724954, 2778065, 2576592, 2511193, 2539794, 2572571, 2634933, 2826459, 2859682, 2831765, 2941984, 3158471, 3184163, 3222761, 3029628, 3160983, 3295909, 3351154, 3304132, 3415962, 3479090, 3441685, 3467208, 3519680, 3617017, 3971096, 4117821, 4281088, 4475274, 4202129, 4428753, 4443675, 4194855, 4119019, 3814460]
4580C814460l13149O8314q3763k15537R1771k80021r2843r0729p5646P4362p1959
4569B825260j22563j99150p8675k7954J25395L0652J22940m4763k06358N93q0847
4558B344530P5841R5784j8208J37076j40783M6164n7105J84508o2413k119j86323
4547B416952m123P741p8823j02854J17424Q2158R8552J33294o1848p8116m655
4536B525702L7943O8814N5427Q6948L7888n4710O4194o208K33470M9190j01910
4525B996748J08378j23717j30750l7708J05357j5046k9345J61204J94840N8935
4515C288896R4388p9136j8816j26252q9647L71790J40568N1930J50235o3841o638
4504C713477K49904o4633J08844K40279q9875j01708Q9804L97803J92054K07467
$$ y = [3814460, 3501311, 3569625, 3485862, 3270325, 3362096, 3082075, 2989232, 2898503, 2822857, 2897219, 2825260, 2702697, 2503547, 2424872, 2396918, 2522313, 2552965, 2675905, 2631142, 2424784, 2425377, 2344530, 2420371, 2516155, 2497947, 2635023, 2494240, 2540404, 2483299, 2667807, 2605394, 2603275, 2416952, 2412829, 2420570, 2341747, 2238893, 2356317, 2438475, 2537027, 2670321, 2608473, 2530357, 2525702, 2563645, 2632459, 2687886, 2774834, 2812722, 2758012, 2822206, 2815998, 3049468, 3098658, 2996748, 3105126, 2981409, 2850659, 2812951, 2918308, 2903262, 2873917, 3035121, 3229961, 3288896, 3383284, 3304148, 3285332, 3159080, 3069433, 3441223, 3581791, 3633721, 3783956, 3720115, 3713477, 3963381, 3898748, 4007592, 4247871, 4157996, 4056288, 4146092, 4543895, 4735949, 4943416]
4494D943416K56662J14510R6115K22745J7024r4511p7789K0905k80899M36545
4484E654723J95392j17141K82458K02933J12229P7319L10615K10461J32611J68320
4474G229920K00979L68473N88568M95573P92407O63801R13051J049615J008585
4465A3310972J018690J107749J167197J179714P37989l05136j336997j767507
4457A5112671j575708j461204j071786r72186n76185k47007p01376k92220o382
4448H208617J82329Q7669q7221J49597L87496K03598L72004M95334M39567L14016
4438A0753006R70616P43595Q87909J041507R15586J088905Q47491N93816Q0827
4429A7923258q62718j388850j462719j391821r87766r12210p53802o12474m73501
$$ y = [4943416, 5200078, 5314588, 5410703, 5633448, 5650472, 5555961, 5478172, 5499077, 5218178, 5654723, 5850115, 5732974, 6015432, 6218365, 6330594, 6407913, 6718528, 6928989, 7061600, 7229920, 7430899, 7799372, 8387940, 8883513, 9675920, 10339721, 11252772, 12302387, 13310972, 14329662, 15437411, 16604608, 17784322, 18522311, 18217175, 16880178, 15112671, 13536963, 12075759, 11003973, 10031787, 9455602, 9208595, 8507219, 8214999, 8208617, 8390946, 8478615, 8391394, 8540991, 8928487, 9132085, 9504089, 9999423, 10438990, 10753006, 11723622, 12467217, 13355126, 14396633, 15312219, 16401124, 17248615, 17842431, 17923258, 17060540, 15671690, 14208971, 12817150, 11829384, 10917174, 10163372, 9550898, 9077397]
4420I077397m82870l03373j78927l08869j34426m6475k1606l38739j94471k5080
4410G042561l99141k15442r300j1400J36764k9782N6211k08014j75680n5958r7146
4399F033673j57970n3583n6057k55918q6511j5679k29300k3425j52487q0994O3439
4388D985188q2789m3738l9859k4972q4513J518J71162m7484J87040j1774m6920
4377D962859K32110P158P6790R7557P1949J42335P0468J32421J62596l5826K14053
4366F134470J73509N67628L09318J68818J70701K77040L6583L49253K73178k06139
4356H254359k41409n4248l05570j61060k25399j1667J25273j72794m1009K30770
4346G397246L00529K41973J58198K51364L89985K58298N06720N17529M43906L80152
$$ y = [9077397, 8594527, 8291154, 8112227, 7803358, 7668932, 7622457, 7600851, 7262112, 7067641, 7042561, 6643420, 6427978, 6418678, 6407278, 6544042, 6514260, 6570471, 6362457, 6186777, 6130819, 6033673, 5875703, 5822120, 5766063, 5510145, 5423634, 5407955, 5178655, 5155230, 5002743, 4921749, 4985188, 4902399, 4858661, 4818802, 4793830, 4709317, 4710835, 4881997, 4834513, 5021553, 5009779, 4962859, 5194969, 5202127, 5278917, 5376474, 5448423, 5590758, 5661226, 5793647, 5956243, 5920417, 6134470, 6307979, 6875607, 7184925, 7353743, 7524444, 7801484, 7838067, 8187320, 8460498, 8254359, 8012950, 7958702, 7653132, 7492072, 7266673, 7255006, 7380279, 7207485, 7166476, 7397246, 7697775, 7939748, 8097946, 8349310, 8739295, 8997593, 9504313, 10021842, 10465748, 10845900]
4336A0845900K14442K38225L75680N25129L22071L61163N19966K68508M86987
4327A4158071L63178L39208L57738M4926k26163r4299k26780m95987j82845l31130
4317A3705917m56544j27896j06998l18767j0501K23651K73965J03470L900K19162
4307A3509359K54341L92856L51523L66001L43395J60781J42828J55634K01299
4298A5878017J92929M8285K26269r853J82686J32672K29294j9580j9550L9118
4288A6880287q2710J86781R6791J08574J90911J94562J7222K85660J0758J43647
4278A8032483L1308j08512k51620J17334o2105j77200l48980l07340R0999j67202
4268A6849165k42016Q6479O782q0329j1005N7901J0014J17988K73472J7246L40900
$$ y = [10845900, 11060342, 11298567, 11674247, 12199376, 12521447, 12882610, 13402576, 13671084, 14158071, 14521249, 14860457, 15218195, 15263121, 15036958, 14942659, 14715879, 14219892, 14037047, 13705917, 13249373, 13121477, 13014479, 12695712, 12685211, 12908862, 13182827, 13286297, 13290197, 13509359, 13763700, 14156556, 14508079, 14874080, 15217475, 15378256, 15521084, 15676718, 15878017, 16070946, 16119231, 16345500, 16335647, 16518333, 16651005, 16880299, 16860719, 16841169, 16880287, 16797577, 16984358, 17081149, 17189723, 17380634, 17575196, 17592418, 17878078, 17888836, 18032483, 18063791, 17955279, 17703659, 17820993, 17758888, 17581688, 17232708, 16925368, 17016367, 16849165, 16607149, 16693628, 16700410, 16620081, 16609076, 16666977, 16676991, 16794979, 17068451, 17085697, 17426597]
4257A7426597J59760L22214M53403O07916Q96187Q70952R68940J229085J377870
4248B4312924J343241J391173J078117K9304j570936j927981j624492j428313
4240B1603037q57157q26392n09973l80203n59346n05289j39070k0918n8196k1659
4230A7724834j00740L6275K63400J83737J59585L58775J92313N94461J52507K00022
4220A9765169M30660N37688O73248M69238N36550N50015O93527N15174N17150
4211B4688419P04730N65212O46248J000293J080988Q38970J022299J446763J464725
4202C3458647J743589J781355K000340K195509K496476K882631L164392L620633
4194E3343572M158678M797735N179998O266079P803915R229276J1058183J3110448
$$ y = [17426597, 17586357, 17908571, 18361974, 18969890, 19866077, 20737029, 21705969, 22935054, 24312924, 25656165, 27047338, 28125455, 28154759, 26583823, 24655842, 23031350, 21603037, 20745880, 19919488, 19409515, 19029312, 18469966, 17964677, 17825607, 17804689, 17746493, 17724834, 17624094, 17660369, 17923769, 18107506, 18267091, 18625866, 18818179, 19412640, 19565147, 19765169, 20195829, 20733517, 21406765, 21876003, 22412553, 22962568, 23656095, 24171269, 24688419, 25393149, 25958361, 26604609, 27604902, 28685890, 29524860, 30547159, 31993922, 33458647, 35202236, 36983591, 38983931, 41179440, 43675916, 46558547, 49722939, 53343572, 57502250, 62299985, 67479983, 73746062, 81549977, 90779253, 101837436, 114947884]
4186A14947884J5516441J7868209K0478809K3734832K7226645K9073417K7355008
4179B76201245J3153695p094111k6609475l6275901l4289604k8086022k0822392
4172A36177435j5348379j1857113j0240003q568022p461718o413978n271870m138007
4164F6878345l725127k891487k272974j722263j402916q83506m97181m45646k28873
4155E2808372j79747q5208l85522m79330K02826P06675J113267J619352K266253
4146E7586938K843743L377531L786822M391004K783869q11578m077230n899372
4138F3981727o123625n263236m617651l919786l211298k562626j962312j670856
4130C4650337j247697j638695j425549j043736r96195p92619q06108n23344k68869
$$ y = [114947884, 130464325, 148332534, 168811343, 192546175, 219772820, 248846237, 276201245, 289354940, 282260829, 255651354, 219375453, 185085849, 156999827, 136177435, 120829056, 108971943, 98731940, 90163918, 82702200, 76288222, 71016352, 66878345, 63153218, 60261731, 57988757, 56266494, 54863578, 53980072, 53482891, 53037245, 52808372, 52628625, 52543417, 52157895, 51678565, 51881391, 52588066, 53701333, 55320685, 57586938, 60430681, 63808212, 67595034, 71986038, 74769907, 73958329, 69881099, 63981727, 57858102, 52594866, 47977215, 44057429, 40846131, 38283505, 36321193, 34650337, 33402640, 31763945, 30338396, 29294660, 28298465, 27505846, 26699738, 26176394, 25907525]
4121B5907525j29110k42610l02763l94683l02681j51736p1363J98968K96560M10100
4111B5218207P12814P24393R33977Q90487L95513M61344j03549j073688j332867
4102B6826631j596121j380655j081806p56411m07754n46160l72639k70472k90316
4093B0124297p37383j021955q83110p74999o67302m74360k73058m43084l85518
4084A4463528m22958k80847j13516j15423j75582R6474J26690m5736q4335k047
4074A3446248L9956j80953m6556r2375n10667q9189l19192l32330j31463k95326
4064A1488153k26954n8594J0088l17574m1988J34123r4760j12149k52417r2152
4054A0435776p4070L7459L2417j35789j30287P8302J17053j5511m8591L6650J3070
$$ y = [25907525, 25778415, 25535805, 25233042, 24838359, 24535678, 24383942, 24312579, 24511547, 24808107, 25218207, 25931021, 26655414, 27589391, 28479878, 28875391, 29336735, 29233186, 28159498, 26826631, 25230510, 23849855, 22768049, 22011638, 21603884, 21057724, 20685085, 20414613, 20124297, 19386914, 18364959, 17481849, 16706850, 16039548, 15565188, 15292130, 14849046, 14463528, 14040570, 13759723, 13646207, 13530784, 13355202, 13451676, 13578366, 13532630, 13448295, 13446248, 13486204, 13305251, 13258695, 13166320, 12655653, 12566464, 12247272, 11914942, 11783479, 11488153, 11261199, 11202605, 11212693, 10895119, 10853131, 10987254, 10892494, 10780345, 10527928, 10435776, 10361706, 10399165, 10431582, 10295793, 10165506, 10243808, 10360861, 10345350, 10296759, 10333409, 10346479]
4043A0346479R2947J71167K23147K7289L7239N1578J54163J23964J68204K73505
4033A1669682Q0386N13329K70568L41728J28396K10476N76261N69276M88471P68087
4023A5616660Q86643J189154J025476J062492J478790J591954J639188K110662
4015B6601019K466264K374288J444258o56950k343216k816695k595035k045692
4007B2428241j291755r23312p87929n57742l13563J31601j69537k21120P1909
3998A8366793P0647K36425O62897O36060Q76301J064021P67359N85384K26144
3989B3492031L08009N13680J061796J240059J303164Q92435q16265k062236k036118
3980B3896555j633454j475128j046025o79220l11626p1514j19296M7081K62382
$$ y = [10346479, 10439426, 10610593, 10833740, 10861029, 10898268, 10949846, 11104009, 11227973, 11396177, 11669682, 11750068, 12263397, 12533965, 12875693, 13004089, 13214565, 13790826, 14360102, 14848573, 15616660, 16503303, 17692457, 18717933, 19780425, 21259215, 22851169, 24490357, 26601019, 29067283, 31441571, 32885829, 32228879, 29885663, 27068968, 24473933, 22428241, 21136486, 20213174, 19425245, 18867503, 18553940, 18685541, 18516004, 18294884, 18366793, 18437440, 18673865, 19336762, 19972822, 20849123, 21913144, 22680503, 23265887, 23492031, 23800040, 24313720, 25375516, 26615575, 27918739, 28811174, 27994909, 25932673, 23896555, 22263101, 20787973, 19741948, 19062728, 18751102, 18679588, 18560292, 18607373, 18869755]
3971A8869755L00011K98225K48281J80185L47811N70373Q12922J004929J322812
3962B3955304J536268J609221J788029K400780K517886K133567J51999k337923
3954C3755131l350135l029068k100203j457563p50486m49070l17118j72833O5437
3945B2194092K34363K76505K08302O97528R17110O47804J060336J109966J333274
3936B8679280J583812J490430K006769K459072K919966L523100L235332K469845
3928D8367606m10140k897969l400574l347570l004089k304333j395627q49397
3920C0757907n07267n52537p3010J46573J06093Q7334O3201J68761K17879L26052
3910C0740986M85049N01898M24144M56223Q65769R12739J106012J003735J057615
$$ y = [18869755, 19169766, 19467991, 19716272, 19896457, 20244268, 20814641, 21627563, 22632492, 23955304, 25491572, 27100793, 28888822, 31289602, 33807488, 35941055, 36093054, 33755131, 30404996, 27375928, 25275725, 23818162, 23067676, 22618606, 22301488, 22128655, 22194092, 22428455, 22704960, 22913262, 23610790, 24527900, 25175704, 26236040, 27346006, 28679280, 30263092, 31753522, 33760291, 36219363, 39139329, 42662429, 45897761, 48367606, 47957466, 45059497, 41658923, 38311353, 35307264, 33002931, 31607304, 30757907, 30250640, 29698103, 29625093, 29771666, 29877759, 29965093, 30028294, 30197055, 30414934, 30740986, 31226035, 31727933, 32152077, 32608300, 33474069, 34386808, 35492820, 36496555, 37554170]
3901C7554170J455749J876956K067381J672766J606348J699436J839069K071535
3893E1843410K344229K375720K269061K538048K435706K397028K192327K478385
3885G0873914K668301K719239L317249L413112M111506M533940L671449K003389
3877I7312099k36952j040634q16488k26604Q75063J434851J275385J210224J043973
3868A00830917P89455J214182J494271J014651K85503m08985j453225j382317
3860A02384452j274236j183067j123074q03764p76490o57694k12498r5831n04114
3851I5753684k180047m015908m509518m724556l597793l168050k454521j973480
3843F9129811j838142j661278j810077j732904j903493j910005j986454j957066
$$ y = [37554170, 39009919, 40886875, 42954256, 44627022, 46233370, 47932806, 49771875, 51843410, 54187639, 56563359, 58832420, 61370468, 63806174, 66203202, 68395529, 70873914, 73542215, 76261454, 79578703, 82991815, 87103321, 91637261, 95308710, 97312099, 97075147, 96034513, 95218025, 94991421, 95866484, 97301335, 98576720, 99786944, 100830917, 101620372, 102834554, 104328825, 105343476, 105628979, 105219994, 103766769, 102384452, 101110216, 99927149, 98804075, 98000311, 97223821, 96566127, 96353629, 96257798, 95753684, 93573637, 89557729, 85048211, 80323655, 76725862, 73557812, 71103291, 69129811, 67291669, 65630391, 63820314, 62087410, 60183917, 58273912, 56287458, 54330392]
3835E4330392j965486j703340j242640r56567j098071j131212j227256j387406
3827D3618414j114940j044405q07699m34410m90643m60003l64196k34172p88914
3818C7879032m03265l06985m67549n20400l16195l36553o02275q14066q19813
3809C3291931q21782n39972k25599j0074k16532l11973J3975k9994J20173l3473
3799C1236680p2755Q6728o5968K12805K86458K45821P4403Q0821j01831k05277
3789C1777885j41580J2065j6376j12720j16923q8549J40648L67633j01874n4513
3779C1665696R4233P8033J40717J25135K37400l7452J45094P6541J60991K08521
3769C2894909K02811r1831K2446K00369K79665K3560J1722K45889K75053K47508
$$ y = [54330392, 52364906, 50661566, 49418926, 48462359, 47364288, 46233076, 45005820, 43618414, 42503474, 41459069, 40651370, 40216960, 39726317, 39266314, 38902118, 38667946, 37879032, 37475767, 37168782, 36701233, 36180833, 35864638, 35528085, 34925810, 34111744, 33291931, 32470149, 31930177, 31704578, 31694504, 31477972, 31165999, 31179974, 31149980, 31270153, 31236680, 31163925, 31250653, 31184685, 31397490, 31683948, 31929769, 32004172, 32084993, 31983162, 31777885, 31636305, 31648370, 31631994, 31519274, 31402351, 31313802, 31454450, 31822083, 31720209, 31665696, 31759929, 31837962, 31978679, 32103814, 32341214, 32303762, 32448856, 32525397, 32686388, 32894909, 33097720, 33005889, 33028335, 33228704, 33508369, 33531929, 33543651, 33789540, 34064593, 34312101]
3759C4312101N23766M74864L29987P73114O60988P14549Q74685O32270N63373
3750C9859697M76444M95487M82855K23893k77219m9151j52016n74186m71514p08296
3740C9305994o10017o75543q00697j059199r55007n43325q28260n20889o88377
3731C2624680n72254l33992l65581l15662m10702l62618j6624k33188k74286j9175
3721B9720598p1601p1331k38782j9637l35389n1703K6027j05592p5390l3564J74806
3710B8918442J12112o0090R164j0488P0339l2170O3574J52246O6434K8548Q5552
3699B9403663Q7462j48747L7954j267k47562j12628k94950l65940j00936m3134
3689B8213915J26223K51985M4838P4599P9744L42573N99096O48001M48459O03698
$$ y = [34312101, 34835867, 35310731, 35640718, 36413832, 37074820, 37789369, 38664054, 39296324, 39859697, 40336141, 40831628, 41314483, 41538376, 41261157, 41212006, 41059990, 40485804, 40014290, 39305994, 38695977, 38020434, 37219737, 36160538, 35205531, 34662206, 33833946, 33313057, 32624680, 32052426, 31718434, 31352853, 31037191, 30626489, 30263871, 30247247, 30014059, 29739773, 29720598, 29648997, 29577666, 29338884, 29319247, 28983858, 28932155, 28958182, 28852590, 28777200, 28743636, 28918442, 29030554, 28970464, 28979628, 28969140, 29039479, 29007309, 29070883, 29223129, 29289563, 29318111, 29403663, 29491125, 29342378, 29380332, 29379065, 29131503, 29018875, 28723925, 28357985, 28257049, 28213915, 28340138, 28592123, 28636961, 28711560, 28791304, 29133877, 29732973, 30380974, 30829433, 31433131]
3679C1433131O49987N73745O35924K75795N04980M67997O39945N56420O33972
3670C6371896P04312O77825P95444L30889M08877L20602j89069N2080m4673l59867
3660C9068316k56531l82737m58285n69726m45579j75903l3727K12335J73316K31660
3650C7363139m275j83526k40274n19537n39018j37822J00404k331L16481K9711
3640C6182952K17576K62573J30152J31799J83268j17530l6624J29793l53121m08004
3630C6322834p46100m40606n01409o25720m13902m51192o82593p48691n13418
3621C1199203m97183p20501q09433o89379l91863m08077l24538n74464k15592
3612B6568173k08069l64403n7038M5784j66434N1710J18014k19661j77185j31632
$$ y = [31433131, 32083118, 32656863, 33292787, 33568582, 34073562, 34541559, 35181504, 35737924, 36371896, 37076208, 37754033, 38549477, 38880366, 39289243, 39609845, 39420776, 39472856, 39428183, 39068316, 38811785, 38429048, 37970763, 37401037, 36955458, 36779555, 36745828, 36958163, 37131479, 37363139, 37358864, 37175338, 36935064, 36415527, 35876509, 35738687, 35839091, 35836760, 36153241, 36182952, 36400528, 36663101, 36793253, 36925052, 37108320, 36990790, 36954166, 37083959, 36730838, 36322834, 35576734, 35136128, 34634719, 34008999, 33595097, 33143905, 32461312, 31712621, 31199203, 30702020, 29981519, 29172086, 28482707, 28090844, 27682767, 27358229, 26783765, 26568173, 26360104, 25995701, 25938663, 25984447, 25818013, 25869723, 25987737, 25768076, 25590891, 25459259]
3602B5459259l26429k00152k35030l71423k96076n27339k54190k98351m73224
3593B2477045m42889k53457l23769k69894l13177l16104m96630k90538k06320
3584A9564267m02700j42759j85746k57702l24880j51553j40886r6639K0010r1088
3574A7790324j85594k31725j93677j6660N0026l37944j57964k72872n1314l73660
3564A6018940k94031k09726k91154k76276p7626r9178k41787o2506j62950j8681
3554A4285025j51187k33964k41587k60886J10674q2361k02532j15400j15324l92754
3544A2599704k36435j94119l36293j30670m51827k16158l35711k55799p0853L8777
3534A0410616K6804j39799j58237J23027r6640Q5802j72525j15917j12112K30035
$$ y = [25459259, 25132830, 24932678, 24697648, 24326225, 24030149, 23502810, 23248620, 22950269, 22477045, 22034156, 21780699, 21456930, 21187036, 20873859, 20557755, 20061125, 19770587, 19564267, 19161567, 19018808, 18833062, 18575360, 18250480, 18098927, 17958041, 17861402, 17881412, 17790324, 17604730, 17373005, 17179328, 17162668, 17212694, 16874750, 16716786, 16443914, 16392600, 16018940, 15724909, 15515183, 15224029, 14947753, 14870127, 14770949, 14529162, 14466656, 14303706, 14285025, 14133838, 13899874, 13658287, 13397401, 13508075, 13425714, 13223182, 13107782, 12992458, 12599704, 12363269, 12169150, 11832857, 11702187, 11250360, 11034202, 10698491, 10442692, 10371839, 10410616, 10437420, 10297621, 10139384, 10262411, 10165771, 10251573, 10079048, 9963131, 9851019, 10081054]
3524A0081054j23504j90982j95224k36515k44757j46260P3009k28603o1141k27336
3514H499741j09446j96125k96097k50099l5042k45494l60449K765J32978l3459
3504G109273k70711q8427j72419j26145N710k15474l9806J50793J9543o4806j44057
3493F163474j18930j54065k44876J75424N3954L5807r7032J9459j3252j89014
3483E630949p0141j15691p2846r8833P8139k53823l10006k5405N270J91953j47480
3472D812086k61895J3552j36861p974o6923l07831J01024m3463r602R6739r6002
3461D092850j8394Q6791J9762n7820R7281n653l43414n0774J81718Q8959K0532
3450D111838Q1354m8220r6536j23459J05032P9293k3185j70535j68248l1221R6436
$$ y = [10081054, 9957550, 9766568, 9571344, 9334829, 9090072, 8943812, 9016821, 8788218, 8727077, 8499741, 8390295, 8194170, 7898073, 7647974, 7612932, 7367438, 7006989, 7009754, 7142732, 7109273, 6838562, 6750135, 6577716, 6451571, 6457281, 6241807, 6202001, 6352794, 6372337, 6307531, 6163474, 6044544, 5890479, 5645603, 5821027, 5874981, 5910788, 5813756, 5833215, 5819963, 5630949, 5560808, 5445117, 5372271, 5273438, 5351577, 5097754, 4787748, 4762343, 4767613, 4959566, 4812086, 4550191, 4563743, 4426882, 4418908, 4351985, 4044154, 4145178, 4101715, 4092113, 4188852, 4092850, 4074456, 4161247, 4181009, 4123189, 4220470, 4214817, 3871403, 3820629, 4002347, 4091306, 4111838, 4193192, 4144972, 4048436, 3924977, 4030009, 4109302, 4086117, 3915582, 3747334, 3716113, 3812549]
3439C812549o4817k2582M9910j70271n4021M173K15653J18144k33458r7550j10726
3428C447004j76266J07600K24227j5959K5272N9803o7020o3492M5831l1371j77170
3417C378459K4660L2769j56753J74618P1993J47945k43874k99272L31957Q0409
3407C542911N5081k46021K47741J27094m5170J19743J47228K11998l34998O0107
3397C885714L00190o6970k3389j24676r3630m5329q6513M7591j30013k22080Q370
3386C449265k17605P4365M2509L7453J89390l00836j28468J36960n886p8152j06468
3375C092527J37234l3959J138k02911j78260n793j6091M272q656J29876N0961
3364B970338M3210k9684j55642j07048M800J74823m0007K22054j51460p4657j24334
$$ y = [3812549, 3747732, 3725150, 3775060, 3604789, 3550768, 3554941, 3770594, 3888738, 3655280, 3557730, 3447004, 3270738, 3378338, 3602565, 3586606, 3611878, 3671681, 3604661, 3541169, 3587000, 3555629, 3378459, 3403119, 3435888, 3279135, 3453753, 3525746, 3673691, 3429817, 3130545, 3462502, 3542911, 3597992, 3351971, 3599712, 3726806, 3681636, 3801379, 3948607, 4160605, 3825607, 3885714, 4185904, 4118934, 4095545, 3970869, 3877239, 3831910, 3745397, 3792988, 3662975, 3440895, 3449265, 3231660, 3306025, 3348534, 3385987, 3575377, 3274541, 3146073, 3283033, 3277147, 3198995, 3092527, 3229761, 3195802, 3196940, 2994029, 2815769, 2809976, 2793885, 2798157, 2789501, 2919377, 2970338, 3013548, 2983864, 2828222, 2721174, 2725974, 2900797, 2860790, 3082844, 2931384, 2856727, 2732393]
3353B732393j0727J40560J433j25478M7885O030o7589J6276l2521K66689k5788
3342B949163p1855M6906k49354j03506J89553J59205J36446p6430J8868j9562
3332B979434J15247j51256k7939k32533j44078J21746J56343j25051m0859p0786
3322B580268J36138l5695J07037r9385o4778Q7486O102J81406j06043J36145Q5739
3311C014420J23775j11546J57320K06499L9360l8937O6507J16772j54732j85047
3301C234391j32823Q0535J06345O878j07252j7694k00165J67478R0800R5309J11982
3290C435784K31470m429l09757N3932N3674K379J77132O1107M9029J00730m0354
3279C810697K28280o6564J13274L15788J84795K3787J45483J63244K29206J64930
$$ y = [2732393, 2721666, 2862226, 2863659, 2738181, 2786066, 2792096, 2724507, 2740783, 2708262, 2974951, 2949163, 2877308, 2924214, 2674860, 2571354, 2760907, 2920112, 3056558, 2980128, 2998996, 2979434, 3094681, 2943425, 2915486, 2682953, 2538875, 2660621, 2816964, 2691913, 2651054, 2580268, 2716406, 2680711, 2787748, 2688363, 2623585, 2711071, 2717173, 2898579, 2792536, 2928681, 3014420, 3138195, 3026649, 3183969, 3390468, 3429828, 3390891, 3457398, 3574170, 3419438, 3234391, 3101568, 3182103, 3288448, 3295326, 3188074, 3170380, 2970215, 3137693, 3228493, 3323802, 3435784, 3667254, 3662825, 3353068, 3407000, 3460674, 3463053, 3640185, 3701292, 3750321, 3851051, 3810697, 4038977, 3972413, 4085687, 4401475, 4586270, 4610057, 4755540, 4918784, 5147990, 5312920]
3269E312920L19830J00557K85827L03671J30939L65033M41380L15787M31967K99844
3259H307755N3526k42191j90284j15597o1239J20966l79389l80943k19528l08141
3249F584935J45748j51766j91102j98478j44700n0743k97275J82076k33741J7891
3239E662845k1985J8449J67929q824p950N7126K63875M43257L14136K78851M01775
3228G569484L51552j01703k86262j74968j32376k0646J05592J74364J27657m3876
3218G568818M4103K8571L1284k06495k61597O8570j15263r5823j89257j34407
3208F738504J11708j92309J03084R3051j3686l73561j9924M06551J34781K35840
3198G224039R7298K55570K916q6682M9522J09084J12938p4870j40681J97809J67679
$$ y = [5312920, 5632750, 5733307, 6019134, 6322805, 6453744, 6818777, 7260157, 7575944, 8007911, 8307755, 8361281, 8119090, 7928806, 7813209, 7751970, 7872936, 7493547, 7112604, 6893076, 6584935, 6730683, 6578917, 6387815, 6189337, 6044637, 5993894, 5696619, 5878695, 5644954, 5662845, 5640860, 5659309, 5827238, 5818414, 5810464, 5867590, 6131465, 6574722, 6888858, 7167709, 7569484, 7921036, 7819333, 7533071, 7358103, 7225727, 7205081, 7310673, 7485037, 7612694, 7568818, 7612921, 7641492, 7672776, 7466281, 7204684, 7273254, 7157991, 7062168, 6872911, 6738504, 6850212, 6657903, 6760987, 6854038, 6840352, 6466791, 6446867, 6853418, 6988199, 7224039, 7321337, 7576907, 7579823, 7493141, 7542663, 7651747, 7764685, 7689815, 7549134, 7746943, 7914622]
3187G914622k5299p5915m5481K5541J61504R7500j4835k05414j38865R0866m7785
3176G736439k04816r3466j42317k51273J24642j72540R7821J66820k81965J5719
3166F995064L7515L8216m864j36142J20176j46762j60175Q6121j60964j61678
3156F506507j84003K87558J79733j27052L5081O4624q3920r7468j4606P2996N924
3145F645374j37110j68916k11473P2957l5162N7326k24004j59099J73284n7903
3135E955274o0399j07174j41660j71115l1266r7598l8878M4559k59253r2907j7137
3124D982446r6349K9868q3625j10494R382K03288k95962l1846J69409r0083k04212
3113D481822k8900N3917J9621j27995q5911M4411J23089k16132k60006K7755k2545
$$ y = [7914622, 7889323, 7813408, 7767927, 7793468, 7954972, 8052472, 8037637, 7832223, 7693358, 7784224, 7736439, 7531623, 7438157, 7295840, 7044567, 7169209, 6996669, 7094490, 7261310, 6979345, 6995064, 7032579, 7070795, 7065931, 6929789, 7049965, 6903203, 6743028, 6829149, 6668185, 6506507, 6322504, 6610062, 6789795, 6662743, 6697824, 6762448, 6678528, 6581060, 6566454, 6639450, 6645374, 6508264, 6339348, 6127875, 6200832, 6165670, 6222996, 5998992, 5839893, 6013177, 5955274, 5894875, 5787701, 5646041, 5474926, 5443660, 5346062, 5307184, 5351743, 5092490, 4999583, 4982446, 4886097, 4915965, 4832340, 4721846, 4731228, 4934516, 4638554, 4606708, 4776117, 4686034, 4481822, 4452922, 4506839, 4526460, 4398465, 4312554, 4356965, 4480054, 4263922, 4003916, 4031671, 4009126]
3102D009126j44207P7656j81362o8295j79887j79742K4743j85963L4154P2394
3092C278617j56497k95995J15636k0368K7138P673j9955k08078J24868O8872j87365
3081B734546m8407k9095r1597O2156J23752K7335j28159j70607l0931j48109J85108
3070B485992j54060l4662n4847p5068k92249j14905O2000o9863Q6505O3051P9114
3059A981008k07396m626P889J35031k86650l58J2878n7872n0282J18129p5593
3048A572158k3133J32010j15228m9458p8654n4235J37522N5733K4824k99749r9802
3037A201988J59163l02252J25947J37564j56566q6623j05716J50650O8529q5565
3027A107119M8920k5433k47121J06084j95229Q7750J95538J0006k01649j52015
$$ y = [4009126, 3864919, 3942575, 3761213, 3692918, 3513031, 3333289, 3358032, 3172069, 3206223, 3278617, 3122120, 2826125, 2941761, 2921393, 2948531, 2956204, 2936249, 2728171, 2853039, 2921911, 2734546, 2686139, 2657044, 2565447, 2627603, 2751355, 2778690, 2650531, 2479924, 2448993, 2300884, 2485992, 2331932, 2297270, 2242423, 2167355, 1875106, 1760201, 1822201, 1752338, 1838843, 1901894, 1981008, 1773612, 1768986, 1776875, 1911906, 1625256, 1624898, 1637776, 1579904, 1529622, 1647751, 1572158, 1549025, 1681035, 1565807, 1516349, 1437695, 1383460, 1520982, 1576715, 1601539, 1301790, 1201988, 1361151, 1058899, 1184846, 1322410, 1165844, 1079221, 973505, 1124155, 1192684, 1107119, 1156039, 1130606, 883485, 989569, 794340, 882090, 1077628, 1087634, 885985, 733970]
3017G33970Q3713j60543m4199J37885J54591j80911j0168Q2899R343J251J35826
3006I43657p7306r5863p3525k1442K0841K86790k2983L1673m0759k69233P3561
2995G55411Q8541j15338r3180K3087N6273n680R1500j46945p5393J43496J28068
2984H49840l7151j79709Q2458L5790j30641J88314j07868k9789J37557j0573j61016
2973F37212p9189q6741r9389Q0500M1093O2695M9627l6901O2754L2523j3665k3317
2961F27202J17769r2605o625n7266j92917J98112m5347N0668K65996J8175k25161
2950F58001j77248J46383K86929o8661j26913j85K5730j51198m4954P4937J42796
2939G65617Q1093K7378j68506j15935J18557k816j29812L3671J703J74753K075
$$ y = [733970, 817683, 657140, 612941, 750826, 905417, 724506, 714338, 797237, 806580, 807831, 943657, 866351, 770488, 696963, 675521, 696362, 983152, 960169, 991842, 951083, 681850, 755411, 843952, 728614, 635434, 658521, 714794, 709114, 800614, 653669, 578276, 721772, 849840, 812689, 632980, 715438, 751228, 620587, 808901, 701033, 671244, 808801, 798228, 637212, 558023, 471282, 371893, 452393, 493486, 556181, 605808, 568907, 631661, 664184, 650519, 627202, 744971, 652366, 645741, 588475, 395558, 593670, 548323, 598991, 864987, 883162, 658001, 480753, 627136, 914065, 845404, 718491, 718306, 744036, 592838, 547884, 622821, 765617, 846710, 874088, 705582, 589647, 708204, 705388, 575576, 609247, 610950, 785703, 787778]
2928G87778n732n814P370Q9755J41364k46005j15696m0079J12348j37147j29407
2917D58735K23446J54587O0071l6239o4395N3700k10702L0394j21477m8145M1640
2906E41615j50379K13963j45458m2864k6487J76907j55787m3690J25104K802K4146
2895E19872J24263j47375J98585J08586j81045k95382l5243J04996n3159M0885
2885C84983L2596J69517J49052q874k82837K4337L2320j51140K11328K2260j4255
2874E69287J02268m8675m8084J21692j33674r2005k3782k3491N345P8546o3498
2863D43929l3942K13843l722M459k96433j51750L09165J72812j95250p3924j08082
2852B81105n6794m0782k7602J48502P5555r7181j4330p821k05800P5050M5957
$$ y = [787778, 782046, 776232, 783602, 873357, 1014721, 768716, 653020, 612941, 725289, 588142, 458735, 682181, 836768, 896839, 860600, 796205, 849905, 639203, 669597, 548120, 499975, 541615, 391236, 605199, 459741, 416877, 390390, 567297, 411510, 367820, 492924, 495726, 519872, 644135, 496760, 695345, 803931, 622886, 327504, 292261, 397257, 344098, 384983, 417579, 587096, 736148, 727274, 444437, 468774, 501094, 349954, 561282, 583542, 569287, 671555, 622880, 574796, 696488, 562814, 470809, 447027, 423536, 428881, 507427, 443929, 409987, 623830, 620108, 624567, 328134, 176384, 485549, 658361, 463111, 389187, 281105, 224311, 183529, 155927, 304429, 379984, 282803, 268473, 260652, 54852, 129902, 175859]
2841A75859J38079K6583q2858J47498k29407M7428J08564j94867k03226O4758
2831a589J72972m7772j2125m2507Q6427Q4627k9746m0290o608L1773R413o2587
2819A41988j0392K942q8490m9880M1999l9214l3722Q5136J35070O3761O5348r1102
2807B23444K6391K8234o4732l7541O0308j9016j66892J21056k9947k7439j56414
2796d2548J35656K1599K7286N7691k30690k01510l4459K22747m5328J21534J6127
2785D8105R2365K0082P4093j6221N6526j02692j26898n6395m5992N4797J25219
2774A22989L0277L0466n8245J2003j18129K2058J19150l8604p6808j53584J49795
2763D1368J03115p0873r2966J02347L5810j75103J2709K05625j91871M3290J46789
$$ y = [175859, 313938, 340521, 257663, 405161, 175754, 223182, 331746, 136879, -66347, -1589, 171383, 123611, 111486, 68979, 155406, 240033, 210287, 169997, 163389, 195162, 204575, 141988, 131596, 134538, 46048, -3832, 38167, -1047, -34769, 50367, 185437, 249198, 314546, 223444, 249835, 278069, 213337, 175796, 236104, 217088, 50196, 171252, 141305, 113866, -42548, 93108, 114707, 141993, 199684, -31006, -232516, -266975, -44228, -89556, 31978, 48105, 140470, 160552, 234645, 218424, 274950, 172258, 45360, -11035, -57027, -2230, 122989, 153266, 183732, 125487, 137490, 19361, 41419, 160569, 121965, 45157, -108427, 41368, 144483, 73610, -19356, 82991, 118801, -56302, -43593, 162032, -29839, 13451, 160240]
2752A60240J54115k00431r5041P1033K5805j08537J43560K7191j0037J46207r5106
2741B18999j77658J03262j88890J23977j74946M9645L6025o4833J27417r9350
2731d6352J5539Q7824k7156o0297K02154R1008N2542j63658p8793j06970r594
2720d3753J46745j04453m8352J37135k4060K4728M3203j57281J51212N0502j55512
2709B0114L1802j59838Q1174l8236n5130J12244k3011R9687j1319q1332p1556
2698i5401N2267j4438j44899R3566Q7960J2363L1275n3899N030k7829L8525L3271
2686A7791p7650N8942Q1681j91308j59416R1792J58622K34093j82977L2512P0983
2675A35065R576j60817p8550r4910Q7331J5465p31K04609j23399m749j6593R3247
$$ y = [160240, 314355, 113924, 18883, 89916, 115721, 7184, 150744, 177935, 167898, 314105, 218999, 41341, 144603, -44287, 79690, -95256, -45611, -9586, -74419, 52998, -46352, -30813, 57011, 29855, -30442, 171712, 262720, 315262, 151604, 72811, -34159, -43753, 102992, -1461, -49813, 87322, 63262, 87990, 131193, -26088, 125124, 175626, 20114, 51916, -107922, -26748, -64984, -120114, -7870, -30881, 68806, 57487, -23845, -95401, -43134, -57572, -202471, -108905, -20945, -8582, 22693, -31206, -26176, -54005, -15480, 17791, -59859, -917, 80764, -110544, -269960, -178168, -19546, 214547, 31570, 64082, 135065, 144641, -16176, -94726, -189636, -102305, -86840, -87571, 117038, -6361, -11110, -27703, 65544]
2663F5544K15619j3120k29064k52985Q5878M6359l0089J5251K30270l9085j45336
2652e0758l0838J99625j35111N2299j9865R9151r363j93334M1990j89405M147
2641b31462m7433J06122J21807J07328O512L9105n1630J97358q2486j91036p4366
2630a00181J7692m0683J96141J11948k64575K27358L5946k41419l0971J51534
2620F2790j04593J05642j12512n8562O9537k1223J34789R3603k8578q4197j6641
2609D0055J72782L532j79061j1680j52315O0263j29711o2933m189P5938L79160
2598A91841k51100O9433J0478O893m9080P9869R4010p9609J47267J0371J4013
2587B44386l1766j22237j15326J92250p7516p068j86621J97841K8812j75238k4390
$$ y = [65544, 281163, 268043, 38979, -214006, -128128, -81769, -111858, -96607, 133663, 94578, -50758, -81596, 118029, -17082, 35217, 15352, 114503, 105140, -88194, -46204, -235609, -231462, -278895, -172773, -50966, 56362, 62874, 101979, 50349, 247707, 165221, -25815, -100181, -82489, -123172, 72969, 184917, -79658, 147700, 183646, -57773, -88744, 62790, -41803, 63839, -48673, -107235, -37698, -58921, 75868, 169471, 140893, 56696, 40055, 212837, 216369, 37308, 25628, -126687, -66424, -196135, -259068, -263257, -187319, 191841, -59259, 10174, 20652, 27545, -21535, 58334, 152344, 72735, 220002, 230373, 244386, 212620, 90383, -24943, 167307, 89791, 82723, -103898, 93943, 122755, -52483, -76873]
2576g6873m6795q202R6929J5901K6655J35293k14983j51573L0433J69197j50885
2565a74903q520O0670n1629O4236K3624O0501J34491L399j16297O2974j21804
2554f3258L1496p2241O6508J27787m897o4693J6563n4121K5002P1503M9178R8803
2542B27630j1906m1239j43241n2263l7069m5737m1071J2751O6413m7738J31289
2531A7819n84M4955N7794Q2758J7326n7533O8960o2662j71609O528m7208r136
2519e2592O347J6245J7389r1874J50524j17990J38427Q6698m2127m0826k9347
2508D0874M7103J82700L0436k00982j20476o8540O0237m2937J54541J9355K13109
2497C15420j96820k35229J82219j01191J65688q9283j26486K45979k5936Q9171
$$ y = [-76873, -123668, -131870, -34941, -19040, 7615, 142908, -72075, -223648, -193215, -24018, -174903, -183423, -122753, -174382, -110146, -86522, -26021, 108470, 111869, -4428, 58546, -63258, -31762, -104003, -37495, 90292, 85395, 20702, 37265, -16856, 8146, 79649, 128827, 227630, 215724, 174485, 31244, -21019, -58088, -103825, -144896, -132145, -65732, -113470, 17819, 17235, 62190, 119984, 202742, 220068, 162535, 231495, 168833, -2776, 3752, -43456, -52592, -46245, -30000, -12611, -104485, 46039, -71951, 66476, 153174, 111047, 70221, 40874, 87977, 270677, 301113, 100131, -20345, -88885, -28648, -71585, 82956, 102311, 315420, 118600, -116629, 65590, -35601, 130087, 40804, -85682, 160297, 134361, 223532]
2487B23532j82060k4215O7181J14736n2992M1201j18566k11014K24846j44524
2477f1875k44p4554J30215j23433j69164L8896P7437J21081J25146J48420O8154
2466B80079n1435j55853j69413n7686N7035J17513K3904j87175L8465J48284j57390
2455a13672r1703J12601M9938J48802j1145l3975j0400r1991j14225J64413r079
2444d36k52825K55983j5922j9442p7578Q2098K264k15354J82829m0474j07478
2433b06335J13306K834j58110r0481L56107n0776R1186O2945P8832k12416n8456
2422g1364J02226p7176q0627m3724K17312K7833j1278k13798J46621J76345j55843
2411A6527n4164j12340k4574K65210M2489k41894M9166O4298n0984o684J25516
$$ y = [223532, 41472, 17257, 84438, 199174, 146182, 187383, 68817, -142197, 82649, -61875, -62119, -136673, -6458, -129891, -299055, -260159, -182722, -61641, 63505, 211925, 280079, 228644, 72791, -96622, -154308, -97273, 20240, 44144, -143031, -104566, 43718, -113672, -205375, -92774, -42836, 105966, 94821, 60846, 50446, -41545, -155770, 8643, -436, -253261, 2722, -13200, -32642, -110220, -28122, -25858, -241212, -58383, -98857, -206335, -93029, -90195, -248305, -338786, 17321, -33455, 57731, 120676, 199508, -12908, -71364, 30862, -46314, -126941, -170665, 46647, 74480, 63202, -150596, -3975, 172370, 16527, -37637, -149977, -174551, 90659, 133148, -108746, -59580, 4718, -46266, -52950, 72566]
2400G2566r1229K9224R6670l1517K3756R0065k5195M2641k63048P3751K24485
2389B42169R2435O4483j58225Q6873J37757J36025j80403j33220j56164L7597
2379A69327J06395m2863p5106j83139Q6789m4714k3209K02718N4482k222n8567
2368A89891j52082k17244J10529K9456m5718J156N0107k9077J2860J8196M7642
2357A5716l5773K70033j72854k76733K23657n1277J063J56875j12289l8935L7309
2346A6792P0279l0033M8634Q3327n3230N5777r496K53j00275j0630J48987p8800
2334A41585m499Q5295l6495k6046O0702J87316j29308j66515R978j72110O2271
2323A2174l5395k10681R3302J56892r4138J62450J63902k03395J0684j20203J06846
$$ y = [72566, -18663, 10561, 107231, 75714, 99470, 189535, 164340, 206981, -56067, 17684, 242169, 334604, 399087, 240862, 327735, 465492, 601517, 421114, 287894, 131730, 169327, 275722, 232859, 157753, -25386, 61403, 16689, -6520, 196198, 250680, 248458, 189891, 37809, -179435, -68906, -39450, -85168, -84012, -33905, -62982, -50122, -31926, 15716, -20057, 249976, 77122, -199611, 24046, -27231, -26168, 130707, 18418, -20517, 16792, 87071, 57038, 105672, 188999, 135769, 191546, 182050, 182303, 82028, 71398, 220385, 141585, 137086, 222381, 185886, 159840, 220542, 407858, 278550, 112035, 122013, -50097, 12174, -23221, -233902, -140600, 16292, -77846, 84604, 248506, 45111, 55795, -64408, 42438]
2312D2438K12230j59576K2349R4962J31317r5399o2451k2076J36697j3435p4478
2301B12578O5871N5841q1559R643K09655J83464k64587m1040m9348j14495K21426
2290D07449J98974l19143j31867Q4669p3145J03407j44449m973Q6651m261L0812
2279B34124L1290l2204J0129k6614Q9831M5974j40063l9420K46788J0370k08479
2268B21726J3229J55100k39010n4100J37562L9243p9495P6714J2025M8433K73086
2257F04513k18794m6173J8732n6511J01122L56l9255j39921L72J8626J24222k0661
2245C46628n5835J03366K22569J2660k50911n6421J40474K02969o1195q463K9124
2234F24965q4363o8035J72191J25146L517J03209j08666K8232K2996j17257N3051
$$ y = [42438, 254668, 95092, 117441, 212403, 343720, 248321, 185870, 163794, 300491, 287056, 212578, 278449, 334290, 252731, 262374, 472029, 655493, 390906, 349866, 300518, 186023, 407449, 606423, 287280, 155413, 240082, 166937, 270344, 125895, 120922, 207573, 203312, 234124, 265414, 233210, 243339, 216725, 306556, 352530, 212467, 173047, 419835, 430205, 221726, 234955, 390055, 151045, 96945, 234507, 273750, 194255, 270969, 282994, 331427, 604513, 385719, 339546, 358278, 301767, 402889, 403245, 363990, 224069, 224441, 243067, 367289, 346628, 290793, 394159, 616728, 629388, 378477, 322056, 462530, 665499, 604304, 595841, 624965, 540602, 472567, 644758, 769904, 773421, 876630, 767964, 796196, 819192, 701935, 754986]
2223G54986L6983k48393n5923K69866K4468l8346K46605m5581j05018M821J41989
2212I86457O6111Q2481q6157K4883O6049k20026J39118K24762J31952n8513M3879
2201A400996O3173L5321n2822o4103Q8110n5122J57491J24806r9466P4180K36832
2190A909396J66888p797J64247q3057M1807Q7439P3899O0649J33320j2097J6122
2179B550816K43195J91715N5655q2192J90064R4910o3364n3841P6228K59083J35834
2168C598103p0843J85526M8596J10425q9867N7665J23768J87106N6202K12834
2158D419515K35981K03813J33366K69545J92683L16672K57585L19439L36455L67506
2148G052560K68257M61393J16466N58527M53433N03769M43244O30955Q00946J105450
$$ y = [754986, 791969, 543576, 487653, 757519, 781987, 743641, 990246, 944665, 839647, 844468, 986457, 1052568, 1135049, 1048892, 1073775, 1139824, 919798, 1058916, 1283678, 1415630, 1357117, 1400996, 1464169, 1499490, 1446668, 1382565, 1470675, 1415553, 1573044, 1697850, 1598384, 1672564, 1909396, 2076284, 2068487, 2232734, 2149677, 2191484, 2278923, 2352822, 2413471, 2546791, 2534694, 2550816, 2794011, 2985726, 3041381, 2959189, 3149253, 3244163, 3180799, 3126958, 3203186, 3462269, 3598103, 3527260, 3712786, 3761382, 3871807, 3781940, 3839605, 3963373, 4150479, 4206681, 4419515, 4655496, 4859309, 4992675, 5262220, 5454903, 5771575, 6029160, 6348599, 6685054, 7052560, 7320817, 7782210, 7898676, 8457203, 8910636, 9414405, 9857649, 10488604, 11289550, 12395000]
2138A2395000Q23940J121114J184784J589735J788898J875939J290044J559301
2130B3628755K393381L275778L632458M602485N666293P086288P855281Q798407
2122F6939126J0528644J3027231J4005100J5149150P359483j6516877k1544328
2115H8947529j9218639j4138059r474069o542385m711915m016201k982013k612702
2107B5251546k079226j779547j426155r99076r35465j417614j316329j285341
2099A4012793j071869o02876o36349o41582n42022n04819m73001n56666m73678
2090H509931k41912m20814m33926n1645l13824k25157k87091k11391j89642j62284
2080E972245l47132j64803l03170k00830j10622j41704j88916j65518l75783N1722
$$ y = [12395000, 13218940, 14340054, 15524838, 17114573, 18903471, 20779410, 22069454, 23628755, 26022136, 29297914, 32930372, 37532857, 43199150, 50285438, 58140719, 66939126, 77467770, 90495001, 104500101, 119649251, 127008734, 110491857, 88947529, 69728890, 55590831, 46116762, 39574377, 34862462, 30846261, 27864248, 25251546, 23172320, 21392773, 19966618, 18967542, 18032077, 16614463, 15298134, 14012793, 12940924, 12338048, 11701699, 11060117, 10518095, 10013276, 9540275, 8983609, 8509931, 8268019, 7847205, 7413279, 7361634, 7047810, 6822653, 6535562, 6324171, 6134529, 5972245, 5625113, 5460310, 5157140, 4956310, 4845688, 4703984, 4515068, 4349550, 3973767, 4025489]
2070D025489k72013q3541m6439k501j03100j31598j38045k6331j39069j87338
2060B895514n1495j49377J4654P5887j48798o9572j24322K7202R3073k42055j12395
2049B208316O762j47429r4908j8569R5023j4929j49199R6927j11667j94396N5306
2038A731237k00926J8419k65788j96281K53959o2613J4269j2469J41752m5713
2028A375846j39561J14882l45204m0904l4559J02894r9978O6487P4471O3701N9649
2017A197724j72347P2017Q4562L849m984j41861n8371K3242j44138Q823p1877
2006G96639k4007R5349m6366J5193J9214l4978q3897l5172j82717M020K56512
1995G79790Q7603l44595Q4435J04627M5435j01796j57588j27983M5267j9518j37077
$$ y = [4025489, 3753476, 3669935, 3623496, 3620995, 3517895, 3386297, 3248252, 3221921, 3082852, 2895514, 2844019, 2694642, 2709296, 2785183, 2636385, 2566813, 2442491, 2469693, 2562766, 2320711, 2208316, 2215078, 2067649, 1972741, 1954172, 2049195, 2034266, 1885067, 1981994, 1870327, 1675931, 1731237, 1530311, 1548730, 1282942, 1086661, 1340620, 1278007, 1292276, 1279807, 1421559, 1375846, 1236285, 1351167, 1005963, 965059, 930500, 1033394, 933416, 999903, 1074374, 1138075, 1197724, 1025377, 1097394, 1181956, 1185805, 1180821, 1038960, 980589, 1003831, 859693, 868516, 796639, 772632, 867981, 821615, 836808, 856022, 821044, 737147, 701975, 519258, 523278, 779790, 867393, 522798, 607233, 711860, 757295, 655499, 497911, 369928, 415195, 395677, 258600]
1984B58600K04411N8606K1891Q0784j20243O1133o3743J01021m9903P108o1893
1973D97772r5069J18665K296K9074j44007Q2129j00m833J6884l2036L0398j3944
1961D87229j5381p8705l8491k40592J3576J04218J7247Q1522J41803K28922j16077
1950E85271j74230l8048J65429j79380l4108l2520J12929j91367q721O7380J65200
1939D37835K41179p2891O9475M6411k43746j84444J12427k6321r9676n4196j95587
1928C0466p5407k5229K83994O0047R1835j13906j2445k1944p2279r5504K9610
1917G9238J69145M0583k20124j43059N3886K63953q680j15253N3176Q2561j44918
1906A10508j03209Q0806m9497R4303K39564j0843n1j27692j05838J2278m8642
$$ y = [258600, 463011, 521617, 543508, 624292, 504049, 565182, 501439, 602460, 552557, 559665, 497772, 402703, 521368, 523664, 552738, 408731, 490860, 490760, 485927, 502811, 470775, 501173, 487229, 471848, 393143, 354652, 114060, 127636, 231854, 249101, 330623, 472426, 701348, 585271, 411041, 372993, 538422, 359042, 324934, 292414, 405343, 213976, 205255, 272635, 437835, 679014, 606123, 675598, 722009, 478263, 293819, 406246, 379925, 280249, 226053, 30466, -44941, -70170, 213824, 273871, 365706, 251800, 239355, 217411, 145132, 49628, 79238, 248383, 288966, 68842, -74217, -20331, 243622, 234942, 119689, 172865, 255426, 110508, 7299, 88105, 38608, 132911, 372475, 361632, 361581, 233889, 128051, 140329, 91687]
1895I1687Q6247q9533J15674R648j9046j21798r2447N8813Q4186J56635k176j49053
1883A28837O3947k834n5234k2609j8660q188l6635r4628J2822J95418L0143n3792
1871A38587r4976k0976P4550N0838l0585q4867J20925P2503P6159J03864n9026
1860C46996q5120J1381J38935K803L4962k61871K89016J58250P1036J83224k44375
1849F45237M5940k3253J12426j64820n2419j16391j69824J21570o2619L0387o3673
1838C02561n9561l4658n1595j05360j75136K35182O1902l4905j21021K7913q7914
1827d2592P4887K956j62042L1969J10576K03312n4323j36728m641M0687j05545
1816d1484q8353L847o1937R4608Q0174l5244n9484J18834K08516n2883k67668
$$ y = [91687, 177934, 88401, 204075, 213723, 194677, 72879, -19568, 39245, 123431, 280066, 277890, 128837, 192784, 189950, 134716, 112107, 93447, 85259, 48624, -46004, -33182, 162236, 192379, 138587, 43611, 22635, 97185, 148023, 117438, 32571, 153496, 225999, 302158, 406022, 346996, 261876, 273257, 412192, 414995, 449957, 188086, 477102, 635352, 706388, 889612, 645237, 691177, 667924, 780350, 615530, 563111, 446720, 276896, 398466, 335847, 366234, 302561, 243000, 208342, 156747, 51387, -123749, 111433, 173335, 138430, 17409, 45322, -42592, 32295, 35251, -126791, -94822, 15754, 219066, 164743, 28015, 23374, 64061, -41484, -129837, -125990, -187927, -93319, -13145, -48389, -107873, 10961, 219477, 166594, -101074]
1805a01074J8249J21781J06056N6808q3187Q3753q0243j04794j3125q4967K37155
1794A56412Q7460P885L3874k54497r158K09313k5183P8023k47887j56604R9683
1783b0679J21118P2843p4785M266L5291r434o7426j498J1743J85490r0285j82577
1771a5933K7489j9962J24339K2269j74987L8763n6948p2060R1831R7633k152J11861
1759A72143M4592K8168j09425K6893J04175k44628J23049j00690K4785N9914M9480
1748A78456r1305N6950r8693m9093k5697l7624k8301K09482J66723k10423j18466
1737d7991j0031L6618O9481j4510k41441K39347M7015k91150p2020J80786J04506
1726F10J78329l0833J01724k17332l01306K07700J14527m5071m7728l3795Q5021
$$ y = [-101074, -82825, 38956, 145012, 201820, 118633, 202386, 122143, 17349, 4224, -80743, 156412, 243872, 251757, 285631, 31134, 21976, 231289, 206106, 284129, 36242, -120362, -20679, 100439, 173282, 98497, 102763, 138054, 128620, 61194, 59696, 71439, 256929, 166644, -15933, 11556, -8406, 115933, 138202, -36785, 1978, -54970, -127030, -35199, 62434, 60282, 172143, 216735, 244903, 135478, 162371, 266546, 21918, 144967, 44277, 69062, 128976, 178456, 87151, 144101, 45408, -3685, -29382, -67006, -95307, 114175, 280898, 70475, -47991, -58022, -21404, 48077, 33567, -207874, 31473, 78488, -212662, -284682, -103896, 610, 178939, 148106, 249830, 32498, -268808, -61108, 53419, 8348, -39380, -73175, 11846]
1715A1846O8583O783q2408r4117O591L2100K2673r7395k6297L15664J7752L8358
1703B20133o5196K3958P0822k0516k51342o8682J5290n0389J04215k15307j2242
1692b49256J87539P9380j46157J05920J02809j85833N1519K28476j71017j14037
1682a10657K28297j36611J2552P5179o5012q3342k9228L9858o8804O9042J93889
1671A25163k61415m1519Q4973j1386J69318j3195K1985K1546q4021j89646r6247
1660b74444L6941J3484J97663l9156N6151M5449j88356j8452J5454J97253J7159
1649E9146j20625J10499l1572j86688J78358k2963j7482p6730J8203P0617K6103
1638F866J48288r4643j69980l1832K42069L6358p1843p2205Q039j43769J33320
$$ y = [11846, 80429, 87212, 4804, -89313, -82722, -50622, -27949, -125344, -151641, 164023, 181775, 220133, 154937, 178895, 249717, 229201, -22141, -90823, -75533, -125922, -21707, -237014, -249256, -61717, 17663, -128494, -22574, 80235, -105598, -54079, 174397, 3380, -110657, 117640, -18971, -6419, 68760, 3748, -79594, -108822, -68964, -137768, -68726, 125163, -136252, -177771, -92798, -104184, 65134, 51939, 73924, 95470, 11449, -178197, -274444, -237503, -224019, -26356, -65512, -9361, 36088, -152268, -170720, -155266, 41987, 59146, -61479, 49020, 17448, -169240, 9118, -13845, -31327, -108057, -89854, -19237, 6866, 155154, 60511, -109469, -141301, 100768, 137126, 65283, -6922, 1117, -142652, -9332]
1627i332J25533L7980m7960J01935m6892n0223j20625P1663p7849j31830L3121
1616a14479m0625J79725j10826j9011m2314j31889N1875J1454j3799K23271J5196
1605H578L9310m4035j3926p2271K9468M8065R9398l2226R5500l1407k786p0458
1593E3210j02759P3438j30410Q8348J36201j2914R4209j06421m3875N9692J25965
1582B34684q1774J84214N931j76038k32826j29542Q9767J74256k9592r1549O7957
1571A5488J3007q8580L4933J12351p2307K1656n5388n3751J49828m5640M646J55418
1559A91661p1629K09215K6046k06466j67312N3133n3686J16735M2750l3842j91463
1548h4858o2699K8630N67O0556K11770l6506j21662N6532j58892n4968r563N2681
$$ y = [-9332, 116201, 154181, 106221, 208156, 161264, 111041, -9584, 62079, -15770, -147600, -114479, -155104, 24621, -86205, -105216, -147530, -279419, -227544, -216090, -229889, -6618, 8578, 47888, 3853, -10073, -82344, -52876, -4811, 94587, 62361, 157861, 126454, 123668, 53210, -49549, 23889, -106521, -18173, 118028, 105114, 199323, 92902, 49027, 108719, 234684, 152910, 337124, 343055, 167017, -65809, -195351, -105584, 68672, 39080, -52469, 15488, 28495, -60085, -25152, 87199, 14892, 36548, -18840, -72591, 77237, 31597, 36243, 191661, 120032, 329247, 355293, 148827, -18485, 34648, -19038, 97697, 140447, 106605, -84858, -147557, -118927, -118360, -57804, 153966, 117460, -4202, 52330, -106562, -161530, -171093, -118412]
1536a18412q9534J23518J21647j02580Q0466M0275j81611J36989J05366l4605
1526H1519j85290l0034J04232j06466l2713O4430k4956k1051J24666o1292r0943
1515a77898l1441j20387J56249J51621L1803j40953j23575J13697L0722J16064
1505E902P7670J82138J12644j95989k56007k18753J00974J31752o305R5728j8148
1494A1606M1763Q3123m1079q4474L3254j27915n8980Q4027m6608L27413r0999
1483A31131j38218L8770k22199N6113k7532R5065J58126j69055n0141J9285k1014
1472a29669K07758m4738J0590j1283j4599j2321p6299K6664l5769k3918o7812
1461a71396J47658N9710r9201J8640J59716M0840j31791J5174J18168O5250k05423
$$ y = [-118412, -207946, -84428, 37219, -65361, 15105, 55380, -126231, 10758, 116124, 81519, -103771, -133805, -29573, -136039, -168752, -104322, -129278, -150329, -25663, -86955, -177898, -209339, -329726, -173477, -21856, 9947, -131006, -254581, -140884, -110162, 5902, 83572, 265710, 378354, 182365, -73642, -292395, -191421, -59669, -65974, 29754, 11606, 53369, 136492, 95413, 10939, 44193, -83722, -142702, -58675, -105283, 222130, 131131, -7087, 31683, -190516, -134403, -161935, -66870, 91256, -77799, -127940, -108655, -129669, 78089, 33351, 43941, 32658, 18059, 5738, -70561, -43897, -79666, -103584, -171396, -23738, 35972, -63229, -44589, 115127, 155967, 24176, 39350, 157518, 222768, 17345]
1450A7345Q8173M0378l60928n5718p5198N4504J89528r865j05259J09320J46809
1439C9089j47646j37289Q6422N1634N9959J62445o3229j31881J4641M4623J13519
1428I2287j00050J06861j17426l800J96044k09763J3744j43682p374j8033J78873
1417a2319N8542k5115l7672r9467n5563J25347j36694k1704P7503J79982N095
1406E7935K6923j82773j55850M4009N3406M6726J60217R5899p4135l9262P3475
1395A06570J16199j33484o0314J16565p5020j48049J29392j13897J41169k9723
1385D9408k64779J5801L2709j18980K5118r7751J79501J07522J68328r3168q8796
1374h5087Q8234j68459l5950j01299R9827j03186q9313K08019L1323J16509J44104
$$ y = [17345, 105518, 145896, -215032, -270750, -345948, -291444, -101916, -111781, -217040, -107720, 39089, -108557, -245846, -159424, -107790, -47831, 114614, 51385, -80496, -65855, -21232, 92287, -7763, 99098, -18328, -22128, 173916, -35847, -22103, -165785, -173159, -191192, -12319, 46223, 21108, -16564, -116031, -171594, -46247, -182941, -204645, -127142, 52840, 57935, 84858, -97915, -253765, -209756, -156350, -109624, 50593, 146492, 72357, 33095, 106570, 222769, 89285, 28971, 145536, 70516, -77533, 51859, -62038, 79131, 49408, -215371, -199570, -166861, -285841, -260723, -358474, -178973, -71451, 96877, 3709, -85087, 3147, -165312, -201262, -302561, -202734, -305920, -395233, -187214, -155891, -39382, 104722]
1363A04722P8266j10358n3291K29093j29300q600N1702K362j06780J3144J14997
1352A85957o363o8975j73281O4257n5382J50580M8101J9831j30908R4817J78717
1341C07351j00876k03277j18666p047J9212K24501q1307M952K44772k54050j82326
1330a46761K747L3703o5853J1041J62864K22636m3625j36672j32024Q1673N4627
1319D4356m7055J12045j19118j1031Q0516j76724J62469J95031O9149r4941k43687
1308b8990L0171J65423o5779j73712m5856Q9630R0321j08919K38582j03762j21944
1297c4835K4377J8229o4829J63549R0360k0783j43442l7438J45769M0802j54957
1286B6802j17755K18708j09102k19158j97667J92864J0982L26439O6647q1021
$$ y = [104722, 182988, 72630, 19339, 248432, 119132, 110532, 162234, 164596, 57816, 70960, 185957, 179594, 110619, -62662, 1595, -53787, 96793, 144894, 164725, 33817, 128634, 307351, 206475, 3198, -115468, -122515, -103303, 121198, 39891, 44843, 289615, 35565, -146761, -144014, -110311, -176164, -165123, -2259, 220377, 176752, 40080, -91944, -10271, 44356, -2699, 109346, -9772, -20803, 59713, -117011, 45458, 240489, 309638, 214697, -28990, 1181, 166604, 100825, -72887, -118743, -29113, 61208, -47711, 190871, 87109, -34835, -10458, 7771, -57058, 106491, 196851, 176068, 32626, -4812, 140957, 181759, 26802, -90953, 127755, 18653, -200505, -398172, -205308, -194326, 132113, 198760, 117739]
1276A17739Q325M2041j40908k50725k8027L5946R180P6427O2399p4120K2284J24740
1264E301P9589o63j62978J03294J85312k26194k9958M2862L3029j1576L4009j2001
1252D0026M9559j74182K5202K8002k2667J05826j9680m981P9566M2364o6393j77557
1240i4915n8624K7298K0280l6853Q0568K5964p1499j34838J62500J84157k47k22750
1228a18959J06816r0455J3379k4341K1262o6109M0430r2964O7449J1952j32937
1217b64477J99830J49793n9116j93086J42914J91377k22786j24997J70140L2248
1207B1840j1564j11848k4538N8823J35328L6055Q8999k28851n2036K8048M2255
1196a7489J54201k708j12645P7526j33402m0554r5396J38482J52549j33161J29126
$$ y = [117739, 126064, 168105, 27197, -223528, -251555, -215609, -206429, -130002, -67603, -141723, -119439, 5301, 84890, 84227, -78751, 24543, 209855, -16339, -46297, -3435, 29594, 18018, 52027, 40026, 89585, -84597, -59395, -31393, -54060, 51766, 32086, 27105, 106671, 149035, 82642, -94915, -153539, -126241, -105961, -142814, -62246, -36282, -107781, -242619, -80119, 104038, 103791, -118959, -12143, -102598, -89219, -113560, -92298, -158407, -117977, -210941, -143492, -131540, -264477, -64647, 85146, 26030, -167056, -24142, 167235, -55551, -180548, -10408, 21840, 10276, -101572, -126110, -67287, 68041, 104096, 193095, -35756, -87792, -59744, -17489, 136712, 134004, 21359, 98885, -34517, -75071, -170467, -31985, 120564, -12597, 116529]
1185A16529n7016n3597j08047K5548J74647k7409r7487q7456J05823J43107M6056
1174A80698j81613k11764L9311K17111J09462j50365J1569m0507N1013j14879
1164h9964l6558L6144O6240R5467j82677p846Q3385J57722K93577k71262m5281
$$ y = [116529, 59513, 5916, -102131, -76583, 98064, 70655, -26832, -114288, -8465, 134642, 180698, -915, -212679, -173368, 43743, 153205, 2840, 14409, -26098, 24915, -89964, -126522, -90378, -24138, 71329, -111348, -119194, -35809, 121913, 415490, 144228, 98947]
$$ [...]
##END NTUPLES=NMR SPECTRUM
##END=
