##TITLE=1H_EC-3265(1-12)
 CDCL3
 8 sc, 
 13.12.2021
##JCAMPDX= 6.0         $$ Bruker NMR JCAMP-DX V2.0
##DATA TYPE= NMR SPECTRUM
##DATA CLASS= NTUPLES
##ORIGIN= UXNMR, Bruker Analytische Messtechnik GmbH
##OWNER= root
$$ XWIN-NMR		Version 3.5
$$ Mon Dec 13 10:48:06 2021 Russian Standard Time (UT+4h)  she@DPX200
##.OBSERVE FREQUENCY= 200.131346
##.OBSERVE NUCLEUS= ^1H
##.ACQUISITION MODE= SIMULTANEOUS
##.ACQUISITION SCHEME= undefined
##.AVERAGES= 8
##.DIGITISER RES= 18
##SPECTROMETER/DATA SYSTEM= spect
##.PULSE SEQUENCE= zg30
##.SOLVENT NAME= CDCl3
##.SHIFT REFERENCE= (INTERNAL, CDCl3, 0, 15.7171)
##AUDIT TRAIL= $$ (NUMBER, WHEN, WHO, WHERE, WHAT)
$$ ##TITLE= Audit trail, XWIN-NMR		Version 3.5
$$ ##JCAMPDX= 5.01
$$ ##ORIGIN= Bruker BioSpin GmbH
$$ ##OWNER= she
$$ F:/spectra/data/she/nmr/H-F/1/pdata/1/auditp.txt
$$ ##AUDIT TRAIL=  $$ (NUMBER, WHEN, WHO, WHERE, WHAT)
(   1,<2021-12-13 10:46:50.09 +0400>,<she>,<DPX200>,
      <created by zg, POWCHK disabled, PULCHK disabled
       configuration hash MD5:
       00 E9 B6 7A A2 85 ED C7 34 08 36 98 17 FE 4E 26
       data hash MD5: 16K
       4D 62 E6 E1 B0 53 C0 31 30 6C 5F 72 E5 F6 D2 9A>)
(   2,<2021-12-13 10:46:52.56 +0400>,<she>,<DPX200>,
      <Start of raw data processing
       efp BC_mod = 2 LB = 0.24 FT_mod = 6 PKNL = 1 PHC0 = -15871.08 PHC1 = 12.0008 SI = 16K 
       data hash MD5: 16K
       7E D7 E3 BC 0B 18 AA 86 7E E4 91 65 F4 69 23 FB>)
(   3,<2021-12-13 10:47:14.82 +0400>,<she>,<DPX200>,
      <pk PHC0 = -1.468733 PHC1 = 2.000001 
       data hash MD5: 16K
       83 0C 32 AC 59 A3 A1 44 10 B3 CA B6 61 64 9D 05>)
(   4,<2021-12-13 10:47:18.26 +0400>,<she>,<DPX200>,
      <abs ABSG = 5 
       data hash MD5: 16K
       C3 6E 44 0E BF AA 5F FB F0 42 F8 F3 FB 1B AE 3D>)
$$ ##END=
$$ 
$$ hash MD5
$$ 0E 49 2C 83 81 9B D1 67 D7 57 5F 13 D4 BC 9A 46
##$RELAX= 
##$RELAX= 
##$RELAX= 
##$RELAX= 
##$RELAX= 
##$RELAX= 
$$ Bruker specific parameters
$$ --------------------------
##$DU= <F:/spectra>
##$EXPNO= 1
##$NAME= <H-F>
##$PROCNO= 1
##$TYPE= <nmr>
##$USER= <she>
##$AMP= (0..31)
100 100 100 100 100 100 100 100 100 100 100 100 100 100 100 100 100 100 
100 100 100 100 100 100 100 100 100 100 100 100 100 100 
##$AQSEQ= 0
##$AQ_mod= 1
##$AUNM= <au_zg>
##$AUTOPOS= <>
##$BF1= 200.13
##$BF2= 200.13
##$BF3= 200.13
##$BF4= 200.13
##$BF5= 200.13
##$BF6= 200.13
##$BF7= 200.13
##$BF8= 200.13
##$BYTORDA= 1
##$CFDGTYP= 0
##$CFRGTYP= 5
##$CHEMSTR= <none>
##$CNST= (0..31)
1 1 145 1 1 1 1 1 1 1 1 1 1 1 1 1 1 1 1 1 1 1 1 1 1 1 1 1 1 1 1 1 
##$CPDPRG= <>
##$CPDPRG1= <>
##$CPDPRG2= <>
##$CPDPRG3= <>
##$CPDPRG4= <mlev>
##$CPDPRG5= <mlev>
##$CPDPRG6= <mlev>
##$CPDPRG7= <mlev>
##$CPDPRG8= <mlev>
##$CPDPRGB= <>
##$CPDPRGT= <>
##$D= (0..31)
0 1.2 0 0 0 0 0 0 0 0.06 0 0.03 0 0 0 0 0.0002 0 0 0 0 0 0 0 0 0 0 0 0 
0 0 0 
##$DATE= 1639378009
##$DBL= (0..7)
120 120 120 120 120 120 120 120 
##$DBP= (0..7)
150 150 150 150 150 150 150 150 
##$DBP07= 0
##$DBPNAM0= <>
##$DBPNAM1= <>
##$DBPNAM2= <>
##$DBPNAM3= <>
##$DBPNAM4= <>
$$ [...]
##$SUBNAM2= <"">
##$SUBNAM3= <"">
##$SUBNAM4= <"">
##$SUBNAM5= <"">
##$SUBNAM6= <"">
##$SUBNAM7= <"">
##$SUBNAM8= <"">
##$SUBNAM9= <"">
##$SW= 18.0517287032376
##$SWIBOX= (0..15)
0 0 2 0 0 0 0 0 0 0 0 0 0 0 0 0 
##$SW_h= 3612.71676300578
##$TD= 16384
##$TD0= 1
##$TE= 0
##$TE2= 300
##$TE3= 300
##$TEG= 300
##$TL= (0..7)
0 120 120 120 120 120 120 120 
##$TP= (0..7)
150 150 150 150 150 150 150 150 
##$TP07= 0
##$TPNAME0= <>
##$TPNAME1= <>
##$TPNAME2= <>
##$TPNAME3= <>
##$TPNAME4= <>
##$TPNAME5= <>
##$TPNAME6= <>
##$TPNAME7= <>
##$TPOAL= (0..7)
0.5 0.5 0.5 0.5 0.5 0.5 0.5 0.5 
##$TPOFFS= (0..7)
0 0 0 0 0 0 0 0 
##$TUNHIN= 0
##$TUNHOUT= 0
##$TUNXOUT= 0
##$USERA1= <user>
##$USERA2= <user>
##$USERA3= <user>
##$USERA4= <user>
##$USERA5= <user>
##$V9= 5
##$VALIST= <valist>
##$VCLIST= <CCCCCCCCCCCCCCC>
##$VD= 0
##$VDLIST= <DDDDDDDDDDDDDDD>
##$VPLIST= <PPPPPPPPPPPPPPP>
##$VTLIST= <TTTTTTTTTTTTTTT>
##$WBST= 1024
##$WBSW= 4
##$XGAIN= (0..3)
0 0 0 0 
##$XL= 0
##$YL= 0
##$YMAX_a= 138062
##$YMIN_a= -230908
##$ZGOPTNS= <>
##$ZL1= 120
##$ZL2= 120
##$ZL3= 120
##$ZL4= 120
##$ABSF1= 15.71824
##$ABSF2= -2.33361
##$ABSG= 5
##$ABSL= 3
##$ALPHA= 0
##$AQORDER= 0
##$ASSFAC= 0
##$ASSFACI= 0
##$ASSFACX= 0
##$ASSWID= 0
##$AUNMP= <proc_1d>
##$AZFE= 0.1
##$AZFW= 0.1
##$BCFW= 0
##$BC_mod= 2
##$BYTORDP= 0
##$COROFFS= 0
##$CY= -3
##$DATMOD= 1
##$DC= 0
##$DFILT= <>
##$DTYPP= 0
##$F1P= 0
##$F2P= 0
##$FCOR= 1
##$FTSIZE= 16384
##$FT_mod= 6
##$GAMMA= 0
##$GB= 0
##$INTBC= 1
##$INTSCL= 0
##$ISEN= 128
##$LB= 0.24
##$LEV0= 0
##$LPBIN= 0
##$MAXI= 10000
##$MC2= 0
##$MEAN= 0
##$ME_mod= 0
##$MI= 1.114404
##$NCOEF= 0
##$NC_proc= -7
##$NLEV= 6
##$NOISF1= 3.799351
##$NOISF2= 2.8
##$NSP= 0
##$NTH_PI= 0
##$NZP= 0
##$OFFSET= 15.71714
##$PC= 1
##$PHC0= -15872.55
##$PHC1= 14.0008
##$PH_mod= 1
##$PKNL= yes
##$PPARMOD= 0
##$PSCAL= 0
##$PSIGN= 0
##$REVERSE= no
##$SF= 200.130006886034
##$SI= 16384
##$SIGF1= 3
##$SIGF2= 2
##$SINO= 5.538805
##$SIOLD= 16384
##$SREGLST= <1H.CDCl3>
##$SSB= 0
##$STSI= 16384
##$STSR= 0
##$SW_p= 3612.71676300578
##$SYMM= 0
##$S_DEV= 0
##$TDeff= 16384
##$TDoff= 0
##$TI= <>
##$TILT= no
##$TM1= 0
##$TM2= 0
##$TOPLEV= 0
##$USERP1= <user>
##$USERP2= <user>
##$USERP3= <user>
##$USERP4= <user>
##$USERP5= <user>
##$WDW= 1
##$XDIM= 16384
##$YMAX_p= 451445148
##$YMIN_p= -1176394
$$ End of Bruker specific parameters
$$ ---------------------------------
##NTUPLES= NMR SPECTRUM
##VAR_NAME=  FREQUENCY,     SPECTRUM/REAL,   SPECTRUM/IMAG
##SYMBOL=    X,             R,               I
##VAR_TYPE=  INDEPENDENT,   DEPENDENT,       DEPENDENT
##VAR_FORM=  AFFN,          ASDF,            ASDF
##VAR_DIM=   16384,         16384,           16384
##UNITS=     HZ,            ARBITRARY UNITS, ARBITRARY UNITS
##FACTOR=    0.220516191357247, 1,           1
##FIRST=     3145.47137600525, 0,            0
##LAST=      -467.245387000529, 0,           0
##MIN=       -467.245387000529, -1176394,    0
##MAX=       3145.47137600525, 451445148,    0
$$ Real data points
##PAGE= N=1
##DATA TABLE= (X++(R..R)), XYDATA
$$ [...]
7812D9627q4084j21618k24907K77536L9350O4318r6402j42544j0756k08049p18865
7801a176394L44146P70710p8099l2079r4173J82980k8324J845N2145j22467k0622
7790b00332Q4542j08997K03711j37401L3072j5592O823L2444j00789K5644J20216
7779e6659Q1663j02000k27524J6055p3088k7813M800J90036M6796Q7027o751J81524
7767A14066l3226j02408O8531l31409j9999K21814K6733R8506r2260J37147J11912
7756A99407k35502q3161J03479o831O8984p9552p1815L943K3702J24354k82716
7745b35708q9490L29296m7607j52407J46765p6029j4584K05152J08366k50400
7735g6646j4318Q9147o8717j37878J16376j9194n1255k6226N5955R1120r0235
$$ y = [49627, -34457, -156075, -380982, -103446, -64096, 222, -96180, -238724, -249480, -457529, -1176394, -832248, -61538, -139637, -171716, -265889, -82909, -111233, -109388, -57243, -179710, -200332, -115790, -224787, -21076, -158477, -125405, -140997, -134174, -101730, -202519, -176875, -56659, 25004, -76996, -304520, -288465, -361553, -389366, -384566, -194530, -147734, -60707, -67458, 114066, 80840, -21568, 46963, -284446, -304445, -82631, -55898, 42608, -49652, 87495, 199407, -36095, -119256, -15777, -22608, 46376, -33176, -104991, -101048, -77346, 47008, -235708, -325198, 4098, -43509, -195916, -49151, -125180, -139764, 65388, 173754, -76646, -90964, -1817, -70534, -208412, -92036, -111230, -162485, -188711, -132756, -41636, -131871]
7724a31871J11110J74748o1369q7594n372k06634J07406J2678q0226J15165m1072
7713i3031K1767J04613o2337J7449p7280K888j24610j37263N2328J03746J4624
7702a77106J10633M1914L7124M069k170J02735j46077N8868m6175k43667K14384
7691d5468J43405k43541k14334N0945J92851J801k9014N3222k50010J0941J49836
7680a79366o4396J19698J55125j99944Q2887J05065J45281K8296k10855l3716
7670e1925R7475o3464K6756o8183n0000K29846j20687J72773l8282m3255l10383
7659b19329O4047J51898J37868K2241k30827k22707J19030K12864r3426J50001
7649I1660J72905k4688l2381j16250j12044J35808L4991j01039j19913q4160J83905
$$ y = [-131871, -20761, 153987, 92618, 5024, -348, -206982, -99576, -86898, -167124, -51959, -93031, -71264, 33349, -28988, -11539, -88819, -85931, -210541, -347804, -295476, -191730, -177106, -66473, -24559, 12565, 16634, 14464, 117199, -28878, 29990, -16185, -259852, -45468, 97937, -145604, -359938, -308993, -116142, -114341, -143355, -90133, -340143, -329202, -179366, -243762, -124064, 31061, -168883, -85996, 19069, 164350, 192646, -18209, -51925, 45550, -17914, 8842, -59341, -109341, 120505, -182, 172591, 134309, 91054, -219329, -155282, -3384, 134484, 156725, -74102, -296809, -177779, 35085, -58341, 91660, 264565, 239877, 207496, 91246, -20798, 115010, 150001, 48962, -70951, -155111, 28794]
7638B8794N5206k58928L4172J58638j44259j73140J26035K38256q3354o7916q1581
7627a68077o4801k7661J98988J48200k42400K4860n2321Q622J48813j03756M0134
7616h9399J7957j69341J55748K9405r3934K41683j8997m9726j41000J7347J04710
7605D453n9331j55364J40732M0520n8985n5391O8026m2233J15106R0104l4097
7594E3540M5657k07434M4934J0459k6802N6786K44507n7130j60829M3435m5908
7583A215R4917j2700j2340p6622J5968l888p2520P961j828K07538R3186j57156
7571H3731r6541J19537N2691J22677l01690O6087m9662j91965J80062J07315j64535
7560g2293r5791N1659J58300r5876p107M8058M0586j5136J14017R7515k20463
$$ y = [28794, 84000, -174928, -140756, 17882, -126377, -299517, -173482, 64774, -18580, -86496, -168077, -232878, -260539, -61551, 86649, -155751, -130891, -183212, -174590, -25777, -129533, -89399, -71442, -240783, -85035, -55630, -149564, 92119, 73122, 23396, -117604, -100257, 4453, -54878, -210242, -69510, -28990, -87975, -143366, -75340, -117573, -2467, 87637, 53540, 99197, -108237, -63303, -52844, -79646, -22860, 221647, 164517, 3688, 47123, 1215, 96132, 83432, 71092, -5530, 10438, 6550, -65970, -58009, -59837, 147701, 240887, 83731, -12810, 106727, 159418, 282095, -19595, 46492, -3170, -195135, -15073, 92242, -72293, -168084, -116425, 41875, -54001, -61108, -13050, 27536, 12400, 126417, 223932, 3469]
7549C469m2063O4825o0613L9814j23037N6840P2301L3671o0146j67969J46611
7538c6297J01306M4228n7826K9406k8625P3404J07276l8680j4813j18687j20820
7527f0128P8531j72590J34154n474J47542j13391J26763J49647j07704k4921N1764
7516B04193o2478J68946L3492j58269O845n2096n3822K68483J50234j91360K26581
7505E40749j31762l6778K09582m4749P3480K45136N7391j70254q0515L4648m60738
7494B36190o0813K30350R2309l3883j53524k06530J32045j90852L3722J24762
7484B03776M9951j02705j04219M7835Q2185j20984M5627q1720N0074J24453j2983
7473A81290o9330q1692P2867j04581Q5552J1759k3662j57946N3227K51985O4831
$$ y = [3469, -38594, 26231, -34382, 5432, -117605, -60765, 11536, 45207, -14939, -182908, -36297, 65009, 109237, 51411, 80817, 52192, 125596, 232872, 194192, 179379, 60692, -60128, 18403, -154187, -20033, -25507, 122035, 8644, 135407, 285054, 177350, 152429, 204193, 141715, 310661, 344153, 185884, 192729, 140633, 86811, 355294, 505528, 314168, 540749, 408987, 372209, 581791, 537042, 610522, 855658, 913049, 742795, 662280, 696928, 236190, 175377, 405727, 498036, 464153, 310629, 104099, 236144, 45292, 79014, 203776, 253727, 151022, 46803, 94638, 176823, 55839, 101466, 19746, 69820, 194273, 181290, 111960, 30268, 103135, -1446, 84106, 95865, 72203, -85743, -32516, 219469, 284300]
7462B84300r8915j8753l6556k4938o9274l9495Q0759N153n0364J01104K8090P6269
7450B37380k44313k07924K35529P9828P8554J62632Q7049j88626j8389n5125j04910
7439F1685J67878j11245j05495P7160N0219J07178k2595j5937O8704k9090m4603
7428B03859k0853o2060n6708M4670j2429k27156m59K03667k55958J32529n5980
7417a06878n370n9991K29957p4583r4402j8898l002J10161n2178L8977K41438
7406B05231j31413r0119k715K0753J19158k21328J22186J074Q4846J57358j3455
7395B51576k3682L837k0289m7406j6382K0904k04202N5912L53128j85894m4088
7384A43414J45301J8417j66653k3676o3212n3926L16232j9760q1392j39717j57246
$$ y = [284300, 185385, 166632, 130076, 105138, 35864, -3631, 77128, 82281, 31917, 133021, 161111, 237380, -6933, -214857, 20672, 100500, 179054, 341686, 428735, 240109, 221720, 166595, 61685, 229563, 118318, 12823, 89983, 140202, 247380, 224785, 208848, 277552, 248462, 203859, 183006, 120946, 64238, 108908, 96479, -130677, -131136, 72531, -183427, -50898, -106878, -112248, -172239, 57718, -16865, -111267, -130165, -133167, -23006, -75184, -36207, 205231, 73818, -16301, -19016, 1737, 120895, -100433, 21753, 22827, 107673, 265031, 251576, 227894, 231731, 211442, 164036, 147654, 168558, -35644, 20268, 373396, 187502, 143414, 288715, 307132, 140479, 116803, 53591, -335, 315897, 296137, 214745, 75028, -82218]
7373h2218L74552J77058k34725L7176k78418Q8742J27792j61985l9650J15135
7363A23459O3890O6683l7885K8700l0689m0321J50110k2869n5876k8270N3098
7352B70030J37045k02070l4832k5395J55818o0471R4083j81487m5182Q8689J08393
7341C04621N8390k5901p2562j06247P015p2352N4483j24177J33578J7605O940
7330A81393M5558Q5305n4551N2147L1383k0697j12357J51434k906k17101P6556
7319B16164J22218n1774r3594J46057P4744m6958m5573p0022j9290J7500K71374
7308E20846J449l1887r8574O4861r9601k9622m431M2091M5069K7156P9158N2223
7296E68738k3773P6420r1030o6687k23743j06277L03672J64J02257j5614q6383
$$ y = [-82218, 292334, 469392, 234667, 271843, -6575, 82167, 209959, 47974, 8324, 123459, 187349, 254032, 216147, 244847, 214158, 173837, 323947, 301078, 245202, 216932, 270030, 407075, 205005, 170173, 144778, 300596, 240125, 334208, 152721, 107539, 196228, 304621, 363011, 337110, 264548, 158301, 165316, 92964, 147447, 23270, 156848, 174453, 181393, 226951, 312256, 257705, 309852, 341235, 320538, 208181, 359615, 356709, 139608, 216164, 338382, 286608, 193014, 339071, 413815, 366857, 321284, 251262, 231972, 249472, 520846, 522295, 490408, 391834, 456695, 357094, 327472, 323041, 365132, 410201, 437357, 516515, 568738, 544965, 621385, 530355, 463668, 239925, 133648, 437320, 437484, 539741, 524127, 437744]
7285D37744P4527N4544k35180L1368L5186J74867J1917J26009O8689k09184j69440
7274D01047K17553p6129j68110K21821j421J04562p089n9075Q6222N0521j72688
7263E97214m2336R9474r9788m7832J59067O2724j07048l9634j17595P1622l6932
7252D98936N3995J37351J90342k5256k7779k0106P796L8238l8961J0492r1544
7241G33504l7666J1592J79494J90117J05720q326k95408k7896K24331N9965j95950
7230I39477j49324Q2999K05787m136r8237O5144Q3599N28O1858j6657J25677q341
7218A288374j0228p2953j99062J51603O1766J9294l1518K39762J54816J8210P1801
7207A691865R7514o0955J20943O1820O7490j98029O9273K32058q7703m7148J64534
$$ y = [437744, 512271, 566815, 331635, 363003, 398189, 573056, 584973, 710982, 779671, 570487, 401047, 618600, 542471, 374361, 596182, 594761, 699323, 692234, 633159, 719381, 769902, 597214, 554878, 654352, 554564, 506732, 665799, 728523, 621475, 581841, 464246, 535868, 498936, 552931, 690282, 880624, 855368, 827589, 807483, 815279, 853517, 814556, 825048, 733504, 695838, 707430, 886924, 1077041, 1182761, 1174435, 879027, 851131, 1075462, 1135427, 939477, 790153, 873152, 1078939, 1074803, 976566, 1041710, 1125309, 1125837, 1187695, 1171038, 1296715, 1288374, 1278146, 1205193, 1006131, 1157734, 1219500, 1238794, 1207276, 1447038, 1601854, 1620064, 1691865, 1789379, 1728424, 1849367, 1911187, 1978677, 1780648, 1849921, 2081979, 1994276, 1947128, 2111662]
7196B111662J713r0432J47351K4021L7578L15680j72961j13290K10917P6575m3681
7185B505133K53194j7306k49251Q4305K17898K07060l6958L2483l4102q1504J85954
7174C066906n047P9743M8197r6367J18279L987K3851J43621N0440J07538K83542
7163C824690j460r6200K39862J30446L3570J8303J47090N3211J49463j11144l9954
7152D347877J46183j1774N8230o1755J49362J70638K09745m0182K83048L68049
7142E619421K87002J27191K75628K91559M00081M83159K34222J35977O13895M74957
7132H943092N21885M80076M60649N60151N08152P62680Q47696M78094P25781J021127
7122A5309383R76735J003349J301530J691276J959526K180798K328431L260410
$$ y = [2111662, 2113375, 2022943, 2170294, 2194315, 2231893, 2547573, 2374612, 2261322, 2472239, 2548814, 2505133, 2758327, 2741021, 2491770, 2576075, 2793973, 3001033, 2964075, 2996558, 2962456, 2880952, 3066906, 3061859, 3141602, 3189799, 3093432, 3211711, 3215698, 3239549, 3383170, 3433610, 3541148, 3824690, 3823230, 3727030, 3966892, 4097338, 4130908, 4149211, 4296301, 4349512, 4498975, 4387831, 4347877, 4494060, 4482286, 4540516, 4478761, 4628123, 4798761, 5008506, 4968324, 5251372, 5619421, 5906423, 6033614, 6309242, 6600801, 7000882, 7484041, 7718263, 7854240, 8468135, 8943092, 9464977, 9945053, 10405702, 10965853, 11474005, 12236685, 13084381, 13562475, 14288256, 15309383, 16286118, 17289467, 18590997, 20282273, 22241799, 24422597, 26751028, 30011438]
7114C0011438L813446M565162N269927N557025O595868P426324Q338150R721228
7106H1298568J1322993J2580373J2996454R097598K262792o024286j3619753j6530608
7098I3384131j6088488j3377431j0582247p483405n446964m343496l571403l043169
7090B9447528k475857k280114k101871j936241j674053j292616j301160j267531
7082A5118085r90701q10896o47985p17430p52958m88786l35966m45471n10174
7073I417718j71190l96146k40694l46459j93442k15838l73369m2854j94486k71165
7063F972075l51167k10053Q430m6055j74072l88877j65075j81928j92159l3871
7053E237248l9831r6007l12799k96347J07492j04667j62162L1375j2954J40991
$$ y = [30011438, 33824884, 38390046, 43659973, 49216998, 55812866, 63239190, 71577340, 81298568, 92621561, 105201934, 118198388, 127295986, 129558778, 123534492, 109914739, 93384131, 77295643, 63918212, 53335965, 45852560, 40405596, 36062100, 32490697, 29447528, 26971671, 24691557, 22589686, 20653445, 18979392, 17686776, 16385616, 15118085, 14127384, 13316488, 12668503, 11951073, 11198115, 10709329, 10373363, 9927892, 9417718, 9246528, 8850382, 8609688, 8263229, 8069787, 7853949, 7480580, 7437726, 7243240, 6972075, 6620908, 6410855, 6419285, 6373230, 6199158, 5810281, 5645206, 5463278, 5271119, 5237248, 5197417, 5101410, 4788611, 4492264, 4599756, 4495089, 4332927, 4364302, 4351348, 4492339]
7043D492339J92222Q625L2553r7822k26153Q7309r9318l88239l66580k95687j43430
7032C195819N9317l11458k07644k14263K01437P580l11395J13981O3434m7246
7022B549562j55494k07425J16654l9001k41452J07981R7771l9614j06839j55866
7012A926277k49217m7859P0678o0994o8038O8779r2925k8927Q7170o8373p8335
7001A458236j64597k19831P8886J37132K3249J40856j78570Q521j59170m2681
6991A082031k8478j10522Q4758R1415o2647r8629K74563j97790N6385m2859k49116
6980G99111J04256P0401n8110Q4768o0064O1193j76644o6420k1547p9231J78368
6969H36081j03836L7751j79201j2576j00837J9859k0744k37207J46514K20546
$$ y = [4492339, 4684561, 4693186, 4725739, 4627917, 4401764, 4489073, 4389755, 4001516, 3634936, 3339249, 3195819, 3255136, 2943678, 2736034, 2521771, 2723208, 2730788, 2419393, 2533374, 2596808, 2549562, 2394068, 2186643, 2303297, 2264296, 2022844, 2130825, 2228596, 2188982, 2082143, 1926277, 1677060, 1629201, 1699879, 1638885, 1570847, 1639626, 1546701, 1517774, 1604944, 1536571, 1458236, 1293639, 1073808, 1152694, 1289826, 1313075, 1453931, 1275361, 1283882, 1124712, 1082031, 1053553, 943031, 1027789, 1119204, 1056557, 957928, 1232491, 1034701, 1091086, 1048227, 799111, 903367, 973768, 915658, 1000426, 940362, 1001555, 824911, 758491, 736944, 657713, 836081, 732245, 769996, 590795, 578219, 477382, 497241, 476497, 239290, 385804, 606350]
6959F06350n6546q1531R5428J21739O9943k9406o7208O1707k85691J4742K96987
6948G46514m8279j57013M8447j5279j35442l9039n0542j13477q0420M1527J93699
6937C90696K91975k75711k97096l5885J33301j8450N7176n0159M8459O443J1876
6926B62625j38838M2392K26607j70884N5809Q9268M7123j03436l6274j55054J36656
6915B55994J44238k16782J92135J3917k6929r2652n5719J10050L3351r7961j83074
6904G6568O9560O7758l1398m567J43893j60497P8687k32296j772O5839J59305
6893B31080K73387O5957o5423j84858r4590m1706J7949k4964l7855J8773J0113
6882A67863J12364J14784r7874j086j23955J98030J18708l46251J57208n5278
$$ y = [606350, 549804, 468273, 563701, 685440, 755383, 725977, 658769, 720476, 434785, 449527, 746514, 698235, 541222, 589669, 574390, 438948, 399909, 349367, 235890, 155470, 196997, 390696, 682671, 406960, 109864, 73979, 207280, 188830, 246006, 195847, 244306, 250749, 262625, 123787, 166179, 392786, 221902, 277711, 366979, 414102, 310666, 274392, 119338, 255994, 400232, 183450, 375585, 389502, 362573, 269921, 214202, 324252, 357603, 259642, 76568, 146128, 213886, 182488, 177921, 321814, 161317, 240004, 7708, 5936, 71775, 231080, 504467, 570424, 505001, 320143, 225553, 183847, 201796, 176832, 138977, 157750, 167863, 280227, 395011, 297137, 296051, 172096, 370126, 488834, 142583, 299791, 244513]
6872B44513J59611M6770k33851j21165j403J45707J12039J24308k14176Q5955
6862C48308j0608j8909J73083m2856k15414j03635q4756L2824K10428O4914p6061
6851B77318m6679m9097K81336l2521R7909k36516p1879J10148o7995j287p0504
6840A90233j65491K09581k2764O0100j12765r0388K5870P601R5681J91015O5893
6829D54566q231k15200n6139K2386j19159m2578J11791J92083j46889M4053j19077
6818A17606p8101R8070j22122J40287K5437o5862J40256j23021K51310n372j54533
6807B23955l2214j4751q7344l9421n9130Q5824J65118O3742r6204k0850m2123
6796A46602J55991r2476k69303k0147Q9791K21079j12284j00209J44434R270j03245
$$ y = [244513, 404124, 450894, 217043, 95878, 94475, 240182, 352221, 476529, 262353, 348308, 337700, 318791, 491874, 449018, 233604, 129969, 45213, 78037, 288465, 353379, 277318, 230639, 181542, 462878, 430357, 528266, 291750, 219871, 330019, 262024, 260737, 190233, 24742, 234323, 211559, 271659, 158894, 68506, 94376, 101977, 197658, 388673, 454566, 446335, 231135, 174996, 197382, 78223, 35645, 147436, 339519, 192630, 236683, 117606, 39505, 137575, 15453, 155740, 181177, 115315, 255571, 132550, 383860, 378488, 223955, 191741, 176990, 89646, 50225, -8905, 76919, 242037, 305779, 209575, 188725, 146602, 302593, 210117, -59186, -79333, 10458, 231537, 119253, 19044, 163478, 172748, 69503]
6785F9503k42480J28056M2473Q0160j15925K2770l0401k361Q7331J45291O4881
6774B49298j56065l8745k08561o4295K56547J16641j55451P0401K6189N9679o7
6763A55571j4720q1635K2492J52844m9332J26366M939o6358k02999l5853r7189
6752h5874K6340N6800J82852n1512k85397Q4610R9560m7786P1773O5519J52701
6741B69586j31918o9680M9061q7463K15394p3841P793m438L1510n4395l6920N8332
6729A73021j44774M7621J11799p1090L9932j48607j14686L4014J47816J29187
6719B04233L4160k68207Q1631J68758J25878j08543l7207m1518J36441J61207
6709D56833l2614m7421K9730J03428q9054M616L9435r9820J71927J73629p1518
$$ y = [69503, -172977, -44921, -2448, 77712, -38213, -15443, -45844, -48205, 39126, 184417, 249298, 93233, 54488, -154073, -218368, 38179, 154820, -631, 69770, 95959, 155638, 155571, 140851, 59216, 81708, 234552, 185220, 311586, 316525, 250167, 47168, 11315, -85874, -59534, -2734, 180118, 128606, -156791, -72181, 27379, -20407, 51366, 116885, 269586, 137668, 67988, 117049, 29586, 244980, 171139, 178932, 174494, 206004, 151609, 114689, 173021, 28247, 75868, 187667, 116577, 156509, 7902, -106784, -72770, 75046, 204233, 238393, -29814, 51817, 220575, 346453, 237910, 200703, 159185, 295626, 456833, 424219, 376798, 406528, 509956, 420902, 425518, 464953, 365133, 537060, 710689, 639171]
6698F39171j88790k0925n5444P8418L1473k54495j70585J44798J82363p2706k45075
6687F8203j21494K85861q103j27051N4772p3155o965j5135n1307K87965j53993
6676A39598j50524J39880m2135Q2203M3647j74645o200j4459J21130m7514Q1402
6665A72383M5051m4931j4522j50639J39519j353r2046n0113L1986L57261j08668
6654B83928j16300k84699o1165J57302K05153N9527l7438P5968j15995k61428
6644i5147J16787K88289k04575j12611o921J04497o0420J0448j15972J00446K80322
6633C05143j98766q1560m1604O781k0507p4928J6063n2100l8571m7228Q8138J00418
6621c8721j85153J94112J62307o4345J19798n738j67896N0788l3106l33449J29027
$$ y = [639171, 450381, 429456, 374012, 452430, 483903, 229408, 58823, 203621, 385984, 313278, 68203, -53291, 232570, 224467, 97416, 152188, 79033, 72068, 56933, 5626, 293591, 139598, -10926, 128954, 86819, 169022, 212669, 38024, 31824, 17365, 138495, 90981, 172383, 217434, 172503, 157981, 7342, 146861, 145508, 53462, 3349, 35335, 392596, 283928, 167628, -117071, -178236, -20934, 184219, 243746, 206308, 282276, 166281, -95147, 21640, 309929, 105354, -7257, -14178, 90319, 29899, 40347, -75625, 24821, 305143, 106377, 24817, -16787, -10006, -30513, -105441, -89378, -141478, -180049, -227277, -139139, -38721, -223874, -29762, 132545, 68200, 187998, 182260, 14364, 65152, 32046, -301403, -172376]
6610a72376j75271K09952J76860n1195j2783J01054J23017j20340K87J7085L7364
6599A33654K7937o1631O2485j44205P2743J5997k1543R5071j75027k37589K73743
6588D1635o7066o2539K74601j27545O5947J11140r2707n498J81673m7489r7020
6577A75132q973N9858j72400K2216J85633R9698j05131j52981J82379R951l28310
6566c2928j30925J96343R2365j83374k7975k4142R4711M0168O2658J37086j54890
6555F9097j10532q3597J85605N8185l4886k09141J66577J69789q7679Q1305M3787
6544B48510Q7312m11406Q1990m5391L59915K7052j19773J13449k57885J52326
6534B36099j84686Q1830R8446j77517J968K56126J31063j41488J27642j0673j39962
$$ y = [-172376, -347647, -137695, 39165, -12030, -24813, 76241, 199258, 78918, 79205, 96290, 133654, 161591, 99960, 162445, 18240, 90983, 106980, 85437, 180508, 5481, -232108, 41635, -25431, -87970, 186631, 59086, 125033, 236173, 143466, 137968, 319641, 272152, 175132, 166159, 226017, 53617, 75833, 261466, 361164, 256033, 103052, 285431, 295382, -32928, -163853, 32490, 124855, -58519, -86494, -110636, -15925, 24243, 86901, 223987, 69097, -41435, -125032, 60573, 118758, 83872, -125269, 41308, 211097, 123418, 204723, 248510, 335822, -75584, 6406, -38985, 320930, 347982, 228209, 341658, 83773, 236099, 51413, 133243, 231689, 54172, 56140, 312266, 443329, 301841, 429483, 418810, 278848]
6523B78848j73920J63924K3332n1995J9646r0649R0313p963j85234r462N4158
6512A10998o1410J49703O8275j65557K0644P0666l2369j24219P8275R5353j27195
6501H3164M7591j49370l9296N09559K9607m2451r5158k764l574q1052L6514j76363
6489A16407p3239Q4044l0411k1734q17J41177K32310j10098J97609p5254j06086
6478C53908j3907j2780M9615P3651j88027M6183O1124j28590n0657Q7522J1591
6467B89633k1495o3870n7657o5286j7067J14130J93919j31451j76587J26975m7334
6456A43910L5030J01675j48247p2030J40525m7403P367k3580P2577j02177J38122
6445B45769r0732m0987J42528K739k07702q2134K57335k3313o2408K3935q4397
$$ y = [278848, 104928, 268852, 292184, 240189, 259835, 169186, 259499, 251536, 66302, 56840, 110998, 49588, 199291, 267566, 102009, 122653, 193319, 160950, 36731, 115006, 210359, 83164, 130755, -18615, -57911, 451648, 481255, 438804, 343646, 340882, 337308, 256256, 292770, 116407, 43168, 127212, 96801, 75067, 74250, 215427, 447737, 337639, 535248, 459994, 353908, 340001, 327221, 376836, 450487, 262460, 308643, 369767, 241177, 190520, 278042, 289633, 268138, 204268, 146611, 81325, 64258, 178388, 372307, 240856, 64269, 191244, 143910, 178940, 280615, 132368, 60338, 200863, 153460, 160827, 137247, 209824, 107647, 245769, 155037, 114050, 256578, 259317, 51615, -30519, 226816, 203503, 141095, 165030, 80633]
6434H0633J00629k3256J40155j60988M4927K13480m2008n3337R9106j4640k64020
6423A20681K17196O1079l7197k61135J06494j197p9306N3640n9310O0770J16582
6412B98297p294Q4431K0028j91784R6229R296J94818k4832j00801q9722j48122
6401A40544J1082O9591J60868r3640J5798p3649P7801p1446m5016K43234J25321
6390E60488j24443n5598r149L4529R0755q8456Q6834K13534q7334p1721k14288
6379C35151r7050l1541J57937l3498N7154R068P6478m0126L4607P8601K2097j55915
6367D12963K7021j2494L295n580j28014j7455J13801J41862j18883J17984l6557
6356D97943J57882j9777J22781N9563j25184O6849m8599j00501q1931J02915J56861
$$ y = [80633, 181262, 158006, 298161, 137173, 182100, 395580, 353572, 300235, 399341, 384701, 120681, 337877, 398956, 361759, 100624, 207118, 205921, 126615, 180255, 120945, 181715, 298297, 291003, 375434, 395462, 203678, 299907, 309203, 504021, 479189, 378388, 288666, 140544, 151626, 221217, 382085, 288445, 304243, 230594, 308395, 236949, 191933, 435167, 560488, 436045, 380447, 371298, 405827, 496582, 408126, 494960, 708494, 621160, 549439, 335151, 238101, 206560, 364497, 330999, 388153, 397221, 473699, 433573, 468180, 546781, 568878, 412963, 439984, 427490, 430785, 425205, 297191, 279736, 393537, 535399, 416516, 534500, 497943, 655825, 636048, 758829, 818392, 693208, 760057, 711458, 610957, 529026, 631941, 788802]
6345G88802j85241N2732K09880M653n9923O8340k66710l0795J77846J3630j56309
6334F16905J31836J18527o9724q9206K29137L0128j91136L9489J69725Q2139k1308
6323A046512q0540Q4514K69252R4581m7575j74967r5362j06400p592N1918o3925
6312I70416p0515P8648j14020n2343P5676Q2360K0001j2430j19754N1233J3591
6301I22863m7061p0102k8882N93j06092L613j01793M0665J97054r0989J52540
6290H72409k3592j55009J32795j0733j16373j06581J86697m3712q5089K8710K7391
6279G06913J1548Q1229l0757L5614j24372j49745L9087J35803j63116K01571j60341
6268E83434J7817L04234N7608j85460j42946J51940o4509o6855k5887n4341J50197
$$ y = [788802, 603561, 656293, 866173, 870826, 810903, 879243, 612533, 581738, 759584, 773214, 616905, 748741, 867268, 797544, 708338, 937475, 967603, 776467, 815956, 985681, 1067820, 1046512, 965972, 1050486, 1319738, 1414319, 1366744, 1191777, 1096415, 990015, 982423, 1034341, 970416, 899901, 978549, 864529, 812186, 887862, 970222, 990223, 977793, 858039, 909272, 922863, 875802, 805700, 776818, 777411, 671319, 674932, 573139, 613804, 810858, 719869, 872409, 848817, 693808, 826603, 815870, 699497, 592916, 779613, 735901, 650812, 679522, 706913, 718461, 799690, 768933, 804547, 680175, 530430, 569517, 705320, 542204, 743775, 583434, 601251, 905485, 963093, 777633, 634687, 786627, 722118, 655263, 629376, 575035, 725232]
6257G25232K7502O4992k213j26016M6132n4036R6708L0730j06730l3145R93K36763
6245I06912J20632j9608p5972R341k0536j0251Q563J32300R6972K48918j21751
6234A275520j16275q1140j1860L01012k28947l2201j01621K82993n9904m3925
6224A183652P1392j43044n4256Q2442J95692j15987q4145J41607J39013o6611
6214A349755j67077J22730l3497L2539o576J14119L5693r8250n9277j2058J31766
6203A409867O2828J6035K35513J38794J05767k20723r4694j98157J35543R1317
6193A682090l3968O1293O8095J12571J68291p2209R8256j6937q838k27057j18362
6182A713225P7176R4083J10487R2279j511m2152K4828P8009p8043k05559J98457
$$ y = [725232, 752734, 817726, 815513, 689497, 735629, 681593, 778301, 809031, 702301, 669156, 670149, 906912, 1027544, 1007936, 931964, 941305, 920769, 910518, 919081, 1051381, 1148353, 1397271, 1275520, 1159245, 1078105, 1066245, 1367257, 1138310, 1106109, 1004488, 1287481, 1227577, 1183652, 1255044, 1112000, 1057744, 1140186, 1335878, 1219891, 1135746, 1277353, 1416366, 1349755, 1182678, 1305408, 1271911, 1304450, 1297874, 1411993, 1447686, 1349436, 1290159, 1278101, 1409867, 1472695, 1488730, 1724243, 1863037, 1968804, 1748081, 1653387, 1455230, 1590773, 1682090, 1648122, 1709415, 1777510, 1890081, 2058372, 1986163, 2084419, 2067482, 2058644, 1831587, 1713225, 1790401, 1884484, 1994971, 2087250, 2085739, 2043587, 2068415, 2146424, 2068381, 1862822, 2061279]
6171B061279K02354o9291j69848p6594k1061K44783O7379r7046O4128K2217L266
6160B231566J26447l8983O7735k05482K3129K18556j19614m0512K5795p0051l1017
6149B187569J68515m6944M0327k6606J24081m5058j34700K18595r1459L9180j2870
6138B420630k9098n410o8006Q9784J08527k5994J2476n663K9766J98529m690j67503
6126B553348L18176P448o7873q3101J05022J06066p5585R8274J10663j13143k1649
6115B937646n5546l974K14697J60168K00111J06066j39558L15974P1466J1086
6105C818136r0641j169L8490K0398J1714K69445O8077J1123K7432Q0626J33054
6094D386685P9039N0323K0842J58589J73387J21041J52991J39131J05371N0989
$$ y = [2061279, 2263633, 2194342, 2024494, 1947900, 1926839, 2171622, 2239001, 2141955, 2206083, 2228300, 2231566, 2358013, 2319030, 2386765, 2181283, 2204412, 2422968, 2303354, 2262842, 2288637, 2218586, 2187569, 2356084, 2309140, 2349467, 2322861, 2446942, 2401884, 2267184, 2485779, 2394320, 2433500, 2420630, 2391532, 2386122, 2318116, 2407900, 2516427, 2490433, 2502909, 2497246, 2527012, 2725541, 2720851, 2553348, 2871524, 2878972, 2811099, 2727998, 2833020, 2939086, 2863501, 2961775, 3072438, 2959295, 2937646, 2882100, 2878126, 3092823, 3252991, 3453102, 3559168, 3419610, 3735584, 3807050, 3818136, 3727495, 3726326, 3764816, 3785214, 3796928, 4066373, 4134450, 4145573, 4173005, 4253631, 4386685, 4465724, 4516047, 4536889, 4695478, 4868865, 4989906, 5142897, 5282028, 5387399, 5438388]
6084E438388J21129L14120M5877P0903K58619J19322J87699j07232J35234L00688
6074F884747K23069J54827J24204J86503K18794K56883r5032K09194m8703o9154
6064H045332J78809O952L13628J84991n2421K63154L43930K22913K08235j04002
6054I611521K09827K22460J04210L45213L24741J66781K42583O62493K63741L91044
6044A2544614N74999M53822M06338Q84659N18308N14979P55197N73741J03868
6035A7330525J35900K54130O31077M33673O59995P65586P86839P03693P82608
6026B2484026J125890R86836J393353J635217J560526J625917J965663K008696
6018C4786124K395082K908121L329749L766134L953588M074914L075427J560825
$$ y = [5438388, 5559517, 5873637, 5919514, 5990417, 6249036, 6368358, 6556057, 6448825, 6584059, 6884747, 7107816, 7262643, 7386847, 7573350, 7792144, 8049027, 7953995, 8163189, 8114486, 8045332, 8224141, 8231093, 8544721, 8729712, 8677291, 8940445, 9284375, 9507288, 9715523, 9611521, 9821348, 10043808, 10148018, 10493231, 10817972, 10984753, 11227336, 11889829, 12153570, 12544614, 13119613, 13573435, 13979773, 14864432, 15382740, 15897719, 16652916, 17226657, 17330525, 17466425, 17720555, 18351632, 18785305, 19445300, 20210886, 20997725, 21701418, 22484026, 23609916, 24596752, 25990105, 27625322, 29185848, 30811765, 32777428, 34786124, 37181206, 40089327, 43419076, 47185210, 51138798, 55213712, 58289139, 59849964]
6010E9849964P73228K23616K3136k6584P2989J81533n9573k45889K51330N07471
6000F1551221P88953J555660J954087K379741K753613L129824K907520K779395
5992G9800014K916108L087150L466926L957182M840508N762427N946719L993877
5984A13770911r98423m628614o576333o392636m570140l621819k738373k313075
5976H1931498j921024j728150j565836j957681k306444k350433k180902k020174
5968F5900854j826178j003696r14802q45971q28526p77487q55182p64010p34692
5959E7350310r83308j412052k688504l662783l984898l548499l057194k555248
5951C5457824k063932j562511j213255p98477q27477p12400o39635l32564o63618
$$ y = [59849964, 60623192, 60846808, 60869944, 60843360, 60916349, 61097882, 61038309, 60792420, 61043750, 61551221, 62340174, 63895834, 65849921, 68229662, 70983275, 74113099, 77020619, 79800014, 82716122, 85803272, 89270198, 93227380, 98067888, 103830315, 109777034, 113770911, 112772488, 108143874, 101567541, 95174905, 90604765, 86982946, 84244573, 81931498, 80010474, 78282324, 76716488, 74758807, 72452363, 70101930, 67921028, 65900854, 64074676, 63070980, 62156178, 61310207, 60481681, 59704194, 58849012, 58085002, 57350310, 56367002, 54954950, 52266446, 48603663, 44618765, 41070266, 38013072, 35457824, 33393892, 31831381, 30618126, 29819649, 28992172, 28279772, 27640137, 27307573, 26643955]
5942B6643955q77164q48173o98637n96594q28523m16022k36798m29776m24512
5933B1287756j48931j95768k19388q2126k34242k01892j27694n47409l35522N1551
5923A9246335j72704k1872n9528k45359O8717j6653J27474O1517j41574K3100
5913A8869453L21773J75115Q2369L01421J85027K52349K86501M90936K07342L21436
5903B1493722L55273J51909L52737L38566M29618P11691O47818N61242Q79840
5894B5922416P12883Q60449J229283Q64530J164365J275242J495371J487073J809328
5885C6820940K162554K546069K724044L171512L539302L476056L024848K474989
5877E9940314J310901N15185N75779L01931O88138Q90581J060082J235496J612853
$$ y = [26643955, 25766791, 24918618, 24219981, 23623387, 22794864, 22378842, 22142044, 21712268, 21287756, 21138825, 20943057, 20723669, 20641543, 20407301, 20205409, 20077715, 19530306, 19194784, 19246335, 19073631, 19051759, 18992231, 18746872, 18815589, 18798936, 18926410, 18987927, 18846353, 18869453, 19191226, 19366341, 19448710, 19750131, 19935158, 20187507, 20474008, 20964944, 21172286, 21493722, 21848995, 22000904, 22353641, 22692207, 23121825, 23833516, 24481334, 25042576, 25922416, 26635299, 27495748, 28725031, 29589561, 30753926, 32029168, 33524539, 35011612, 36820940, 38983494, 41529563, 44253607, 47425119, 50964421, 54440477, 57465325, 59940314, 61251215, 61766400, 62342179, 62644110, 63332248, 64222829, 65282911, 66518407, 68131260]
5868F8131260J791267K310059K349528K779351L070222K645583K734448K437107
5860H8248825K451787K873892K231416K917664L400041L638545L978436L317657
5852A13058263R11845k663142n440983o521456o214719n248982m239138l413412
5844H0228276k299626k014499j964974j993950j670690j398048r85786p03801
5836F7196902o14209l48640k57071l12192k2510l71544m39892o08034o40300r05520
5826F2676990j413026k381106l373086l800040l707835l096783k487147j344963
5818D1073004j152362r23918j128749j735461k342242k419431k005298j547473
5810B7818070j514594j240487q71668r90569r32920q39517r97305r71915o23641
$$ y = [68131260, 69922527, 72232586, 74582114, 77361465, 80431687, 83077270, 85811718, 88248825, 90700612, 93574504, 95805920, 98723584, 102123625, 105762170, 109740606, 113058263, 113970108, 111306966, 105865983, 99344527, 93129808, 87880826, 83641688, 80228276, 77928650, 75914151, 73949177, 71955227, 70284537, 68886489, 67900703, 67196902, 66582693, 66234053, 65976982, 65664790, 65642280, 65270736, 64830844, 64222810, 63582510, 62676990, 61263964, 58882858, 55509772, 51709732, 48001897, 44905114, 42417967, 41073004, 39920642, 38996724, 37867975, 36132514, 33790272, 31370841, 29365543, 27818070, 26303476, 25062989, 24191321, 23200752, 22267832, 21428315, 20431010, 19459095, 18835454]
5801A8835454m97018o27338o97305m86586k71344j40387j79106k46459k18751
5792A5471160o6571l49992n37368m18894l20498m19898j57650m28412k88414j05727
5782A2377736k50065k74929l08084k17820j59128l49346m15527j32291j56199
5773A0114347M4505q1502j51848j54118j98722K68089O5480j94201O5640j3606
5763I764064J91082j58240m28881j44831q8711j52152m9436j15617k40139l89206
5753H187933j32834K3535j50662n21532k08199k60937j08684q8958j86255k24502
5743F328905L482j73818N1490M6398K5551R3338R728j55311J44678k9510J05191
5732F450122Q2462k16600L2392j81830l09057k94001k49256j11563k92234m07535
$$ y = [18835454, 18338436, 17711098, 17013793, 16527207, 16255863, 16115476, 15936370, 15689911, 15471160, 15404589, 15054597, 14517229, 14098335, 13777837, 13357939, 13200289, 12771877, 12483463, 12377736, 12127671, 11852742, 11544658, 11326838, 11167710, 10818364, 10402837, 10270546, 10114347, 10158852, 10077350, 9925502, 9771384, 9572662, 9840751, 9906231, 9712030, 9777670, 9764064, 9955146, 9796906, 9368025, 9223194, 9134483, 8982331, 8932895, 8817278, 8577139, 8187933, 8055099, 8078634, 7927972, 7406440, 7198241, 6937304, 6828620, 6739662, 6553407, 6328905, 6332387, 6158569, 6210059, 6256457, 6282008, 6375346, 6385074, 6229763, 6374441, 6344931, 6450122, 6532584, 6315984, 6348376, 6166546, 5857489, 5563488, 5314232, 5202669, 4910435, 4502900]
5722D502900P3829k21374j48370J2764p3485o1925j09001k62680n3216k26914
5712C432528P8372J13988m560r2903J03420k0363J5861K18605l8157m232M3582
5701C846141j38217k8893j86415k5200j14888r6381k29967k50105j8984m7379
5691B709712k61377j70448K38861K7312j74959j5664Q8501k62910Q3063m0874
5681B221217j42383N7456J33079O1107j60045J38125k7769j31196k513l7612J66947
5670B276413O1386J06254P4313j10297k03297l0139J43249O5947J33447J65221
5660B682497j09841n0386K56807j30956J50437P403k8250J36829J81522R9083
5650C195145J89923k11099M5047J5849j37580J77905K0363K5622J08316r227k4404
$$ y = [4502900, 4576729, 4355355, 4206985, 4219749, 4146264, 4084339, 3975338, 3712658, 3659442, 3432528, 3510900, 3624888, 3620328, 3527425, 3630845, 3610482, 3626343, 3844948, 3806791, 3802559, 3846141, 3707924, 3679031, 3492616, 3467416, 3352528, 3256147, 3026180, 2776075, 2757091, 2709712, 2448335, 2277887, 2516748, 2544060, 2369101, 2353437, 2441938, 2179028, 2262091, 2221217, 2078834, 2136290, 2269369, 2330476, 2170431, 2308556, 2280787, 2149591, 2147078, 2109466, 2276413, 2337799, 2444053, 2518366, 2408069, 2204772, 2174633, 2317882, 2383829, 2517276, 2682497, 2572656, 2522270, 2779077, 2648121, 2798558, 2805961, 2777711, 2914540, 3096062, 3195145, 3385068, 3173969, 3219016, 3234865, 3097285, 3275190, 3295553, 3321175, 3429491, 3420264, 3395860]
5639C395860M3146N9085K5442J66714O9485J79139M4677p8279J30807O6564Q30
5628D103470J1124K30521J27447J01883J77777K8031Q0753n5234k71445N6595
5618D590922K7561J11998j12523j33284l6150j40209n20J30435L6530o0758O1875
5607D475877j902j38600L1395j59032j41609j15065j61832L34273k3210j47991
5597C952304N9267k9183k5663l34198k3472j8014p326r377J72346k21844K166
5586C517006K60434N4511R0486l6109K8376K12990K24436O5437J25251J57359
5576D700177M12139L55591J21609N30108P87943N98575P74352J113739J040578
5567A0434811J524482J458196N66853j049532j817086j952928j582540j320730
$$ y = [3395860, 3439006, 3498091, 3523533, 3690247, 3759732, 3938871, 3983548, 3905269, 4036076, 4102640, 4103470, 4114594, 4345115, 4472562, 4574445, 4752222, 4780253, 4861006, 4805772, 4534327, 4590922, 4618483, 4730481, 4617958, 4484674, 4448524, 4308315, 4307795, 4438230, 4474760, 4414002, 4475877, 4473975, 4335375, 4366770, 4207738, 4066129, 3951064, 3789232, 4123505, 4100295, 3952304, 4011571, 3982388, 3956725, 3622527, 3599055, 3581041, 3573715, 3564338, 3736684, 3514840, 3517006, 3777440, 3831951, 3922437, 3886328, 3914704, 4127694, 4352130, 4417567, 4542818, 4700177, 5112316, 5467907, 5589516, 6119624, 6907567, 7506142, 8280494, 9394233, 10434811, 11959293, 13417489, 13984342, 12934810, 11117724, 9164796, 7582256, 6261526]
5559F261526r02933m84780n04021l10876l77039k55834k70348L9713K377m959
5549C192826j32425m4090N674j90976L4916k0863M567o9985M8733J45779J31702
5538C105858J85100J01946k13569l64629k20967k41395j16642j7386j33694o6754
5528B017868M8583K0358j01570l3125L4193j30724N9j08381R3967L2347j11408
5517A762167j44762O5374k6309j54467j82922r4340P5576K4530m6900J2935m5649
5506A245233L1153L6940k17825J9479R9566K8917r8536J11685r1717K7912n5925
5495A136882l5373K14590k04791n142l648N5533j82525R1671o8104k00643q7815
5484G10635K22147q9814k85062K00551J67779K09807J04204r5033k05916L0569
$$ y = [6261526, 5358593, 4873813, 4369792, 4058916, 3681877, 3426043, 3155695, 3195408, 3197785, 3192826, 3060401, 3016311, 3021985, 2831009, 2865925, 2845062, 2849629, 2779644, 2828377, 2974156, 3105858, 3290958, 3392904, 3179335, 2814706, 2593739, 2352344, 2235702, 2218316, 2084622, 2017868, 2066451, 2086809, 1985239, 1952114, 1986307, 1855583, 1855642, 1747261, 1841228, 1873575, 1762167, 1617405, 1682779, 1656470, 1502003, 1319081, 1224741, 1300317, 1324847, 1277947, 1290882, 1245233, 1276386, 1313326, 1095501, 1114980, 1214546, 1243463, 1144927, 1256612, 1164895, 1192807, 1136882, 1101509, 1316099, 1111308, 1106166, 1102518, 1158051, 975526, 1067197, 999093, 798450, 710635, 932782, 842968, 557906, 758457, 926236, 1136043, 1240247, 1145214, 939298, 969867]
5474I69867r4301M7845N8597k6508L2841k60127j56557K2562J89868p3955K6811
5463G36943P9684j69348K36772P943k06166l9626J64351L2440P2752j51450j2574
5452G51721q5958K9169L7653J03762q0888r9223K28546p3939j37380o7703J6505
5441F22265O4323K08814J64777k91979k87988O2980J95963m5499l3519J33835
5431G93972m1919M4626k04826K55973k9005m4599J845J9794k20933j19959J28046
5420E83015K9724P4188j6686k1523O0788K9526j09639l4441j38224m1851J46955
5409E61832Q8404J41559J05076j5938r7087N4558l4253j43148R1035q224n9729
5398F84085m9817K7227J2646p2976Q2010o4867L0057L11692j14901N1587L5701
$$ y = [969867, 875566, 923411, 982008, 955500, 988341, 728214, 571657, 594219, 784087, 710132, 736943, 816627, 647279, 884051, 891994, 685828, 646202, 810553, 842993, 915745, 764295, 751721, 665763, 694932, 732585, 836347, 755459, 656236, 884782, 810843, 673463, 605760, 622265, 686588, 895402, 1060179, 768200, 480212, 543192, 739155, 693656, 660137, 793972, 752053, 796679, 591853, 847826, 818821, 774222, 776067, 795861, 574928, 454969, 583015, 612739, 686927, 670241, 648718, 709506, 739032, 629393, 594952, 456728, 414877, 561832, 650236, 791795, 896871, 880933, 783846, 838404, 804151, 661003, 752038, 743814, 684085, 634268, 661495, 674141, 601165, 683175, 618308, 648365, 960057, 845156, 896743, 932444]
5387I32444p8089l7529j13497N9062O2486k09856J23514R632j23208O6878L3802
5376G25639J95506p3188J40611j49143j16044p4333j01047J77902q4405K76469
5366I17967n5125j4571J41532J1968N995P7100J29889j09506j50157J40766k24739
5355H71119j8896K51658j74387l6370P6767O7642m8881j58591R3890l2478R1461
5344I82934j58272n0733J00656l3298K60006j48844l0484J01471j45004j23843
5334G54589J6348m8166K3881n3809O2712L6894L21483m6155j10886Q2002p2671
5323I66222l6302O5075Q1243j04074L240q6115N014J0128m4257j77527m3005O2805
5311G02447J35827J47830J89580J1378j16178K1484p1666J15842l5627r3345o2881
$$ y = [932444, 854355, 816826, 703329, 762391, 824877, 615021, 738535, 748167, 624959, 691837, 725639, 921145, 847957, 988568, 839425, 723381, 649048, 548001, 725903, 641498, 917967, 862842, 848271, 989803, 1001771, 1007766, 1084866, 1214755, 1105249, 955092, 1095858, 871119, 852223, 1103881, 929494, 893124, 969891, 1037533, 988652, 830061, 923951, 891473, 982934, 824662, 773929, 874585, 841287, 1101293, 952449, 921965, 1023436, 878432, 754589, 770937, 722771, 746652, 692843, 755555, 792449, 1113932, 1067777, 956891, 1038893, 966222, 929920, 994995, 1076238, 972164, 975404, 889289, 894303, 904431, 860174, 682647, 639642, 702447, 838274, 986104, 1175684, 1187062, 1070884, 1092368, 1020702, 1136544, 1100917, 1007572, 944691]
5300I44691P1585j0394k9433L07759j30352q3366P6102K9356J39537J8350K0235
5289A354070J4540r2217l7703J39383P3176J96270p5437O790K03452N8064J16985
5278A957373K07229K8852k46981M45122K94010p0506J84850J31056k17337p4567
5268B639101j81300r3435p9588J48233J59783O5464J35973M818J93474J26976
5258C119499K0245J52874M34602K80425J76255L86690O0833R6686J59473L72508
5248E260090J64351j09554J39106j15621j99064k34255j20885k95329k44635m2768
5238D201436k36685j75417J6306O0258o4800J52845J77876K29855K16275R551
5228D587500J55930Q5908L8539j04422j9712l97785j92613O816k14098O7180J81837
$$ y = [944691, 1016276, 1005882, 976449, 1284208, 1153856, 1070490, 1146592, 1175948, 1315485, 1333835, 1354070, 1368610, 1276393, 1238690, 1378073, 1451249, 1647519, 1572082, 1578872, 1782324, 1840388, 1957373, 2164602, 2193454, 1946473, 2391595, 2685605, 2615099, 2799949, 2931005, 2713668, 2639101, 2457801, 2364366, 2284778, 2433011, 2592794, 2658258, 2794231, 2799049, 2992523, 3119499, 3139744, 3292618, 3727220, 4007645, 4183900, 4570590, 4631423, 4728109, 4887582, 5260090, 5424441, 5314887, 5453993, 5338372, 5139308, 4905053, 4784168, 4488839, 4244204, 4201436, 3964751, 3789334, 3805640, 3865898, 3801098, 3953943, 4131819, 4361674, 4577949, 4587500, 4743430, 4829338, 4867877, 4763455, 4743743, 4345958, 4153345, 4160161, 3946063, 4013243, 4195080]
5217D195080j38499k45336m7159j86449j43931j92286j4877M1201j84852J4355
5207C097247j31354J06590O1403p894M6486j809j680j9025J0208o4741j35682
5196B959749k90485k96435j69784j23579R3283p0003P9480J20990j46984j79619
5186A976613J32583m1513O490J57593j25742k11035P6259j09406m4249K6472J39001
5175A983066j54748K2470j13521j12688L53885k01149k328O8190q8051L8981l0654
5164A763453j24316p8908r8923J71281R8932R1543N575O1686o2792K8546L026
5153A859103L2960j46065m1337P7736K2178j09873p3149M5964r0539n6884K11578
5142A731672J38483l2271P855L81J08997p5733j3775m9372J02339N3343n0772
$$ y = [4195080, 4056581, 3811245, 3764086, 3577637, 3433706, 3241420, 3226543, 3267744, 3082892, 3097247, 2965893, 3072483, 3133886, 3125992, 3172478, 3170669, 3168989, 3149964, 3160172, 3095431, 2959749, 2669264, 2372829, 2203045, 2079466, 2172749, 2102746, 2182226, 2303216, 2156232, 1976613, 2109196, 2067683, 2074173, 2231766, 2106024, 1894989, 1971248, 1861842, 1817593, 1844065, 1983066, 1828318, 1850788, 1737267, 1624579, 1978464, 1777315, 1774987, 1843177, 1755126, 1794107, 1763453, 1639137, 1560229, 1461306, 1632587, 1731519, 1823062, 1828637, 1890323, 1827531, 1856077, 1859103, 1892063, 1745998, 1704661, 1782397, 1804575, 1694702, 1621553, 1667517, 1576978, 1520094, 1731672, 1870155, 1837884, 1845739, 1846120, 1955117, 1879384, 1865609, 1816237, 1918576, 1971919, 1921147]
5131A921147J39727J96026Q5680J2226M6453J32341K94280K36597L47335J81420
5121C593232J31961J91290j34752m19976m61802l30612l07885J54443j2129k91884
5111B111886p7231L8737m1362O7351r0210j19237l0449l8437J27427p8445O7132
5100A937162l818j23519p2687Q654Q7067J38743j67838J45146j04948O0648p7653
5089A826957j48751K72314m8494O8272K48689K3191p5242O2679J4542P5996L26432
5078B646585K04596M2465O7805J32716j05254J61566K43480o246J73093L58461
5068C919267K89706M33725M40341N12317L53197M97996Q21823P62314R81079J090552
5058A0102317J065736M83658m7840r54730j419500j185244q48960o02183p29716
$$ y = [1921147, 2060874, 2256900, 2342580, 2354806, 2401259, 2533600, 2827880, 3064477, 3411812, 3593232, 3725193, 3916483, 3781731, 3361755, 2899953, 2569341, 2261456, 2415899, 2403770, 2111886, 2034655, 2073392, 2032030, 2099381, 2009171, 1889934, 1859485, 1821048, 1948475, 1870030, 1937162, 1933344, 1809825, 1737138, 1745792, 1832859, 1971602, 1803764, 1948910, 1843962, 1904610, 1826957, 1678206, 1950520, 1902026, 1970298, 2218987, 2242178, 2166936, 2229615, 2244157, 2320153, 2646585, 2851181, 2893646, 2961451, 3094167, 2988913, 3150479, 3393959, 3387713, 3560806, 3919267, 4208973, 4642698, 5083039, 5595356, 5948553, 6446549, 7268372, 8030686, 9011765, 10102317, 11168053, 11651711, 11603871, 10649141, 9229641, 8044397, 7195437, 6593254, 5863538]
5049E863538n79395l00439m03986n77627r1707Q6024r4861q0945l1162k47817
5039C541623K5107P5753J26482k869j28354k34006k05467Q9387M8452J49381J78603
5028C664092J65793R3591l15417j36203q6996k18863M7286j75293o5505l10316
5018B662169k35705J38361J58559j95165K3508J04786J9513j55046L3016j8808
5008B535188O0282O5544L5519j46343j00360L2405n8348j24233J81809M1600J822
4997B524885J83484P8504k38458Q0985r5299Q2608J84748j41008j48169j12796
4987B399484j9206O1689r0134L1935L7973O781J11441l4989K5788j028L9974k6571
4975B543137J66270k17449p485J64546j3240n6754k143K0090N371K4953L293J71359
$$ y = [5863538, 5284143, 4983704, 4579718, 4002091, 3910384, 3996408, 3901547, 3820602, 3789440, 3541623, 3566730, 3642483, 3768965, 3766096, 3637742, 3403736, 3198269, 3287656, 3336108, 3485489, 3664092, 3829885, 3923476, 3608059, 3471856, 3384860, 3165997, 3213283, 3037990, 2972485, 2662169, 2426464, 2564825, 2723384, 2528219, 2551727, 2656513, 2676026, 2520980, 2553996, 2535188, 2595470, 2661014, 2696533, 2550190, 2449830, 2482235, 2423887, 2299654, 2481463, 2523063, 2524885, 2708369, 2786873, 2548415, 2629400, 2534101, 2616709, 2801457, 2660449, 2512280, 2399484, 2380278, 2441967, 2351833, 2383768, 2421741, 2428522, 2539963, 2504974, 2530762, 2529734, 2569708, 2543137, 2709407, 2491958, 2484473, 2649019, 2635779, 2579025, 2576882, 2596972, 2602343, 2627296, 2630589, 2801948]
4963B801948o2114J59348J4769J4940J1668J9800q475J20774P6109P4340p8343
4952C144764K01769J87900j53016k15295l507K77440j37293L9446N1668K697n620
4941C390953n625J65288R9346J33358J09244o3200J8912O6871l8056L4681Q5479
4930C997251k1864Q9249J83723j68460J4915K96955p5883O4884P4039K12396r5439
4919D571766K88395J16669R5280m1288J02688J68117J51518J95850N2155J45908
4909E847058J39523J18232K26217J33719L76074J04074J18974L32450K84123R7342
4899G777786L2087J16817K03733K9792K28352J74029J72998l9055K11931K28654
4889I137124K33852J25341K30052J14082Q2474K56114K44321J41534K72747L0943
$$ y = [2801948, 2739834, 2899182, 2913951, 2928891, 2940559, 2960359, 2951884, 3072658, 3148767, 3223107, 3144764, 3346533, 3534433, 3381417, 3166122, 3162615, 3440055, 3302762, 3342208, 3393876, 3396573, 3390953, 3385328, 3550616, 3649962, 3783320, 3892564, 3829364, 3848276, 3915147, 3877091, 3911772, 3997251, 3975387, 4064636, 4248359, 4079899, 4094814, 4391769, 4315886, 4380770, 4454809, 4667205, 4571766, 4860161, 4976830, 5072110, 5030822, 5133510, 5301627, 5453145, 5648995, 5701150, 5847058, 5986581, 6104813, 6331030, 6464749, 6840823, 6944897, 7063871, 7396321, 7680444, 7777786, 7809873, 7926690, 8130423, 8160215, 8388567, 8562596, 8735594, 8696539, 8908470, 9137124, 9370976, 9496317, 9726369, 9840451, 9922925, 10179039, 10423360, 10564894, 10837641, 10868584]
4879A0868584J24564r2626J02788J46200L09200K49895R4851M72319L10353J17778
4869A2703906J54615J27537K28743J42795M48590M71463K33839M55778M14023
4860A5381289M37367J97590M22160M78539N31505O94687R92537Q90439Q56524
4851B0882637Q57276J081096J690003J931643K032057K286965K364281K053586
4843C5179544J110467J042986J367815K025070R15979m14864l87007l90423J69645
4834D0619212J025645J256673J822612J802562J935043K219349L115980L515383
4826E7312459M449550M554997N719905N565701N176467O346301Q472168J0749279
4818A08346827J4343459J6453324J8411488K0710185K3520519K5404296L0613131
$$ y = [10868584, 10993148, 10900522, 11003310, 11149510, 11458710, 11708605, 11803456, 12275775, 12586128, 12703906, 12858521, 12986058, 13214801, 13357596, 13806186, 14277649, 14511488, 14967266, 15381289, 15818656, 16016246, 16438406, 16916945, 17448450, 18143137, 19135674, 20026113, 20882637, 21739913, 22821009, 24511012, 26442655, 28474712, 30761677, 33125958, 35179544, 36290011, 37332997, 38700812, 40725882, 41641861, 41226997, 40839990, 40449567, 40619212, 41644857, 42901530, 44724142, 46526704, 48461747, 50681096, 53797076, 57312459, 61762009, 66317006, 72036911, 77602612, 82779079, 89125380, 97597548, 108346827, 122690286, 139143610, 157555098, 178265283, 201785802, 227190098, 257803229]
4811B57803229L4514660M0667753M6515407N6430394J5513705m4775595o4170368
4804C42499185o9031728n6619968m1645948k8507107k0970523j5313839j1975879
4797I8434193q950794p455252n796078n121314m169082l920697l293019l057751
4789E6670206k457511j839535k310077l088194l151035k989758k458584k218268
4781C6157244j794258j725036j630256j298146r29117j175743j028221q29300
4773B5747167o10192p25359p59881q74874q04565n33357l13040l61750l53477
4764B0410672n18259o73665m94720l31598k30406l81193m20834l79753l49772
4755A6630472k30130K2173q3161k65664J24774k38516o39440p60775m30799o78645
$$ y = [257803229, 292317889, 332985642, 379501049, 435931443, 451445148, 406669553, 342499185, 273467457, 216847489, 175201541, 146694434, 125723911, 110410072, 98434193, 89483399, 82028147, 76232069, 71110755, 66941673, 63020976, 59727957, 56670206, 54212695, 52373160, 50063083, 46974889, 43823854, 40834096, 38375512, 36157244, 34362986, 32637950, 31007694, 29709548, 28780431, 27604688, 26576467, 25747167, 25136975, 24411616, 23651735, 22776861, 21972296, 21438939, 21125899, 20764149, 20410672, 19892413, 19218748, 18724028, 18392430, 18162024, 17780831, 17359997, 16980244, 16630472, 16400342, 16422515, 16339354, 16073690, 16198464, 15959948, 15320508, 14559733, 14128934, 13450289]
4745A3450289n02261l82634n76636m38675o29178k12237k20905j85389m83573
4736I818801k43874j97459k36049k15491l39958l3105r2940l01354l54928k7623
4726G776020p0788j74741P8518j99239r2625j41319k18686l97077k09515M6630
4716F397178q1760k2566j57365j63679q0323l893j17741m02011P6899j94073p5314
4705E175352P1722k24922k02683o8190K49228j12700k39593j80905N2962l6579
4695D483692k3401m9384j89451P344N5182j04885k15288m0605j38509j9235m9648
4684C715812r6154m429O3283L2894o6169k26155J16191m6523K43269k74600k29788
4673C227631k3221K2508j14617j03018l0802O0211k3113p6488K4842J07198j88678
$$ y = [13450289, 12948028, 12565394, 11988758, 11550083, 10920905, 10708668, 10487763, 10302374, 9818801, 9574927, 9377468, 9141419, 8925928, 8585970, 8552865, 8459925, 8158571, 7803643, 7776020, 7705232, 7530491, 7609009, 7409770, 7317145, 7175826, 6957140, 6560063, 6350548, 6397178, 6315418, 6292852, 6135487, 5971808, 5891485, 5887592, 5769851, 5367840, 5444739, 5250666, 5175352, 5247074, 5022152, 4819469, 4751279, 5000507, 4887807, 4648214, 4467309, 4520271, 4483692, 4460291, 4410907, 4221456, 4228800, 4283982, 4179097, 3963809, 3923204, 3784695, 3765460, 3715812, 3619658, 3615229, 3678512, 3711406, 3645237, 3419082, 3535273, 3488750, 3732019, 3457419, 3227631, 3204410, 3226918, 3112301, 3009283, 2978481, 3038692, 3015579, 2939091, 2963933, 3071131, 2882453]
4662B882453J94541J22157j62481k0666J7106k44665J7086R0437O0296N5560J22475
4651C134299N0617l34059p4185J43724j90252p6834J23853k9504N9843J17206
4641B924708Q1686P639k21578k5091J85429k8839o6479j84496L1829m3850K36907
4630B897865R8886J35846L0256j76257j28959p1145k24304Q99k56204k77572J14557
4619B143868n0731k54129R4543J4738J30918p8537k91558J67511J28770K54517
4609B259910o8244k56393J13317P3997l4105J08217J54869q641n1443L4235L1955
4598B357674k25822N16K57458J77940l6124J00440j18388k67386N2709J58589
4588B457606P8138p4374j79089J1963J7003J85138j00555k53537j13184j7621
$$ y = [2882453, 3076994, 3199151, 3036670, 3016004, 3033110, 2788445, 2805531, 2895968, 2956264, 3011824, 3134299, 3184916, 2850857, 2776672, 2920396, 2730144, 2653310, 2777163, 2747659, 2807502, 2924708, 3006394, 3014033, 2792455, 2767364, 2952793, 2923954, 2857475, 2672979, 2704808, 2660958, 2897865, 2996751, 3132597, 3162853, 2986596, 2857637, 2786492, 2562188, 2563087, 2306883, 2029311, 2143868, 2093137, 1839008, 1933551, 1948289, 2079207, 2000670, 1709112, 1876623, 2005393, 2259910, 2191666, 1935273, 2048590, 2122587, 2088482, 2196699, 2351568, 2342927, 2291484, 2325719, 2357674, 2131852, 2132368, 2389826, 2567766, 2531642, 2632082, 2513694, 2246308, 2299017, 2457606, 2535744, 2461370, 2282281, 2294244, 2311247, 2496385, 2395830, 2142293, 2029109, 2011488]
4578B011488o1823p9649l8277L1847J27978q4179J71720R2868l8913q4684K6875
4567B075251q6080l9468m7458j19028M8201k8904R7969K34804M8241J37938j45663
4556B175803r5187K5316k4051J44343j8564l8518q9882N5834K0368R6395O072
4545B257929J42263J97581n2472j26229Q7262J87735K05660J38101L8799J71339
4535C247968L50736K94233L98744M56068K76066M00457N37479M51727O67520M58982
4525G539980N1974l31368q67836p16827n99463m62682n03716k95508l28463k45057
4515C241034O3138n3036r2449j37735Q1205r3529J04951j05025R3132j46625M314
4504B959375N8463N8227L3041l7349J03226J99851K28837J93699P0824L20339
$$ y = [2011488, 1949665, 1870016, 1831739, 1863586, 1991564, 1907385, 2079105, 2171973, 2133060, 2048376, 2075251, 1989171, 1949703, 1902245, 1783217, 1831418, 1802514, 1900483, 2135287, 2183528, 2321466, 2175803, 2080616, 2105932, 2081881, 2226224, 2207660, 2169142, 2079260, 2135094, 2155462, 2251857, 2257929, 2400192, 2597773, 2545301, 2419072, 2506334, 2694069, 2899729, 3037830, 3076629, 3247968, 3598704, 3892937, 4291681, 4747749, 5023815, 5424272, 5961751, 6413478, 7080998, 7539980, 7591954, 7260586, 6392750, 5675923, 5076460, 4613778, 4110062, 3814554, 3486091, 3241034, 3304172, 3251136, 3158687, 3020952, 3102157, 3008628, 3113579, 3008554, 3101686, 2955061, 2959375, 3017838, 3076065, 3109106, 3071757, 3174983, 3374834, 3603671, 3797370, 3868194, 4188533]
4494D188533K79644J14606L53843L95233m137k60476k20906m06567k3782m5757
4484D370234M1730k72500K57010m2363r2067L92874J46943J46210M5603J58600
4474E152274K99324J87585K13005M14439M15114L88763M67904M36421K01200L2887
4464H208916L27432J90411L50865L11566K34522j77852n00463p99343n35761k80366
4454G329927l24624l91759j52354p3326P7507K7286K66240L52801N52024M47092
4444H110814M93656O39624N77811N34252N73364k79110m79208m99728n35250j25442
4434I010783N6493J4953J50684Q7874Q1718l73376n63427m51631n36259m98175
4424F979637n39235k71850n20151k27194k98000j7105j29176k63312j08518J97044
$$ y = [4188533, 4468177, 4582783, 4936626, 5331859, 5327722, 5067246, 4846340, 4439773, 4415991, 4370234, 4411964, 4139464, 4396474, 4354111, 4262044, 4654918, 4801861, 4948071, 4993674, 5152274, 5451598, 5639183, 5852188, 6266627, 6681741, 7070504, 7538408, 7974829, 8176029, 8208916, 8536348, 8726759, 9077624, 9389190, 9623712, 9445860, 8945397, 8146054, 7610293, 7329927, 7005303, 6613544, 6461190, 6387864, 6465371, 6492657, 6758897, 7111698, 7663722, 8110814, 8604470, 9244094, 9821905, 10356157, 10929521, 10650411, 10171203, 9671475, 9136225, 9010783, 9067276, 9082229, 9232913, 9320787, 9402505, 9029129, 8465702, 8014071, 7477812, 6979637, 6440402, 6168552, 5648401, 5421207, 5123207, 5106102, 4976926, 4713614, 4605096, 4802140]
4414D802140k85283j06864N9243j72980k82622J6271j53141q4535j63895j7032
4404C611302k5134R9654J43880J36452j13554k30703J15106J7423j35210j86201
4394C433015J47720O9189L1429J02084J09062n6677j5538Q3886j7785j53545P7931
4383C810771j40353K27391J77851L4183n1527j54410K2840J1199q8384j24398
4373C725163J86579J50880j16026O9232K33849M4507K78779q8264l009R8920M1930
4362D622540J66952j0582q8685J75760K34672n7825j10819k0801K5236j3079n5069
4351D868300m1330M5653K2033n3147J56724J81531K20m7380J51236J83085K12280
4340E679205J01990J2283N0857O5097l459J9975K20940J68537j9156K74965J48645
$$ y = [4802140, 4516857, 4409993, 4469236, 4296256, 4013634, 4029905, 3876764, 3792229, 3628334, 3611302, 3586168, 3685822, 3829702, 3966154, 3852600, 3621897, 3737003, 3754426, 3619216, 3433015, 3580735, 3649924, 3681353, 3783437, 3892499, 3835822, 3820284, 3904170, 3886385, 3732840, 3810771, 3670418, 3897809, 4075660, 4109843, 4058316, 3903906, 3926746, 3937945, 3849561, 3725163, 3911742, 4062622, 3946596, 4015828, 4249677, 4294184, 4572963, 4484699, 4481690, 4580610, 4622540, 4789492, 4778910, 4690225, 4865985, 5100657, 5042832, 4932013, 4911212, 4936448, 4923369, 4868300, 4826970, 4872623, 4894656, 4841509, 4998233, 5179764, 5179984, 5132604, 5283840, 5466925, 5679205, 5781195, 5793478, 5844335, 5909432, 5905973, 5925948, 6146888, 6315425, 6296269, 6571234, 6719879]
4329F719879J04276J72883J46925K5077o4296j62714j29689M1309j23910p337
4319F722403J53207j3148j71610J52640J34638K6491r5947J69514L33826J01876
4309G513890J21307K08539J14609J55065K79110L8037m934r7354R8857J49161
4299H576287J90176P3419J76035K46994N8283P408J27024K05264K58406J70767
4289A0090063K10103J91732L53739L13213J34591K58098K37419L28951O20735
4280A2738644K92180L59817J46738K44497K07780L29939M39669L48728P63302
4271A5871294Q64780P36758N33124N88601N28928R58671O79119J96494j62896
4262B0794873m21288j98965r2024p24950n78236m57212l51227j52002J18539L5489
$$ y = [6719879, 6824155, 6997038, 7143963, 7169040, 7104744, 6942030, 6812341, 6853650, 6729740, 6722403, 6875610, 6862462, 6690852, 6843492, 6978130, 7004621, 6908674, 7078188, 7412014, 7513890, 7635197, 7843736, 7958345, 8113410, 8392520, 8430557, 8425623, 8328269, 8427126, 8576287, 8766463, 8839882, 9015917, 9262911, 9321194, 9328602, 9455626, 9660890, 9919296, 10090063, 10300166, 10491898, 10845637, 11158850, 11293441, 11551539, 11788958, 12117909, 12738644, 13030824, 13390641, 13537379, 13781876, 13989656, 14319595, 14759264, 15107992, 15871294, 16736074, 17472832, 18005956, 18594557, 19123485, 20082156, 20761275, 20957769, 20794873, 20373585, 20174620, 20082596, 19357646, 18779410, 18322198, 17970971, 17818969, 17937508, 17972997]
4252A7972997L39404M12342J41515M30815M33965L81054L8924l96983m70878o78269
4242A8604886o16805m15768k17383Q2196j24218l47740K60794J13807L4480R3041
4232A7467290j3395K17294J44386K13875J20259K12563L78656L59505N25190L56596
4222A9982219L96302O00689P84055N62724P79880R84426R66306R82971J111236
4213B7150808J091261J240430J263007J442002J509755J756565K003843K194337
4205C9652008K329469K235204K196487K709043K724607L272116L824215M480977
4197F3424126M880712N641013O431758P748874R295955J1715210J3814640J6226103
4189A39178391J7971342K0185375K2227083K5542708K9291735L4680587M0193293
$$ y = [17972997, 18312401, 18724743, 18866258, 19297073, 19731038, 20112092, 20151016, 19754033, 19283155, 18604886, 17988081, 17572313, 17354930, 17437126, 17312908, 16965168, 17225962, 17339769, 17374249, 17467290, 17453895, 17671189, 17815575, 18029450, 18149709, 18362272, 18740928, 19100433, 19625623, 19982219, 20378521, 20979210, 21763265, 22325989, 23105869, 24090295, 25056601, 26039572, 27150808, 28242069, 29482499, 30745506, 32187508, 33697263, 35453828, 37457671, 39652008, 41981477, 44216681, 46413168, 49122211, 51846818, 55118934, 58943149, 63424126, 68304838, 73945851, 80377609, 88126483, 97422438, 109137648, 122952288, 139178391, 157149733, 177335108, 199562191, 225104899, 254396634, 289077221, 329270514]
4182C29270514M6026171L9063415J4093228j9292305m8877561n7076690n3238331
4175B49968441m2148351l1373835k3225271j8062078j4232216j1947889r672984
4168I9305817q199291o633487n553467m752295m853336m307464m017054l570885
4160E7418538l042584k646370k074475j589206j595415j551777j324155j063248
4152D2531308r70200p37295n11518l98225l33814L81328O46353K52575P22137
4143D1582649l40162j839025k157040k348222k280359j978638j690845j291521
4135B7656837j304738j120675j093710o81771p58206q66225o57633n32077m58499
4126B0183303n80191l86189j93687n77135m74382k24648k74454m28394k06268
$$ y = [329270514, 375296685, 414360100, 428453328, 409161023, 360283462, 303206772, 249968441, 207820090, 176446255, 153220984, 135158906, 120926690, 108978801, 99305817, 91106526, 84473039, 78919572, 74167277, 69313941, 65006477, 60989423, 57418538, 54375954, 51729584, 49655109, 48065903, 46470488, 44918711, 43594556, 42531308, 41561108, 40823813, 40312295, 39914070, 39580256, 39961584, 40607937, 40860512, 41582649, 41242487, 39403462, 37246422, 34898200, 32617841, 30639203, 28948358, 27656837, 26352099, 25231424, 24137714, 23455943, 22697737, 21831512, 21173879, 20641802, 20183303, 19603112, 19216923, 19023236, 18446101, 17971719, 17747071, 17472617, 17044223, 16837955]
4117A6837955k71364j3840q6185j5957J19027K43332m8580J0241M12503L17259
4107A7504391N4872r2188m04437o90691m90248o94894n75033m84212l16759n1888
4097A3758913l68681J09387Q7091j82732l50487l85531m93213m67923k38496k71535
4087A1196793k78668n6939j47284k79498p4276k78976k10954j79109j01371j65031
4077I424687L8745j04565k19937j08908P6212r1193j78384Q4361j8682l09277
4067H593059k04946R6276j79118j03154j58236p9153K33195j59377k97524K4903
4057G765925K5749R4908q3674J6690j31461o2445L7665n8584n4892J78266J3177
4046G741324Q0851J26028j0960R4470l5328o5587J00622o9656J92548J67322J0663
$$ y = [16837955, 16566591, 16552751, 16466566, 16450609, 16569636, 16812968, 16764388, 16774629, 17187132, 17504391, 17559263, 17467075, 17062638, 16371947, 15881699, 15186805, 14611772, 14127560, 13810801, 13758913, 13390232, 13499619, 13586710, 13403978, 13053491, 12667960, 12174747, 11706824, 11468328, 11196793, 10918125, 10861186, 10713902, 10434404, 10360128, 10081152, 9870198, 9691089, 9589718, 9424687, 9463432, 9358867, 9138930, 9030022, 9106234, 9015041, 8836657, 8921018, 8902336, 8593059, 8388113, 8484389, 8305271, 8202117, 8043881, 7964728, 8197923, 8038546, 7741022, 7765925, 7791674, 7886582, 7802908, 7819598, 7688137, 7625692, 7663357, 7604773, 7549881, 7728147, 7741324, 7822175, 7948203, 7937243, 8031713, 7996385, 7930798, 8031420, 7961764, 8154312, 8321634, 8332297]
4035H332297J43821n1218k73647l3932R1667P6343K59307J27901Q3639O4079J34825
4024H955082M14249K23849J18734L65853K45243M10816L28426M18091O11089N83689
4014A2675121M25760M12297o5034l09365n29468n23317m49620o55143l55545J2203
4004A0637889j06550p0427J55295j56649j01280K58816K28947M9602K43650J76726
3994A1316019N26278N71544K66059N45052O98862M06444Q30553J190002J128881
3985A7479694J090635M35611l00835q07301p24826k57457m61532j52490P2903
3976A6374402L32383P03441M78162L04286J0174k71498l18992k02491J21588L93996
3966A7925451L80010M12385N67146L63375M19663Q92990J117351J173068J340737
$$ y = [8332297, 8476118, 8424900, 8151253, 8117321, 8208988, 8285331, 8544638, 8672539, 8756178, 8820257, 8955082, 9369331, 9593180, 9711914, 10077767, 10323010, 10733826, 11062252, 11480343, 12091432, 12675121, 13100881, 13513178, 13448144, 13138779, 12609311, 12085994, 11636374, 10981231, 10625686, 10637889, 10531339, 10460912, 10616207, 10459558, 10358278, 10617094, 10846041, 10895643, 11139293, 11316019, 11842297, 12413841, 12679900, 13224952, 13923814, 14330258, 15160811, 16350813, 17479694, 18570329, 19005940, 18705105, 17897804, 17172978, 16915521, 16453989, 16301499, 16374402, 16706785, 17410226, 17888388, 18192674, 18202848, 17931350, 17612358, 17409867, 17531455, 17925451, 18305461, 18717846, 19284992, 19648367, 20068030, 20961020, 22078371, 23251439, 24592176]
3957B4592176J010098M55470m26262p38908o37337l00822K51L64798L39175j27641
3947B4530998m91344n38306n5334r8385J25770J87288O80422P52634N98158Q02127
3937B6494028M93307M21441L89967P65772O41558O00882J032831J204685J107051
3928C3151522k5676m77975o37133m76506m26940k41056K59409N74514P44921Q26657
3918C3271737R77291J345843J192344R23386O87907O67923R17856Q68247J069768
3909D1922302J479283J316637J350177J554348J485730J869191J882175K370021
3901E5229864L110520K936925L483306L097567L087643K793043L217280L536688
3893H0492836L977637M165669M243016M176875M071432L907200L551490L818888
$$ y = [24592176, 25602274, 26057744, 25631482, 24892574, 24255237, 23954415, 23954666, 24319464, 24658639, 24530998, 24039654, 23501348, 23446014, 23347629, 23473399, 23660687, 24341109, 25093743, 25691901, 26494028, 26987335, 27408776, 27798743, 28564515, 29206073, 29806955, 30839786, 32044471, 33151522, 33125846, 32647871, 32010738, 31534232, 31107292, 30866236, 31125645, 31700159, 32445080, 33271737, 34249028, 35594871, 36787215, 37710601, 38398508, 39066431, 39984287, 40852534, 41922302, 43401585, 44718222, 46068399, 47622747, 49108477, 50977668, 52859843, 55229864, 58340384, 61277309, 64760615, 67858182, 70945825, 73738868, 76956148, 80492836, 84470473, 88636142, 92879158, 97056033, 101127465, 105034665, 108586155, 112405043]
3885A12405043M213324M926546N438478N989151O865798P463583O605848L885620
3877A57793391O02153j292215j599540n04819R99885J922007K024655J794116
3869A61739633J541962J437386J789007J916753J357501N22086j180857k208405
3861A66915066k782319k608795k437776k431179k329465j863803j220944o13880
3853A50626905j91091r13337l260962o371259q078326q115005p036980n707761
3845A10952184m673389m015781l484721l026186l060856l241742l585972l938264
3837H1925273l516013l653588l731334l100629k726780k288969j711294k029373
3829E9167293k300824k478954k324240k056259j731834j231160j219361r51457
$$ y = [112405043, 116618367, 121544913, 126983391, 132972542, 139838340, 147301923, 153907771, 157793391, 158395544, 157103329, 155503789, 154998970, 155998855, 157920862, 159945517, 161739633, 163281595, 164718981, 166507988, 168424741, 169782242, 170304328, 169123471, 166915066, 164132747, 161523952, 159086176, 156654997, 154325532, 152461729, 151240785, 150626905, 150435814, 149522477, 146261515, 139890256, 131811930, 123696925, 116659945, 110952184, 106278795, 102263014, 98778293, 95752107, 92691251, 89449509, 85863537, 81925273, 78409260, 74755672, 71024338, 67923709, 65196929, 62907960, 61196666, 59167293, 56866469, 54387515, 52063275, 50007016, 48275182, 47044022, 45824661, 44873204]
3821D4873204j246590j097878j179276j167877r93741j145027p77149o41157q59122
3812C5765387j199599j537377j296896j039847o98610p46318o79333m81231m06315
3803B7679861k75220k42303k41955r1586n03041q6332l22735k29507j59185p7867
3793B5450130m2855r7651j93300m09293o79574n67444o86786l46246k96663j22422
3783B2007896k21707j63562L4870j05591Q5789N0855o3691o4749J98587Q6927
3773B1845624L24819K70984K17197M32351O90830O02893O33182Q81484R32181
3764B6831545J124304J326023J619827K076856K315903K598164P53528j584704
3756C7061446k985728l424366k978952k499010j855694j518828j013389o85018
$$ y = [44873204, 43626614, 42528736, 41349460, 40181583, 39187842, 38042815, 37265666, 36624509, 35765387, 34565788, 33028411, 31731515, 30691668, 29993058, 29246740, 28567407, 28086176, 27679861, 27404641, 27162338, 26920383, 26828797, 26325756, 26239424, 25916689, 25687182, 25527997, 25450130, 25407275, 25309624, 25116324, 24707031, 24027457, 23460013, 22773227, 22426981, 22130318, 22007896, 21786189, 21622627, 21657497, 21551906, 21637695, 21688550, 21624859, 21560110, 21758697, 21845624, 22170443, 22441427, 22658624, 23090975, 23781805, 24384698, 25017880, 25899364, 26831545, 27955849, 29281872, 30901699, 32978555, 35294458, 37892622, 38646150, 37061446, 34075718, 30651352, 27672400, 25173390, 23317696, 21798868, 20785479, 20100461]
3748B0100461n86853n00503m30624k93780l48843n35585k96596l46516m23385
3739A6337776l71953l6311m99008l28840j76869j78621l91990n03110l13746m16063
3729A3121265j01784j70350L2107k21330m072j9610j32269k72747N7190j59369
3719A2129031k44655k31600P2965O09J7774k65275K8074j63296j45494n4446J93107
3708A1336794R9687N8247k44000k33032J10956m4999p3008J36834j7920j2143
3698A1117416J19265o2849k08925j65379j37340J39719j35314k87330J60761j25480
3688A0414544p6314q4914Q1453J18600J09308O4171N7297M93682J17682J17730
3678A1413239M24761O5999M0316J87896K22005P0839J37904L31624J54716L64113
$$ y = [20100461, 19513608, 19013105, 18582481, 18288701, 17939858, 17404273, 17107677, 16761161, 16337776, 15965823, 15929512, 15430504, 15101664, 14924795, 14746174, 14354184, 13851074, 13537328, 13121265, 13019481, 12849131, 12881238, 12659908, 12655836, 12636226, 12503957, 12231210, 12288400, 12129031, 11884376, 11652776, 11725741, 11726350, 11744124, 11478849, 11506923, 11343627, 11198133, 11143687, 11336794, 11436481, 11494728, 11250728, 11017696, 11128652, 11083653, 11010645, 11147479, 11129559, 11117416, 11236681, 11173832, 10964907, 10799528, 10662188, 10801907, 10666593, 10379263, 10540024, 10414544, 10338230, 10253316, 10334769, 10453369, 10562677, 10626848, 10684145, 11177827, 11295509, 11413239, 11838000, 11903999, 11944315, 12132211, 12354216, 12425055, 12562959, 12894583, 13049299, 13413412]
3668A3413412J82923Q7917l049J6970P7025j71250K01056J2765q4996j42393k49432
3657A3340948j53828j89306m3999j3565K34690J70020m8483o2144j45357k35651
3647A2853325l93710P6869j17646N8982K30464K1736j25860K17956R2123j79059
3637A2735180J02150j43680L9371K79334j84131l45859j65771K4938j60451k00645
3627A1980436p6434k68682k46982k33739j79873j45617k01390j62088m48555q3911
3617I933165k15625m18210k73806m2576l4754R988j35710J8773l8145K0562J6821
3606H840483L6881k49932j39811J44899R6656P6168m4879j46965K1977j42507
3596H492970j0177j42013j9416k39005k75128q275M6448m31438l88718m1855j33901
$$ y = [13413412, 13596335, 13684252, 13681203, 13698173, 13775198, 13603948, 13805004, 13817769, 13732773, 13590380, 13340948, 13187120, 12997814, 12953815, 12940250, 13174940, 13344960, 13296477, 13234333, 13088976, 12853325, 12459615, 12536484, 12418838, 12477820, 12708284, 12730020, 12604160, 12822116, 12914239, 12735180, 12837330, 12693650, 12733021, 13012355, 12828224, 12482365, 12316594, 12341532, 12181081, 11980436, 11904002, 11635320, 11388338, 11154599, 10974726, 10829109, 10627719, 10465631, 10017076, 9933165, 9717540, 9299330, 9025524, 8982948, 8948194, 8958182, 8822472, 8841245, 8803100, 8823662, 8840483, 8877364, 8627432, 8487621, 8632520, 8729176, 8805344, 8760465, 8613500, 8635477, 8492970, 8482793, 8340780, 8321364, 8082359, 7807231, 7798956, 7845404, 7413966, 7025248, 6983393, 6849492]
3585F849492j8219M0479M3244J4673j39520m73941k95571J21268K39697j25955
3575F255647q3091R5029r0038j47392J28912l03945j7628L6913j51526L1705l4753
3564E719833K3991l1237j25498L7983J15121q6450q6857j04583j86753J0458J0179
3553E296187p6766k3469o7316N2830m5l22992l47603m7855K90890k79771J426
3542D475516o9594j64966m2413j40408j31396K34694k49j66585j37632Q364J99787
3531D065118o8200P898j94602L28700l3866j63486N270j97862K88993o6093k26424
3520C745446k15414j46177L9005j02677j78164r5567l4079L84250M503j28785
3510C272341r5836j37859n8701j66092K27778j58577k38650J18120q6846M2647
$$ y = [6849492, 6831273, 6871752, 6914996, 6929669, 6790149, 6316208, 6020637, 6141905, 6381602, 6255647, 6172556, 6267585, 6177547, 6030155, 6159067, 5855122, 5837494, 5874407, 5722881, 5754586, 5719833, 5743824, 5712587, 5587089, 5625072, 5740193, 5653743, 5566886, 5462303, 5275550, 5286008, 5296187, 5219421, 5195952, 5128636, 5181466, 5181421, 4858429, 4510826, 4462971, 4753861, 4474090, 4475516, 4405922, 4240956, 4198543, 4058135, 3926739, 4161433, 4161184, 3994599, 3856967, 3865331, 4065118, 3996918, 4004816, 3810214, 4138914, 4105048, 3941562, 3946832, 3748970, 4037963, 3971870, 3745446, 3530032, 3383855, 3422860, 3320183, 3142019, 3046452, 3012373, 3396623, 3401126, 3272341, 3176505, 3038646, 2979945, 2813853, 3041631, 2883054, 2644404, 2762524, 2675678, 2718325]
3500B718325P0408N9434o9979Q9558l02768j31220K43850J53121k5697l02076
3490B502956j42188m5899M0606J95394Q8189J02310o5868j27287J92424j98094
3480B542543l2220L12724k81212k61747m695O0567l5016m7371N4137j16708N2211
3469B243213o8050l7668K78278k09286K4612P9746q047N5855j04927K10987k57583
3458B207130p1758J45455N5207j0975j6677J93636J02563L7303k1378J91710p5602
3447B736614j28601J60202p2351J61622j1910J24938m454L71033K97359L11304
3437C945756K97771N1351M08092J30722l02685m54155m29453j33418j40129j08751
3427C265101j14646Q3053r8720k45793M3210Q9797q8934L0243l401k02691K11624
$$ y = [2718325, 2788733, 2848167, 2778188, 2867746, 2564978, 2433758, 2677608, 2830729, 2805032, 2502956, 2360768, 2314869, 2355475, 2550869, 2639058, 2741368, 2675500, 2548213, 2740637, 2542543, 2510323, 2823047, 2541835, 2280088, 2275393, 2335960, 2300944, 2253573, 2307710, 2191002, 2243213, 2175163, 2137495, 2415773, 2206487, 2231099, 2310845, 2302798, 2358653, 2253726, 2464713, 2207130, 2135372, 2280827, 2336034, 2325059, 2308382, 2502018, 2604581, 2641884, 2620506, 2812216, 2736614, 2608013, 2768215, 2695864, 2857486, 2845576, 2970514, 2966060, 3337093, 3634452, 3945756, 4243527, 4294878, 4702970, 4833692, 4531007, 4076852, 3647399, 3513981, 3373852, 3265101, 3150455, 3233508, 3134788, 2888995, 2932205, 3022002, 2933068, 2963311, 2959910, 2757219, 2968843]
3416B968843J40353J23772M692R0553L03682K88227J8216R8199K70433N95871
3406D902841O11638M81246M24191Q94746K38661o22981p37529q35068q31318m77351
3396D049076k85308m77440k74813L3738N6933j94533j69060p104N08M868j39741
3385B597124o1524j01810P2762J37397K07225J8793Q444L820O3909L00782N5617
3374C302539K88167J20301K88714O05860J49184j85936m01194m83736m36732m89953
3364B757214k29060m1973l0809l34405K37226j42215r8672J50469l6438j45324
3354B086013m9188N668J22271j62892j11726j25364j62866J37621M185O4173O2207
3343A870102M1667l0253k40280K54736m4042j10713R5120O6943o1573k2633L1961
$$ y = [2968843, 3109196, 3232968, 3237660, 3328213, 3631895, 3920122, 3938338, 4036537, 4306970, 4902841, 5514479, 5995725, 6419916, 7314662, 7553323, 6930342, 6192813, 5357745, 4526427, 4049076, 3763768, 3286328, 3011515, 3045253, 3102186, 2907653, 2738593, 2731489, 2731997, 2736865, 2597124, 2535600, 2433790, 2506552, 2643949, 2851174, 2869967, 2878411, 2882231, 2946140, 3246922, 3302539, 3590706, 3711007, 3999721, 4605581, 4754765, 4568829, 4167635, 3683899, 3247167, 2757214, 2528154, 2486181, 2455372, 2120967, 2358193, 2215978, 2117306, 2267775, 2231337, 2086013, 2036825, 2042493, 2164764, 2001872, 1890146, 1764782, 1601916, 1739537, 1743722, 1807895, 1870102, 1911769, 1881516, 1641236, 1895972, 1851930, 1741217, 1836337, 1903280, 1841707, 1819074, 1851035]
3332A851035M0393J0397k28405J24693J29352N7791j06087n4472j97793P203M5362
3321A679469j03372m3987K13287M1271j12220j17312J06951n8991J55318Q7755
3311A848169n3317N3803j29143J35221k9102R6021k9047m5754J49121M0659j10836
3300A925795O3632n6264R1692n19j33277Q1101O7240K7369J1559J36923j51831
3289B063420o0003k3723N6638K7680J11215J05461J33057m3786l3399J16497p1924
3278B381133P2417N0314K52112J14162k6079q061N6586R6782J42019J98677J08909
3267C438971K41665K49133J72705Q2818L70522K30890O6851N666J41077j1861
3257D988437q065k05584k7102j05548p8414j6486k37263l03489l31054q1352l2259
$$ y = [1851035, 1891428, 1901825, 1673420, 1798113, 1927465, 1985256, 1879169, 1824697, 1626904, 1634107, 1679469, 1576097, 1532110, 1745397, 1786668, 1674448, 1557136, 1664087, 1605096, 1760414, 1848169, 1794852, 1848655, 1719512, 1854733, 1825631, 1921652, 1892605, 1846851, 1995972, 2036631, 1925795, 1989427, 1933163, 2024855, 2024336, 1891059, 1972160, 2039400, 2066769, 2078328, 2215251, 2063420, 2003417, 1979694, 2036332, 2064012, 2175227, 2280688, 2413745, 2369959, 2336560, 2453057, 2381133, 2453550, 2503864, 2755976, 2870138, 2844059, 2835998, 2892584, 2989366, 3131385, 3330062, 3438971, 3680636, 3929769, 4102474, 4185292, 4555814, 4786704, 4853555, 4859221, 5000298, 4988437, 4980372, 4774788, 4747686, 4642138, 4563724, 4547238, 4309975, 4006486, 3675432, 3594080, 3561821]
3246C561821o1281k37973j57683j580j76164K5183n3125j43055j65505j96680
3236B393958Q7942j3803O2121K08029j8615m1176M1450M0908n9764p1763n1660
3225B577627m4248K0781Q2088O9042N5286j31908L64555k0115k44403K04684J28674
3214C062063p3724l17394j36843k5408R0084J3101p704r9425k11253l18885L6835
3203B011447p8130Q4562J567P200o1082J02144J06864L02928J15993j17693L7219
3192B513019q4081p9463J069J15880J41643J98379j47545q2797j48972J45520
3182B572652L9230l0703K4736k3851M4278k44938p1572p4618M8602j23749k9142
3171B130925O6830K4161k4413m2983L8175p6708k8308J1838n892j91678J22511
$$ y = [3561821, 3500540, 3262567, 3104884, 3103304, 2927140, 2952323, 2899198, 2756143, 2590638, 2393958, 2481900, 2468097, 2530218, 2738247, 2719632, 2678456, 2719906, 2760814, 2701050, 2629287, 2577627, 2533379, 2554160, 2636248, 2705290, 2760576, 2628668, 2993223, 2973108, 2728705, 2933389, 3062063, 2988339, 2670945, 2534102, 2508694, 2598778, 2611879, 2604175, 2504750, 2293497, 1974612, 2011447, 1933317, 2017879, 2019446, 2026646, 1965564, 2067708, 2174572, 2477500, 2593493, 2475800, 2513019, 2428938, 2349475, 2350544, 2466424, 2608067, 2806446, 2658901, 2576104, 2427132, 2572652, 2611882, 2581179, 2605915, 2582064, 2626342, 2381404, 2309832, 2235214, 2283816, 2160067, 2130925, 2197755, 2221916, 2197503, 2154520, 2192695, 2115987, 2087679, 2099517, 2093625, 1901947, 2024458]
3160B024458k0520j5090k4441M455R3080r1876k40367J63852j853M5924N9680
3149A997302o3737j30454j09994R7849l9930L55639k2132K0505q0492j64930m5309
3138A814317p2096P352J36108o2135j04461n457m1462M2122N7913j39820P5667
3127A708048J6467J008r4281m0246j77386j98469J9646M629o716J83513J69026
3116A585239j30660n623L1340n4995M5720L7214J21473k29611j91276J57076L5728
3105A401625l4682J00911j3903k01268J61139j24784j50357L1806L9440j06528
3095A103399j60105P6046L6282k84049L1889J28359r6658K76804j4769k11290
3085H85908J50424r5567j1729K8161j74418R9275N6984k24518O052L2551J34502
$$ y = [2024458, 2003938, 1988848, 1964407, 1968862, 2061942, 1970066, 1729699, 1893551, 1891698, 1937622, 1997302, 1933565, 1803111, 1693117, 1790966, 1751036, 2106675, 2084543, 2105048, 2024556, 1859626, 1814317, 1742221, 1749573, 1885681, 1823546, 1719085, 1713628, 1672166, 1714288, 1772201, 1632381, 1708048, 1724515, 1725523, 1631242, 1590996, 1413610, 1215141, 1234787, 1239416, 1232700, 1416213, 1585239, 1454579, 1448956, 1480296, 1425301, 1471021, 1508235, 1629708, 1400097, 1208821, 1365897, 1401625, 1366943, 1467854, 1453951, 1252683, 1413822, 1289038, 1138681, 1170487, 1209927, 1103399, 943294, 1019340, 1055622, 771573, 803462, 931821, 835163, 1111967, 1097198, 885908, 1036332, 940765, 929036, 957197, 782779, 882054, 939038, 714520, 720572, 753123, 887625]
3074H87625J61049j46441j07437j37086L2573o0753R5138p7961m0395J02252K9459
3063G38023k26233L9492K3293j72827K72371J31406L7531k15483j38370R3145
3053E82348M1146j11653J1211L9424J07028M1106q6532K8913q0510j4348K17122
3042G75255J09972j45341l09776p9752N6732J42502Q5552j12334K0648l6769j32165
3031C74524l9853P340R7352L6193L7174l8547j5328o2878o2132Q8158n732j77652
3019B38619J66476k0548j02031l8845L7491K0412J35573j65832o5191J70426J59440
3008E35990o1532L1973j69641J14852l6089R7759Q8681o1680P362j59944O0893
2997D48624j12802j30495O5992J08298q0820P7927J2280r2040n6871O2465l0978
$$ y = [887625, 1048674, 902233, 794796, 657710, 690283, 629530, 724668, 646707, 606312, 708564, 738023, 511790, 551282, 574575, 401748, 674119, 805525, 843056, 627573, 489203, 582348, 623494, 511841, 523052, 562476, 669504, 710610, 624078, 652991, 572481, 558133, 775255, 885227, 739886, 430110, 350358, 407090, 549592, 635144, 522810, 543458, 506689, 374524, 334671, 342011, 439363, 475556, 512730, 474183, 458855, 395977, 333845, 422003, 416271, 238619, 405095, 384547, 282516, 243671, 281162, 301574, 437147, 271315, 206124, 376550, 535990, 474458, 506431, 336790, 451642, 415553, 513312, 601993, 540313, 547675, 387731, 448624, 335822, 205327, 271319, 379617, 298797, 376724, 389004, 296964, 240093, 302558, 271580]
2986B71580J32270L30572j00316k48533k0509j59191J27940J8494J31821L6748
2976E20876p1977q448O7835j03065n844J69946j09036o1986J01427j08877j25191
2965B65660R1555M8378j3443M0421J16186j57645j1875J70984n4043p3478K3177
2954D45877j59865Q6505R0904j68224J24397J06438j7546P4331N0417j00122M6990
2943E80102p2052Q4855k00538k05398K51628J47746J4412O5768j70141q3470R4906
2932E07818o6767k45157N3247J37018J10514J23184k38828j54475K3179K47284
2922D97017J73001n9414j30545k4815J54871J09399j16873k190J32912N6175q4393
2911G05145m1995J3658j7825r4714q9265j03614j16228N8358N8443K45585K7709
$$ y = [271580, 403850, 734422, 634106, 385573, 365064, 205873, 333813, 352307, 484128, 520876, 448899, 440451, 508286, 405221, 399377, 569323, 460287, 398301, 499728, 390851, 265660, 357215, 405593, 392150, 432571, 548757, 391112, 379237, 550221, 496178, 422700, 445877, 286012, 372517, 463421, 295197, 419594, 526032, 508486, 582817, 633234, 533112, 580102, 508050, 592905, 392367, 186969, 438597, 586343, 600755, 666523, 496382, 412912, 507818, 441051, 195894, 249141, 386159, 496673, 619857, 381029, 226554, 249733, 497017, 670018, 610604, 480059, 455244, 610115, 719514, 602641, 600451, 733363, 789538, 705145, 663150, 676808, 658983, 564269, 475004, 371390, 255162, 313520, 371963, 617548, 645257]
2900F45257p1425M6115p7250j95953q6068m1459J19793j28130K41794Q5845q5532
2889D52987K7080P9200j17760J00148j68999l6808o4670n9094m5536J02026Q6685
2878C55259r0087N7903k0945J42412n8955j04569m1480R5485m3994m3469J52349
2867C99909k00238m7525J0683p233J41041N7703l8613m7718r809j12798J63480
2856C08882j67073J0697j60352R1938J09642J14811j25946J24873l3321j88894
2846H5257O7371O1101j51542J26174j46765Q4438N7782l3089q449k8054l4840
2835G9384m0016Q5052P9551M9892l1420n5361M0968j63511r7737P4374j22983
2824a01807M6067O7685P2192j70935Q3999Q0422J41061l7529q5589l0643n0764
$$ y = [645257, 573832, 619947, 542697, 346744, 260676, 219217, 339010, 210880, 452674, 538519, 452987, 480067, 559267, 441507, 541655, 372656, 335848, 271178, 212084, 166548, 268574, 355259, 265172, 323075, 302130, 444542, 385587, 281018, 239538, 335023, 291029, 247560, 399909, 199671, 152146, 162829, 155596, 296637, 354340, 315727, 268009, 258200, 145402, 308882, 141809, 152506, -7846, 84092, 193734, 308545, 182599, 307472, 274151, 85257, 152628, 213729, 62187, 188361, 41596, 126034, 183816, 150727, 142278, 114224, 79384, 39368, 124420, 203971, 253863, 222443, 167082, 208050, 44539, -53198, 21176, -101807, -55740, 11945, 84137, -86798, -2799, 77623, 218684, 181155, 95566, 64923, 14159]
2813A4159J32580k77130J41604n7040J73128J1602P4373R1188k08551N7481j05121
2802D8273q518j1879J74957p4780P0223o0292j40282N0644J06491n0287n4112
2791E0438K7848M7853n8673J9932P186K25180j03424j09841K0376Q1678n1788
2780A56765j48445p601J5102P8100j34758l3151j08162J73081L6791l3144o7389
2769g2811j90982j7400R3749K30676o0322j24273p219J65482L5317j41602o688
2758i6073P7122n9921O1743m5764J37301q5302j12481J70203K3468j36091J1590
2747e4205n4791J64187j679j8558j2109r463K49837j70074j75927k6038K25459
2736A16639j7239j58212J16786L7284o5778J11383j35030k2329r2472l1764L6959
$$ y = [14159, 146739, -130391, 11213, -45827, 127301, 138903, 213276, 304464, 95913, 153394, 48273, 39755, 27876, 202833, 128053, 198276, 137984, -2298, 48346, 154837, 104550, 50438, 78286, 126139, 67466, 87398, 94584, 319764, 216340, 106499, 126875, 208553, 156765, 8320, 719, 15821, 93921, -40837, -73988, -182150, -9069, 27722, -5422, -72811, -263793, -281193, -187444, 43232, -17090, -141363, -148582, 16900, 52217, -89385, -96073, -18951, -78872, -17129, -62893, 74408, -10894, -123375, 46828, 70296, -65795, -54205, -108996, 55191, 53512, 34954, 22845, 13382, 263219, 93145, -82782, -108820, 116639, 99400, -58812, 57974, 95258, 29480, 140863, 5833, -16496, -108968, -140732, -103773]
2725a03773L16999L1511j89868J2145n7266p6612O7890J0073M014K4698j70993
2714a31182K10472J3712O0319J8943m2453J21358j64084p1688M0322K4810j14023
2703c3494j24075M5019J03317R1730j03278j03031R4078k65507K70432J58703
2693A33894j35701N9571j21763J63861L2663q9377r2724l7330J27445L9877j77011
2682i6595N3753J51614m3734J27358j17393j16320P2919k4622r9188r1213l6360
2671b19781p8010P2499q2361J15925J18712k2825O0458R4656j67882J46102j51055
2660a13562Q540N8341j67226N3228P0573K7645l125R8515j11014J02883l3501
2649h703n595R9548j29680J3343j36274M9316k9253Q5510K18994j5895q1939j17846
$$ y = [-103773, 213226, 244737, 54869, 67014, 9748, -66864, 1026, 11099, 15113, 39811, -131182, 79290, 93002, 153321, 172264, 129811, 251169, 87085, 15397, 55719, 80529, -33494, -157569, -112550, -9233, 82497, -20781, -123812, -29734, -295241, -24809, 133894, -1807, 57764, -63999, 99862, 132525, 43148, -49576, -86906, 40539, 80416, -96595, -42842, 108772, 65038, 192396, 75003, -41317, 31602, 6980, -92208, -183421, -219781, -297791, -225292, -307653, -191728, -73016, -95841, -35383, 59273, -108609, 37493, -113562, -105022, -46681, -213907, -160679, -90106, -62461, -65586, 32929, -78085, 24798, -8703, -14298, 85250, -44430, -31087, -167361, -118045, -147298, -61788, 157206, 141311, 59372, -58474]
2637e8474j04604J20328J62387J03480j56465k36121j1052P2861r5979k9103J99882
2626c2860N1961K2778Q8717Q1290j35834J381p6885O1196j58215j25815J38823
2615h3463J26902J2041O4344k17136J07960K3711q3416J8965j07821L5753J49283
2604D7123k2167N0902J57243m5511j27974m9030o3390p6696J33741P187o0876
2593d9448l904J2878K02883L4174j77968Q1342P2399k20422r910k82939J48213
2582a92702J74380r6358J80162j65451J9232q6484Q6067p0562J17043O834K966
2571b4873P6116N7961j25795j24982L940K04345O4370J5930j15364p6375K2056
2560b2671M7525Q2646o4553m6986J32309j37857j57586O1133m2052L2140L2155
$$ y = [-58474, -163078, -42750, 119637, 223117, 66652, -169469, -180521, -107660, -203639, -232742, -32860, 19101, 41879, 130596, 211886, 76052, 77433, 548, 61744, -96471, -222286, -83463, 43439, 55480, 119824, -97312, 10648, 34359, -49057, -30092, -137913, -102160, 47123, 24956, 75858, 233101, 187590, 59616, 10586, -52804, -129500, 4241, 11428, -49448, -53352, -40474, 162409, 196583, 18615, 99957, 172356, -48066, -57976, -340915, -192702, -18322, -114680, 65482, -99969, -80737, -167221, -81154, -151716, -34673, -27839, -24873, 51243, 109204, -16591, -141573, -137633, 66712, 131082, 147012, 31648, -44727, -22671, 24854, 107500, 42947, -4039, 128270, -9587, -167173, -106040, -148092, -115952, -83797]
2549h3797L7913K65p8454j09158J30577J6256o1985J325j1032j79530J22005K20300
2537D685n569p9455Q9730l3682j7602K24193N682j40271k499o0861l5936o084
2525e7669J35827j53676k4612J3811N4411k5736k3439P2244N6793j87188O6266
2514g2968j8401j41652Q0162k3590Q0056P2660K8539n8935K67962p5221q0855
2503E7757R7992J04131O8343q3295j58534k65997K52047J6211n4239Q5384m80
2492A19320j84623J5251J19294Q6022N7664j48541j19162K15628n4432j0709k8121
2481F7591j28892p4765J30501M5294j60872K71956o3935j58957k2833K2155K7113
2470d5644L0765J21564j19754p6491M2686m6430K00486L5203l148p4241n1056
$$ y = [-83797, -45884, -45619, -124073, -233231, -102654, -86398, -148383, -147058, -158090, -337620, -215615, 4685, -884, -80339, 9391, -24291, -41893, 182300, 187982, 47711, 45212, -15649, -51585, -57669, 78158, -75518, -100130, -86319, -31908, -57644, -81083, -8839, 47954, -139234, -72968, -91369, -233021, -152859, -176449, -96393, -23733, 4806, -54129, 213833, 138612, 57757, 155749, 259880, 328223, 244928, 86394, -179603, 72444, 88655, 34416, 119800, 119320, -65303, -50052, 69242, 155264, 212928, 64387, -54775, 160853, 106421, 95712, 67591, -61301, -136066, -5565, 39729, -121143, 150813, 86878, -72079, -94912, -72757, -45644, -14879, 106685, -13069, -89560, -46874, -93304, 107182, 142385, 139237, 64996, 13940]
2459A3940R3686J92351k63591n4112p8252p1711m080K34755l771J64177m1056
2448A82336o1348J39205j71086L5327j84506J43431j14616m4240O2407p9075K88251
2437A96086k3556j32061p8253k16119J46329J2982L2877J48944j55993l005Q5450
2426A3681N2717k1270L201J31121J50800k19512l64649j3613K59394J4288J6772
2415B2930J53866J40157j52233j13947O6212l1865j97344K41330J50978k79043
2405A041l2921M0755k2675L27185k5328K8062j31250j63430J25020L4599N504
2394A86562J76538K66k09413J26096M4594L07830m2312J0646Q8137p5982N4852
2383F67814K6165P0940p9109j55625j37552k2610l0997j08029m2248L2770J35477
$$ y = [13940, 107626, 299977, 36386, -17726, -95978, -167689, -171769, 62986, 59215, 223392, 182336, 120988, 260193, 89107, 124434, -60072, 83359, -31257, -75497, -13090, -92165, 196086, 172530, 40469, -37784, -253903, -107574, -94592, -61715, 87229, -68764, -71769, 13681, 66398, 45128, 48329, 179450, 330250, 110738, -253911, -267524, -8130, 6158, 22930, 176796, 316953, 164720, 50773, 116985, 85120, -112224, 129106, 280084, 1041, -31880, 8875, -13800, 313385, 288057, 316119, 184869, 21439, 146459, 181058, 186562, 363100, 363366, 153953, 280049, 324643, 632473, 590161, 600807, 688944, 612962, 667814, 693979, 764919, 685810, 530185, 392633, 370023, 339026, 230997, 188749, 221519, 356996]
2372C56996P492J2200l4829j57384K6810m1380K21J12368J25704N3906j15870
2361C46234M6770j63098L0390k8029o3206j17014j44412l6248J75508K15706L3401
2350B96002n6193K37530K9675j73341M0105k12169m9361J48360j69228J7600J25212
2339B34192K568p0589J46863R4325m3977j23905k56403J97721J16902J06374R2770
2328D96841k3785j13411j20716J04193j44Q9631m7198l8710j91846J45704Q6059
2317C86618J02765l6071r8723N1469M0545j37773j05772J43034j21473K6630J44825
2306C96074Q7744k08317r2456L9462l6449J84530J26293j0948j62866p0637J92052
2295D44482j82384k8832O6580J39923J74458p0601Q7277K3295K1108Q066m0375
$$ y = [356996, 364488, 376688, 341859, 184475, 211285, 169905, 170126, 282494, 408198, 462104, 346234, 393004, 229906, 260296, 232267, 169061, 52047, -92365, -128613, 46895, 262601, 296002, 239809, 477339, 507014, 333673, 373778, 161609, 112248, 260608, 91380, 108980, 234192, 236760, 166171, 313034, 407359, 363382, 239477, -16926, 180795, 297697, 404071, 496841, 473056, 359645, 238929, 343122, 342978, 432609, 385411, 346701, 154855, 300559, 386618, 489383, 453312, 354589, 406058, 446603, 308830, 203058, 346092, 224619, 251249, 396074, 483818, 275501, 183045, 222507, 186058, 370588, 496881, 485933, 323067, 252430, 444482, 262098, 233266, 299846, 439769, 614227, 543626, 630903, 654198, 675306, 683372, 642997]
2284F42997j11650j57415P7788j87340J60403J88208j27621Q000j45472o3365
2274B84533q1444J81786k1614j02320J1270R3125O5703r4871J46395r1563l9740
2263C51260Q829J28799K4638M5504J56540L4445j07845j10724m4098J4623J51226
2252F53197q636P3198k63306J05438J39495N2880q5049r5683J62113k5155m1575
2241F66917K6120o7864K9596j09469l0329J01988o0644O2398J23310P4014l8074
2230G77963J72880j3464J56422r4386j31488J9902l8305J92257O5477M4748j07654
2219A044352O1921K46007J14414k14018q5805O298K469J28459L2759J95283N9411
2208A591550k2317n1473J34287K01244J33034j68513m2712Q9543k8736O00J30917
$$ y = [642997, 531347, 373932, 451720, 264380, 424783, 612991, 485370, 493370, 347898, 284533, 203089, 384875, 363261, 260941, 272211, 365336, 431039, 336168, 482563, 391000, 351260, 360089, 488888, 513526, 559030, 715570, 750015, 642170, 531446, 487348, 501971, 653197, 644561, 717759, 454453, 559891, 699386, 752266, 667217, 571534, 733647, 708492, 666917, 693037, 625173, 654769, 545300, 514971, 616959, 556315, 618713, 742023, 816037, 777963, 950843, 937379, 1093801, 999415, 867927, 887829, 849524, 1041781, 1107258, 1152006, 1044352, 1106273, 1352280, 1466694, 1252676, 1166871, 1173169, 1175638, 1304097, 1336856, 1532139, 1591550, 1569233, 1517760, 1652047, 1853291, 1986325, 1817812, 1775100, 1864643, 1835907, 1836507, 1967424]
2197A967424J21772k2350j3374J0737J11648K12038j19093J79823l1218n4480
2187B362927p8389n8559J95475K45841R5622K4012j06316m9408L3724J09579m2187
2176B732321K41218p9358r3709J95188J18725J42464L8092k38648L03653j02990
2166C256956J18620J18113L0392J89654n0049Q6553K94977p2130J79912J38625
2156D291623J31423M02799L16371K64224M4401K66250L64267N43753M11680K93081
2146G329872N82637M54081L99022P84903N84329P29720P24947P22065R40835J000231
2136A4252642J289199J610860J523765J433569J817814J916891K878950L802150
2128C0525840M336437M647455N462106N651478O670600Q327274J0206243J1271996
$$ y = [1967424, 2089196, 2066846, 2053472, 2064209, 2175857, 2387895, 2268802, 2448625, 2417407, 2362927, 2284538, 2225979, 2421454, 2667295, 2762917, 2786929, 2680613, 2631205, 2664929, 2774508, 2732321, 2973539, 2894181, 2800472, 2995660, 3114385, 3256849, 3294941, 3056293, 3359946, 3256956, 3375576, 3493689, 3524081, 3713735, 3663686, 3750239, 4045216, 3973086, 4152998, 4291623, 4423046, 4825845, 5142216, 5406440, 5450841, 5717091, 6081358, 6625111, 7036791, 7329872, 7912509, 8366590, 8765612, 9550515, 10134844, 10864564, 11589511, 12311576, 13252411, 14252642, 15541841, 17152701, 18676466, 20110035, 21927849, 23844740, 26723690, 30525840, 34862277, 39509732, 44971838, 50623316, 57293916, 65621190, 75827433, 87099429]
2120H7099429J5332666J5022408n316137j5459606j8297489j6930740j2059609
2113D9390922q680076n978697m425453l501644k704735j913330j762136j125285
2105A9299566n62395o81914j257424j377442j281405j292961j009453q67337q10226
2096A0159009l98463m45022n98900l89548m44794n54367j67968k43741j90624
2087F725582l37955O7088l84879j02531j23480l95250k66913j54570j27829j2435
2077D886828q1816j57060l00869m1899o3354k14371j66794k06412k88498q954
2067C356801j65549J30701j53784p4398j28916l7741j60951j34080p6951k1167
2057B533965j73883J66004m3743k7411j63502j86288k4348J10805o2402J27382
$$ y = [87099429, 102432095, 117454503, 112138366, 96678760, 78381271, 61450531, 49390922, 40710846, 34732149, 30306696, 26805052, 24100317, 22186987, 20424851, 19299566, 18737171, 18055257, 16797833, 15420391, 14138986, 12846025, 11836572, 10969235, 10159009, 9760546, 9315524, 8716624, 8327076, 7882282, 7327915, 7159947, 6916206, 6725582, 6387627, 6454715, 6069836, 5967305, 5843825, 5448575, 5181662, 5027092, 4899263, 4886828, 4805012, 4647952, 4347083, 4305184, 4241830, 4027459, 3860665, 3654253, 3365755, 3356801, 3191252, 3321953, 3168169, 3093771, 2964855, 2927114, 2766163, 2632083, 2555132, 2533965, 2360082, 2526086, 2482343, 2454932, 2291430, 2105142, 2080794, 2191599, 2129197, 2256579]
2047B256579k3005p8877j52139k37837q2888N3264r4330L8316J54255j02064n0748
2036A680526j03119K37181O5297m6643p7148j5584j95626k45884J11907j80427
2026A230480j50135P2550O683m2372j78242O9638K47544k79496k11203O6385P1103
2015I02935P9418Q9293j06820j12309o2524J56614O5148l0489O6402J6073L0407
2004A094148o0342o0157m317j3358p0442j04737J0841K00560l06056N5205J25522
1993H66867P3446m9813k15992L7236K31296l1133j16135j17591r9067Q4858K4099
1982F88071M5203p437q2878k6428J26124j63362k13439k820l8783P3853L948J91445
1970E93497j65675l9889Q5062l5825J51544m708o0025Q4162J24195j15599j02569
$$ y = [2256579, 2233574, 2154697, 2002558, 1764721, 1681833, 1735097, 1640767, 1679083, 1833338, 1731274, 1680526, 1577407, 1814588, 1879885, 1833242, 1756094, 1740510, 1544884, 1299000, 1410907, 1230480, 1080345, 1152895, 1159578, 1117206, 938964, 1008602, 1256146, 976650, 765447, 831832, 902935, 982353, 1071646, 964826, 852517, 789993, 946607, 1011755, 981266, 1047668, 1063741, 1094148, 1033806, 973649, 969332, 955974, 885532, 780795, 791636, 992196, 686140, 741345, 866867, 940313, 890500, 674508, 711744, 943040, 911907, 795772, 678181, 579114, 663972, 688071, 733274, 725837, 642959, 616531, 742655, 579293, 365854, 363034, 324251, 398104, 402052, 593497, 427822, 387933, 472995, 437170, 588714, 584006, 523981, 608143, 732338, 616739, 514170]
1959E14170M0634m3787j71717K6512K02707j04139j20289j54949J29489K27695
1949E46326m6561R948n8183k52848j7606L8678o1635J55303J6514q9458J77231
1938D17709p9080j20702K23860l36644r7133K71904M6765J4022j70846j14041
1928E5814J92928K9160j76819k1283m3826J02118M0815K4026N7395n0682m7709
1917A61937N0795K14108m4541k47106p8516O5061Q5885m5062p4437j25968J77531
1906A39687J15835k13306K48330q6110k10205J68634K28131k1597l33833J31730
1896A67296K0381K8442R5482K9023J11512p2133o540j53407P942m8641R7769J56456
1884D33582k37351M877J03227J8394r9870J83311n6109j90908j10103j45364J53950
$$ y = [514170, 554804, 511017, 339300, 365812, 568519, 464380, 344091, 189142, 318631, 546326, 499765, 509713, 451530, 198682, 181076, 219754, 158119, 313422, 329936, 240478, 417709, 338629, 217927, 441787, 105143, 8010, 279914, 326679, 340701, 169855, 55814, 248742, 277902, 101083, 79800, 35974, 138092, 178907, 202933, 260328, 209646, 161937, 212732, 426840, 382299, 135193, 56677, 121738, 207623, 162561, 88124, -37844, 139687, 255522, 42216, 290546, 204436, -5769, 162865, 390996, 369399, 35566, 167296, 187677, 216119, 311601, 340624, 452136, 380003, 373463, 220056, 227998, 179357, 277126, 433582, 196231, 201108, 304335, 322729, 222859, 406170, 350061, 159153, 49050, -96314, 57636]
1873E7636l0985j56771J07595J09766K03036k2749l3222p7288K0270O244P2765
1862B56297q3565N7488j10138K8899J71205j45637n9667J23331J28139O4914P1013
1851E02279j70095J71628J43347n7814n7153q1402o746P2544j28389j63261p1951
1840A52987M2870p0305o7035j19120K41905K4302j28167J85129o7732n8621r534
$$ y = [57636, 26651, -130120, -22525, 87241, 290277, 267528, 234306, 157018, 177288, 183532, 256297, 172732, 230220, 120082, 148981, 320186, 174549, 114882, 238213, 366352, 431266, 502279, 332184, 503812, 647159, 589345, 532192, 450790, 444044, 516588, 388199, 224938, 152987, 195857, 125552, 58517, -60603, 181302, 205604, 77437, 262566, 194834, 136213, 126679]
$$ [...]
##END NTUPLES=NMR SPECTRUM
##END=
