##TITLE=1H_EC-3265(1-1)
 CDCl3
 8 sc, 
 10.12.2021
##JCAMPDX= 6.0         $$ Bruker NMR JCAMP-DX V2.0
##DATA TYPE= NMR SPECTRUM
##DATA CLASS= NTUPLES
##ORIGIN= UXNMR, Bruker Analytische Messtechnik GmbH
##OWNER= root
$$ XWIN-NMR		Version 3.5
$$ Fri Dec 10 11:45:01 2021 Russian Standard Time (UT+4h)  she@DPX200
##.OBSERVE FREQUENCY= 200.131346
##.OBSERVE NUCLEUS= ^1H
##.ACQUISITION MODE= SIMULTANEOUS
##.ACQUISITION SCHEME= undefined
##.AVERAGES= 8
##.DIGITISER RES= 18
##SPECTROMETER/DATA SYSTEM= spect
##.PULSE SEQUENCE= zg30
##.SOLVENT NAME= CDCl3
##.SHIFT REFERENCE= (INTERNAL, CDCl3, 0, 15.7226)
##AUDIT TRAIL= $$ (NUMBER, WHEN, WHO, WHERE, WHAT)
$$ ##TITLE= Audit trail, XWIN-NMR		Version 3.5
$$ ##JCAMPDX= 5.01
$$ ##ORIGIN= Bruker BioSpin GmbH
$$ ##OWNER= she
$$ F:/spectra/data/she/nmr/H-F/1/pdata/1/auditp.txt
$$ ##AUDIT TRAIL=  $$ (NUMBER, WHEN, WHO, WHERE, WHAT)
(   1,<2021-12-10 11:43:19.10 +0400>,<she>,<DPX200>,
      <created by zg, POWCHK disabled, PULCHK disabled
       configuration hash MD5:
       00 E9 B6 7A A2 85 ED C7 34 08 36 98 17 FE 4E 26
       data hash MD5: 16K
       9A 05 EE FB 47 30 8C F3 2F 75 88 6F 53 5E 03 F7>)
(   2,<2021-12-10 11:43:48.10 +0400>,<she>,<DPX200>,
      <Start of raw data processing
       efp BC_mod = 2 LB = 0.24 FT_mod = 6 PKNL = 1 PHC0 = -15869.6 PHC1 = 8.4008 SI = 16K 
       data hash MD5: 16K
       0F 73 C2 EB BE 79 34 64 51 4A F2 62 6E 9F 5F 2E>)
(   3,<2021-12-10 11:44:05.17 +0400>,<she>,<DPX200>,
      <pk PHC0 = -0.4638949 PHC1 = 1.8 
       data hash MD5: 16K
       8E 76 F0 C9 CE 24 DC C1 8E E8 88 30 52 25 D5 D7>)
(   4,<2021-12-10 11:44:07.90 +0400>,<she>,<DPX200>,
      <abs ABSG = 5 
       data hash MD5: 16K
       E2 C6 A6 5F FD 2B 23 0D AA E3 25 13 38 D9 54 22>)
(   5,<2021-12-10 11:44:34.56 +0400>,<she>,<DPX200>,
      <abs ABSG = 5 
       data hash MD5: 16K
       FE 0E D6 79 B2 2B 75 72 BD 28 4B 14 E1 41 5F 63>)
$$ ##END=
$$ 
$$ hash MD5
$$ 49 D7 A5 E6 D8 4A 3E 4F 07 E7 B2 03 23 50 67 DC
##$RELAX= 
##$RELAX= 
##$RELAX= 
##$RELAX= 
##$RELAX= 
##$RELAX= 
$$ Bruker specific parameters
$$ --------------------------
##$DU= <F:/spectra>
##$EXPNO= 1
##$NAME= <H-F>
##$PROCNO= 1
##$TYPE= <nmr>
##$USER= <she>
##$AMP= (0..31)
100 100 100 100 100 100 100 100 100 100 100 100 100 100 100 100 100 100 
100 100 100 100 100 100 100 100 100 100 100 100 100 100 
##$AQSEQ= 0
##$AQ_mod= 1
##$AUNM= <au_zg>
##$AUTOPOS= <>
##$BF1= 200.13
##$BF2= 200.13
##$BF3= 200.13
##$BF4= 200.13
##$BF5= 200.13
##$BF6= 200.13
##$BF7= 200.13
##$BF8= 200.13
##$BYTORDA= 1
##$CFDGTYP= 0
##$CFRGTYP= 5
##$CHEMSTR= <none>
##$CNST= (0..31)
1 1 145 1 1 1 1 1 1 1 1 1 1 1 1 1 1 1 1 1 1 1 1 1 1 1 1 1 1 1 1 1 
##$CPDPRG= <>
##$CPDPRG1= <>
##$CPDPRG2= <>
##$CPDPRG3= <>
##$CPDPRG4= <mlev>
##$CPDPRG5= <mlev>
##$CPDPRG6= <mlev>
##$CPDPRG7= <mlev>
##$CPDPRG8= <mlev>
##$CPDPRGB= <>
##$CPDPRGT= <>
##$D= (0..31)
0 1.2 0 0 0 0 0 0 0 0.06 0 0.03 0 0 0 0 0.0002 0 0 0 0 0 0 0 0 0 0 0 0 
0 0 0 
##$DATE= 1639122198
##$DBL= (0..7)
$$ [...]
##$SUBNAM2= <"">
##$SUBNAM3= <"">
##$SUBNAM4= <"">
##$SUBNAM5= <"">
##$SUBNAM6= <"">
##$SUBNAM7= <"">
##$SUBNAM8= <"">
##$SUBNAM9= <"">
##$SW= 18.0517287032376
##$SWIBOX= (0..15)
0 0 2 0 0 0 0 0 0 0 0 0 0 0 0 0 
##$SW_h= 3612.71676300578
##$TD= 16384
##$TD0= 1
##$TE= 0
##$TE2= 300
##$TE3= 300
##$TEG= 300
##$TL= (0..7)
0 120 120 120 120 120 120 120 
##$TP= (0..7)
150 150 150 150 150 150 150 150 
##$TP07= 0
##$TPNAME0= <>
##$TPNAME1= <>
##$TPNAME2= <>
##$TPNAME3= <>
##$TPNAME4= <>
##$TPNAME5= <>
##$TPNAME6= <>
##$TPNAME7= <>
##$TPOAL= (0..7)
0.5 0.5 0.5 0.5 0.5 0.5 0.5 0.5 
##$TPOFFS= (0..7)
0 0 0 0 0 0 0 0 
##$TUNHIN= 0
##$TUNHOUT= 0
##$TUNXOUT= 0
##$USERA1= <user>
##$USERA2= <user>
##$USERA3= <user>
##$USERA4= <user>
##$USERA5= <user>
##$V9= 5
##$VALIST= <valist>
##$VCLIST= <CCCCCCCCCCCCCCC>
##$VD= 0
##$VDLIST= <DDDDDDDDDDDDDDD>
##$VPLIST= <PPPPPPPPPPPPPPP>
##$VTLIST= <TTTTTTTTTTTTTTT>
##$WBST= 1024
##$WBSW= 4
##$XGAIN= (0..3)
0 0 0 0 
##$XL= 0
##$YL= 0
##$YMAX_a= 258019
##$YMIN_a= -411401
##$ZGOPTNS= <>
##$ZL1= 120
##$ZL2= 120
##$ZL3= 120
##$ZL4= 120
##$ABSF1= 15.72265
##$ABSF2= -2.3292
##$ABSG= 5
##$ABSL= 3
##$ALPHA= 0
##$AQORDER= 0
##$ASSFAC= 0
##$ASSFACI= 0
##$ASSFACX= 0
##$ASSWID= 0
##$AUNMP= <proc_1d>
##$AZFE= 0.1
##$AZFW= 0.1
##$BCFW= 0
##$BC_mod= 2
##$BYTORDP= 0
##$COROFFS= 0
##$CY= -3
##$DATMOD= 1
##$DC= 0
##$DFILT= <>
##$DTYPP= 0
##$F1P= 0
##$F2P= 0
##$FCOR= 1
##$FTSIZE= 16384
##$FT_mod= 6
##$GAMMA= 0
##$GB= 0
##$INTBC= 1
##$INTSCL= 0
##$ISEN= 128
##$LB= 0.24
##$LEV0= 0
##$LPBIN= 0
##$MAXI= 10000
##$MC2= 0
##$MEAN= 0
##$ME_mod= 0
##$MI= 1.114404
##$NCOEF= 0
##$NC_proc= -6
##$NLEV= 6
##$NOISF1= 3.799351
##$NOISF2= 2.8
##$NSP= 0
##$NTH_PI= 0
##$NZP= 0
##$OFFSET= 15.72265
##$PC= 1
##$PHC0= -15870.06
##$PHC1= 10.2008
##$PH_mod= 1
##$PKNL= yes
##$PPARMOD= 0
##$PSCAL= 0
##$PSIGN= 0
##$REVERSE= no
##$SF= 200.130005783345
##$SI= 16384
##$SIGF1= 3
##$SIGF2= 2
##$SINO= 5.538805
##$SIOLD= 16384
##$SREGLST= <1H.CDCl3>
##$SSB= 0
##$STSI= 16384
##$STSR= 0
##$SW_p= 3612.71676300578
##$SYMM= 0
##$S_DEV= 0
##$TDeff= 16384
##$TDoff= 0
##$TI= <>
##$TILT= no
##$TM1= 0
##$TM2= 0
##$TOPLEV= 0
##$USERP1= <user>
##$USERP2= <user>
##$USERP3= <user>
##$USERP4= <user>
##$USERP5= <user>
##$WDW= 1
##$XDIM= 16384
##$YMAX_p= 277797796
##$YMIN_p= -317787
$$ End of Bruker specific parameters
$$ ---------------------------------
##NTUPLES= NMR SPECTRUM
##VAR_NAME=  FREQUENCY,     SPECTRUM/REAL,   SPECTRUM/IMAG
##SYMBOL=    X,             R,               I
##VAR_TYPE=  INDEPENDENT,   DEPENDENT,       DEPENDENT
##VAR_FORM=  AFFN,          ASDF,            ASDF
##VAR_DIM=   16384,         16384,           16384
##UNITS=     HZ,            ARBITRARY UNITS, ARBITRARY UNITS
##FACTOR=    0.220516191357247, 1,           1
##FIRST=     3146.57395023012, 0,            0
##LAST=      -466.14281277566, 0,            0
##MIN=       -466.14281277566, -317787,      0
##MAX=       3146.57395023012, 277797796,    0
$$ Real data points
##PAGE= N=1
##DATA TABLE= (X++(R..R)), XYDATA
$$ [...]
7918h7693J07639m5998J3346p7783n0344K9082O5299J903n1017o5143r4141J48794
7906a06056k3723l0186j3441J23707N0445r8659J18992k406p7962M407j00214
7895a55096K8065J40896m5929Q6293l5962k9863m2584j05131J32461J3234k7078
7884d0694J4529j10755M9934J06296L2214r230n4131p1657j7504m0177p316J03229
7872d5262k4645l1791L4157n5555m0290J47361K414n3197J7463j27549O4381M6458
7860f6055j38014n6894J52895O325J7264o210l3249J70447o8907n8840j4622J5537
7848h0323N664L2884o1487l4135l6764K5213N9185L5028M6196k2342p1550n327
7836a07758L1641l3541O5175m2260J7255J00479k0444m3376m186j4948l4445L327
$$ y = [-87693, 19946, -26052, -12706, -90489, -140833, -111751, -46452, -44549, -95566, -160709, -254850, -106056, -129779, -159965, -173406, -49699, 746, -97913, 21079, 18673, -59289, -54882, -155096, -127031, 13865, -32064, 54229, 18267, -11596, -54180, -159311, -26850, -13616, -40694, -26165, -136920, -86986, 19310, 51524, 42294, -11837, -83494, -100998, -141175, -148491, -45262, -69907, -101698, -67541, -123096, -163386, -16025, -13611, -66808, -49345, -176894, -112513, -66055, -204069, -260963, -108068, -101743, -84479, -90689, -123938, 46509, -22398, -81238, -95860, -80323, -74659, -41775, -103262, -137397, -174161, -148948, -89763, -54735, -8539, -30881, -102431, -107758, -76117, -109658, -44483, -86743, -69488, 30991, 10547, -32829, -37015, -51963, -86408, -83081]
7824h3081N9126l2618j73225O543Q905R2357L1545m8218k674M1077L0815R0352
7812B0904j20896L1044L2273j13416k7803k8168P7361k2924l2322K54455J53662
7801B24170j96328M7733l9330r5946j08815P0317Q647O7053n522Q300j12068J2996
7789a18793M6035K1971n8453q4099J3741J10874l4007j6258N3938n3561N4623
7778f3989J5940J3010p7823j6410q0082Q3540J66111N0430j10258p609l4619O413
7766e5346k0565m3834L7802L2812j759P631o5978K0221O3084m1375O764K6622
7754c3921j1250l8697K236r2319J88851R867q3048j734M2662j3567O29K0846p3707
7741h3152M1497K0261j6540l8776k6330o8548N9443N1327o6671J5541Q4942q9863
$$ y = [-83081, -23955, -56573, -229798, -223255, -214350, -121993, -90448, -138666, -141340, -100263, -69448, 20904, -99992, -68948, -36675, -150091, -177894, -206062, -128701, -151625, -183947, 70508, 224170, 27842, 75575, 36245, -59701, -168516, -98199, -89552, -22499, -28021, -19721, -131789, -118793, -72758, -50787, -109240, -193339, -179598, -68724, -102731, -118989, -65051, -118612, -63989, -48049, -35039, -112862, -129272, -209354, -125814, 40297, 90727, -19531, -27140, -61759, -55346, -75911, -119745, -81943, -49131, -50890, -43259, -109237, -89016, -25932, -67307, -60543, -33921, -45171, -83868, -81632, -173951, 14900, 24767, -58281, -60015, -17353, -30920, -30291, -9445, -83152, -41655, -21394, -37934, -76710, -103040, -171588, -112145, -60818, -127489, -111948, -27006, -116869]
7729a16869j1852n6089K5301m6597N785J34103m2419M9270J00p8572P5413m6196
7717a08622P7034P6317m5005r4185j6662N4647K6728l8716O197J12231j0095m4548
7705d679o7260K7818N8831j48585l7819O0847J4724J10344n9926j03236J21326
7694b7615O5248m0301k3621j90825N5485O8440j2167p8127m8152k6716J12473
7683a45878J0467k979R4033K387O5846r8532o2734R4548o514J0242K8091m9605
7671f0628J5031J4271P5598M9009j8425r0078k6225K4662l7777N3J07057L2740
7659H5288k1796p7096n0441R1935o9522J00426P1982m4765j25643O0952K7170
7648D8490q6148J8751m200L3627n0490M3813J9464l3669q4707O2375K8566o5524
$$ y = [-116869, -128721, -184810, -159509, -206106, -200321, -66218, -108637, -59367, -59267, -137839, -62426, -108622, -31588, 44729, -276, -94461, -111123, -56476, -29748, -68464, -62267, 49964, 39869, -4679, -71939, -44121, 14710, -133875, -171694, -110847, -96123, 14221, -45705, -148941, -27615, 37633, -2668, -26289, -217114, -161629, -93189, -105356, -183483, -231635, -258351, -145878, -135411, -138390, -44357, -41970, 23876, -74656, -137390, -42842, -49356, -39114, -11023, -60628, -45597, -31326, 44272, 93281, 74856, -15222, -41447, -16785, -54562, -54509, 52548, 85288, 63492, -13604, -64045, 27890, -41632, 58794, 130776, 86011, -39632, 21320, 48490, -37658, -18907, -23107, 10520, -39970, 3843, 23307, -10362, -95069, -32694, -4128, -69652]
7636f9652l5920K8470Q602R6684N19j9595q6897n3125j1743J7482J35205m1270
7624c1240l7937L7689L6714q7759j1988k8416r617Q3827L4228q9285Q7320O4835
7612D8371p0984n7315o8046m3067J12157O3993m4352l504k1472n7720o3616P1919
7600a33636J15703M1383m8717l2883j16178Q4455K6951m89L509r1434j5799O7261
7588i9874P414M5127k72l1860P1470r5764k0646O3245K5244J3184l9485L5955
7576b6262n8026j4045j2372l0362o9365J12867Q0986j4165L4963k7910Q4143j34055
7564g3603j6256n8885K8422J5806L3359o9079P1903K0418j9345Q4289m9041P7862
7552D5850o4076q161J3881j19273l3643j7250K2409P9993k7474K0503O7277N6259
$$ y = [-69652, -105572, -77102, -68500, 28184, 28703, 9108, -77789, -130914, -142657, -125175, 10030, -31240, -69177, -31488, 5226, -82533, -94521, -122937, -132554, -48727, -14499, -103784, -16464, 48371, -22613, -79928, -147974, -191041, -78884, -14891, -59243, -62747, -84219, -141939, -205555, -133636, -17933, 23450, -25267, -58150, -174328, -89873, -62922, -63411, -59902, -151336, -167135, -99874, -92460, -47333, -47605, -79465, -7995, -103759, -124405, -61160, -35916, -22732, -62217, -26262, -84288, -98333, -110705, -141067, -210432, -97565, -16579, -30744, 4219, -23691, 60452, -73603, -89859, -148744, -120322, -104516, -71157, -140236, -68333, -47915, -67260, 17029, -32012, 45850, -18226, -26387, -12506, -131779, -165422, -182672, -160263, -80270, -107744, -87241, -19964, 36295]
7540C6295j140K5234p203j43874o2733J36252N8582k0394k6479m8526M7519N6015
7528D9548j13744n367N3517K4162M835r129j7773p7225N8771J04397j02130j9822
7516d9960p0149P1875N5702n2393j0924O5854L3502L6751N3984l9695m6982L4301
7504H1866M9931Q362N4984m5117M4751P2274K0820K434O0959m64k7236n0763J2848
7491B85649K664J393p6607n9648l6112M3149K2809r2319m7451M3855r143j2100
7479F6139n4329N7063l8655m3277K029J7709j3537N203R457L5480r052K7844o0488
7466A586O135Q935m3642J3324j0200J16890n0524j5386m3519J2577o2188m517
7454g0529J6202M0309R4874J1442J4416k9847m7517K0402k4171k56k8365L4285
$$ y = [36295, 35155, 60389, 53186, -90688, -153421, -17169, 41413, 21019, -5460, -53986, -6467, 49548, -64196, -69563, -16046, 8116, 12951, 3822, -13951, -91176, -32405, 71992, -30138, -49960, -120109, -48234, 7468, -44925, -55849, 10005, 43507, 80258, 134242, 94547, 47565, 81866, 131797, 140159, 195143, 150026, 194777, 267051, 287871, 290305, 351264, 350800, 323564, 272801, 285649, 288313, 289706, 213099, 153451, 117339, 160488, 183297, 90978, 43527, 87382, 78239, 66139, 11810, 68873, 30218, -13059, -11030, 6679, -6858, -1655, 7802, 43282, 34230, 62074, 1586, 7721, 16656, -26986, -13662, -23862, 93028, 42504, 27118, -16401, -3824, -66012, -70529, -54327, -14018, 80856, 92298, 106714, 76867, 29350, 49752, 25581, 25325, -3040, 31245]
7442C1245m2733q1685L7867l2722J29958N039j26511j95K6672K3026Q3195l1996
7430B1160l5718J54250k6640n4629O758j18464K6266m699m4480n4938p379Q2068
7418e6445p4263L4039J7879j6768J6856J7483j7596o2236K4939P4253K8619L78
7406a2862M0457j0798m7469O3397k6122m4427o4570N9961K004L4206N1331k7749
7394A7359j4111J11756j20557N9866N0684r653K031n5951m3424j9817P070J0403
7382d344J7713P3422l035L2326j14996m4517M8370O3246r737o6347Q2008r6903
7370b2794n1160J9329K0687P3355N8158k6624Q409k2713k8444n8571O1070L4157
7358F4859p7826l6886N1279r2178P5507J8375N264L2121P2972j9934k4401m797
$$ y = [31245, -11488, -93173, -55306, -88028, 41930, 46969, -79542, -79737, -53065, -30039, 53156, 21160, -14558, 139692, 113052, 58423, 65181, -53283, -27017, -31716, -76196, -131134, -138513, -56445, -130708, -96669, -78790, -95558, -78702, -61219, -78815, -141051, -116112, -41859, -13240, -12862, 27595, 16797, -30672, 32725, 6603, -37824, -102394, -42433, -40429, -6223, 45108, 17359, 3248, 115004, -5553, 54313, 104997, 95344, 97375, 41424, -2000, -21817, -14747, -4344, 13369, 86791, 83756, 116082, 1086, -43431, 4939, 68185, 58448, -7899, 74109, -22794, -73954, -54625, -33938, 39417, 97575, 70951, 79360, 56647, 28203, -30368, 30702, 64859, -12967, -49853, 1426, -90752, -15245, 3130, 8394, 40515, 113487, 93553, 69152, 64355]
7346F4355N9210j7171Q6600L409r3699j9691J9660r2317j4298m0304P7435P0195
7334A03384L8283N7201k25289m5258Q5191L5985j09007Q1216R8373K3325k0864
7323A22540j30673L8676N5293J04382k6747r9786O4381k0338l9394P8899k8875
7312A18358k5784J4705k2215k7626q769q3784K2676L1260K3976L3943n5016J9945
7300D1669N070n9852R4892N6165L8285j8868l663j3939M6972J0344j63870j5472
7288A7733P0584J14069L871l3980L4941L2366K320m9350l2361p857M4497j2909
7276A83924L1908q235l2469N8159n8293L4136l5180o4683M7129N207M4514k9617
7264A76500J0334j2324L2466P8519M2618r3251k0102J50613q3608Q9792N6693
$$ y = [64355, 123565, 106394, 192994, 196403, 102704, 83013, 102673, 10356, -3942, -44246, 33189, 103384, 141667, 198868, -26421, -71679, 13512, 49497, -59510, 21706, 120079, 143404, 122540, -8133, 30543, 85836, 190218, 163471, 63685, 128066, 107728, 68334, 147233, 118358, 92574, 107279, 85064, 57438, 48669, -35115, -12439, 18821, 42797, 76740, 21724, 41669, 46739, -13113, 81779, 137944, 176229, 157361, 153698, 139759, 186731, 197075, 33205, 17733, 88317, 202386, 206257, 172277, 207218, 239584, 241904, 192554, 160193, 152336, 196833, 183924, 215832, 207597, 175128, 233287, 174994, 209130, 173950, 109267, 156396, 161603, 206117, 176500, 186834, 174510, 206976, 285495, 328113, 234862, 214760, 365373, 281765, 371557, 428250]
7253D28250L1328j56335M7482Q815L1965k5095N8269n3199o1288P9607j04385
7242B85414L2495j7223j47791J36470n7317R2477M2289m298P5188n055o5579O6195
7230D33265k9559n2235J62243p850m8149L9579m5228N0912J17992o7702l0289
7219E22979m4308j6012k4572N8678q1290O2204L348M07K8150Q7005O2478L6553
7207F95620M686l1816o41M639j9907K4186J38039r327J8917n3194N2565o987K3031
7194H39811K969K3352J2712K2064N3463o5869r498J63134k4187r4241J42860N5771
7182A122341R6327n8028J19069O7990p4562L2303J21044j8994N4066J52234P3112
7171A686902N8275l046J79568L8304O5838J24241j14639M1455J14538l1994J46573
$$ y = [428250, 459578, 303243, 350725, 359540, 391505, 366410, 424679, 371480, 310192, 389799, 285414, 317909, 300686, 152895, 289365, 232048, 324525, 366814, 362516, 437704, 432649, 367070, 433265, 403706, 351471, 513714, 505864, 457715, 497294, 452066, 502978, 620970, 553268, 522979, 478671, 462659, 438087, 496765, 415475, 477679, 481027, 481434, 509584, 596589, 659067, 695620, 700306, 668490, 667849, 672488, 652581, 676767, 814806, 805479, 824396, 771202, 823767, 816780, 839811, 842780, 866132, 878844, 900908, 954371, 888502, 879004, 1042138, 1017951, 923710, 1066570, 1122341, 1218668, 1160640, 1279709, 1347699, 1273137, 1305440, 1426484, 1407490, 1461556, 1613790, 1686902, 1745177, 1742131, 1921699, 1960003, 2025841, 2150082, 2035443, 2076898, 2191436, 2159442, 2306015]
7160B306015J18793o9276Q4186J66854Q9684N3332n313P1656N4428j8067J06884
7149B959176j7497L4684N6177J25082m245J34985J20665M1191M4957J54074J05595
7138C754844N3312M2139J72416J77555K48969K00721L89579K42995K05332L16454
7128E804316J40067K38592K65250K31831L19920M49571L94380L95365L65166O00203
7118I204661N25642N72062P97398Q05808R03997J092914J258246J360405J739210
7109A8260343J982373K384069K724855L096368L537886L968719M773067N479595
7101D6207275O325189P341994P690575P005433M137971k90651m840777q218348
7093F5358661r090207q359175o798464n261982m194068l606528l076156k622769
$$ y = [2306015, 2424808, 2355532, 2439718, 2606572, 2696256, 2749588, 2744275, 2815931, 2870359, 2852292, 2959176, 2941679, 2976363, 3032540, 3157622, 3153377, 3288362, 3409027, 3450218, 3495175, 3649249, 3754844, 3808156, 3850295, 4022711, 4200266, 4449235, 4649956, 5039535, 5282530, 5487862, 5804316, 5944383, 6182975, 6448225, 6680056, 6999976, 7449547, 7843927, 8239292, 8604458, 9204661, 9730303, 10302365, 11099763, 11905571, 12809568, 13902482, 15160728, 16521133, 18260343, 20242716, 22626785, 25351640, 28448008, 31985894, 35954613, 40727680, 46207275, 52532464, 59874458, 67565033, 74570466, 78708437, 78417786, 73577009, 65358661, 56268454, 47909279, 41110815, 35848833, 31654765, 28048237, 24972081, 22349312]
7085B2349312k375372j970718j626818j396003j145721j068683q81481q07457
7077A1077059p10003n47386n96963m68041l54802k30471l85329l87068k00801
7068G196195l13036k05494j50493j34748l23559k04211o3786j13540j84120k21273
7058E281935k84400k18284j98163k25435k07347m8826j79852p2947j72537r5231
7048C578913j49854j66246q8487l9378p7563J41n1015l0984l8280J4135J09461
7037C060843J3788o7376J7759J2777J9798j55232k83391j32040j56204j66134
7027B164588j05543l2545j16106j07999J4560j74069j8991M4230J10575l8441
7017A740259j62191r1717O7518m7551r7235k3336m4279M2411j74599l9988m633
$$ y = [22349312, 19973940, 18003222, 16376404, 14980401, 13834680, 12765997, 11884516, 11077059, 10367056, 9819670, 9222707, 8754666, 8399864, 8169393, 7784064, 7396996, 7196195, 6883159, 6677665, 6527172, 6392424, 6068865, 5864654, 5800868, 5687328, 5503208, 5281935, 4997535, 4779251, 4581088, 4355653, 4148306, 4099480, 3919628, 3846681, 3674144, 3578913, 3429059, 3262813, 3174326, 3134948, 3057385, 3057526, 3006511, 2975527, 2937247, 2951382, 3060843, 3074631, 3007255, 3025014, 3037791, 3057589, 2902357, 2618966, 2486926, 2330722, 2164588, 2059045, 2026500, 1910394, 1802395, 1816955, 1642886, 1623895, 1668125, 1778700, 1740259, 1578068, 1486351, 1553869, 1506318, 1409083, 1385747, 1341468, 1383879, 1209280, 1169292, 1164659]
7006A164659o7895o990j398o7873m1873q8711J24305n7141n0556k4352n3535o1342
6994G67298P2125M9516m8070n8290k1492j8772l5377k3325J5042q3544R005M8166
6982F72282n3342p262l5497k3464L5329j00880M0415N1199r2984J7458O0317k0006
6970E43565k1781j58022R8J35885M4218m8048l0758L7160J0207k3426K287j00354
6958C91031N1856o9531J5193m1069J6918J58391q4743j08762J11803o8695L3545
6947D05937j2443l6740J3667K5560q1337p3621J01515P358j3368K2816j24391
6936B34953J4200L1747r4562l6093l6770N4881p1787N2472j15059K0235O7211
6925A21428q258j1656K4527m486O7796K6754q6360O3695J9722o4839o7563k9570
$$ y = [1164659, 1096764, 1089774, 1088376, 1020503, 978630, 889919, 1014224, 957083, 906527, 882175, 828640, 767298, 839423, 888939, 840869, 782579, 761087, 742315, 706938, 683613, 698655, 615111, 624116, 672282, 618940, 611678, 576181, 552717, 588046, 487166, 527581, 578780, 485796, 503254, 563571, 543565, 521784, 363762, 363860, 499745, 543963, 495915, 465157, 502317, 512524, 489098, 491385, 391031, 442887, 373356, 388549, 347480, 364398, 522789, 438046, 329284, 441087, 372392, 405937, 393494, 356754, 370421, 395981, 314644, 241023, 342538, 349896, 336528, 359344, 234953, 249153, 280900, 186338, 150245, 113475, 168356, 96569, 149041, 33982, 54217, 121428, 113170, 101514, 126041, 121555, 189351, 216105, 129745, 193440, 213162, 148323, 80760, 51190]
6913E1190L4656n8957O2011P6864L4269N3283K8280o0190k2475j7668m1226j1392
6901A28645q9689N7374J8283l9642n1946L5354k356n7663J01729o9662j3853O4398
6889H0972N1177l477J10789n2240j39294p1108L1359J6997L8266m1136J9188o804
6877C4689M9410K3734Q429K3991k4015j7645M2052K5201j13524M7053O4083K7533
6865A90991q3989o2565k030N8924j7071N8336l2477p7049m0343J1522K4507L6891
6853F5647P536j0701k2806j2878L1039K0313R4785m2391j1454j5529k5786k3989
6841E3786M0587P7013n1996P313j8474j10368k8364k2677R3089j1206K7086j13046
6829e7257J65247M5374q3671j1374m742N7378n8037n0493R3325l8515k4178m3689
$$ y = [51190, 85846, 26889, 88900, 165764, 200033, 253316, 281596, 221406, 198931, 181263, 140037, 128645, 38956, 96330, 114613, 74971, 23025, 58379, 56023, -1640, 100089, 30427, 16574, 80972, 132149, 128672, 239461, 187221, 47927, -23181, 8178, 25175, 63441, 22305, 41493, 34689, 84099, 107833, 116262, 140253, 116238, 98593, 140645, 165846, 52322, 99375, 163458, 190991, 107002, 44437, 42407, 101331, 84260, 142596, 110119, 33070, -7273, 4249, 28756, 65647, 73183, 62482, 39676, 26798, 57837, 78150, 172935, 130544, 119090, 103561, 77775, 53786, 94373, 171386, 119390, 126703, 108229, -2139, -30503, -53180, 39909, 28703, 55789, -57257, 107990, 153364, 69693, 58319, 53577, 110955, 52918, 2425, 95750, 57235, 33057, -10632]
6817a0632q1371N5109n7748J4294J07870N8836K6412n4443j1979P0959j0793q2849
6805B3665K784M7317k406P4731J5374j07747m1148N9644r271M5474J3647j7813
6793A04251r3145J5786J10438K4696j02065o514J7096P6569M076r1587L9079M6129
6781A44809j2391K147m5658N38n2112m2130l0322J3960O3215n8154o8520O7265
6769a7353O9491m6523m020N4485o7670J4474o3828M3130n3654J3360M5565o389
6757a8932n1860J2287P1275M2876k1267q539l7782R3716m9739m1414L1837L6815
6745E9273N7526J2518r965m2444o7036N1414J03812k4821q4510k3822o2003p5543
6733a05601J02887J14774M1444j07434o2861P7387k0338M16J5506O5172J3872
$$ y = [-10632, -92003, -36894, -94642, -80348, 27522, 86358, 112770, 58327, 46348, 117307, 106514, 23665, 26449, 73766, 71360, 146091, 161465, 53718, 12570, 72214, 62943, 108417, 122064, 104251, 11106, 26892, 137330, 162026, 59961, 53447, 70543, 147112, 151188, 59601, 98680, 144809, 132418, 134565, 88907, 89445, 37333, -4797, -35119, -21159, 42056, -16098, -84618, -17353, 52138, 5615, 1595, 56080, -11590, 2884, -60944, -17814, -71468, -58108, -12543, -18932, -70792, -58505, 12770, 55646, 34379, 25840, -11942, 81774, 32035, -9379, 22458, 59273, 116799, 129317, 119352, 76908, 9872, 61286, 165098, 140277, 55767, 31945, -30058, -105601, -2714, 112060, 153504, 46070, -16791, 60596, 40258, 40674, 56180, 121352, 135224]
6722A35224K416l7497k0776J292K7866j16918o6973J15543P6662N5769o0273o3898
6710D8437j2425M8299o3226J30087N3769m1947J1057N7131K8469J8364M3458K1008
6698C42481o4640J05245o3525R7438m4666j03528Q475J8620J3686p8141j05984
6687A25461L9999J853l7068p560m8455l150J021L786P4473l7793k9391l4161N5473
6674A04488k6699J22579j604k9658j37440r9023j9504J13977N5007m7590p029
6663B7504o1363M3050L9618N8568n7606M6615Q8214p2708q1761O0165r4854l8169
6651d2727M3491m3810k1979J05972J7848J887j28594J8776M8567k1204n121L9278
6639A2384N0183o6955N3767k976j0684l9797p2479P0735J1136j4780L8922j0160
$$ y = [135224, 137640, 100143, 79367, 80659, 108525, -8393, -75366, 40177, 116839, 172608, 112335, 48437, 36012, 84311, 21085, 151172, 204941, 162994, 174051, 231182, 259651, 278015, 321473, 342481, 277841, 383086, 319561, 416999, 372333, 268805, 277280, 295900, 309586, 231445, 125461, 165460, 167313, 130245, 122685, 74230, 71080, 72101, 75887, 150360, 112567, 83176, 49015, 104488, 77789, 200368, 198764, 169106, 31666, -67357, -86861, 27116, 82123, 34533, 27504, -33859, 9191, 48809, 107377, 49771, 96386, 184600, 111892, 30131, 90296, -4558, -42727, 764, -43046, -65025, 40947, 58795, 60682, -67912, -49136, -569, -21773, -26894, 12384, 62567, -4388, 49379, 46403, 35719, -4078, -76557, -5822, 5314, -9466, 29456, 19296]
6627A9296j00169K732p9004N1532J63606m7689q5418M9976Q6444p4282N1928M7353
6615H6305m0926p4472N4244j4161l5135O9953L5687K3848l6578k1798l3954K0847
6603C3860j4995k0992K0675J0213p4907J01006P0153n1081p6456k8035P2678P0527
6591A12646l0430k7741r7338l8800N2633J9020J28092K7552j22427P327j11720
6580h1186n8995J1641Q0955p155n6908J4752J27151N9105J7288n8281m3619K9202
6568C3950j2821O8901p7369n9043O479K5309Q1691k9890K7209l9123o775L1966
6556E0484j51200J9086L2934l1854N1150M6836j3186l8372J41026k1854N8233
6545A43283j2018l8228q5210N8366J8913r3307N0887J8065N683m055M6300k5229
$$ y = [19296, -80873, -78141, -157145, -105613, 57993, 10304, -75114, -25138, 61306, -12976, 38952, 86305, 45379, -29093, 25151, 10990, -24145, 45808, 81495, 105343, 68765, 46967, 13013, 33860, 18865, -2127, 18548, 28761, -46146, 54860, 125013, 73932, -2524, -30559, 42119, 112646, 82216, 54475, -42863, -81663, -29030, -10010, 118082, 145634, 23207, 30534, -81186, -140181, -128540, -47585, -54740, -111648, -96896, 30255, 89360, 106648, 48367, 4748, 33950, 21129, 90030, 12661, -46382, -39903, -14594, 67097, 37207, 64416, 25293, 18518, 50484, -100716, -81630, -48696, -80550, -29400, 17436, 4250, -34122, 106904, 85050, 143283, 131265, 93037, 7827, 66193, 85106, -8201, 42686, 60751, 66434, 62379, 108679, 83450]
6533H3450q0482M6073N8596q2377p4711K0836j8968l1512R1509M6128P0709q0534
6521D8717p618P1819J5862m583l6848q984M1267j50477j1553m7092M9711j872
6509d1651j5657n0536P8633K5241J4395l8106K0478N6301J1413l4565j06300N4369
6497b5985K2573k2526k252N4088m055o7459K4480N3831J2134m2611J6927o069
6485A3076q4583J1733j8347O2935k3588R3544K6284p4141m7828o0243Q9486M0225
6473B8553r0665J9055Q1591l665L9505o7810P3320j07587n595N4892J16084M1461
6461A79139p6616m5305Q484j7084k8128j2053n1483k9154J05336J14593n1648
6450I6081p4089J28848N4255q3993K8749n1970n053K4670m756n1835M5676p9599
$$ y = [83450, 2968, 49041, 107637, 25260, -49451, -28615, -47583, -79095, 12414, 58542, 129251, 48717, 41099, 112918, 128780, 124197, 87349, 78365, 119632, -30845, -42398, -89490, -39779, -41651, -57308, -107844, -29211, -3970, 10425, -27681, -7203, 49098, 60511, 25946, -80354, -25985, -3412, -25938, -28190, 25898, 21843, -45616, -21136, 32695, 44829, 2218, 19145, 13076, -71507, -59774, -78121, -15186, -38774, 54770, 81054, 6913, -40915, -101158, -11672, 28553, -62112, -43057, 38534, 34869, 74374, 6564, 79884, -27703, -33298, 21594, 137678, 179139, 102523, 57218, 65702, 48618, 20490, 8437, -43046, -72200, 33136, 147729, 96081, 21992, 150840, 205095, 121102, 149851, 97881, 92828, 117498, 112742, 60907, 106583, 26984]
6438B6984K0429P8495n9285N9891K0655j39601j6376N0601J18528l4335q1690
6427D4296J9938K4684n2767O7545Q4773p6260M342j3550J1343P0115j3214j6996
6415A54249o9546o9523q5525N4007J60428o6112o4388M5156N7008m7370o1008
6404G376P0495K9255m1105R25R5527p0377J3626K4855m417l5951N6200n4535p8788
6391A3086N4615J88568J1839p9011L880K1201l1375k8755q7630J25847K3113J360
6379B16738j1062o9341k9069L1047k6175m0714O7350Q067O1444L5822R413k6151
6367B27369m156j9320N3443O047m714R6820l1795k0435R9844p084J58q7387o5657
6354B43133k2788n6437n179O9091J1619J4655o2584m1538n0083Q0174R6572K5396
$$ y = [26984, 47413, 125908, 66623, 126514, 147169, 7568, -8808, 41793, 160321, 125986, 44296, 64234, 88918, 36151, 103696, 188469, 112209, 116551, 103001, 114344, 184459, 171245, 154249, 84703, 15180, -70345, -16338, 144090, 77978, 13590, 58746, 115754, 68384, 7376, 77871, 107126, 66021, 66946, 162473, 92096, 105722, 130577, 126160, 90209, 146409, 91874, 13086, 67701, 256269, 268108, 189097, 192977, 214178, 182803, 154048, 66418, 192265, 215378, 216738, 205676, 136335, 107266, 138313, 112138, 71424, 138774, 146841, 208285, 244107, 253520, 227369, 223213, 203893, 257336, 263383, 258669, 355489, 323694, 303259, 403103, 396019, 396177, 308790, 243133, 220345, 163908, 158729, 227820, 239439, 254094, 191510, 149972, 99889, 180063, 276635, 302031]
6342C02031R3464R627k4953l2936M4029O3589l5023P3497p2309J6920P3340q9550
6330D21726J9901O0362P856K1743n9322R778J7543m4751r4312M1510J48232J6589
6318E66855q7346k1860L3562M3784L1667l6581k5361k9971L9709K8735J00967
6307F44160O7141j47722q7997n2022P3542M9667j3641k3860n9992m9832O9812
6296D69256J24188P036q8445l1524P034j6424m6068k4532O3962o0271l9992k0699
6284C43521J3262J67021R2760n9677q2844o6931O986N2140l2401k370L706O5625
6272E00798j60205p1116J00245J25573j46720l7853m377j8505j01470m3221J75919
6261C19068J2372J4761Q9862l360p2824M531J7273p3128m0783j08886J15951J69241
$$ y = [302031, 395495, 405122, 380169, 347233, 391262, 454851, 419828, 493325, 421016, 437936, 511276, 421726, 441627, 501989, 509845, 531588, 472266, 482044, 499587, 454836, 360524, 402034, 550266, 566855, 479509, 457649, 491211, 534995, 566662, 530081, 504720, 474749, 514458, 543193, 644160, 711301, 563579, 475582, 423560, 497102, 546769, 533128, 509268, 449276, 399444, 469256, 593444, 600480, 512035, 480511, 487545, 471121, 425053, 400521, 464483, 404212, 364220, 343521, 356783, 523804, 616564, 556887, 474043, 407112, 414098, 466238, 433837, 431467, 435173, 500798, 340593, 269477, 369722, 495295, 348575, 310722, 306345, 287840, 186370, 143149, 319068, 331440, 346201, 436063, 432703, 359879, 364410, 381683, 308555, 267772, 158886, 274837, 444078]
6249D44078n6912J9504p2115M6876R027k3458j5948J08409K4103N058j05584K5728
6237D08766j4838R1m5144L3865O1039J3896N8920k7883N3166k1874l4729M7397
6225E32672J4896n4789N9407r2990j3044J07480K4139J6420M1527j5628n1421
6214E68669p9657N8312J6552p9672J32610j9908M4612Q2522l0180j7739k593R157
6202F82685J49420k7601n2111R7537m5232k638m6767k8413P1163Q9119K9729L5970
6190I52861J8940l6585k5833j6245K4551M4028M5828j6536L8964j4297J39758
6179A155434q5377J0499P2669k4321l5199J46672M3146Q7493L7333j11610m2414
6168A254325O5552M4672k8092Q7944r0053m4844O7653l7439O3101O6121j1916
$$ y = [444078, 387166, 406670, 334555, 381431, 390458, 367000, 351052, 459461, 483564, 488622, 383038, 408766, 393928, 394019, 348875, 382740, 443779, 457675, 516595, 488712, 541878, 520004, 485275, 532672, 547568, 492779, 552186, 459196, 446152, 553632, 577771, 594191, 635718, 620090, 568669, 489012, 547324, 563876, 484204, 616814, 596906, 641518, 724040, 693860, 676121, 673528, 682685, 832105, 804504, 752393, 849930, 804698, 802060, 755293, 726880, 798043, 887162, 916891, 952861, 971801, 935216, 909383, 893138, 917689, 961717, 1007545, 991009, 1029973, 1015676, 1155434, 1070057, 1080556, 1153225, 1128904, 1093705, 1240377, 1283523, 1371016, 1408349, 1296739, 1254325, 1319877, 1364549, 1336457, 1424401, 1334348, 1289504, 1357157, 1319718, 1382819, 1448940, 1437024]
6157A437024j7849Q1140n7192M6645k1538J1374N3645M6109l6117k3499P2977
6146A592719P104L3269L541k0196n536J8055j9732Q1846l3507M2761Q0120p5571
6134A704873J5607J48803m2117K7010J44072m9744O9728O5891j33337N7502L4580
6123B042868j0554l5816M3552Q924J58450O4735P6899m350o5913P9339O7441j1229
6111B414346K4942M645R8384M6984N6732J5301L4166J40911P5888p0749Q4436
6100B925986J8266m1696J45118Q0416J64710J17734m7275o3406q750K39605M5166
6089C575874J10764J55760J75297N2861Q3881J04025J08548J78756O2783J18239
6079D726788J70699O8362J97459J22593K20470J00781J21861J71764L36543J99340
$$ y = [1437024, 1419175, 1500315, 1443123, 1489768, 1468230, 1479604, 1533249, 1579358, 1543241, 1519742, 1592719, 1599823, 1633092, 1636633, 1616437, 1610901, 1628956, 1609224, 1691070, 1657563, 1700324, 1780444, 1704873, 1720480, 1869283, 1827166, 1854176, 1998248, 1948504, 2018232, 2084123, 1950786, 2008288, 2042868, 2032314, 1996498, 2040050, 2048974, 2207424, 2272159, 2349058, 2344708, 2278795, 2358134, 2425575, 2414346, 2439288, 2443933, 2542317, 2589301, 2646033, 2661334, 2695500, 2836411, 2912299, 2841550, 2925986, 2944252, 2902556, 3047674, 3128090, 3292800, 3410534, 3363259, 3299853, 3291103, 3530708, 3575874, 3686638, 3842398, 4017695, 4070556, 4154437, 4258462, 4367010, 4545766, 4608549, 4726788, 4897487, 4965849, 5163308, 5285901, 5506371, 5607152, 5729013, 5900777, 6237320, 6436660]
6069F436660K00962N11877L93879M02651N18512N97374O81297O90815R21037R23575
6059A2278639J020657J264021J531043J714260J665252M84737j405715j773704
6051A6779190j640073j179619p61362m91256k17412n3036l7761L9173J48845K45240
6041A2831929K03986L44503M67774N46023O78110Q39814J004803J120568J263937
6032A9301447J451707J695644J944177K327980K645742K819495L275599M154266
6024C9616057M787857M905073K709024l010981n877712n768621m336610k745370
6016C0278717j607313j131566p29114k94575n1409K07433M54020O48480P95311
6007B8569984J114097J229147J436671J859392K152941K775094L145856L463454
$$ y = [6436660, 6637622, 7149499, 7543378, 7946029, 8464541, 9061915, 9743212, 10434027, 11355064, 12278639, 13299296, 14563317, 16094360, 17808620, 19473872, 19958609, 18552894, 16779190, 15139117, 13959498, 13198136, 12706880, 12489468, 12436432, 12398671, 12437844, 12586689, 12831929, 13035915, 13380418, 13848192, 14394215, 15072325, 15912139, 16916942, 18037510, 19301447, 20753154, 22448798, 24392975, 26720955, 29366697, 32186192, 35461791, 39616057, 44403914, 49308987, 52018011, 49007030, 43129318, 37360697, 33024087, 30278717, 28671404, 27539838, 26810724, 26516149, 26464740, 26672173, 27126193, 27774673, 28569984, 29684081, 30913228, 32349899, 34209291, 36362232, 39137326, 42283182, 45746636]
5999D5746636L533105L156108K863786K411643K334481K903418L697007M405926
5991G1052110M502431L207958k080488o131597o092883m649286k787126j407438
5983E5613681m43677l3860M37669N12940O87956J021752J430664J861517K380609
5974F3469251K862662L476530L422336K127407p97516k985293l614966l263670
5966F4696741k171572j414831r67109n65290k68243m5429J40315R5685l70078
5957E9130189k063811l397264l412774k821441k044128j522464j181094j083465
5949D1603748q50144o68485p24261p56212q71363j276651j723558k345919k527968
5940B9859187k314571j942370j440182j244543r36130p01829o20617n35877n43552
$$ y = [45746636, 49279741, 52435849, 55299635, 57711278, 60045759, 62949177, 66646184, 71052110, 75554541, 78762499, 76682011, 70550414, 64457531, 59808245, 57021119, 55613681, 55170004, 55136144, 55573813, 56086753, 56774709, 57796461, 59227125, 61088642, 63469251, 66331913, 69808443, 73230779, 75358186, 74560670, 71575377, 67960411, 64696741, 62525169, 61110338, 60143229, 59577939, 59309696, 59264267, 59404582, 59500267, 59130189, 57066378, 53669114, 50256340, 47434899, 45390771, 43868307, 42687213, 41603748, 40753604, 40085119, 39360858, 38604646, 37733283, 36456632, 34733074, 32387155, 29859187, 27544616, 25602246, 24162064, 22917521, 21981391, 21279562, 20658945, 20123068, 19579516]
5931A9579516m49145m92002o73100o56278l01106m25474l52239l71559j87553
5922A5671060j95843j87833k17456j96803j32536l18474o5438j35144k45946p2555
5912A3903032j17668j38150j65241m9907j7936k0636n3671J07204Q6913J7693
5902A3551633J16265L4029O4921J27298J30896K06537J11675K05492J55612L16717
5892A5021075L20967J45132J33760J92582L54258K49330L97666M02599N68301
5883A7785670O12893M63824O28498O74328P11626Q94001R94903Q74710J106533
5874B4746986J304022J415718J719198J868407K030510K119995K059107J527190
5866C8791133R61551M71356L15998K97396M18854O77178Q19376Q81506R37593
$$ y = [19579516, 19130371, 18638369, 17965269, 17308991, 17007885, 16582411, 16230172, 15858613, 15671060, 15475217, 15287384, 15069928, 14873125, 14740589, 14422115, 14356677, 14221533, 13975587, 13903032, 13785364, 13647214, 13481973, 13432066, 13414130, 13393494, 13339823, 13447027, 13533940, 13551633, 13667898, 13701927, 13766848, 13894146, 14025042, 14231579, 14343254, 14548746, 14704358, 15021075, 15342042, 15487174, 15620934, 15813516, 16167774, 16417104, 16814770, 17217369, 17785670, 18398563, 18862387, 19490885, 20165213, 20876839, 21770840, 22765743, 23640453, 24746986, 26051008, 27466726, 29185924, 31054331, 33084841, 35204836, 37263943, 38791133, 39752684, 40224040, 40540038, 40837434, 41256288, 41933466, 42752842, 43634348, 44571941]
5857D4571941J168975J322850J419370J584526J593752J506000J477098J506492
5849E6151004J647065J666250J826899J760967J928507K296283K469451K324374
5841G2070800J247398p65984k776304l842823l810852l249354k522685j870071
5833E4480125j470527j325360j275562j315121j216908j045402j051789j024207
5825D4755249r69060p39771o13049l88427q2390p8265k42723k14049l61455n83171
5815D0482889p82459j215100k060064k425302k460296k227124j827771j544374
5807B5940399j364617j076539r47320q59314q46159q01335p17860p61528p87288
5798A7778439q63229q28931o96200o03908n67051n87015n50676n25957l05583
$$ y = [44571941, 45740916, 47063766, 48483136, 50067662, 51661414, 53167414, 54644512, 56151004, 57798069, 59464319, 61291218, 63052185, 64980692, 67276975, 69746426, 72070800, 73318198, 72552214, 69775910, 65933087, 62122235, 58872881, 56350196, 54480125, 53009598, 51684238, 50408676, 49093555, 47876647, 46831245, 45779456, 44755249, 43786189, 43046418, 42433369, 42044942, 41962552, 41884287, 41641564, 41427515, 41066060, 40482889, 39700430, 38485330, 36425266, 33999964, 31539668, 29312544, 27484773, 25940399, 24575782, 23499243, 22551923, 21692609, 20846450, 20045115, 19327255, 18565727, 17778439, 16915210, 16086279, 15390079, 14786171, 14219120, 13632105, 13081429, 12555472, 12249889]
5789A2249889k15891j77261k08504k01102r9184p0214j17763j15865p5785k6884
5779A0941436j04183O0230M3873m5474m1329k20323m02512k74866l80988m20424
5769I155440k83069k85746l32654j99485j97744r9031j47951k16043P0752J56004
5759G620473r233p8860J17329q071r1875q3322j11489q4824j47581j28331J9715
5748G013931l8665p3054o0399k26196j05090k28142l21813k40439k68639k44978
5738E206516j26267q7687j35286k9821j24450p0494J0699M03j39967M3539J25122
5727D672307K6554n443M2425j14739o8552J19604p5674k97366l15628l15293o6440
5716C601755j62524n4976j12745k03893m3706r723n0903j39479n4870L3520o1193
$$ y = [12249889, 12033998, 11856737, 11648233, 11447131, 11347947, 11277733, 11159970, 11044105, 10968320, 10941436, 10837253, 10897483, 10941356, 10895882, 10854553, 10634230, 10231718, 9956852, 9575864, 9155440, 8872371, 8586625, 8253971, 8054486, 7856742, 7757711, 7609760, 7393717, 7464469, 7620473, 7611240, 7532380, 7649709, 7641638, 7549763, 7466441, 7354952, 7270128, 7122547, 6994216, 7013931, 6975266, 6902212, 6841813, 6615617, 6510527, 6282385, 5960572, 5720133, 5451494, 5206516, 5080249, 4992562, 4857276, 4827455, 4703005, 4632511, 4643210, 4643613, 4503646, 4547185, 4672307, 4698861, 4693418, 4735843, 4621104, 4552552, 4672156, 4596482, 4299116, 3983488, 3668195, 3601755, 3439231, 3384255, 3271510, 3067617, 3023911, 3014188, 2963285, 2823806, 2768936, 2802456, 2741263]
5705B741263j13019j29905J7167Q7578Q3761r5468L0116j515o6870O9825N9105
5694B682038N994k7930k9779M8123k24829j39942r0022n6526O6176m9437o7029
5683B116837j02438o8275k7746n5573O0214m2555j48949n9419k5071K5743J0679
5672A683447m0280l333P7657j02831l9692q619O1587J969m3085l7680N9970M2129
5660A651239N6748k87L2234P1641M9605j7784L5848Q4089M412N4472M155J12389
5648B138761Q1779O8692J06117P978R698m2509p0359j348j285K0903k7554n6172
5636B234701N1478K8207o4187M6685J30596j24546L3980P7576P4243O0796P4278
5625B623807J5635j0251N7797J74375P2382L5787J32838Q5871L2631K1394M541
$$ y = [2741263, 2628244, 2498339, 2515506, 2603084, 2686845, 2591377, 2621493, 2619978, 2553108, 2622933, 2682038, 2688032, 2660102, 2630323, 2678446, 2453617, 2313675, 2223653, 2167127, 2233303, 2183866, 2116837, 2014399, 1946124, 1918378, 1862805, 1923019, 1880464, 1731515, 1672096, 1647025, 1672768, 1683447, 1643167, 1639834, 1717491, 1614660, 1574968, 1566349, 1627936, 1629905, 1586820, 1549140, 1609110, 1651239, 1707987, 1707700, 1739934, 1811575, 1861180, 1843396, 1879244, 1963333, 1967745, 2022217, 2026372, 2138761, 2220540, 2289232, 2395349, 2403327, 2413025, 2370516, 2300157, 2298809, 2297524, 2318427, 2290873, 2234701, 2286179, 2314386, 2250199, 2296884, 2427480, 2302934, 2336914, 2414490, 2488733, 2549529, 2623807, 2639442, 2629191, 2686988, 2861363, 2933745, 2969532, 3102370, 3188241, 3220872, 3242266, 3246807]
5614C246807n1419l3525j60096K0732n4937n6118k5329J8589Q8982n6540k8723
5603B908423q0633j6014K261j27963j06705q2851p2086Q1298J8389j48053k7910
5592B348156q4783r685o7004k635j51944r4612N7814r7149P6298j49946m7286
5581A777224O7115j3911k1602l4099j50444k7739k9337q575k2052j00975n9490
5570A376115j3103j51846k8684O0557n5890j5724o5431J18625o2375j26196n6629
5559I79419J6073J9817K0016M1012n3780l953L693J25164j0294q0300L7923j9126
5547A075664l5828k3793q0263o6486L1861L7210o1213m348K8435m4287Q151L6365
5535I01468L9860m8112K4265p0443l1978L1233j6666p0672Q1217J40345J1364
$$ y = [3246807, 3195388, 3161863, 3001767, 3022499, 2967562, 2911444, 2886115, 2904704, 2993686, 2937146, 2908423, 2827790, 2811776, 2814037, 2686074, 2579369, 2496518, 2424432, 2505730, 2524119, 2376066, 2348156, 2263373, 2253688, 2186684, 2184049, 2032105, 1937493, 1995307, 1898158, 1974456, 1824510, 1777224, 1844339, 1830428, 1808826, 1774727, 1624283, 1596544, 1567207, 1558632, 1536580, 1435605, 1376115, 1363012, 1211166, 1182482, 1243039, 1187149, 1171425, 1105994, 1224619, 1162244, 1036048, 979419, 995492, 1015309, 1035325, 1076337, 1022557, 1018604, 1022297, 1147461, 1137167, 1056867, 1094790, 1075664, 1039836, 1016043, 935780, 869294, 901155, 938365, 877152, 872804, 901239, 856952, 865103, 901468, 941328, 893216, 917481, 847038, 815060, 846293, 829627, 758955, 840172, 980517, 991881]
5524I91881q7491O795l0438m3402l1178M908P1236k8974O737j548K3323m8758
5512H33091N4078L9649J5856N545m6611N7308L9031n1693l1397j06363p0616L2866
5500G70744O7577j0642p3714j04859k2667l1859N9443L6237O8530l9663n3599
5489F65528k462P8792L5981n0971K4570j01822j3208O0639L4574N6663j22316
5478F65968j27158l5740P2058J5575K4047K6467m7540k7804l7052j0631N8829
5467E77019q4899q331L0365m9945J6243L9157j08671n924N8257K2643J0053r629
5455D86338J25945p2419P7443o1459n3474L0464J5859k7678R2866M0424N3255
5444G07564M7398q2998j08294Q5532L1297m2203k0512M2014n8806k2902J6628
$$ y = [991881, 904390, 911185, 880747, 837345, 806167, 811075, 882311, 853337, 860074, 858526, 881849, 833091, 887169, 926818, 942674, 948219, 901608, 958916, 997947, 946254, 914857, 808494, 737878, 770744, 838321, 827679, 753965, 649106, 626439, 594580, 654023, 690260, 758790, 719127, 665528, 663066, 741858, 777839, 726868, 751438, 649616, 636408, 697047, 731621, 788284, 665968, 538810, 503070, 575128, 590703, 614750, 641217, 593677, 565873, 528821, 518190, 577019, 492120, 483789, 514154, 464209, 480452, 519609, 410938, 405014, 463271, 485914, 495967, 486338, 612283, 539864, 617307, 555848, 502374, 532838, 548697, 521019, 613885, 654309, 707564, 754962, 671964, 563670, 649202, 680499, 638296, 617784, 659798, 600992, 578090, 594718]
5433E94718J49603R091j8829m9226m0349o374k150P3073p3584O6567O9124Q339
5421G80003P2857M088M6026o6118k0239r2572q1651J04957Q2282K0449n8621N2574
5409H44035P7540Q2037n662L6854J4175O0810n4618J9482J11394M6483K9948l3060
5397A229418K1433M6887Q6101J28457P6437R0751K04834J42833J3184J12968J4126
5386B167429K160J06215j2283j26973L5339K404j280p5987J16171N5224k6411
5375B242008l5227O6139R1131J2138J02802J48867J09506O7182J81360M9969Q0809
5364C116684Q1523K07530K20086K04663Q7732p6921k28278j69603o5049j13801
5354C264566k36478K7132n1943n9927j08513q4997M7067m3486l8051P804j7390
$$ y = [594718, 744321, 753412, 734583, 685357, 645008, 638634, 636484, 709557, 635973, 702540, 771664, 780003, 852860, 856948, 902974, 836856, 816617, 724045, 642394, 747351, 829633, 850082, 791461, 844035, 921575, 1003612, 997950, 1034804, 1048979, 1109789, 1055171, 1074653, 1186047, 1232530, 1262478, 1229418, 1250851, 1297738, 1383839, 1512296, 1588733, 1679484, 1884318, 2027151, 2040335, 2153303, 2167429, 2169589, 2275804, 2263521, 2136548, 2171887, 2174291, 2173011, 2097024, 2213195, 2268419, 2242008, 2206781, 2272920, 2364051, 2376189, 2478991, 2627858, 2737364, 2804546, 2985906, 3035875, 3116684, 3198207, 3405737, 3625823, 3830486, 3918218, 3841297, 3613019, 3443416, 3378367, 3264566, 3028088, 3055220, 3003277, 2943350, 2834837, 2749840, 2796907, 2753421, 2715370, 2723174, 2705784]
5343B705784O583J139k6584j09444q8188J5320R133k3771j12315M4091o8530o7949
5331B285269k26501k66572k2560m8553p1854j10309j61582J21140p0570r4216
5321A333692O9549N3390P4813q6459m1006j9546j08740K8105J0119J6703L728
5310A334348p6623o7550o4225n887l3462O7675L4564m9853O1873r2251J9199R8348
5298A226156q2881p7443O1127o2491m2533M9042J63299L5288j14972l7736J4173
5287A131029j11J02067k4110K2291K826K2166J33545Q8079j10313J0510O1458
5276A439437L955J77224R6459l341Q2549N1924J2318O2845J20553J29705J04856
5265B278484J1418O9186Q1361j30j31724o1625O6834K2004k9802O8490K2463N8613
$$ y = [2705784, 2712367, 2713506, 2686922, 2577478, 2489290, 2504610, 2513743, 2489972, 2377657, 2421748, 2353218, 2285269, 2058768, 1792196, 1769636, 1721083, 1649229, 1538920, 1377338, 1498478, 1427908, 1333692, 1403241, 1456631, 1531444, 1444985, 1403979, 1384433, 1275693, 1303798, 1313917, 1330620, 1334348, 1257725, 1190175, 1125950, 1120063, 1086601, 1154276, 1188840, 1138987, 1200860, 1108609, 1127808, 1226156, 1143275, 1065832, 1126959, 1064468, 1021935, 1070977, 1234276, 1269564, 1154592, 1116856, 1131029, 1130918, 1232985, 1208875, 1231166, 1233992, 1256158, 1389703, 1477782, 1367469, 1377979, 1439437, 1443392, 1620616, 1717075, 1713734, 1796283, 1848207, 1860525, 1923370, 2043923, 2173628, 2278484, 2289902, 2359088, 2440449, 2440319, 2308595, 2246970, 2313804, 2335808, 2306006, 2374496, 2396959, 2455572]
5253B455572N0773o9639K8656K22046O4424J23410J57112J41411K26679j22384
5243C278060j5480J32796J15213J77692J23094J04772J20618R6587j07220k20024
5233C806108j5472j68078j46698o3904j23220l5964Q0656N6171M4714O4995N6347
5222C555655J39037J29396L0325J82558K3713O416m6381j03408j08673j08249
5212C700389p0987n1112n2551n0440j04752k3420k06944j46788m7520J8066j48356
5201B815585j00338n2300k8700j16173K4128M0140P1491M0005R5789J3596m9621
5190B753602p1517o4012j22215p8348j6620j04014o0252j69699m1413l9275n9452
5179A926785m8477m6610m0908o8303K3824j05858L7766L8632K1983J1308n3389
$$ y = [2455572, 2506345, 2436706, 2465362, 2687408, 2751832, 2875242, 3032354, 3173765, 3400444, 3278060, 3262580, 3395376, 3510589, 3688281, 3811375, 3916147, 4036765, 4133352, 4026132, 3806108, 3790636, 3622558, 3475860, 3411956, 3288736, 3252772, 3333428, 3389599, 3434313, 3499308, 3555655, 3694692, 3824088, 3854413, 4036971, 4060684, 4067100, 4020719, 3917311, 3808638, 3700389, 3629402, 3578290, 3525739, 3475299, 3370547, 3347127, 3140183, 2993395, 2945875, 2963941, 2815585, 2715247, 2662947, 2634247, 2518074, 2542202, 2582342, 2653833, 2693838, 2789627, 2803223, 2753602, 2682085, 2618073, 2495858, 2417510, 2400890, 2296876, 2236624, 2066925, 2025512, 1986237, 1926785, 1878308, 1831698, 1790790, 1722487, 1746311, 1640453, 1678219, 1716851, 1738834, 1750142, 1696753]
5168A696753p7519q2429N1093l3740n4379J9943L6442K6125l9014P2316j7969
5157A597622K2975K2265L7904j6470k1997M646K4734J12035N2509j9173q353L4660
5145A843357N8532p8075k6778L2072M4629J05357J44833P6416N556K20986k8786
5134B398099j86872j40966r1720j19370K780J10986p5527L627Q5777L3867l3395
5123A987286k3675K9690J3320P5762p6229J8909k7667M6982R7571Q2485L4080
5112B258514O9299J00355J32518O2812J78674J02688J38776l5630j10574k68539
5102B628893p4542j24193j33451m6297J36481k8600Q2192J75179P8799M7988J08299
5091B850748n7934k1973r4414j02968J8041j12820l3788p9049j6806Q7927m3996
$$ y = [1696753, 1619234, 1536805, 1587898, 1554158, 1499779, 1519722, 1556164, 1582289, 1543275, 1615591, 1597622, 1620597, 1642862, 1680766, 1664296, 1642299, 1646945, 1671679, 1783714, 1836223, 1817050, 1808697, 1843357, 1901889, 1823814, 1797036, 1829108, 1873737, 1979094, 2123927, 2200343, 2205899, 2426885, 2398099, 2211227, 2070261, 1978541, 1859171, 1861951, 1972937, 1897410, 1901037, 1986814, 2020681, 1987286, 1963611, 1993301, 2006621, 2082383, 2006154, 2025063, 1997396, 2044378, 2141949, 2224434, 2258514, 2327813, 2428168, 2560686, 2623498, 2802172, 2904860, 3043636, 3008006, 2897432, 2628893, 2554351, 2430158, 2296707, 2250410, 2386891, 2358291, 2440483, 2615662, 2694461, 2742449, 2850748, 2792814, 2770841, 2676427, 2573459, 2591500, 2478680, 2444892, 2365843, 2349037, 2436964, 2392968]
5080B392968J3713m2671L212k5062J5830J52670Q2600L2600J26172l2253J48712
5069B868491R1324M7013O0003K40163K18789K20287K40936J85152K20080K80670
5059D672908L79871K84923K57523L44701M57712N18818O44035O86840Q65483R36145
5049A0048959J203334J358352J506860J398897K81868j172574j858793k015579
5041A0751324j646393j160492q48439o43336n70312n77197l24203k09487k62771
5032D508694k88091j65266n4264r7284k5449O6261k8883r6208k6922l8367o3055
5021C691166K6185N7933k899J13501J04455K0856M8071j56388j17936j90090j86342
5010C408512k49463o1604q4865o0011j63438m3080q2313q4621j18717q4812j13608
$$ y = [2392968, 2406681, 2364010, 2367222, 2342160, 2357990, 2510660, 2593260, 2625860, 2752032, 2719779, 2868491, 2959815, 3006828, 3066831, 3306994, 3525783, 3746070, 3987006, 4172158, 4392238, 4672908, 5052779, 5337702, 5595225, 5939926, 6397638, 6916456, 7560491, 8247331, 9112814, 10048959, 11252293, 12610645, 14117505, 15516402, 15798270, 14625696, 12766903, 10751324, 9104931, 7944439, 7096000, 6452664, 5882352, 5305155, 4980952, 4771465, 4508694, 4220603, 4055337, 4001073, 3903789, 3878340, 3944601, 3915718, 3819510, 3792588, 3754221, 3691166, 3717351, 3775284, 3772385, 3885886, 3990341, 4011197, 4059268, 3902880, 3784944, 3594854, 3408512, 3159049, 3097445, 3012580, 2952569, 2789131, 2746051, 2663738, 2579117, 2460400, 2375588, 2261980]
4999B261980n8171o758Q7832j5341q8650J447J07067l5253p9051L7778P7158P7788
4987B367826L3192n9795J4889l3815j2077J07490R684r2937K0897L6792L6845
4976B428991r4041n754K6923J7048k9816R2071n4236o7194M5468N3282l9422Q458
4964B381778j2932M9923N0178P189L7176l1776R8300J49987n8894l3015k1498
4953B616416J8294O1650J09462n635L0083k3920J23588k279Q1352J743K1056J26241
4941C158051M4540n4882K7086k5259n9290p4000N5998Q7550K723k5587N7288J0178
4929C204396M4181O9710K9125J11221L119l2963m8175J31614R5391Q9796M1669
4918C739084M8990K16175J12598J9507M9016k6986k9964L5114Q6390l0084J92649
$$ y = [2261980, 2203809, 2197051, 2284883, 2269542, 2180892, 2182339, 2289406, 2254153, 2175102, 2212880, 2290038, 2367826, 2401018, 2341223, 2356112, 2322297, 2310220, 2417710, 2427394, 2334457, 2355354, 2392146, 2428991, 2334950, 2329196, 2356119, 2373167, 2343351, 2435422, 2381186, 2313992, 2359460, 2412742, 2373320, 2381778, 2368846, 2418769, 2468947, 2476136, 2513312, 2481536, 2579836, 2729823, 2670929, 2637914, 2616416, 2634710, 2696360, 2805822, 2800187, 2830270, 2806350, 2929938, 2927659, 3009011, 3010754, 3031810, 3158051, 3202591, 3147709, 3174795, 3149536, 3090246, 3016246, 3072244, 3159794, 3162517, 3136930, 3194218, 3204396, 3248577, 3318287, 3347412, 3458633, 3461752, 3428789, 3380614, 3512228, 3607619, 3697415, 3739084, 3788074, 4004249, 4116847, 4136354, 4185370, 4158384, 4128420, 4163534, 4249924, 4219840, 4412489]
4907D412489N0180J30675J56462J49454J19457K35752R8453J78964N4098J31061
4897E717045J03649K51719J62879K60679J37134N5181J41255J72381J33160K91103
4887G426185M3248K51179J72690K21900J71500K54021R2031J87981J12848J85208
4877I118791J29790K27327K05904M01213P7441K19936K62759L17864K81571L42368
4867A1584964L26429M90783M19837L95341M15032M64786M68752O48413N99072
4858A5813409P62280M08970O45092L14247O50606P35703P72244Q47104Q02473
4849B1752128P35102Q84490P54917J099902R87613J372773J392161J668982J723053
4840C2371121K067745K285246K849288L360197M101454M847095N812850O567805
$$ y = [4412489, 4462669, 4593344, 4749806, 4899260, 5018717, 5254469, 5352922, 5531886, 5585984, 5717045, 5820694, 6072413, 6235292, 6495971, 6633105, 6688286, 6829541, 7001922, 7135082, 7426185, 7469433, 7720612, 7893302, 8115202, 8286702, 8540723, 8632754, 8820735, 8933583, 9118791, 9248581, 9475908, 9681812, 10083025, 10160466, 10380402, 10643161, 10961025, 11242596, 11584964, 11911393, 12402176, 12822013, 13217354, 13632386, 14097172, 14565924, 15214337, 15813409, 16575689, 16984659, 17629751, 17943998, 18594604, 19330307, 20102551, 20949655, 21752128, 22487230, 23371720, 24126637, 25226539, 26214152, 27586925, 28979086, 30648068, 32371121, 34438866, 36724112, 39573400, 42933597, 47035051, 51882146, 57694996, 64262801]
4832F4262801P322176Q148018R437385R667411J0996809J3308488J7510592K0340107
4824A60993787K1467792J2422402j6373119k8565750k8075986k0328189j3083013
4817H8457924q751638n773240m129740k621925j395611m01510L91462R58949J321108
4808F8055779J315836K146917L134087M820931O264077P683894Q846842J0517961
4800A12786324J2317875J4724023J5429977J8106821K2047379K7373677K9231906
4793B52017982K5779814o230499l8232176m4230709l8988529k7032196j9297390
4786A03786297j3582275j0638857q271827p060938n397264m694440l760407l424772
4778D6955517k630941k380868j554916j375135j011406j452223j832610k115486
$$ y = [64262801, 71584977, 79732995, 89170380, 98837791, 109834600, 123143088, 140653680, 160993787, 182461579, 194883981, 178510862, 149945112, 121869126, 101540937, 88457924, 79706286, 73933046, 69803306, 67181381, 65785770, 65384260, 65775722, 66734671, 68055779, 69371615, 71518532, 74652619, 79473550, 85737627, 93421521, 102268363, 112786324, 125104199, 139828222, 155258199, 173365020, 195412399, 222786076, 252017982, 277797796, 271567297, 233335121, 189104412, 150115883, 123083687, 103786297, 90204022, 79565165, 71293338, 64232400, 58835136, 54140696, 50380289, 46955517, 44324576, 41943708, 40388792, 39013657, 38002251, 36550028, 34717418, 32601932]
4770C2601932k024970j898630j333162j328024r82079j003828p96869q21834o81912
4761B1730624q53551o54239p06987m43887m52655k66440m55821n34516o24692
4752A6737836m70327m68724m03181l52386k17468k79159j44059k61997k35670
4743A3904865n956n1469k67635j64051m14159n85334n59875n14262m46552l57864
4733A0537708l26154m19675k76625j86466k01979l07445k99162l41969k11786
4724G966447l01143j87824j53666j84597r2984j27397P1005q2693j25498j49672
4714F631978n917j39460j80687j12005j59594j33757j57194k03285j39690k04893
4704E195496j46194j08769j29957o0445o7086r8495o4202l9093J4408j01637p2391
$$ y = [32601932, 30576962, 28678332, 27345170, 26017146, 25035067, 24031239, 23234370, 22412536, 21730624, 20877073, 20222834, 19515847, 19071960, 18619305, 18352865, 17897044, 17362528, 16737836, 16267509, 15798785, 15395604, 15043218, 14825750, 14546591, 14402532, 14140535, 13904865, 13898909, 13847440, 13579805, 13415754, 13001595, 12416261, 11856386, 11342124, 10895572, 10537708, 10211554, 9791879, 9515254, 9328788, 9126809, 8819364, 8520202, 8178233, 7966447, 7665304, 7477480, 7323814, 7139217, 7046233, 6918836, 6989841, 6907148, 6781650, 6631978, 6626061, 6486601, 6305914, 6193909, 6034315, 5900558, 5743364, 5540079, 5400389, 5195496, 5049302, 4940533, 4810576, 4750131, 4683045, 4584550, 4520348, 4481255, 4495663, 4394026, 4321635]
4693D321635o7314r9852l5897R4892M0291j335m2813p9869p4449j86078P3198
4682C942409m6094q0420J08505P7069J5471o1613k7358J03737O1848J12455M6872
4671D252881R1568J15461J87053J57061L01381K92343K77719o8855j31096m14287
4661E061229m93704l38861k31615j71715k08721j05809j78M0027j42846j26136
4651C281671o4128p5034k9190j45332k8828o0759O6707m0052p395R8298O7663
4640C063621N5372m8019J9085l0667k7140k7680j4662O9815O8838R5140n1757
4629C171946M2198J5985M7840J35449J04794J61453J12266q4605j98079k64282
4619C244965j60477k16879p5013o6914n7585k8620m929k3853m0279P0949k676
$$ y = [4321635, 4254321, 4154469, 4118572, 4213464, 4253755, 4252420, 4209607, 4129738, 4055289, 3869211, 3942409, 3896315, 3815895, 3924400, 4001469, 4016940, 3955327, 3927969, 4031706, 4093554, 4206009, 4252881, 4344449, 4459910, 4646963, 4804024, 5105405, 5397748, 5675467, 5606612, 5475516, 5061229, 4567525, 4228664, 3997049, 3825334, 3616613, 3510804, 3510626, 3550653, 3407807, 3281671, 3217543, 3142509, 3113319, 2967987, 2939159, 2878400, 2945107, 2905055, 2897660, 2995958, 3063621, 3118993, 3070974, 3090059, 3059392, 3032252, 3004572, 2989910, 3059725, 3128563, 3223703, 3171946, 3214144, 3230129, 3277969, 3413418, 3518212, 3679665, 3791931, 3707326, 3509247, 3244965, 3084488, 2867609, 2792596, 2725682, 2668097, 2639477, 2634548, 2610695, 2570416, 2641365, 2638689]
4608B638689j1415L8865j2892Q0905K87J241J13453m3446o5836J9764J4510J11034
4596B885159P3610Q1810J64393P9341L320J04509K34780R265J54958J49652K00586
4585D141383J49481o1290n2246r0727n3351q5950j20267j222l7823k3358L6508
4574C801138R7547n6110K2572k6070j861R0808j05217K2763J5712K8417j7887
4563C871812N0002N1267q131n1274J44378m364Q1988N5175J79872M3358J74140
4552D588223Q7807k2931J90113Q5978J04459J33213K04992J36967J74590M8947
4542E732358J12154J29088J52716J67309J38162L12679K74739L35543K96681K80761
4532G932190L81639M61123M40053N36051O48679N56686Q12765R74621J099862
$$ y = [2638689, 2627274, 2666139, 2653247, 2734152, 2734439, 2735680, 2849133, 2805687, 2739851, 2759615, 2774125, 2885159, 2958769, 3040579, 3204972, 3284313, 3287633, 3392142, 3626922, 3636187, 3791145, 3940797, 4141383, 4290864, 4229574, 4177328, 4086601, 4033250, 3947300, 3827033, 3825811, 3787988, 3764630, 3801138, 3898685, 3842575, 3865147, 3839077, 3837216, 3928024, 3822807, 3845570, 3861282, 3889699, 3871812, 3921814, 3973081, 3964950, 3913676, 4058054, 4053690, 4135678, 4190853, 4370725, 4414083, 4588223, 4676030, 4653099, 4843212, 4929190, 5033649, 5166862, 5371854, 5508821, 5683411, 5732358, 5844512, 5973600, 6126316, 6293625, 6431787, 6744466, 7019205, 7354748, 7651429, 7932190, 8313829, 8774952, 9215005, 9751056, 10399735, 10956421, 11769186, 12743807, 13843669]
4523A3843669J241870J583850J753231K036335K407377K652721L029812L460359
4515C2009224L999997M726611N397619N499739M456279R69442m301742p200787
4507D5556382p222526o163869m891762l609292k685925k106078j767735j399445
4499A5709750j168190r10720q06103p82335n79841m15090k83299l39233k82361
4490A0142578k63138k14666j55492r2890p6547l6962L1251n1339L8064K8843J16620
4479I466322R5710J26699J96134J60102j9473j51494j07682Q1324J01965N9380
4469A0008987k1245Q4252P0684K77462K61552L41363M31502L59655M56586N37460
4459A2808258M37479M63276N97709O17768N91634R68529J113560J089795J394838
$$ y = [13843669, 15085539, 16669389, 18422620, 20458955, 22866332, 25519053, 28548865, 32009224, 36009221, 40735832, 46133451, 51633190, 56089469, 57058911, 52757169, 45556382, 38333856, 32169987, 27278225, 23668933, 20983008, 18876930, 17109195, 15709750, 14541560, 13630840, 12824737, 12042402, 11462561, 11047471, 10764172, 10424939, 10142578, 9879440, 9664774, 9509282, 9416392, 9339845, 9302883, 9334134, 9282795, 9320859, 9349702, 9466322, 9562032, 9688731, 9884865, 10044967, 10025494, 9874000, 9766318, 9847642, 9949607, 10008987, 9987742, 10071994, 10142678, 10420140, 10681692, 11023055, 11454557, 11814212, 12270798, 12808258, 13245737, 13709013, 14306722, 14924490, 15516124, 16484653, 17598213, 18688008, 20082846]
4450B0082846J569431J449800J540162J559437J669413K036168K614109K995868
4442C5517234L603937M241243M894513N017059L654510m58665n098061o843311
4434D4528459o618407n278600l923912k848692k249973j721689j489922j283157
4426A9114107j182701q98896o51973m19044m05300l76887m89733o85814p99191
4417A3204568q49386p97857p04104o47671m74953l34624m12839k92712l45971
4408H344451k41842j84626j62949j52917k77382j58144j48406j96275j67695j25338
4398F528877j35348j64019j78100j45401j15215L0206o1557j89615l4171m8602
4388E487055k8566r7071j42410j40857j60522k296L6796J4190q2626m7313n2155
$$ y = [20082846, 21652277, 23102077, 24642239, 26201676, 27871089, 29907257, 32521366, 35517234, 39121171, 43362414, 48256927, 53273986, 56928496, 56469831, 51371770, 44528459, 37910052, 32631452, 28707540, 25858848, 23608875, 21887186, 20397264, 19114107, 17931406, 17032510, 16380537, 15961493, 15556193, 15179306, 14689573, 14003759, 13204568, 12355182, 11557325, 10853221, 10205550, 9730597, 9395973, 8983134, 8690422, 8344451, 8102609, 7917983, 7755034, 7602117, 7324735, 7166591, 7018185, 6821910, 6654215, 6528877, 6393529, 6229510, 6051410, 5906009, 5790794, 5821000, 5759443, 5569828, 5535657, 5487055, 5458489, 5361418, 5219008, 5078151, 4917629, 4915333, 4952129, 4966319, 4883693, 4836380, 4784225]
4377D784225L5326j30999m5172l3891l3663r8123l4954R96J3246k4207k2867m2652
4365D367265J18529n858n4896o446J24588J38779K0758m2459n6703K0546M4755
4354D668858J08590Q1701r965k6153J6110k1657r6691Q1224r9704m1286n4720
4343D606307M5878J81938j3486R9766J27728J92002J54547O8319J1633J57272
4333E631904Q5237k588J52277J15616l7778Q0258J47702R1931P1324K2194J66054
4322F524131J16033K4909J38918m047k7219J10427J2492M2373j7306j13822J26560
4311F933449J09588O4946K8136J35778N5061Q1221J86309J81610J50255J78961
4301H105314J25876R2905K38068J80080J14320J21067K17324K50112K89657K42513
$$ y = [4784225, 4819551, 4688552, 4643380, 4609489, 4575826, 4477703, 4442749, 4443745, 4456991, 4432784, 4409917, 4367265, 4485794, 4479936, 4425040, 4418594, 4543182, 4681961, 4702719, 4660260, 4603557, 4624103, 4668858, 4777448, 4859149, 4849184, 4823031, 4839141, 4817484, 4720793, 4802017, 4702313, 4661027, 4606307, 4652185, 4834123, 4820637, 4920403, 5048131, 5240133, 5394680, 5462999, 5474632, 5631904, 5717141, 5714553, 5866830, 5982446, 5944668, 6024926, 6172628, 6264559, 6335883, 6358077, 6524131, 6640164, 6665073, 6803991, 6799944, 6772725, 6883152, 6895644, 6938017, 6920711, 6806889, 6933449, 7043037, 7107983, 7136119, 7271897, 7326958, 7408179, 7594488, 7776098, 7926353, 8105314, 8231190, 8324095, 8562163, 8742243, 8856563, 8977630, 9194954, 9445066, 9734723, 9977236]
4291I977236J72956J79015J75235K11454L66866L04932L34497K96763M28139M42958
4281A2890051L36732M74515N32884O91372O78545O74304O04801Q94340J026832
4272A8804376J088274J261239J421201J767462K072804K213884K527516K801303
4264C3958059L160696L444927M020412M899321N785795N955439M342428j840920
4256F3726157o779740p815215o854088m991580l822432k918799k354935j918280
4248B6271088j552967j140160p44036m70778l61600k27375j69209P9062M8939
4239B1732964j16792o11868p67955o15671o76691n80415l83778o4776j71107j70812
4229A7573099p1832j20308j10415o4274P2758M2520J01017K3425Q5256O5463K15563
$$ y = [9977236, 10150192, 10329207, 10504442, 10715896, 11082762, 11387694, 11722191, 12018954, 12447093, 12890051, 13226783, 13701298, 14234182, 14925554, 15604099, 16278403, 16883204, 17777544, 18804376, 19892650, 21153889, 22575090, 24342552, 26415356, 28629240, 31156756, 33958059, 37118755, 40563682, 44584094, 49483415, 55269210, 61224649, 65567077, 63726157, 56946417, 49131202, 42277114, 37285534, 33463102, 30544303, 28189368, 26271088, 24718121, 23577961, 22833925, 22363147, 22001547, 21774172, 21604963, 21684025, 21732964, 21616172, 21004304, 20236349, 19620678, 18943987, 18363572, 17979794, 17915018, 17743911, 17573099, 17501267, 17380959, 17270544, 17206270, 17279028, 17321548, 17422565, 17445990, 17531246, 17596709, 17812272]
4218A7812272J87613J23168K16923J72393M18370M22272M61900N18024N36708
4209B0869643N97480O06889O77300O41003O46528P52200P19252Q61773R33581
4200B7305649J012554J264016J431160J325955J513644J717219J905030K074872
4192C9550099K478899K736884L133482L454652M063693M718146N474508O478098
4184G2088461P541357Q424523R647278J0719519J2519020J4388181J6504564J9101660
4176A70934563K2800140K6261830K7949931K1499103M272173j6305945l1926465
4169B25485330l4899913l0161221k2665654j6499906j2933978j1492255j0070416
4162H6761987q827794p244474o052654m879236m250045l529373l133534k744189
$$ y = [17812272, 17999885, 18123053, 18339976, 18512369, 18930739, 19353011, 19814911, 20332935, 20869643, 21467123, 22074012, 22751312, 23392315, 24038843, 24791043, 25510295, 26372068, 27305649, 28318203, 29582219, 31013379, 32339334, 33852978, 35570197, 37475227, 39550099, 42028998, 44765882, 47899364, 51354016, 55417709, 60135855, 65610363, 72088461, 79629818, 88054341, 97701619, 108421138, 120940158, 135328339, 151832903, 170934563, 193734703, 219996533, 247946464, 269445567, 273717740, 257411795, 225485330, 190585417, 160424196, 137758542, 121258636, 108324658, 96832403, 86761987, 77934193, 70689719, 64637065, 59757829, 55507784, 51978411, 48844877, 46100688]
4154D6100688k329722k087805j807744j411749j283335j038446j018369q93357
4146C4230161p66535o17964n18371l63994j91327j02725N3256J78201J55921k82366
4136C1774257j029051j630784j805002j783248j522921j373462j159561j040577
4128B0429651q23562p85749o36565o30587m89082l45539k82271l18925j65232
4119A5952139k94554l52768l63730m68916l96990l91108l10354o3452j02801k6287
4109A3181179j8906k5235M6889J9879J06807J36196J13397J69916J99871J24583
4099A4054576l9417k92694l60764m61312m89932k05091k99504j99392j46132j18819
4089A1441519p7539n7337o2608j93807j50787l70385m04512l42635l60872k14052
$$ y = [46100688, 43770966, 41683161, 39875417, 38463668, 37180333, 36141887, 35123518, 34230161, 33463626, 32845662, 32327291, 31963297, 31771970, 31669245, 31722501, 31900702, 32056623, 31774257, 30745206, 29114422, 27309420, 25526172, 24003251, 22629789, 21470228, 20429651, 19606089, 18820340, 18183775, 17553188, 17064106, 16718567, 16436296, 16117371, 15952139, 15657585, 15304817, 14941087, 14472171, 14075181, 13684073, 13373719, 13310267, 13207466, 13181179, 13162273, 13137038, 13183927, 13203806, 13310613, 13446809, 13560206, 13730122, 13929993, 14054576, 14015159, 13722465, 13361701, 12900389, 12410457, 12205366, 11905862, 11706470, 11560338, 11441519, 11363980, 11306643, 11244035, 11050228, 10899441, 10529056, 10124544, 9781909, 9421037, 9206985]
4079I206985j53529k24130j71647r1351j03815J2158J11220N5790j63058k4748
4069H453875j10154j63182j49186p2139k4713r8707k00712l7005K6262J2745M486
4058G641570q5q2504p6687q2705j4262K5779q4217o3537P4586j22234N0191J29260
4046G395155n6293m1066j0181n1724R7735k5576o0955L4454J12000l0396J29024
4035G492177K2347m8921r4023q1125N6078L2926K8635k8786J8547J32078N3485
4024G583418p6186J26439M0634n3339R57n4251J51234J40834R1492J84390J02507
4013H238129J31367K06137K44116K68229L93368M44485L57827L61935K76261m4086
4003A0877768m23507n76169k75612m41624j71640o5026p5893n1409p106o8014
$$ y = [9206985, 9053456, 8829326, 8657679, 8566328, 8462513, 8474671, 8585891, 8641681, 8478623, 8453875, 8343721, 8180539, 8031353, 7959214, 7934501, 7835794, 7635082, 7598077, 7624339, 7637084, 7641570, 7641485, 7558981, 7482294, 7399589, 7385327, 7411106, 7326889, 7263352, 7337938, 7215704, 7265895, 7395155, 7338862, 7297796, 7287615, 7235891, 7333626, 7308050, 7247095, 7281549, 7393549, 7363153, 7492177, 7514524, 7465603, 7371580, 7290455, 7346533, 7379459, 7408094, 7379308, 7397855, 7529933, 7583418, 7507232, 7633671, 7674305, 7620966, 7621923, 7567672, 7718906, 7859740, 7951232, 8135622, 8238129, 8369496, 8575633, 8819749, 9087978, 9481346, 9925831, 10283658, 10645593, 10921854, 10877768, 10454261, 9878092, 9602480, 9160856, 8989216, 8924190, 8848297, 8796888, 8789782, 8721768]
3993H721768l40J05894J861j7845J53919K07152L34627J87512K45420M11730M74566
3982A0826264L79443N85841O71545P23210Q95732R47796P40116M4961l80559n36382
3972A4897967m14676k48532J17969K17442N45045P16733Q08704P67158J0298o14633
3962A6803475q30923o81503o29724k68976n4889N4818R4695K13894M06210N77648
3952A5684725N43609Q96508J113573J126552O93563J86854K3882r2583K98595
3943B0475278P15064Q56418J133437J065826m7537j129961j508671j279137r54525
3934A9326192o27217m15396j53684K46690K20310K60679L93157M68834O13695
3925B0333260N65626N62661P30108P91646P66450M57774k6934m44279o99721l90214
$$ y = [8721768, 8721428, 8827322, 8829183, 8811338, 8965257, 9172409, 9507036, 9694548, 9939968, 10351698, 10826264, 11205707, 11791548, 12463093, 13186303, 14082035, 15029831, 15769947, 15814908, 15434349, 14897967, 14483291, 14234759, 14352728, 14570170, 15115215, 15831948, 16640652, 17407810, 17418108, 16803475, 15972552, 15291049, 14661325, 14392349, 14337460, 14392278, 14486973, 14700867, 15107077, 15684725, 16228334, 17124842, 18238415, 19364967, 20058530, 20245384, 20269266, 20176683, 20475278, 21190342, 22046760, 23180197, 24246023, 24198486, 23068525, 21559854, 20280717, 19326192, 18698975, 18283579, 18129895, 18376585, 18596895, 18857574, 19250731, 19719565, 20333260, 20898886, 21461547, 22191655, 22983301, 23749751, 24207525, 24180591, 23736312, 23036591, 22646377]
3915B2646377l49635j55278N5763P0902J87537L15373L97232L89350M40594O77034
3905B4675249P56644Q20011P74476P26789O47610O74740P46043P86039R47180
3896C1554781R27689J029639J040554R66801J048711R92437J064976J385940J658306
3887D1669834J914310J950350J913571J830938J711844J942647K088359K208621
3879E7230474K283067K145867K190517K092979J965062K079681K205368K471582
3871G4664597K842969L046143L641211M090530M441456M098526K622254N46354
3863I9994040r87833j324496o53007L34613Q12895J070852R14510P59178P96732
3854A01717484Q80275J060865Q49297J23618m98086j324339j595664j723178j486635
$$ y = [22646377, 22296742, 22141464, 22197227, 22268129, 22455666, 22771039, 23168271, 23557621, 23998215, 24675249, 25431893, 26251904, 27026380, 27753169, 28400779, 29075519, 29821562, 30607601, 31554781, 32482470, 33512109, 34552663, 35519464, 36568175, 37560612, 38625588, 40011528, 41669834, 43584144, 45534494, 47448065, 49279003, 50990847, 52933494, 55021853, 57230474, 59513541, 61659408, 63849925, 65942904, 67907966, 69987647, 72193015, 74664597, 77507566, 80553709, 84194920, 88285450, 92726906, 96825432, 99447686, 99994040, 99006207, 97681711, 97028704, 97363317, 98176212, 99247064, 100161574, 100920752, 101717484, 102597759, 103658624, 104507921, 104631539, 104133453, 102809114, 101213450, 99490272, 98003637]
3845I8003637j322480j337369j213832r57497l37238R261l79502j653957l484503
3836H7326520m691078m850672m318012l530801k938166k449705k307656k007830
3828F0232600j735748j915732k028684k144904k313090k285707k096072k077673
3820D3634990j787086j292816j055692j169487j368718j516186j357821j346974
3812C2740210j181373p74357o95671o50844n35857o23113p55615q25702p56522
3803B5941156o13790n70342m80917m86809n47604o54262o96521p49010n00318
3794B0641583m57581m39298m81772k05107p1737j61224j14145j43254k10935j98878
3784A8157652k76204k25712r9382k2963j23477k53818l40850k71989k13282m05867
$$ y = [98003637, 96681157, 95343788, 94129956, 93172459, 92835221, 92844482, 92464980, 90811023, 87326520, 82635442, 77784770, 73466758, 69935957, 66997791, 64548086, 62240430, 60232600, 58496852, 56581120, 54552436, 52407532, 50094442, 47808735, 45712663, 43634990, 41847904, 40555088, 39499396, 38329909, 36961191, 35445005, 34087184, 32740210, 31558837, 30784480, 30088809, 29437965, 28902108, 28278995, 27523380, 26697678, 25941156, 25327366, 24757024, 24276107, 23789298, 23241694, 22587432, 21890911, 21141901, 20641583, 20184002, 19744704, 19262932, 19057825, 18986088, 18824864, 18710719, 18567465, 18356530, 18157652, 17881448, 17655736, 17556354, 17533391, 17409914, 17156096, 16815246, 16543257, 16329975, 15924108]
3774A5924108l91912m04195k37159l04614k22883j58453j14293r7559j61071j65538
3764A3666431n0909N2381l2505j42304q6615j48856j30231j21379l14439l09610
3754A2381964l07241l14150k90927j34186k03234k01963j69638j14529m8560m0267
3744A0557269n7968k1179R7889L6560l4362K5797J0542L1272J234O721l9589L4549
3732A0648735J0815j12921m2773n9080j69766k14471o1865p1878j92038o8953
3722I665805j44662j40869j13897m2955j55867j2247k2046k1998k3163J1046k5363
3711H973784l5493N2873j25652l1684O488j1399p0577j9672Q2065J0452l4618
3700H796567l1187j1095M5752O3372M0228N8353J81281m3517J22538J59906j45769
$$ y = [15924108, 15532196, 15128001, 14890842, 14586228, 14363345, 14204892, 14090599, 13993040, 13831969, 13666431, 13615522, 13667903, 13635398, 13493094, 13406479, 13257623, 13127392, 13006013, 12691574, 12381964, 12074723, 11760573, 11469646, 11335460, 11132226, 10930263, 10760625, 10646096, 10597536, 10557269, 10499301, 10478122, 10576011, 10612571, 10578209, 10604006, 10614548, 10645820, 10647054, 10653775, 10614186, 10648735, 10659550, 10546629, 10503856, 10444776, 10275010, 10060539, 9998674, 9926796, 9734758, 9665805, 9521143, 9380274, 9266377, 9223422, 9067555, 9055308, 9033262, 9011264, 8988101, 8999147, 8973784, 8938291, 8991164, 8865512, 8833828, 8840316, 8828917, 8758340, 8738668, 8820733, 8831185, 8796567, 8765380, 8754285, 8800037, 8863409, 8903637, 8961990, 9143271, 9099754, 9222292, 9382198, 9236429]
3689I236429j02388L7167k8988k4161j00358L2035N9439M4400J3287n316R4345
3678I255891J20532J03686l6882l4278J17763K464Q6111J26377K880J55199K23992
3667A0123735M1484J63747L20145K18953O6055J85042K03131P8757J31778J70309
3657A1703136J11828Q9382O873L3293O4728m0009n3433o5905k3503k4684m3824
3646A1757882j4106m5057m5273k25492l24121j99469j42784n7656q873J0223j02663
3635A0602611J15237R9778N8424J40737m428N7310L4006P1566N0100J5204J2905
3624A1253450n3968K1760n5013j52335j03601q2620j99332m2501l17121k03249
3614A0065470j79146k30020l00511l25960j80793k15305p6225l5767l797j43324
$$ y = [9236429, 9134041, 9171208, 9142220, 9118059, 9017701, 9049736, 9109175, 9153575, 9166862, 9161546, 9255891, 9376423, 9480109, 9443227, 9408949, 9526712, 9529176, 9615287, 9741664, 9744544, 9899743, 10123735, 10165219, 10328966, 10649111, 10868064, 10934119, 11119161, 11322292, 11401049, 11532827, 11703136, 11814964, 11904346, 11911219, 11944512, 12009240, 11969231, 11915798, 11849893, 11826390, 11801706, 11757882, 11743776, 11698719, 11653446, 11427954, 11103833, 10904364, 10761580, 10703924, 10695051, 10705274, 10602611, 10717848, 10817626, 10876050, 11016787, 11012359, 11069669, 11103675, 11175241, 11225341, 11240545, 11253450, 11199482, 11221242, 11166229, 11013894, 10910293, 10827673, 10628341, 10585840, 10268719, 10065470, 9886324, 9656304, 9355793, 9029833, 8849040, 8633735, 8557510, 8521743, 8517946, 8374622]
3604H374622l2006r9986j30942O3642L447k5648k9995M1143J7651J09202l833
3593H287297k6736l995j19243O3822J7922o7451k0122j96378j33478j68633r0480
3582G542525n0085j51966k38635k34516j31731j26643p1047p7952K9213j43329
3572F345834r6946m8471l6901M0474Q1828j5574n6806m6128k6919K4556k4531
3561F140416n8679l9869K3876P1151o25J2402j09438j81560m9582l6671p7402
3550E694019j01828r4927L4005M4779o1380q7576j42401k9323M2657n0243q1183
3539E166599l6438j6844j15861q5391Q7937r6852q0215N371p5865M3795N6355
3528D852591J0167n7077n1345P9864p6673j4993O1317l4859n9095m396Q3486K0519
$$ y = [8374622, 8342616, 8242630, 8111688, 8175330, 8178777, 8153129, 8123134, 8164277, 8181928, 8291130, 8287297, 8260561, 8256566, 8137323, 8201145, 8219067, 8151616, 8131494, 7935116, 7801638, 7633005, 7542525, 7492440, 7340474, 7101839, 6867323, 6735592, 6608949, 6537902, 6459950, 6489163, 6345834, 6248888, 6200417, 6163516, 6203990, 6285818, 6270244, 6213438, 6167310, 6140391, 6164947, 6140416, 6081737, 6041868, 6065744, 6136895, 6136270, 6148672, 6039234, 5857674, 5808092, 5771421, 5694019, 5592191, 5497264, 5531269, 5576048, 5514668, 5427092, 5284691, 5255368, 5298025, 5247782, 5166599, 5130161, 5113317, 4997456, 4912065, 5000002, 4903150, 4822935, 4828306, 4752441, 4796236, 4852591, 4862758, 4805681, 4754336, 4834200, 4757527, 4742534, 4803851, 4768992, 4709897, 4705501, 4788987, 4809506]
3516D809506l0815O807r0799j41835l4242P0267n5326J00735k5895o1239L4047
3505D581211K2721M5976o4988J1554p6424N8824p374R255n0249n034Q5939P4222
3493D685633l9535J0654L1040j1327R9963O4932j23317j4708J33539K0997P0883
3482D928754N5447J03977N5165J20499o4444m6884Q6204K2374J09290J1478M5794
3471E427654q053J42871O0087J18602K9971j3283J88783J03127P0416P9798J44025
3460F343998J80523P7295J88442J13488K37099J32746J09487O3591K61163J48185
3450G856017K11330J95756K33576K08395L61910K48634J63354J72279K24161M00898
3440A0276310M29560L47770M66806M63524N39787P47082Q71570J069709J265086
$$ y = [4809506, 4778691, 4785498, 4694699, 4552864, 4518622, 4588889, 4533563, 4634298, 4608403, 4547164, 4581211, 4603932, 4649908, 4584920, 4596474, 4520050, 4578874, 4571500, 4580755, 4530506, 4525472, 4611411, 4685633, 4646098, 4656752, 4687792, 4676465, 4776428, 4841360, 4718043, 4703335, 4836874, 4857871, 4928754, 4984201, 5088178, 5143343, 5263842, 5199398, 5152514, 5238718, 5261092, 5370382, 5381860, 5427654, 5419601, 5562472, 5622559, 5741161, 5771132, 5757849, 5946632, 6049759, 6120175, 6199973, 6343998, 6524521, 6601816, 6790258, 6903746, 7140845, 7273591, 7383078, 7446669, 7707832, 7856017, 8067347, 8263103, 8496679, 8705074, 9066984, 9315618, 9478972, 9651251, 9875412, 10276310, 10705870, 11053640, 11520446, 11983970, 12523757, 13270839, 14142409, 15212118, 16477204]
3431A6477204J519917J646600J847787K040517K487004K709157L366829M257254
3423C6352269N045696N341560M032268k144869o361928o706659n367380l465645
3415B6725312k457831j553295j064647q30570m81621l15472j60538m8532J35571
3406A9948377L54183N53307O15288R68867J231499J632227K045562K346713K772649
3397C2468672L160856L539873M300807M745042N864567P488230R247338R890535
3389H0705920R021018j911046j2269027j3850028j1947423p983874n618198l860068
3381C2287274l007171k258775j942318j333816j187856r44631q60570n96216l66704
3372A9789217k31652k6072J74142L47263O69206Q47721J012130J297006J467227
$$ y = [16477204, 17997121, 19643721, 21491508, 23532025, 26019029, 28728186, 32095015, 36352269, 41397965, 46739525, 50771793, 48626924, 42264996, 35558337, 30190957, 26725312, 24267481, 22714186, 21649539, 20818969, 20337348, 20021876, 19861338, 19812806, 19948377, 20302560, 20855867, 21471155, 22440022, 23671521, 25303748, 27349310, 29696023, 32468672, 35629528, 39169401, 43470208, 48215250, 54079817, 61568047, 70815385, 80705920, 89726938, 87815892, 75546865, 61696837, 49749414, 41765540, 36147342, 32287274, 29280103, 27021328, 25079010, 23745194, 22557338, 21612707, 20752137, 20155921, 19789217, 19557565, 19531493, 19705635, 20052898, 20722104, 21569825, 22581955, 23878961, 25346188]
3363B5346188J729520K018944K562747L200813M085296M590339M508639M81556
3355D8524042n410838o851015o230621m517837l161839k221864j809399j407789
3347A6912840j120928j004323r19310o09176o66511m45642m75525n49176m42212
3338A0680037k42542k15743k29616k62400k22342j07848l7878j36425p2096j19955
3328I033192j00484n6670r4903p9042r047n2540J656r5386L4092m6897p8019j30658
3316H325294k17281j17085q4508J5738r5794j38590K2764L3098J00353q6313n5162
3305G702514N7291p5140K9207m1876K0422o008R8589O2227J9524k3481K6101Q5296
3293G954666P5778q2516R2386J15017J02497R0142J28822J49865J51137L6056
$$ y = [25346188, 27075708, 29094652, 31657399, 34858212, 38943508, 43533847, 48042486, 48524042, 43113204, 36262189, 30031568, 25513731, 22351892, 20130028, 18320629, 16912840, 15791912, 14787589, 13868279, 13259103, 12592592, 12146950, 11671425, 11122249, 10680037, 10437495, 10221752, 9992136, 9729736, 9507394, 9399546, 9361668, 9225243, 9153147, 9033192, 8932708, 8876038, 8781135, 8702093, 8693046, 8640506, 8642162, 8546776, 8580868, 8533971, 8455952, 8325294, 8108013, 7990928, 7906420, 7922158, 7826364, 7687774, 7710538, 7743636, 7843989, 7757676, 7702514, 7759805, 7684665, 7713872, 7671996, 7692418, 7686410, 7784999, 7847226, 7866750, 7843269, 7869370, 7954666, 8030444, 7947928, 8040314, 8155331, 8257828, 8347970, 8476792, 8626657, 8777794, 8813850]
3283H813850J38159J39287Q8487K05276J46324J17615K05861J86483K16129K21414
3273A0478885K00825K68530M25806K95148L92333M21713M12342N97276N19660
3264A4012518N74772O37825P17958P69489P28275P38938O25262N95303L91036
3255A9791376L83298Q2185j00456m07990n55479p32057q71217r38000q83671q82692
3245A4885297p68537p19676m52206n20761n15589m31514l60431k05804l08363
3236A0602416l12513k86257k56754k02858j63824m28970l50680k93505j70104
3227H136951k50372j94605o4379j81161n8967j43634j03680k562j65861J6596
3217F988326O2892l0025J2069k3140n5687O4387J1180O440j13595K6378J20681
$$ y = [8813850, 8952009, 9091296, 9179783, 9385059, 9531383, 9648998, 9854859, 10041342, 10257471, 10478885, 10679710, 10948240, 11374046, 11669194, 12061527, 12483240, 12895582, 13492858, 14012518, 14587290, 15225115, 15943073, 16712562, 17440837, 18179775, 18805037, 19400340, 19791376, 20174674, 20256859, 20156403, 19748413, 19192934, 18460877, 17589660, 16651660, 15767989, 14885297, 14116760, 13397084, 12944878, 12424117, 11908528, 11477014, 11116583, 10910779, 10602416, 10289903, 10003646, 9746892, 9544034, 9380210, 8951240, 8600560, 8307055, 8136951, 7886579, 7691974, 7627595, 7446434, 7387467, 7243833, 7140153, 7137591, 6971730, 6988326, 7051218, 7021193, 7033262, 7010122, 6954435, 7018822, 7030002, 7036442, 6922847, 6949225, 7069906]
3206G069906K40482J81223P7026R5196p4608k05613k85964l69179l21532k44802
3196F162135k44443j00912j45563q2747j13191j22511o0343K7046r5915M8592
3186E272148q1599l5873J5002r8251K6929N5828k6118k759J5297J3698Q6797m1369
3174E199730R2065R0018J28106J5035P2400p8089k13641p1455j01919k08166j68054
3163D756030r5511p9074r6501j31895n1810j9819m9056j07027J3875N0531r6808
3152D092935j33525N768K0935j22466N1807p5698N1470j00678j6130J3418j05086
3141C682750L4650k8997p6492L0011n8694m498k9657J63980j0043j5239q8908
3130C598863q4490O5111J5649J8446k19184o6082n3025J1839j00672J3170O559
$$ y = [7069906, 7310388, 7491611, 7568637, 7663833, 7589225, 7383612, 7097648, 6728469, 6406937, 6162135, 5917692, 5816780, 5671217, 5588470, 5475279, 5352768, 5292425, 5319471, 5223556, 5272148, 5190549, 5154676, 5169678, 5071427, 5098356, 5154184, 5128066, 5125307, 5140604, 5154302, 5241099, 5199730, 5291795, 5381813, 5509919, 5524954, 5597354, 5519265, 5305624, 5234169, 5132250, 4924084, 4756030, 4660519, 4581445, 4484944, 4353049, 4301239, 4281420, 4232364, 4125337, 4139212, 4189743, 4092935, 3959410, 3965178, 3986113, 3863647, 3915454, 3839756, 3891226, 3790548, 3774418, 3787836, 3682750, 3717400, 3688403, 3611911, 3641922, 3583228, 3578730, 3549073, 3713053, 3703010, 3687771, 3598863, 3514373, 3579484, 3595133, 3613579, 3394395, 3328313, 3275288, 3287127, 3186455, 3199625, 3206184]
3119C206184j6546j58143j3872p1764M5002j6807j5501Q0638j2213N0115K5054
3108C102147p2412k7104M3710j14657M7697Q0246o5526p3588l6658m5801J41486
3097B979540R3666j45240j17980l4583p1380q7302J2176l2764r0435M8097j34853
3086B418942j09594o8731L0851n8833K6283K4081R044J4124n0189K6062n1200
3075B210840L220j39926m594m398J10237L1354k0555K4010l8591j3640k8357k0647
3063B108953M5843o1700j08089K2912q9902k6311Q2536O6846p7436n1920K2429
3052A934161K2162o2836p5753K7196M7917M4680q8053K5009r647n3900k0711K8808
3040A819033P117j3547n0716r1511J27734J64771p5226m9311J19428o1030K5054
$$ y = [3206184, 3189638, 3031495, 3017623, 2945859, 2990861, 2974054, 2958553, 3039191, 3026978, 3077093, 3102147, 3029735, 3002631, 3046341, 2931684, 2979381, 3059627, 2994101, 2920513, 2883855, 2838054, 2979540, 3073206, 2927966, 2809986, 2775403, 2704023, 2616721, 2628897, 2596133, 2505698, 2553795, 2418942, 2309348, 2240617, 2271468, 2212635, 2238918, 2262999, 2272043, 2286167, 2235978, 2262040, 2210840, 2214060, 2074134, 2069540, 2065142, 2175379, 2206733, 2186178, 2210188, 2171597, 2157957, 2129600, 2108953, 2154796, 2093096, 1985007, 2007919, 1918017, 1891706, 1974242, 2041088, 1963652, 1911732, 1934161, 1956323, 1893487, 1817734, 1844930, 1892847, 1937527, 1849474, 1874483, 1864836, 1810936, 1790225, 1819033, 1826150, 1812603, 1761887, 1670376, 1798110, 1962881, 1887655, 1838344, 1957772, 1896742, 1921796]
3029A921796l721M4708Q4721N1733M5344R4417K6916R2647K4770J0922J07669
3018B501922L8851R7860l3571N3384l2706m0305Q2538m4145p2591P0914J24909
3007B747060O0703R105o0302j591N108j990p2645l333J18768j1398r7257P8713
2995B770941J23234l3884Q0782P682J19815J70976J41145J66403J47112K09382
2985C903588J65343J04409J26958P3547q30N6976j3147j17563o8838j57471J1057
2974D084029l3034M1975l6499p1747n2662k7177k9766o4477j57764m3N1128j08760
2962C595203j03275K7307J38349J9121p6548L7829J46864P5597R0853J39818Q8684
2951D179802J80843J06825n6965M1913N6456P5271n155L5643R4836l2332J5230
$$ y = [1921796, 1918075, 1962783, 2047504, 2099237, 2144581, 2238998, 2265914, 2358561, 2383331, 2394253, 2501922, 2540773, 2638633, 2605062, 2658446, 2625740, 2585435, 2667973, 2623828, 2551237, 2622151, 2747060, 2807763, 2816868, 2756566, 2754975, 2760083, 2758093, 2685448, 2682115, 2800883, 2789485, 2692228, 2770941, 2894175, 2860291, 2941073, 2948755, 3068570, 3239546, 3380691, 3547094, 3694206, 3903588, 4068931, 4173340, 4300298, 4373845, 4373015, 4429991, 4416844, 4299281, 4230443, 4072972, 4084029, 4050995, 4092970, 4056471, 3984724, 3932062, 3904885, 3875119, 3810642, 3652878, 3652835, 3703963, 3595203, 3491928, 3519235, 3657584, 3676705, 3600157, 3637986, 3784850, 3860447, 3951300, 4091118, 4179802, 4360645, 4467470, 4410505, 4452418, 4508874, 4584145, 4578990, 4614633, 4709469, 4677137, 4692367]
2940D692367j6497r6823j4889m8562j3884K5942n0866m3420J4130r2547K8887
2929D383838l8401J5234J5868j5813J63070O9513o1797O5884J51900J71354P4507
2918D995157K2452J43334J78146P8604N3720L9350R1060l9389j07938k09656j75809
2907E069031k26282j84838j07040n1645k06460n0454l2227Q230Q1318k9201K0450
2896D290882N489R8890L1152p825n0641J31459q7739M1828J14434M3276Q205l7298
2884D582112j65264j43662J6575j55677j63841j86431j7438l9296j71192j08909
2874C446977k8420k5506p8527p0806m3566j45189n7333O4401J6231j9355j39728
2863B919179r0462M530r4469o2334r8365j28339r0862o9139m4817o3562j51387
$$ y = [4692367, 4675870, 4579047, 4564158, 4515596, 4501712, 4527654, 4476788, 4433368, 4447498, 4354951, 4383838, 4345437, 4360671, 4376539, 4360726, 4523796, 4593309, 4531512, 4597396, 4749296, 4920650, 4995157, 5017609, 5160943, 5339089, 5417693, 5471413, 5510763, 5601823, 5562434, 5454496, 5244840, 5069031, 4842749, 4657911, 4550871, 4499226, 4292766, 4242312, 4210085, 4218315, 4299633, 4270432, 4290882, 4296371, 4395261, 4426413, 4418588, 4367947, 4499406, 4411667, 4453495, 4567929, 4611205, 4619410, 4582112, 4416848, 4273186, 4289761, 4134084, 3970243, 3783812, 3766374, 3727078, 3555886, 3446977, 3418557, 3393051, 3314524, 3243718, 3200152, 3054963, 2997630, 3062031, 3078262, 3058907, 2919179, 2828717, 2833247, 2738778, 2676444, 2578079, 2449740, 2358878, 2289739, 2244922, 2181360, 2029973]
2852B029973k0568M7098j04639p0007l9671q5554J4686J2242l2376l4865P2808
2841A789127Q8214j90434j22303q3775o3986O6007L066L7177m3424n9053q1556
2830A339060o0828l2459K3934n9143P3428M2434r2935k5631M9167k5935k1921
2819A209171q7666j19002M0475M7198k7457j27476J0702n9390M744J28038l3328
2808I86009j10979J8160j0170o2178o721O8809n573k2620K5054R751k2769l7688
2796H29085p7428K0964j5677L2404j0870n8478l9622o668N9404n7260m0158J7358
2784F53054q575p5622l0162Q5579k5602M7944o7132j2640P2221P4538q2351m1227
2772E90025k892o0647l1187N8649O3452q1189M8470K4866j74518n383q8555k5078
$$ y = [2029973, 2009405, 2056503, 1951864, 1881857, 1842186, 1756632, 1771318, 1783560, 1751184, 1716319, 1789127, 1877341, 1686907, 1564604, 1480829, 1416843, 1482850, 1485916, 1523093, 1479669, 1420616, 1339060, 1278232, 1245773, 1269707, 1210564, 1283992, 1326426, 1233491, 1207860, 1257027, 1231092, 1209171, 1121505, 1002503, 1042978, 1090176, 1062719, 935243, 945945, 886555, 891299, 1019337, 986009, 875030, 893190, 883020, 820842, 814121, 882930, 877357, 854737, 879791, 889542, 866773, 829085, 751657, 772621, 756944, 789348, 778478, 720000, 680378, 673710, 733114, 675854, 635696, 653054, 644479, 568857, 538695, 624274, 598672, 646616, 579484, 566844, 639065, 713603, 631252, 590025, 587133, 526486, 495299, 553948, 617400, 536211, 584681, 609547, 435029, 429646, 341091, 316013]
2760C16013k9092J2844j0291P0930P7980o9968O6003K4598n4073q6141N7360Q4095
2748D60258k6377j06224m5579P8807j08151P9310Q4402p8661K4204R859q380n0569
2736C12899q2681J23375N5060O9446o4411j51477K4132m837o8283M766O2346L9011
2724C19346J0952J222N0744j84017k4494n4140O3742J6206O8947j6781J4912l3734
2712B32905j2511L6842J8553J3100L7032r221K5528J3850n0154m9587J5772p4089
2700A98020o3767J3331P9644O1597m2518p4353R9553k749j9194j8315L5574K4169
2688B90992r0201K0526J5384O7443J21360R998r3197n6158M9587n9725o8625M4089
2676B51473P5490j1575p3518J17511M5569l3878j06965P5928P9662m2798N3242
$$ y = [316013, 286921, 299765, 289474, 360404, 438384, 368416, 434419, 459017, 404944, 318803, 376163, 460258, 433881, 327657, 282078, 360885, 252734, 332044, 416446, 337785, 361989, 371848, 363468, 312899, 230218, 353593, 408653, 478099, 413688, 262211, 286343, 281506, 213223, 217989, 280335, 319346, 330298, 331520, 382264, 198247, 173753, 119613, 183355, 199561, 268508, 251727, 266639, 232905, 220394, 257236, 275789, 288889, 325921, 316700, 342228, 356078, 305924, 256337, 272109, 198020, 134253, 147584, 227228, 288825, 246307, 171954, 271507, 268758, 249564, 231249, 266823, 290992, 200791, 221317, 236701, 304144, 425504, 435502, 342305, 286147, 335734, 276009, 207384, 251473, 326963, 315388, 241870, 359381, 404950, 371072, 264107, 340035, 419697, 376899, 430141]
2665D30141l3240q1644N5399j7249m8111R5794n100L9535k0527k9008J9159Q291
2653D13440l0645K9089P0507k465j6473o7956J23177m1165j8532L6076j0107K4970
2641E09916R7534P208o6488J06207O2928m176J511q013k0903L6598m5993j3817
2629F62512M9166J9618M082k1334N300l2577L8387L2907N5211K4936k4704n4022
2617G59482o277l5378P9836l1678j39188J2627R1800P5511j5126n337K7345Q796
2605H22413O3504n526k2510j9511P226N1956J6180P152N014p0459m225o148j1693
2592H33373m6395m7492P371J0158l6232M2550k8674L4312r0183o6655J39889q7026
2580F64996o3784L359Q6746K0740j8957j2587k5505j4394P1721P0678M3283m1893
$$ y = [430141, 396901, 315257, 370656, 353407, 305296, 401090, 395990, 435525, 414998, 385990, 405149, 413440, 382795, 411884, 482391, 479926, 463453, 395497, 518674, 477509, 458977, 495053, 484946, 509916, 607450, 614658, 548170, 654377, 717305, 713129, 714640, 706627, 685724, 722322, 676329, 662512, 711678, 731296, 735378, 714044, 719344, 686767, 725154, 758061, 813272, 838208, 813504, 759482, 753205, 717827, 797663, 765985, 626797, 639424, 731224, 806735, 791609, 786272, 813617, 822413, 885917, 880391, 857881, 838370, 845596, 897552, 913732, 920884, 925898, 855439, 851214, 845066, 833373, 786978, 739486, 746857, 757015, 720783, 763333, 734659, 768971, 678788, 612133, 752022, 664996, 601212, 604571, 691317, 712057, 693100, 680513, 655008, 640614, 712335, 783013, 826296, 784403]
2568G84403p5730k0204j453J6858j5565o1941l0082P024j7556o2322j62340J20181
2556D81273K3723o3184l2307r2623m7047K536R4545M8926K3365k9900O5320l0238
2544D44389q2500m5538r6041M2291J15475l8864k889K7343l109m0599n8961o5236
2532A95761P0346q0781p4226m5314Q9079q6351R9242N0319p4292L7961N5127K35
2520B37106n2662K3570p8448L3935J99k6479l8296J4754q4166R8870L7353n3638
2508A12098j7675N85j9124O234L6366k7889j31368J08269K0574K7535J08114j18420
2496A05299m3989N3920q8260n3530K3401m7408L6702O0932K0913M1156m7634l6447
2484B5055p054M0672R812r7838Q566J10386l4672m6595J15455q0911k6360j46262
$$ y = [784403, 708673, 688469, 687016, 703874, 688309, 626368, 596286, 603310, 585754, 523432, 361092, 481273, 504996, 441812, 409505, 316882, 269835, 272371, 366916, 415842, 439207, 409307, 474627, 444389, 361889, 316351, 220310, 262601, 378076, 339212, 336323, 363666, 360557, 319958, 260997, 195761, 266107, 185326, 111100, 65786, 154865, 68514, 167756, 218075, 143783, 181744, 236871, 237106, 184444, 208014, 129566, 163501, 163700, 137221, 98925, 113679, 29513, 128383, 165736, 112098, 94423, 95008, 75884, 82118, 118484, 90595, -40773, 67496, 88070, 115605, 223719, 105299, 61310, 115230, 26970, -26560, -3159, -50567, -13865, 47067, 67980, 109136, 61502, 25055, 18001, 58673, 68485, -29353, -20787, 89599, 54927, 8332, 123787, 42876, 16516, -129746]
2472a29746m1320M5309R4920K5671p4619R4912k7720J508m0557K0807K8306K2893
2460B0364J12406l5549j6148N415k0009k3060K5458k0634n1975p4707n5984J08184
2448b6239R0244o3832J56937l0497j78227j3961J01883j1829m1749K7917j12410
2437a01763J06767N9321p3839N9841J5482p0469q7253Q7845M8373R952K4655l2815
2425D6097q4385j3735m6008M8214O2457P5924m1785J8309N3214m5303p0207m3655
2413d0863m9459l531L0878P4138L660n4589L3132N561k1500l2766K0515K6506
2401h318Q7509n6664q8681k489J60424l2973L3267l1716j8596l1253L0516p1791
2389c0765R7899N5598p638k787J19889L0734N7533o556j5098O9687j21233l4055
$$ y = [-129746, -171066, -125757, -30837, -5166, -79785, 15127, -12593, -11085, -51642, -30835, -2529, 20364, 132770, 97221, 81073, 86488, 66479, 43419, 68877, 48243, -3732, -78439, -134423, -26239, 64005, 173, 157110, 126613, -51614, -65575, 36308, 24479, -17270, 10647, -101763, 5004, 64325, -9514, 50327, 65809, -4660, -91913, -4068, 44305, 54257, 78912, 46097, -38288, -52023, -98031, -49817, 12640, 88564, 46779, 65088, 118302, 72999, 2792, -40863, -90322, -93853, -62975, 11163, 14823, -39766, -6634, -1073, -22573, -55339, -34824, -8318, 79191, 22527, -66154, -68643, 91781, 58808, 92075, 60359, 41763, 10510, 41026, -30765, 67134, 122732, 115094, 112307, 232196, 262930, 320463, 313907, 298809, 368496, 247263, 213208]
2377B13208k3056j12678Q2769J0330o287K7343j54213k9011k787J12633j4070
2366A04181m0052k7878J4672P537l0904j2192R3781K5338j14933J08727o9659
2355E8618q4563Q4751n1020K861Q9790j9415p4315L4085j7136P4782l7284k9381
2343C1773K1878p7814j4249m4883Q9046O0686O6950o9453l5590O8998p1902K9459
2331E4899L773M1543K9952l6754R9259j4873j4645o2432o7248k4404O0880K5267
2319I5217j2579o0885L4728J23786j15919q7217k7936J18655P211j157k086K615
2307G4433m0866K024O0826L4719l9974j09086m6685J48104p2942J6581R2436L2490
2295A52060Q536m6415j19138R2893J8474l346K2626j7972M4482K7350O499J9144
$$ y = [213208, 190152, 77474, 160243, 170573, 164286, 191629, 37416, 8405, 5618, 118251, 104181, 64129, 36251, 50923, 58460, 27556, 15364, 109145, 134483, 19550, 128277, 58618, -25945, 58806, 7786, 10647, 100437, 81022, 6707, 40792, 23656, 98438, 61154, 31773, 53651, -24163, -38412, -83295, 5751, 66437, 133387, 63934, 28344, 97342, 25440, 54899, 58672, 100215, 130167, 93413, 192672, 177799, 163154, 100722, 33474, 9070, 69950, 95217, 82638, 21753, 56481, 180267, 64348, -22869, -50805, 67850, 75061, 73904, 71818, 74433, 33567, 35591, 96417, 131136, 91162, -17924, -64609, 83495, 10553, 27134, 119570, 152060, 160596, 114181, -4957, 87936, 106410, 103064, 125690, 107718, 152200, 179550, 186049, 205193]
2283B05193o2420m9018L5760O1514m1539P411j8713L1338M0399m9105n5731K5219
2271A30308P3503r6320M070K0717l9728K5658J7562j06497k7353L7215M4018L9671
2259A22824k3503K3399k351J8119N4717M2031j5690q5376J01017Q689n7514O1856
2247B48218J7891j22661M3491m7740Q4323j3752l5847L5806m7158J42270J4846
2236C19687l3513N0678j2825N1383o8217k7178P3788l6537n1822l1118L7374k6651
2224B45049M7738J2848l0625N5155N9071M0739q0166q691n0469N6868R1708l6641
2212D02584N5160O7701q3899K9919p406P7415J1820r1165J11725P8121M552L4056
2200F90583j600o2659N4678j9662l3716J12527O6210N8029K3934p3313Q1098J06560
$$ y = [205193, 142773, 93755, 129515, 191029, 149490, 156901, 138188, 169526, 209925, 160820, 105089, 130308, 203811, 107491, 111561, 132278, 92550, 118208, 135770, 29273, 1920, 39135, 83153, 122824, 99321, 122720, 120369, 138488, 193205, 235236, 219546, 134170, 235187, 243876, 186362, 248218, 266109, 143448, 186939, 139199, 223522, 209770, 173923, 209729, 162571, 304841, 319687, 286174, 336852, 324027, 375410, 307193, 280015, 353803, 317266, 265444, 234326, 271700, 245049, 292787, 305635, 275010, 330165, 389236, 429975, 349809, 341118, 290649, 347517, 439225, 402584, 457744, 525445, 441546, 471465, 464059, 541474, 553294, 462129, 573854, 651975, 656527, 690583, 688983, 626324, 681002, 661340, 627624, 740151, 806361, 864390, 888324, 815011, 896109, 1002669]
2188A002669P9863K380N9152J21052l9993Q2985n1008l2041L1023M2766L7726
2177A336574O1705p357j1755P6712J20342J5098R968M5912l2731J180O0665N1326
2165A727639J3567n4932M7592P7165R9264r3658R0616J03855Q8679j8214J74423
2154B255996J25778N2288N9307N0665J79760J88436K40709K87690M85O3103J10153
2143C614370J08797L33100J79921K62213K79500K46537K50508M09232L26692M62637
2133F473507O35064N63718N22795P43794R33514Q25295Q30422J004704J312353
2124A3845166J582251K070878K332789K713107L231003L340123M170073N205272
2116C8490662O604693P639783O569693m084244r918695r575218p865365n003456
$$ y = [1002669, 1082532, 1084912, 1144064, 1265116, 1225123, 1308108, 1257100, 1225059, 1256082, 1298848, 1336574, 1398279, 1390922, 1379167, 1455879, 1576221, 1591319, 1601287, 1647199, 1614468, 1615648, 1676313, 1727639, 1741206, 1686274, 1733866, 1811031, 1910295, 1816637, 1907253, 2011108, 2099787, 2081573, 2255996, 2381774, 2434062, 2493369, 2544034, 2723794, 2912230, 3152939, 3440629, 3441114, 3504217, 3614370, 3723167, 4056267, 4236188, 4498401, 4777901, 5024438, 5274946, 5684178, 6010870, 6473507, 7108571, 7672289, 8195084, 8938878, 9872392, 10697687, 11528109, 12532813, 13845166, 15427417, 17498295, 19831084, 22544191, 25775194, 29115317, 33285390, 38490662, 45095355, 52735138, 59304831, 55220587, 45301892, 35726674, 27861309, 22857853]
2108B2857853l723918k596299k027082j596710j384164r10183q17621o42008l82313
2099H777555l94687o29748n54585o69637n06376l50398l17254l46694k88123k61054
2089D458999j40138k59648k05508j14501j02155r1843j47368k53363K2272p6723
2079C090024j01989k45937k6415j04614p0389j17970J230r1025j53360j1739p7678
2068B090138j40585j7306j46468j61200r7544r556j53988n0467o6112q0759O4199
2057A230352K5122r2844N9415r7066j18884k4527N9062O0128m393k0399o3138
2046A012828m5091j41556J00409K6422j18859R8190O173r1304l1454k5352O1983
2035H52389R9230n3372n1882o3758k9707r925j1851q3792J4374j3698j7890j04416
$$ y = [22857853, 19133935, 16537636, 14510554, 12913844, 11529680, 10619497, 9801876, 9159868, 8777555, 8382868, 7753120, 7198535, 6528898, 6022522, 5672124, 5354870, 5008176, 4720053, 4458999, 4318861, 4059213, 3853705, 3739204, 3637049, 3545206, 3397838, 3144475, 3166747, 3090024, 2988035, 2742098, 2715683, 2611069, 2540680, 2422710, 2423940, 2332915, 2179555, 2167816, 2090138, 1949553, 1932247, 1785779, 1624579, 1527035, 1517479, 1363491, 1313024, 1246912, 1166153, 1230352, 1255474, 1162630, 1222045, 1124979, 1006095, 981568, 1040630, 1100758, 1096365, 1075966, 1012828, 967737, 826181, 926590, 953012, 834153, 932343, 938516, 847212, 815758, 790406, 852389, 951619, 898247, 846365, 782607, 752900, 742975, 731124, 647332, 661706, 648008, 630118, 525702]
2023E25702l2134Q862J119k649r8490m5083R434k3464l7865P2514J09583r9339
2011C88190O9315L3705j69208N0190n596K9970l7609k1400M4318n2922k4364L3631
1999C38220j17435L3351j8274j4346j02217O1417N6547Q2666p356J20232N0113
1988D82918j84511n3464O9833k4635r3526P2198k402r9447J08996J28716p9888
1977C24788j54383p5602k8400P1147Q4737M8884l5330k4672j7655n0680p188M3727
1965A79373Q8726m552j10651J1646j066Q8893o8422j04848Q6494j3809p6035l0309
1953D5440K4388R5471q5933l0379k1846r8972J00978l5621M2212Q766N4693j791
1941I7406L3498k6719m6002k4254L4909M2691l3996l6958L8149M6343j5668l2583
$$ y = [525702, 493568, 502430, 503549, 500900, 402410, 357327, 366761, 343297, 305432, 377946, 487529, 388190, 457505, 491210, 322002, 372192, 366596, 396566, 358957, 337557, 381875, 328953, 304589, 338220, 220785, 254136, 235862, 221516, 119299, 180716, 237263, 319929, 312573, 432805, 482918, 298407, 244943, 314776, 290141, 196615, 268813, 266411, 166964, 275960, 404676, 324788, 170405, 94803, 66403, 137550, 222287, 271171, 235841, 211169, 193514, 142834, 135646, 179373, 268099, 263547, 152896, 164542, 163476, 252369, 183947, 79099, 165593, 151784, 75749, 45440, 69828, 165299, 79366, 48987, 27141, -71831, 29147, -6474, 35738, 44504, 99197, 97406, 130904, 104185, 58183, 33929, 68838, 111529, 77533, 40575, 78724, 125067, 109399, 76816]
1929G6816l3262O4059m3988k2327l0248L4640K3095P3355p3360j00790L3979J7986
1917A9955P0671j08713L4658J16598L3346j20837n5972J5109M5205N8375j02398
1906E997l4666K280R18O6448L1299p0550K7686j0223J3073O4303j15042o3441
1894h1918Q8589O943k860K0285L2852m6683P3915r4843l2611K0314O8021K3611
1882G5615q3613M0895J7320l9878P090q176R3935k6692M5786K666k3823j3819
1870H7306O5381J5353q2091k5273l4932M9468l8934P9350l6991n4672J9470J5389
1858E8824N939L0770p4526J10652l2907k6760r2677Q0142J10398j5473K300Q9050
1846B45732Q8190l3924m1030K4717l1180k2586l2074m2471k0865K6601m5067J8055
$$ y = [76816, 43554, 107613, 63625, 41298, 11050, 45690, 68785, 142140, 68780, -32010, 1969, 19955, 90626, -18087, 16571, 133169, 166515, 45678, -10294, 4815, 50020, 108395, 5997, -28669, -26389, -25471, 40977, 72276, 1726, 29412, 19189, 32262, 96565, -18477, -81918, 6671, 13614, 10754, 31039, 63891, 17208, 91123, -3720, -36331, -16017, 52004, 75615, -7998, 32897, 50217, 10339, 17429, 9253, 103188, 76496, 122282, 124948, 101125, 87306, 152687, 168040, 85949, 60676, 25744, 75212, 36278, 115628, 78637, 23965, 43435, 58824, 64763, 95533, 21007, 131659, 98752, 71992, -20685, 59457, 169855, 154382, 156682, 245732, 333922, 299998, 258968, 283685, 252505, 229919, 197845, 155374, 134509, 161110, 116043, 134098]
1834A34098m5735j75493j1699R6183Q9828l0042n3436L0323l9394m7610l4469
1823h7446m7292Q9842M188N1539n0426k674Q3420o3955K2490J01437j00063j05556
1811a04496K41553M0506k6048p8589j13219P4945K2363p0945M5790n896o5127
1800c9163k4512P5307r573p3490l6895k2953J5206R2311j5133j39884o535J23217
$$ y = [134098, 88363, -87130, -98829, -2646, 87182, 57140, 3704, 34027, -5367, -52977, -87446, -134738, -44896, -40708, 10831, -39595, -42269, 41151, -22804, -314, 101123, 1060, -104496, 137057, 177563, 151515, 72926, -40293, 34652, 57015, -13930, 31860, 25964, -39163, -63675, 11632, 2059, -71431, -108326, -131279, -116073, -23762, -38895, -178779, -185314, -62097]
$$ [...]
##END NTUPLES=NMR SPECTRUM
##END=
