##TITLE=1H_EC-3265(1)
 CDCl3,8 sc, 
 26.10.2021
##JCAMPDX= 6.0         $$ Bruker NMR JCAMP-DX V2.0
##DATA TYPE= NMR SPECTRUM
##DATA CLASS= NTUPLES
##ORIGIN= UXNMR, Bruker Analytische Messtechnik GmbH
##OWNER= root
$$ XWIN-NMR		Version 3.5
$$ Tue Oct 26 10:16:53 2021 Russian Standard Time (UT+4h)  she@DPX200
##.OBSERVE FREQUENCY= 200.1313468511
##.OBSERVE NUCLEUS= ^1H
##.ACQUISITION MODE= SIMULTANEOUS
##.ACQUISITION SCHEME= undefined
##.AVERAGES= 8
##.DIGITISER RES= 18
##SPECTROMETER/DATA SYSTEM= spect
##.PULSE SEQUENCE= zg30
##.SOLVENT NAME= D2O
##.SHIFT REFERENCE= (INTERNAL, D2O, 0, 15.7238)
##AUDIT TRAIL= $$ (NUMBER, WHEN, WHO, WHERE, WHAT)
$$ ##TITLE= Audit trail, XWIN-NMR		Version 3.5
$$ ##JCAMPDX= 5.01
$$ ##ORIGIN= Bruker BioSpin GmbH
$$ ##OWNER= she
$$ F:/spectra/data/she/nmr/H-F/1/pdata/1/auditp.txt
$$ ##AUDIT TRAIL=  $$ (NUMBER, WHEN, WHO, WHERE, WHAT)
(   1,<2021-10-26 10:15:06.43 +0400>,<she>,<DPX200>,
      <created by zg, POWCHK disabled, PULCHK disabled
       configuration hash MD5:
       00 E9 B6 7A A2 85 ED C7 34 08 36 98 17 FE 4E 26
       data hash MD5: 16K
       38 BB 7A 78 4D FB BC BF D4 58 E7 B6 B9 27 F1 65>)
(   2,<2021-10-26 10:15:09.40 +0400>,<she>,<DPX200>,
      <Start of raw data processing
       efp BC_mod = 2 LB = 0.24 FT_mod = 6 PKNL = 1 PHC0 = -15233.94 PHC1 = 15.00083 SI = 16K 
       data hash MD5: 16K
       25 F2 8E F7 24 63 2D AA FF B3 AA B3 9B ED 42 CB>)
(   3,<2021-10-26 10:15:31.29 +0400>,<she>,<DPX200>,
      <pk PHC0 = 80.48447 PHC1 = -2.399999 
       data hash MD5: 16K
       3A 5F 23 48 1D 23 B6 C3 48 F5 97 4B 29 0F B2 D1>)
(   4,<2021-10-26 10:15:34.93 +0400>,<she>,<DPX200>,
      <abs ABSG = 5 
       data hash MD5: 16K
       8D 77 3E B2 EF 2F 5F 93 C4 27 84 54 90 16 48 CE>)
$$ ##END=
$$ 
$$ hash MD5
$$ 71 D2 48 42 5D CB B3 3B 4D 5F 22 D0 86 95 49 91
##$RELAX= 
##$RELAX= 
##$RELAX= 
##$RELAX= 
##$RELAX= 
##$RELAX= 
$$ Bruker specific parameters
$$ --------------------------
##$DU= <F:/spectra>
##$EXPNO= 1
##$NAME= <H-F>
##$PROCNO= 1
##$TYPE= <nmr>
##$USER= <she>
##$AMP= (0..31)
100 100 100 100 100 100 100 100 100 100 100 100 100 100 100 100 100 100 
100 100 100 100 100 100 100 100 100 100 100 100 100 100 
##$AQSEQ= 0
##$AQ_mod= 1
##$AUNM= <au_zg>
##$AUTOPOS= <>
##$BF1= 200.13
##$BF2= 200.13
##$BF3= 200.13
##$BF4= 200.13
##$BF5= 200.13
##$BF6= 200.13
##$BF7= 200.13
##$BF8= 200.13
##$BYTORDA= 1
##$CFDGTYP= 0
##$CFRGTYP= 5
##$CHEMSTR= <none>
##$CNST= (0..31)
1 1 145 1 1 1 1 1 1 1 1 1 1 1 1 1 1 1 1 1 1 1 1 1 1 1 1 1 1 1 1 1 
##$CPDPRG= <>
##$CPDPRG1= <>
##$CPDPRG2= <>
##$CPDPRG3= <>
##$CPDPRG4= <mlev>
##$CPDPRG5= <mlev>
##$CPDPRG6= <mlev>
##$CPDPRG7= <mlev>
##$CPDPRG8= <mlev>
##$CPDPRGB= <>
##$CPDPRGT= <>
##$D= (0..31)
0 1.2 0 0 0 0 0 0 0 0.06 0 0.03 0 0 0 0 0.0002 0 0 0 0 0 0 0 0 0 0 0 0 
0 0 0 
##$DATE= 1635228905
##$DBL= (0..7)
120 120 120 120 120 120 120 120 
##$DBP= (0..7)
150 150 150 150 150 150 150 150 
##$DBP07= 0
##$DBPNAM0= <>
##$DBPNAM1= <>
##$DBPNAM2= <>
##$DBPNAM3= <>
##$DBPNAM4= <>
$$ [...]
##$SUBNAM2= <"">
##$SUBNAM3= <"">
##$SUBNAM4= <"">
##$SUBNAM5= <"">
##$SUBNAM6= <"">
##$SUBNAM7= <"">
##$SUBNAM8= <"">
##$SUBNAM9= <"">
##$SW= 18.0517286264689
##$SWIBOX= (0..15)
0 0 2 0 0 0 0 0 0 0 0 0 0 0 0 0 
##$SW_h= 3612.71676300578
##$TD= 16384
##$TD0= 1
##$TE= 0
##$TE2= 300
##$TE3= 300
##$TEG= 300
##$TL= (0..7)
0 120 120 120 120 120 120 120 
##$TP= (0..7)
150 150 150 150 150 150 150 150 
##$TP07= 0
##$TPNAME0= <>
##$TPNAME1= <>
##$TPNAME2= <>
##$TPNAME3= <>
##$TPNAME4= <>
##$TPNAME5= <>
##$TPNAME6= <>
##$TPNAME7= <>
##$TPOAL= (0..7)
0.5 0.5 0.5 0.5 0.5 0.5 0.5 0.5 
##$TPOFFS= (0..7)
0 0 0 0 0 0 0 0 
##$TUNHIN= 0
##$TUNHOUT= 0
##$TUNXOUT= 0
##$USERA1= <user>
##$USERA2= <user>
##$USERA3= <user>
##$USERA4= <user>
##$USERA5= <user>
##$V9= 5
##$VALIST= <valist>
##$VCLIST= <CCCCCCCCCCCCCCC>
##$VD= 0
##$VDLIST= <DDDDDDDDDDDDDDD>
##$VPLIST= <PPPPPPPPPPPPPPP>
##$VTLIST= <TTTTTTTTTTTTTTT>
##$WBST= 1024
##$WBSW= 4
##$XGAIN= (0..3)
0 0 0 0 
##$XL= 0
##$YL= 0
##$YMAX_a= 162450
##$YMIN_a= -269430
##$ZGOPTNS= <>
##$ZL1= 120
##$ZL2= 120
##$ZL3= 120
##$ZL4= 120
##$ABSF1= 15.72375
##$ABSF2= -2.328099
##$ABSG= 5
##$ABSL= 3
##$ALPHA= 0
##$AQORDER= 0
##$ASSFAC= 0
##$ASSFACI= 0
##$ASSFACX= 0
##$ASSWID= 0
##$AUNMP= <proc_1d>
##$AZFE= 0.1
##$AZFW= 0.1
##$BCFW= 0
##$BC_mod= 2
##$BYTORDP= 0
##$COROFFS= 0
##$CY= -3
##$DATMOD= 1
##$DC= 0
##$DFILT= <>
##$DTYPP= 0
##$F1P= 0
##$F2P= 0
##$FCOR= 1
##$FTSIZE= 16384
##$FT_mod= 6
##$GAMMA= 0
##$GB= 0
##$INTBC= 1
##$INTSCL= 0
##$ISEN= 128
##$LB= 0.24
##$LEV0= 0
##$LPBIN= 0
##$MAXI= 10000
##$MC2= 0
##$MEAN= 0
##$ME_mod= 0
##$MI= 1.114404
##$NCOEF= 0
##$NC_proc= -7
##$NLEV= 6
##$NOISF1= 3.799351
##$NOISF2= 2.8
##$NSP= 0
##$NTH_PI= 0
##$NZP= 0
##$OFFSET= 15.72375
##$PC= 1
##$PHC0= -15153.46
##$PHC1= 12.60083
##$PH_mod= 1
##$PKNL= yes
##$PPARMOD= 0
##$PSCAL= 0
##$PSIGN= 0
##$REVERSE= no
##$SF= 200.130006415331
##$SI= 16384
##$SIGF1= 3
##$SIGF2= 2
##$SINO= 5.538805
##$SIOLD= 16384
##$SREGLST= <1H.CDCl3>
##$SSB= 0
##$STSI= 16384
##$STSR= 0
##$SW_p= 3612.71676300578
##$SYMM= 0
##$S_DEV= 0
##$TDeff= 16384
##$TDoff= 0
##$TI= <>
##$TILT= no
##$TM1= 0
##$TM2= 0
##$TOPLEV= 0
##$USERP1= <user>
##$USERP2= <user>
##$USERP3= <user>
##$USERP4= <user>
##$USERP5= <user>
##$WDW= 1
##$XDIM= 16384
##$YMAX_p= 351806077
##$YMIN_p= -617619
$$ End of Bruker specific parameters
$$ ---------------------------------
##NTUPLES= NMR SPECTRUM
##VAR_NAME=  FREQUENCY,     SPECTRUM/REAL,   SPECTRUM/IMAG
##SYMBOL=    X,             R,               I
##VAR_TYPE=  INDEPENDENT,   DEPENDENT,       DEPENDENT
##VAR_FORM=  AFFN,          ASDF,            ASDF
##VAR_DIM=   16384,         16384,           16384
##UNITS=     HZ,            ARBITRARY UNITS, ARBITRARY UNITS
##FACTOR=    0.220516191357247, 1,           1
##FIRST=     3146.79421127612, 0,            0
##LAST=      -465.922551729658, 0,           0
##MIN=       -465.922551729658, -617619,     0
##MAX=       3146.79421127612, 351806077,    0
$$ Real data points
##PAGE= N=1
##DATA TABLE= (X++(R..R)), XYDATA
$$ [...]
7082B0866930k254691j340192j122243j009080r07521n72361p22855o82240p32509
7073A1523238n58842m47309l38522n26522l40118l28929l38353l93566j52855
7064H098222k72306m52258k08921l20726j21306l67868j70109j44763l80028M9673
7054E709610j77406j91368k15664k95157J4226j85507l6328k93756J09366m2438
7044D395578j13521K35832J04997J79839J09574o4885J90872J59821J96972K6424
7034E421503j68179k36428k65510k87168l10107m73626l24388k41420j08367q2725
7024B923585k80440l7081J77466j66562p6094p708L3011r2018l01687k0620j42703
7013B009149l604N2152j09018r4950o4598K6569r9061j08791N7802J56935r0077
$$ y = [20866930, 18612239, 17272047, 16149804, 15140724, 14233203, 13660842, 12937987, 12255747, 11523238, 10964396, 10517087, 10178565, 9652043, 9311925, 8982996, 8644643, 8251077, 8098222, 7825916, 7373658, 7164737, 6844011, 6722705, 6354837, 6184728, 6039965, 5659937, 5709610, 5532204, 5340836, 5125172, 4830015, 4844241, 4658734, 4622406, 4328650, 4438016, 4395578, 4282057, 4517889, 4622886, 4802725, 4912299, 4847414, 5038286, 5198107, 5395079, 5421503, 5253324, 5016896, 4751386, 4464218, 4154111, 3680485, 3356097, 3114677, 3006310, 2923585, 2643145, 2606064, 2783530, 2616968, 2540874, 2533166, 2566177, 2474159, 2172472, 2151852, 2009149, 2005545, 2057697, 1948679, 1853729, 1789131, 1815700, 1716639, 1607848, 1665650, 1822585, 1732508]
7002A732508J765k36047J76572o5281k72173j42208J34218Q184r7981P0602L7314
6991A347473m2986l30250r4984Q6857J37129j1563j46067P3592M7554m9958m2024
6980I74773m2049o0310k9533N6545K7288j48871J98291O037q4044M3785M6340
6969I88252j24823j08895Q7504n0213r962M6712Q7029j41270k02534k0456J4788
6958E66132k7349J16522J72408n2974k69834J87076J6865Q3693j83970M568M7740
6947F60877O044m0346j35251r982J538j79436P3937J0393j65367L27560K2374
6936E72341k42184P1356K7101j24538j08094j46798r9455K18703O7628J02815
6926C38875j18908J53162P0531j46570N5866p4589n4113m4111J26057J23094J0147
$$ y = [1732508, 1734273, 1498226, 1674798, 1609517, 1337344, 1195136, 1329354, 1337538, 1239557, 1310159, 1347473, 1304487, 974237, 879253, 966110, 1103239, 1091676, 945609, 1019201, 1066755, 1016797, 974773, 932724, 872414, 842881, 899426, 926714, 777843, 976134, 982171, 898127, 941912, 988252, 863429, 754534, 842038, 791825, 781863, 828575, 915604, 774334, 571800, 551344, 566132, 538783, 655305, 827713, 774739, 504905, 691981, 708846, 792539, 608569, 613137, 660877, 666921, 626575, 491324, 481342, 482880, 303444, 377381, 387774, 222407, 549967, 572341, 330157, 401513, 428614, 304076, 195982, 49184, -50271, 168432, 236060, 338875, 219967, 373129, 443660, 297090, 352956, 278367, 224254, 180143, 306200, 429294, 439441]
6915D39441j23727j64469J43588j60777K79593q3645j10649J05295n4452j62841
6905A07357o5251J86494Q1811q2309J03211j43333j13296J40242r0435J1484J68459
6894C04434Q0002k7014j25300p3544J09935l1913k7523q3487J04198k18496l8920
6883b7628R5265k2362N4657J65090k16270J18897O7564J06529J36566l17477r8134
6872F2697L759m5245m5758P2134R0880Q9762L9296r3032q06j56865n2658O4471
6860B8635r8649N3077J2035k2961l3112P6933j32252N4638K62946l5930k18353
6849e2993Q4518J39943J31898J64853j35625j23534k37875j15957J70983L0090
6839E6301Q6201J11979j64765m0232o0788N125l4984m6976J52531l4249n2195
$$ y = [439441, 315714, 151245, 294833, 134056, 413649, 330004, 219355, 324650, 270198, 107357, 42106, 228600, 310411, 228102, 331313, 187980, 74684, 214926, 124491, 135975, 304434, 384436, 357422, 232122, 158578, 268513, 236600, 209077, 125590, 229788, 11292, -27628, 67637, 45275, 99932, 265022, 48752, 167649, 235213, 341742, 478308, 160831, 62697, 66456, 21211, -24547, 47587, 138467, 228229, 267525, 174493, 173687, 16822, -35836, 28635, -70014, -16937, -4902, -27863, -60975, 15958, -116294, -61656, 201290, 165360, -52993, 31525, 171468, 303366, 468219, 332594, 209060, -28815, -144772, 26211, 56301, 142502, 254481, 89716, 49484, -11304, -6179, -41163, -88139, 64392, 30143, -22052]
6828b2052J20492k2447j45488N309J44460J6546j0995j12147J70118R1594J19748
6817C55138j21009k10727j8498J95667J31158J76812k70088j15779o9460J28115
6807A81329j3158Q6386M4232k75718J4808q3782q1250Q4485N1547J00252J79352
6796B88483o904j68940k4391K27862P0742j12265M2718k65057N1283J8080o5244
6785E6367K17952L3567j37879Q2258J8521o7188M4028j0144J14771j36857j44329
6774G1067K21563J6175r1386J26158j98245M9905J48250m958k28475j42984N3646
6763B0716R8932n2298k9182P4645j48795k04478L23982J41649q4238l5284J6940
6752A22589O6168L9079j53340O8814n090j4024l2650l4660j0230J36083k9891
$$ y = [-22052, 98440, 75993, -69495, -64186, 80274, 96820, 85825, -26322, 143796, 235390, 355138, 234129, 23402, 4904, 200571, 331729, 508541, 238453, 122674, 53214, 181329, 168171, 254557, 298789, 23071, 37879, -45903, -127153, -42668, 8879, 109131, 288483, 281579, 112639, 88248, 316110, 386852, 274587, 317305, 52248, 103531, 121611, 56367, 274319, 307886, 170007, 252265, 270786, 203598, 247626, 237482, 352253, 215396, 71067, 292630, 308805, 217419, 343577, 145332, 195237, 343487, 338529, 110054, -32930, 20716, 119648, 67350, 38168, 112813, -35982, -240460, 83522, 225171, 140933, 105649, 122589, 188757, 227836, 74496, 143310, 138220, 124196, 91546, 56886, 46656, 182739, 152848]
6741A52848J75961k27780j0707J12625k6409j76005j92117N3931K61715q3123
6731D0939K42328O7258q0849j06577Q1589p8807J00640J13373K4466m6286p3596
6720B84478m5319P0214r2656j51238Q2396j16173J17553J25934K34506L5700j94567
6709C50828l18P4137p6396K45276j37856J44117O9343Q7241J12931j27928p8946
6698F62429J70912j26590J09253K09519j24177k34348J9585k52587J91203J6139
6688F41338l43035J4500O6841J02763Q7765q5803L2428p514o115L3547O1805q4280
6676E14240k38958j629N9055o3957K01830j79873j13926j26933R2897R0692k5493
6665B07945J47850p9160J03809K0018j31650l36654K9118K49600J46431j92764
$$ y = [152848, 328809, 101029, 90322, 202947, 176538, 533, -191584, -137653, 124062, 40939, 283267, 350525, 269676, 163099, 244688, 165881, 266521, 379894, 404360, 358074, 284478, 239159, 309373, 216717, 65479, 147875, 31702, 149255, 275189, 509695, 545395, 350828, 350510, 424647, 348251, 593527, 455671, 599788, 669131, 756372, 869303, 741375, 662429, 833341, 706751, 816004, 1025523, 901346, 666998, 686583, 433996, 625199, 641338, 298303, 312803, 379644, 482407, 570172, 484369, 516797, 509283, 503168, 536715, 598520, 514240, 275282, 273653, 332708, 268751, 470581, 290708, 176782, 49849, 142746, 233438, 207945, 355795, 276635, 380444, 400462, 268812, -67842, -38724, 210876, 357307, 164543]
6655A64543p8849n5625J05995J19153M0559n2451q0325p403j75444Q4535J49216
6644B13904o7009J968J52847k30581O8642J75988k00444j40653K1385K57995K4759
6633B78801j660R8541k6764r547j94837L8695j33967j39623M14806j25744k25301
6622b6600Q4530J47454j15332L016J83303j44985r1110p1689j01969R3909O0869
6611B1396q8998M6721L80352j46977j17215J39515m0949j67595M2383r304j19259
6600e9930L8623j07152L40444n4489j9423J47005J18090J2730l02495j61698K4465
6589b3830j72504P8070M4298J7011k1005k8875O8330m2619k7862P7041k388J33873
6577I9540j20862j94348J60294J76168N3200j48330K19492r1516l8887R0499J03322
$$ y = [164543, 85694, 30069, 136064, 255217, 295776, 243325, 163000, 155597, -19847, 64688, 213904, 146895, 148863, 301710, 71129, 139771, 315759, 115315, -25338, -3953, 254042, 278801, 277141, 375682, 348918, 339371, 144534, 183229, 49262, -90361, 324445, 198701, -26600, 57930, 205384, 90052, 93068, 276371, 131386, 40276, -31413, -133382, -39473, 21396, -67602, -20881, 359471, 212494, 95279, 234794, 193845, 26250, 68633, 59329, -59930, -21307, -128459, 211985, 157496, 138073, 285078, 403168, 415898, 113403, -48295, -23830, -196334, -118264, -73966, -56955, -77960, -106835, -38505, -81124, -108986, -31945, -34333, 99540, -21322, -215670, -55376, 120792, 173992, 25662, 245154, 153638, 114751, 205250, 308572]
6566C08572j38344j39847k23344P5295r4280J26734J1462M18R741m0913K14943
6555A10437K3766J02412n596j6956r3891l2677k4155m7780Q8790j84205n573K9081
6543e6347j47451J32980K974K56356k5134j07450k1296J15105r8367m9300J51365
6532A53435j08549O5363j10270O0897J81493K4237J53338o7315k97740r4123N2966
6521A3732J72210j59167k029J13572j49739L256K3116n9335J31007r4683K4180
6510A6120N8388J17084j27251r0532M414P7199J84493K0729r1711j45551k57750
6499b34368K4391Q2197j74660J6753n3862K95065M5442p5666q7079O7154J15166
6488B0533l1911j15287J23006J9477p8260M7664K12023J7155k02966n4059j06482
$$ y = [308572, 170228, 30381, -192963, -117668, -211948, -85214, -73752, -73334, -63593, -104506, 110437, 134203, 236615, 231019, 214063, 120172, 87495, 63340, 15560, 104350, -79855, -85428, -56347, -203798, -70818, -67844, 188512, 163378, 55928, 34632, 149737, 51370, 2070, 153435, 44886, 110249, -21, 60876, 242369, 266606, 419944, 352629, 54889, -39234, 13732, 185942, 26775, 24746, 138318, -11421, -8165, 14951, -44384, 86623, -8060, 16120, 74508, 191592, 64341, -26191, -21777, 55422, 239915, 260644, 168933, 23382, -234368, -209977, -127780, -302440, -285687, -339549, -44484, 958, -74708, -161787, -94633, 20533, -11378, -126665, -3659, 15818, -62442, -14778, 197245, 214400, 11434, -42625, -149107]
6477a49107J60309K55472l13213o1272J30938J53775m4631j7607n3067o0868J86773
6466A87502K9543l4745l7963j23678J85462N7885r8588N5588m5605J10214n5775
6455B29840j993J3792j28879O4190M8683Q2117q0868l06966K5672J09728l006
6444E2310O6560N064r5864L0292p923m5967q1764N0275L0295J33305K8756m6091
6432A19248R8642m1280m3681K22156J62677j64811j36036j40396O5344J42355
6422B84218M2426r3049J35495j12892o3437l8285n453J7737J30919J23044j66319
6411B54404l2201m4714O4241N5396n2613n6750O8787n4898j5048m4593P5709N7522
6399B75242r4934p4528j48815J2277K43979J33534K4991j13595m242K07321j29833
$$ y = [-149107, 11202, 266674, -46539, -107811, 23127, 176902, 132271, 114664, 61597, 729, 187502, 217045, 182300, 144337, 20659, 206121, 264006, 165418, 221006, 175401, 285615, 229840, 227847, 241639, 112760, 176950, 225633, 307750, 226882, -80084, -54412, 55316, 52310, 118870, 123934, 28070, 58362, 50439, 4472, -77292, -27017, 3278, 136583, 165339, 119248, 217890, 176610, 132929, 355085, 517762, 352951, 216915, 76519, 141863, 284218, 326644, 233595, 369090, 256198, 192761, 154476, 149023, 166760, 297679, 420723, 254404, 222203, 177489, 241730, 297126, 244513, 187763, 256550, 201652, 186604, 142011, 217720, 275242, 180308, 105780, -43035, -30758, 213221, 346755, 371746, 258151, 253909, 461230, 331397]
6388C31397o0746J10n6096J97267K8342q8391N9303Q1341j28068n8117q9188P8015
6376B95169j84747J15752J16698j11452L31427J00857j86463J88981M9655j70765
6366E45112Q9234o1529j82393k6852J06241l5753j98189q5643J28955J75496o338
6355D48341k18790R9178J49386j22434N9167l577J31250O857j22990O615J08621
6344E41624M9644Q7112K02932n4719j65932P0908R5565J63737L9381j53507k08609
6333F68136j18798K6310L638k02724J41988K57402k6240o2219n7298J08583q9046
6322F49732n9491J83771k6350p7837J65255q7114j4021J94269L7297k47111j04554
6311F13846J40134j91354j49596N2875J02363P6820j519N2660O4903N3152P8160
$$ y = [331397, 270651, 270761, 214665, 411932, 440274, 351883, 411186, 492527, 364459, 306342, 217154, 295169, 110422, 226174, 342872, 231420, 562847, 663704, 477241, 666222, 715877, 545112, 634346, 572817, 390424, 363572, 469813, 434060, 235871, 150228, 279183, 454679, 448341, 229551, 328729, 478115, 355681, 414848, 411271, 542521, 549378, 426388, 433003, 541624, 591268, 678380, 881312, 826593, 660661, 731569, 827134, 990871, 1030252, 876745, 668136, 549338, 575648, 579286, 376562, 518550, 775952, 749712, 687493, 630195, 738778, 649732, 590241, 774012, 747662, 669825, 835080, 747966, 733945, 928214, 965511, 718400, 613846, 753980, 562626, 413030, 465905, 568268, 645088, 643569, 696229, 761132, 814284, 892444]
6300H92444j00173j89224N0948l0879j04983p7923J57595J68119n861j92876O4540
6289F31727R144l0135q2010q0561j4278J75297K91523J22452j58062j45780K3097
6278G42414p6324j8960L1950J37353o8164R7376Q3808l19709r3126J93796N8223
6267G68637l8787r6228j40468K482Q3054J52216o0803j25162L7263J87859j82204
6256E87859j57245K8096L8197k014K0304K6927K56316l27405R5483O7543j54538
6245D79523J5799P6705J81247L1468j56316k8876j5515j17963R4641N774K02933
6234G69420J14623m3156J51l6046J26288j04591L977j53313k80165K37045J08189
6223G42422r8679j03583J03385R9041K21239l277j26063O2753o8265p7060P6977
$$ y = [892444, 792271, 603047, 653995, 623116, 518133, 440210, 597805, 765924, 760063, 567187, 631727, 640871, 610736, 528726, 448165, 433887, 609184, 900707, 1023159, 865097, 719317, 742414, 666090, 647130, 679080, 816433, 748269, 845645, 929453, 609744, 516618, 710414, 768637, 729850, 633622, 493154, 495636, 578690, 730906, 670103, 544941, 582204, 770063, 587859, 430614, 458710, 496907, 494893, 515197, 542124, 798440, 471035, 566518, 634061, 479523, 495322, 572027, 753274, 784742, 628426, 599550, 584035, 466072, 560713, 566487, 769420, 884043, 840887, 841038, 804992, 931280, 826689, 830666, 677353, 397188, 634233, 742422, 643743, 540160, 643545, 742586, 963825, 960548, 834485, 897238, 828973, 751913, 828890]
6212H28890M1619O5777N4178K828n5441K5163J69530o0567m8355J44275k41509
6201I26388J98019q4896j9186J24073K79202j03105o5269j19163M0655j99917
6191I76801J7208J63171J91091J61341k29623j12285k9657J47231J17684n4096
6181A348866K45734r9450k4918J76754k6198J93107p2111n1226L3640L2402j2399
6170A744201r6155J60737N2018r6778j35367L9342p2977K6532M6436p4420J89989
6159A783558j5684p3084J04586P1857K67155m8530k04564K47308m3906J6997L4000
6148B139693J159n005L3288o2148r6876l345J23840j44967o991J5624J06956P4591
6136B175819J20129j10985n6606P3451R2253Q6005P8772N2322l0669P4869M0010
$$ y = [828890, 870509, 936286, 990464, 993292, 937851, 963014, 1132544, 1071977, 1023622, 1167897, 926388, 1124407, 1039511, 1020325, 1144398, 1423600, 1320495, 1255226, 1136063, 1176718, 976801, 994009, 1157180, 1348271, 1509612, 1279989, 1167704, 1138047, 1285278, 1402962, 1348866, 1594600, 1495150, 1470232, 1646986, 1620788, 1813895, 1741784, 1690558, 1724198, 1756600, 1744201, 1648046, 1808783, 1860801, 1764023, 1628656, 1667998, 1595021, 1621553, 1667989, 1593569, 1783558, 1767874, 1694790, 1799376, 1871233, 2138388, 2089858, 1885294, 2132602, 2088696, 2105693, 2139693, 2140852, 2135847, 2169135, 2106987, 2010111, 2006766, 2130606, 1985639, 1978648, 1994272, 2101228, 2175819, 2295948, 2184963, 2128357, 2201808, 2294061, 2380066, 2458838, 2511160, 2480491, 2555360, 2595370]
6125B595370k8148n9013q5150q9423K03031J04781J89900Q4866N7365J33926J0537
6114C118042Q5569k34617J01262L5378N3065J4070J58914O6059P8630N2670Q9420
6103C618462J31627q1140j02508J86886K77598L9940J47616N1189P053J40491
6093D417214K01025O3200J08058K44602L38251J80000r2289Q5590J76520K19963
6083E942134J76113K05683L30968L20708K11363L82653K64408J91660O44202P01408
6073I371300N99052Q48136O72119R79537J301879J201263J248013J322986J517182
6064A9061467J351274J372766O67556j570044k418402j972699j021727q87762
6056A4582429m98253j30515J0970J08945J57507L74599K39824N14423M41320M32105
$$ y = [2595370, 2567222, 2508209, 2423059, 2333636, 2536667, 2641448, 2831348, 2916214, 2973579, 3107505, 3118042, 3203611, 2968994, 3070256, 3105634, 3158699, 3172769, 3331683, 3397742, 3476372, 3529042, 3618462, 3750089, 3668949, 3566441, 3753327, 4030925, 4070865, 4218481, 4269670, 4276723, 4417214, 4618239, 4681439, 4789497, 5034099, 5372350, 5552350, 5460061, 5545651, 5722171, 5942134, 6118247, 6323930, 6654898, 6975606, 7186969, 7569622, 7834030, 8025690, 8669892, 9371300, 9970352, 10818488, 11490607, 12470144, 13772023, 14973286, 16221299, 17544285, 19061467, 20412741, 21785507, 22453063, 20883019, 18464617, 16491918, 15470191, 14582429, 14084176, 13953661, 13964631, 14073576, 14231083, 14605682, 14845506, 15359929, 15801249, 16233354]
6046A6233354O94410J027211Q76137J503822J359898J642037J893672K156216
6038B7386757K967926L055969L422085L596675L759385M132533M096203M622675
6030E7040208K860919l562734q024244o920514m476829k613992j783821p69941
6022C1749052n27712Q299m3480K01675Q90811J118149Q95007J334697J769729
6013C7396227J940640K277464K917679L417147L812972M113516M662755M653735
6005F5192135M523098L863462K946393L209900L537372L440467L908880L566914
5997I4188621k242510q309862p832858m570975k752481j269923l80607N70740
5989F7400145J262662J114223J310533J810382K020904K494614K430796L082043
$$ y = [16233354, 16927764, 17954975, 18831112, 20334934, 21694832, 23336869, 25230541, 27386757, 30354683, 33410652, 36832737, 40429412, 44188797, 48321330, 52417533, 57040208, 59901127, 56338393, 48314149, 41393635, 36916806, 34302814, 32518993, 31749052, 31221340, 31229639, 31186159, 31387834, 32278645, 33396794, 34291801, 35626498, 37396227, 39336867, 41614331, 44532010, 47949157, 51762129, 55875645, 60538400, 65192135, 69715233, 73578695, 76525088, 79734988, 83272360, 86712827, 90621707, 94188621, 91946111, 83636249, 75803391, 71232416, 68479935, 67210012, 66829405, 67400145, 68662807, 69777030, 71087563, 72897945, 74918849, 77413463, 79844259, 82926302]
5981H2926302L675768L522082L291905K021080j675300m479088m818785l643527
5973H0820437j769890j143135p56607n89809m34141l3098j83976l97595k290680
5964G3221506m545054m602433l529679k572755j567806j445848j211754j052949
5956E2693228j150252r24562j041264j103553j331665j765723k486916l118535
5948C9770758l023009k609123k320944j783718j216987r40593p42983p32326o64039
5939B5737036o77568q77560l25196p18993o64132o41878p85074l91694m02118
5930B0252823m29276m34457k82575k60440j15458n03588j92822n8009k26500r1356
5920A7658342k15436l37077k92858l7588K33605p1998j07584j45350k14293N6313
$$ y = [82926302, 86602070, 90124152, 93416057, 95437137, 93761837, 89282749, 84463964, 80820437, 79050547, 77907412, 77150805, 76560996, 76126855, 76093757, 75909781, 75512186, 73221506, 68676452, 64074019, 60544340, 57971585, 56403779, 54957931, 53746177, 52693228, 51542976, 50618414, 49577150, 48473597, 47141932, 45376209, 42889293, 39770758, 36747749, 34138626, 31817682, 30033964, 28816977, 27876384, 27133401, 26401075, 25737036, 25059468, 24181908, 23856712, 23137719, 22473587, 21831709, 21046635, 20654941, 20252823, 19823547, 19389090, 19106515, 18846075, 18730617, 18227029, 18034207, 17976198, 17749698, 17658342, 17442906, 17105829, 16812971, 16775383, 17008988, 16936990, 16829406, 16684056, 16469763, 16526076]
5910A6526076o868J9434J05866K13016L08218L97364L79457q2791K51175Q9421
5900A8200368J29513J45645K53410L08362L55628N08279J69937L26386O00007
5891B0997535M62703L97729Q29051P10254P50294Q20278R94936J065126J016387
5882B8044293J571378J585451J574207J752189K130709K506971K552618K759045
5874D4476861K625115K498415J651846R32750L51245L99711M89736N25267P19238
5865E4670184J348476J319104J311197J646624J737838K170309K490823K625440
5857F9319995K133034K048395K078059K195504K339659K210222K379891K449895
5849H7154654K651007K790399K163612M42711k358324m308014m658239m323255
$$ y = [16526076, 16519208, 16538642, 16644508, 16857524, 17165742, 17563106, 17942563, 17859772, 18110947, 18200368, 18329881, 18475526, 18728936, 19037298, 19392926, 19901205, 20071142, 20397528, 20997535, 21460238, 21857967, 22687018, 23397272, 24147566, 24967844, 25962780, 27027906, 28044293, 29615671, 31201122, 32775329, 34527518, 36658227, 39165198, 41717816, 44476861, 47101976, 49600391, 51252237, 52184987, 52536232, 52935943, 53425679, 53950946, 54670184, 56018660, 57337764, 58648961, 60295585, 62033423, 64203732, 66694555, 69319995, 71453029, 73501424, 75579483, 77774987, 80114646, 82324868, 84704759, 87154654, 89805661, 92596060, 94759672, 95202383, 92844059, 88536045, 83877806, 79554551]
5841G9554551l384960k841459k209508j713687j643362j322632j314183j210586
5833F3914174j037291p01853l07713n16575n42882q08567j034175o96655n65296
5824E7703167o83505r99198r15356j081787j426489k121800l134157l133542k724372
5815D1482961k510515j877440j494623j525104j331582j335611r64754j010592
5807B9432740j071648p37203q52331q64540r38720q82522p63622r25762j195605
5798B1200787j016033q58994o11294o64778r10066l97291l80724k77401l31087
5789A5753119o6235l16846j62056K46776m54649l40053r2471K97103l1880n6445
5779A4776363p6542k5451m27967l15813k12424n97077m52309m37565k58267m56393
$$ y = [79554551, 76169591, 73328132, 71118624, 69404937, 67761575, 66438943, 65124760, 63914174, 62876883, 62175030, 61867317, 61350742, 60807860, 59999293, 58965118, 58268463, 57703167, 57019662, 56020464, 55105108, 54023321, 52596832, 50475032, 47340875, 44207333, 41482961, 38972446, 37095006, 35600383, 34075279, 32743697, 31408086, 30443332, 29432740, 28361092, 27623889, 26771558, 25907018, 24968298, 24085776, 23322154, 22396392, 21200787, 20184754, 19325760, 18714466, 18049688, 17139622, 16742331, 16361607, 16084206, 15753119, 15686884, 15370038, 15207982, 15454758, 15000109, 14660056, 14567585, 14864688, 14832808, 14776363, 14699821, 14674370, 14246403, 13930590, 13718166, 13121089, 12668780, 12231215, 11972948, 11516555]
5769A1516555k38873j73553k31137k6566k80917l34360J20498k22285P6205K54871
5759A0460438J14219O7892J12268j04200j02722k41329k48573J6632r2082k34727
5749I747816j84215o6325k55878l18171m14658m65311k27578j00250k55243q1187
5739G379000k17742j79285j19813r1250j3323j58982r2059J00381k54011P790
5729F360706K75779J16707j46291j22801R8001q9822k75440k13752k70968k88422
5719E443697l55973k17099j0366j08670j51079j01908j22923j20869m0380J028
5709D215458j47087j36582j62145r3218L235o5776k16839J06370J40750R7660
5699C741826J44091j26874j25725J12218q157R0118J8602k79484j27137k87405
$$ y = [11516555, 11277682, 11104129, 10872992, 10846426, 10565509, 10231149, 10351647, 10129362, 10205567, 10460438, 10574657, 10642549, 10754817, 10650617, 10547895, 10306566, 10057993, 10074625, 9982543, 9747816, 9563601, 9497276, 9241398, 8923227, 8508569, 8043258, 7815680, 7715430, 7460187, 7379000, 7161258, 6981973, 6862160, 6770910, 6757587, 6598605, 6506546, 6606927, 6352916, 6360706, 6636485, 6753192, 6606901, 6484100, 6582101, 6492279, 6216839, 6003087, 5732119, 5443697, 5087724, 4870625, 4860259, 4751589, 4600510, 4498602, 4375679, 4254810, 4214430, 4215458, 4068371, 3931789, 3769644, 3676426, 3679661, 3613885, 3397046, 3503416, 3644166, 3741826, 3885917, 3759043, 3633318, 3745536, 3737379, 3827497, 3846099, 3566615, 3439478, 3152073]
5689C152073j98760n2339K67020j4828k27158j38253j90487J81936K33326j44958
5679B867572j14588j93006j39515J58585q6240q2079r8593n3716J2642K09723
5669B480785l0656k23845N7341O2098J50625l2377J32415J0929J26791L8390k17629
5658B554867R3645Q2723j00237L11003j21260m9387N0570O9970P0687K18600R8294
5647C279475j64325M4856K0676M1769m1235m5703K5031l847L0643p350P5640k3668
5635C231962m47329J03768Q3788q9182J34139J03684K25534O1677J97550L2186
5625C637777J86213K19434j7397R0555P4201J64798J64108l0146j53605K04675
5615D540613j72211j16232n5959j09855L8805J79158k07982p9232J16065M7159
$$ y = [3152073, 2953313, 2900974, 3167994, 3153166, 2926008, 2787755, 2597268, 2779204, 3012530, 2867572, 2752984, 2559978, 2420463, 2579048, 2492808, 2410729, 2312136, 2258420, 2271062, 2480785, 2450129, 2226284, 2283625, 2345723, 2496348, 2463971, 2596386, 2607315, 2734106, 2772496, 2554867, 2648512, 2731235, 2630998, 2942001, 2820741, 2771354, 2821924, 2891894, 2962581, 3181181, 3279475, 3115150, 3160006, 3180682, 3222451, 3181216, 3135513, 3160544, 3156697, 3187340, 3179990, 3255630, 3231962, 2784633, 2888401, 2972189, 2883007, 3017146, 3120830, 3346364, 3408041, 3605591, 3637777, 3823990, 4043424, 4026027, 4116582, 4190783, 4355581, 4519689, 4489543, 4335938, 4540613, 4368402, 4252170, 4196211, 4086356, 4125161, 4304319, 4096337, 4017105, 4133170, 4180329]
5605D180329k22715p6154M5952N9425k45911N1704j08057n5079l2676l05844Q5163
5594C376137j5308k29122m2223L3653n4835N9301k35976l882j32946N3040R8490
5583B906329j73085j19739J00436k50125k3489o4984R5170r7741p4196L3585r7386
5572B234775j35029n037j05135k7494R0227K3333Q7597Q1522Q9768q1074M4298
5561B297751J20781J85046m1366J2546k76808j73600j54964j20468j92219P6547
5551A733246Q8829m5334j25138j26179K27975j95432J02046k35342k55674J82882
5541A351879K1540R1158J6934P7049j5821M2435k5656m9630r6939M745M2210q6880
5529A373024R8820J06687j65817j21577j66872J68332J4725O5605J7354k26911
$$ y = [4180329, 3957614, 3881460, 3927412, 3986837, 3740926, 3792630, 3684573, 3629494, 3596818, 3290974, 3376137, 3360829, 3131707, 3089484, 3123137, 3068302, 3127603, 2891627, 2887745, 2754799, 2807839, 2906329, 2733244, 2613505, 2713941, 2463816, 2440327, 2375343, 2470513, 2372772, 2298576, 2332161, 2234775, 2099746, 2094709, 1989574, 1962080, 2052307, 2075640, 2163237, 2244759, 2334527, 2253453, 2297751, 2418532, 2603578, 2562212, 2574758, 2297950, 2124350, 1969386, 1848918, 1656699, 1733246, 1822075, 1776741, 1651603, 1525424, 1753399, 1557967, 1660013, 1424671, 1168997, 1351879, 1373419, 1464577, 1481511, 1558560, 1542739, 1585174, 1559518, 1509888, 1412949, 1417694, 1459904, 1373024, 1471844, 1578531, 1412714, 1291137, 1124265, 1292597, 1307322, 1372927, 1390281, 1163370]
5519A163370j25209J1026K88619J39734J29402m3156o5752k76330m1057k07770
5509I72877M9029n5172o6007J18657J16893J41855p5325j39338k72141J18230
5499I09558n8023N1891J2248L2013J5678L7169J3428L1600o6060J50718l6238
5488A093982k66450j00838K8959O4813R6626o5154j18890N1926R8006J04514j84704
5477H02790k17858R8704J9177j12446Q1850m6992J04765R0955r343j78080r7054
5466E36468J72630R1946R4476O4722j95188j1234M4811O9536q8072l9292K00431
5455I41234J57918j8633j57948J3272n0710M3310p014m7111j7274J43862J72227
5444A173133k25372r5281k6548K92283P9089o6766m3629J16835J75535K5765J96350
$$ y = [1163370, 1038161, 1049187, 1337806, 1477540, 1606942, 1563786, 1498034, 1221704, 1180647, 972877, 1021906, 966734, 900727, 1019384, 1136277, 1278132, 1202807, 1063469, 791328, 909558, 851535, 903426, 915674, 947687, 963365, 1000534, 1013962, 1045562, 979502, 1130220, 1093982, 827532, 726694, 755653, 820466, 917092, 851938, 733048, 784974, 882980, 987494, 802790, 584932, 683636, 702813, 590367, 672217, 625225, 729990, 820945, 811602, 633522, 536468, 709098, 801044, 895520, 960242, 765054, 753820, 798631, 868167, 780095, 740803, 941234, 1099152, 1080519, 922571, 935843, 885133, 928443, 921429, 874318, 857044, 1000906, 1173133, 947761, 852480, 825932, 1118215, 1197304, 1130538, 1086909, 1203744, 1379279, 1405044, 1601394]
5433A601394N9027l9713j2689j22501j32311k00667k9597J77666L0405j13912
5423A217102J63099R057j93990k25607n533M9915l7531J97578r4788j13831J34674
5412A100145j96846J34382J61439R741m2791K600o0151m1927Q7304o5916n8989
5401A028991J14285K26195K2116j07452Q2029J95331J58184J88354k33759p1705
5391A602569P6934j55253P098j622L8209J44916L5873Q774Q0707N111p1860O8276
5379A839732j59950j24860L1918r5116r2868K85250J31549p2815L4037R7012J84369
5368B058258K4215p7807l8187k4345p4543l3020J00513j1689o6274j83452K30052
5357A903721j04137q6917j13966N8773k2091p7842K7363J1253O0419L2738m4751
$$ y = [1601394, 1660421, 1620708, 1608019, 1485518, 1353207, 1152540, 1122943, 1300609, 1331014, 1217102, 1380201, 1389258, 1195268, 969661, 964128, 1014043, 976512, 1174090, 1079302, 965471, 1100145, 903299, 1037681, 1199120, 1208861, 1166070, 1168670, 1108519, 1066592, 1153896, 1087980, 1028991, 1143276, 1369471, 1391587, 1284135, 1366164, 1561495, 1719679, 1908033, 1674274, 1602569, 1679503, 1524250, 1531348, 1529726, 1567935, 1712851, 1748724, 1757498, 1838205, 1843316, 1771456, 1839732, 1679782, 1554922, 1586840, 1491724, 1398856, 1684106, 1815655, 1742840, 1776877, 1873889, 2058258, 2082473, 2004666, 1966479, 1942134, 1867591, 1834571, 1935084, 1923395, 1857121, 1673669, 1903721, 1799584, 1712667, 1598701, 1657474, 1635383, 1557541, 1584904, 1596157, 1656576, 1689314, 1644563]
5346A644563k37504J05285J68439N1873n9559j33040J06684j091j01736L4078
5336A577992m3337j53282j45741j69547J62705Q1044q6812j09338N2183M4920
5326A210787J8135r6355M1953r0361k9868K58294j09999L987J49324P4081l5714
5315A394264J31355j53707j37352J28513M7787j88143j42131K07882Q5193L6671
5305A410332J07649j63799o7193K02599k06198L2591J43952k4078J02114l9379
5295A498590l5021R587J96099j88141j9427M6095J52662k5807m357j23703R047
5284A515624L8574L11474m3753j62159J44296N8592J47134j08705K30729J38206
5274B270012k2743J22009M69357L18500n7216K12227J05885J05234J42430m5266
$$ y = [1644563, 1407059, 1512344, 1680783, 1732656, 1673097, 1540057, 1646741, 1645650, 1543914, 1577992, 1534655, 1381373, 1235632, 1066085, 1228790, 1309834, 1223022, 1113684, 1165867, 1210787, 1228922, 1132567, 1174520, 1084159, 1054291, 1312585, 1202586, 1206573, 1355897, 1429978, 1394264, 1525619, 1371912, 1234560, 1363073, 1410860, 1222717, 1080586, 1288468, 1373661, 1410332, 1517981, 1354182, 1286989, 1489588, 1283390, 1315981, 1459933, 1435855, 1537969, 1498590, 1463569, 1473156, 1669255, 1481114, 1461687, 1507782, 1660444, 1634637, 1630280, 1506577, 1515624, 1554198, 1865672, 1821919, 1659760, 1804056, 1862648, 2009782, 1901077, 2131806, 2270012, 2247269, 2369278, 2838635, 3157135, 3099919, 3312146, 3418031, 3523265, 3665695, 3620429]
5264C620429l4727k19872j6417J67027l3351o21j58928O0496J50095K87106J33644
5253C954881K5183J77738J31098K02147K97424K40609K35040J03980J33834L73821
5243E875755J92376J61156K57418J44402K24064P6795p0774l93134j55783j52403
5233F159872j02149j57917j28399K8970p3505M1108j46923M012R8993M51961R7802
5222F273825n1755K00341J38981l26746l14135j14950j20184k6261L1872J52853
5212E843841j94042k9676j55027k36358j85454r6149l6923p9502N4967j15750
5202D769927k30731L1990l16324k93742K72714J23729M4369o1295j57110q7256
5192D096271j15793j69560j85659j19583l1745k7516j00527k26880Q0230R6009
$$ y = [3620429, 3585702, 3365830, 3349413, 3516440, 3483089, 3482468, 3323540, 3384036, 3534131, 3821237, 3954881, 3980064, 4157802, 4288900, 4491047, 4788471, 5029080, 5264120, 5368100, 5501934, 5875755, 6068131, 6229287, 6486705, 6631107, 6855171, 6931966, 6861192, 6468058, 6312275, 6159872, 6057723, 5899806, 5771407, 5800377, 5726872, 5767980, 5621057, 5625069, 5724062, 6176023, 6273825, 6222070, 6422411, 6561392, 6234646, 5920511, 5805561, 5685377, 5659116, 5690988, 5843841, 5649799, 5620123, 5465096, 5228738, 5043284, 4947135, 4910212, 4830710, 4885677, 4769927, 4539196, 4571186, 4254862, 3961120, 4233834, 4357563, 4401932, 4340637, 4183527, 4096271, 3980478, 3810918, 3625259, 3505676, 3473931, 3446415, 3345888, 3119008, 3199238, 3295247]
5182C295247j10835j54826J0829j85280q3535Q2332J00288k03860K7670k00417
5172B577613o1393J23970j44727r1015o776P8609J44134l68374j26103N8276J31486
5161B315700J13040l6440J08875K23260k4330k18632K90973j7169R3663K51197
5151C100137J56567J19079J0939N5539r3018J60527N0381l6357k35720k21274
5141C066800j70625j48780o6016k50147O5377O0395r8241K9720P8140N6190j03692
5130B519121J00759l0346q5652J00942J84302q2696M9827J76241J17556P5732
5120C125786l9268J28284K9127J77492K26682R512K62676q369j67263l7491j49956
5109C557212k37683k97230l5408k54946R405j71693J15639J23650J61895N7474
$$ y = [3295247, 3184412, 3029586, 3040415, 2855135, 2771600, 2853932, 2954220, 2750360, 2778030, 2577613, 2516220, 2640190, 2495463, 2404448, 2397672, 2476281, 2620415, 2252041, 2125938, 2184214, 2315700, 2428740, 2392300, 2501175, 2724435, 2700105, 2481473, 2772446, 2755277, 2848940, 3100137, 3256704, 3375783, 3386722, 3442261, 3349243, 3509770, 3560151, 3523794, 3288074, 3066800, 2896175, 2747395, 2681379, 2431232, 2496609, 2557004, 2458763, 2488483, 2566623, 2622813, 2519121, 2619880, 2589534, 2503882, 2604824, 2789126, 2706430, 2756257, 2932498, 3050054, 3125786, 3086518, 3214802, 3243929, 3421421, 3648103, 3657615, 3920291, 3911922, 3744659, 3707168, 3557212, 3319529, 3022299, 2986891, 2731945, 2741350, 2569657, 2685296, 2808946, 2970841, 3028315]
5099C028315J5759M4857k4707Q9193P2689j6570j12929L486j96314l2876m3966
5088B826937m7834K27385q4259J93032j8068j8789J32872k48845k326J39608K10733
5077C310446L0169L8304K80728J17357O9535N6414J48617J26799L58370J56389
5067D693128N42372J93906K67771L75057J32416N01973M08041N29449R93947Q23667
5057I461727J047004J280774J155761J397827J488658J351206J216035N69691
5049A8968683p57098k315534k328640j930407j660522j073113r44877n99323n82335
5040F776834l47256m52434m52497k84080j06232k21371r216k47693j68761p349
5030D479945j46411J34734n8368j89883n5938j33450K1419K40521m8333N2449
$$ y = [3028315, 3044074, 3088931, 3064224, 3153417, 3226106, 3209536, 3096607, 3100093, 2903779, 2870903, 2826937, 2779103, 3006488, 2922229, 3115261, 3097193, 3078404, 3211276, 2962431, 2960105, 3099713, 3310446, 3340615, 3378919, 3659647, 3777004, 3846539, 3902953, 4051570, 4178369, 4536739, 4693128, 5235500, 5429406, 5697177, 6072234, 6204650, 6706623, 7114664, 7644113, 8638060, 9461727, 10508731, 11789505, 12945266, 14343093, 15831751, 17182957, 18398992, 18968683, 18211585, 15896051, 13567411, 11637004, 9976482, 8903369, 7958492, 7359169, 6776834, 6429578, 5977144, 5524647, 5240567, 5134335, 4912964, 4903748, 4656055, 4487294, 4479945, 4333534, 4468268, 4409900, 4220017, 4164079, 4030629, 4052048, 4292569, 4244236, 4296685]
5020D296685M2099l6297m543j35632k72993k97560k0592R154j25589k07425p9784
5009C167523j01362r6600M4542j27135j47677M8516k6749L9303N6717J12298j84776
4998B784600j95524J01618K16067n9262K1965k5596J0833n0722J04636P0312o8417
4987B910510n6736k0728O156J2462O2546Q6230l8140k8470O9878k94182N8564
4976B768090J01237k64369K41979o6907N8746N2494K2946P5909j54277M5729k392
4965B879185J91605p0206R220J1056P0517M8479j1821J90753j50630R5210J73063
4954C436431J08869J90777K07661n3217N0393K45257O1718L966J91805M24883
4944D868543j53527l09685o2960j06946j24317M2999j95220J01769k3791L5023
$$ y = [4296685, 4338784, 4302487, 4297944, 4162312, 3889319, 3591759, 3571167, 3580321, 3454732, 3247307, 3167523, 3066161, 2969561, 3014103, 2886968, 2739291, 2787807, 2761058, 2800361, 2857078, 2969376, 2784600, 2589076, 2690694, 2906761, 2847499, 2869464, 2843868, 2854701, 2803979, 2908615, 2978927, 2910510, 2853774, 2833046, 2839202, 2851664, 2914210, 3000440, 2962300, 2933830, 3003708, 2709526, 2768090, 2869327, 2604958, 2846937, 2780030, 2838776, 2891270, 2914216, 2990125, 2835848, 2881577, 2879185, 3070790, 3000584, 3009804, 3020860, 3091377, 3139856, 3128035, 3318788, 3168158, 3263368, 3436431, 3545300, 3736077, 3943738, 3890521, 3940914, 4186171, 4247889, 4251855, 4443660, 4868543, 4715016, 4405331, 4342371, 4235425, 4111108, 4154107, 3958887, 4060656, 4036865, 4071888]
4934D071888O7722j28311m0208j55504J22446L35669N0166q6082J26409J06928
4924D471123p9506K40309K75171n1002P3243J9960K14020J26163j567k528P1881
4913E357267k354M9137L92827R6114o0634K29175L81800k36065J08652J70431
4903F486350J0452K73667M54586m2345J07380J56404J75190K12518J05344M74028
4893H413574M56925L40237K75612K19692L41222L13601J87386K82231R8031K69494
4883A1198005P3606L33123J37018K08057M66820K44331N31653L97137J33589M31601
4873A4154940M87891M16253L89388N95377N15087N05277M30061N16508N13636
4864A8524418N63141O77366P51038Q53781J111623J041986Q66380J390332J355366
$$ y = [4071888, 4139610, 4011299, 3971091, 3815587, 3938033, 4273702, 4323868, 4237786, 4364195, 4471123, 4391617, 4631926, 4907097, 4856095, 4929338, 4949298, 5163318, 5289481, 5287914, 5285386, 5357267, 5354913, 5404050, 5796877, 5892991, 5832357, 6061532, 6443332, 6207267, 6315919, 6486350, 6496802, 6770469, 7225055, 7182710, 7290090, 7446494, 7621684, 7834202, 7939546, 8413574, 8870499, 9210736, 9486348, 9706040, 10047262, 10360863, 10548249, 10830480, 10928511, 11198005, 11271611, 11604734, 11741752, 11949809, 12416629, 12660960, 13192613, 13589750, 13723339, 14154940, 14642831, 15059084, 15448472, 16043849, 16558936, 17064213, 17494274, 18010782, 18524418, 19087559, 19764925, 20515963, 21369744, 22481367, 23523353, 24389733, 25780065, 27135431]
4855B7135431J583514J367414J702410J820845K248508K450213K491703L061468
4847D3861506L442778M130588N132211O195172P223924Q459492R612870J1292419
4839I9350960J3342524J4440302J5102613J5497734J6254991J5869564J8334466
4832B08193154J6147779j4326581m0496974l4032212k1507846j4225332q929652
4825I0822336n871547l565588k314917j299813j16912Q86066J319542J952964
4817H1812131L084030L836441L244881L884757N463475Q206668J0361174J2365591
4809A32259148J5032582J8398293K1004314K2586905K3845470K4342252K4541809
4802B82010773K4336607K8411741O284036m4690961o4747526m8492547l2912808
$$ y = [27135431, 28718945, 30086359, 31788769, 33609614, 35858122, 38308335, 40800038, 43861506, 47304284, 51434872, 56567083, 62762255, 69986179, 78445671, 88058541, 99350960, 112693484, 127133786, 142236399, 157734133, 173989124, 189858688, 208193154, 224340933, 210014352, 169517378, 135485166, 113977320, 99751988, 90822336, 84950789, 81385201, 79070284, 77770471, 77653559, 78539625, 79859167, 81812131, 84896161, 88732602, 91977483, 95862240, 101325715, 109532383, 119893557, 132259148, 147291730, 165690023, 186694337, 209281242, 233126712, 257468964, 282010773, 306347380, 334759121, 341043157, 296352196, 231604670, 183112123, 150199315]
4795A50199315k3138910j6628518j2037908r446426p684893o397441n401083m919692
4787F4544444m223783l503815k926482k294743j682671j566722j411043j888613
4779D5046572k353961k398516k132358j950573j609567j267217j255706j093831
4771C0984843j250232j069105j218060j115529q79078p09849r80634n85151l52602
4762B2824603q52035n34302m28274n18128m69888n43578k09094l63641m38400
4753A8467263m12702m40899j63981l3798J74629J9211J10837L81563M20639K16717
4743A8739479l65924p94719o94053o23911n57973l19528m32681n62058n06420
4734A3882212o01138o14721m50261l65636k35448l08468k72111n52118j04518
$$ y = [150199315, 127060405, 110431887, 98393979, 88947553, 81262660, 74865219, 69464136, 64544444, 60320661, 56816846, 53890364, 51595621, 49912950, 48346228, 46935185, 45046572, 42692611, 40294095, 38161737, 36211164, 34601597, 33334380, 32078674, 30984843, 29734611, 28665506, 27447446, 26331917, 25452839, 24742990, 23762356, 23177205, 22824603, 21972568, 21438266, 21009992, 20491864, 20021976, 19478398, 19269304, 18905663, 18467263, 18054561, 17613662, 17449681, 17415883, 17590512, 17609723, 17720560, 18102123, 18522762, 18739479, 18373555, 17578836, 16884783, 16260872, 15702899, 15383371, 14950690, 14388632, 13882212, 13281074, 12666353, 12216092, 11850456, 11615008, 11306540, 11034429, 10482311, 10377793]
4725A0377793m53745k76656k95953k56292l39721o12184l02390J96843k34123
4716G803572l21384K1636O1631l88534k24177m6727k33676P8360j00762k13176
4706F436763j29417m6396r8388j07517j04262j72636J05014j60212l5620k56347
4696E430982L7717L5650o3144q222l09903p3235k72639J41247j19080j00761J93961
4685D892573l893J15548J97862O7907k9820k29562J3148O8460L47368K71220J60950
4674E871761K27401K05092J24112j39437k07339k82168l79290l96996k02427m64271
4664D356438o8647P80k62620J09158j93330J38513l3548j81880O9084l5956j67113
4653C730879j46348j66878J85440J80748J66644R5031J81478m5403k4404O7742
$$ y = [10377793, 9924048, 9647392, 9351439, 9095147, 8755426, 8143242, 7840852, 8037695, 7803572, 7482188, 7503824, 7565455, 7176921, 6952744, 6906017, 6672341, 6750701, 6649939, 6436763, 6307346, 6260950, 6162562, 6055045, 5950783, 5778147, 5883161, 5722949, 5687329, 5430982, 5468699, 5504349, 5441205, 5432983, 5123080, 5049845, 4777206, 4918453, 4799373, 4698612, 4892573, 4888680, 5004228, 5202090, 5269997, 5240177, 5010615, 5023763, 5092223, 5439591, 5710811, 5871761, 6099162, 6304254, 6428366, 6288929, 6081590, 5799422, 5420132, 5023136, 4820709, 4356438, 4287791, 4288571, 4025951, 4135109, 3941779, 4080292, 4046744, 3864864, 3933948, 3897992, 3730879, 3584531, 3417653, 3603093, 3783841, 3950485, 4045516, 4226994, 4181591, 4157187, 4224929]
4643D224929J86127K24541M2500j54124k84564J09078O259K67197M3207M5884
4633D711034L88142R3045J26915K59766n913J39186L19397L54166M96184L16983
4623G198905J14465k49962p22147j008665m65854l88149j83434J04030j62742
4614D236447l32418p2457m3695Q3422J53817k68563p0884N7550l0802o4375K70274
4603C918316j3770k08727R1973K19960J05554J6181P2482k26981P6304N2738l5889
4592D068141q9437J75770j775j82050J20818Q0883l7707n5592J52244M9845O8606
4581D349746J35987L9353J76592J29108J13399J75174Q7385m0316N6184r0053
4571E132559j21198L03707n034j72969L9372J20658J03725R1354j09156J54698
$$ y = [4224929, 4411056, 4635597, 4678097, 4523973, 4239409, 4348487, 4354746, 4621943, 4665150, 4711034, 5099176, 5192221, 5319136, 5578902, 5572989, 5712175, 6031572, 6385738, 6881922, 7198905, 7313370, 7063408, 6341261, 5332596, 4866742, 4478593, 4295159, 4399189, 4236447, 3904029, 3831572, 3787877, 3871299, 4025116, 3756553, 3685669, 3743219, 3712417, 3648042, 3918316, 3904546, 3695819, 3787792, 4007752, 4113306, 4129487, 4201969, 3974988, 4051292, 4104030, 4068141, 3978704, 4154474, 4152699, 3970649, 4091467, 4172350, 4134643, 4079051, 4231295, 4281140, 4349746, 4485733, 4525086, 4701678, 4830786, 4944185, 5119359, 5206744, 5166428, 5222612, 5132559, 5011361, 5315068, 5310034, 5137065, 5176437, 5297095, 5400820, 5492174, 5383018, 5537716]
4561E537716M2425j02344N4636K14501J80593J04146J07947L3384R5454j7299
4551F251159J05156J78930R9865K14041J56006K74868L20184O5611L11726O20926
4541H598472L87017M15207N94500P41319P62847P68358J035456J054572J178817
4532A5536565J261509J607563J997323K265507K977021L499199M017121L974792
4524C7136600M398762M835934N021557M807548M747273L636971j164927p297411
4516E6122307r427638q196856o119494m576540l198014k559761k045375j491229
4508A8507400j307664j101372j195771q66643p43086l84501o16320k71870j24162
4499A1896011l19452k51819k48873k07355l04795j04320N7730K03737P8992m8291
$$ y = [5537716, 5580141, 5477797, 5532433, 5746934, 5927527, 6031673, 6139620, 6173004, 6268458, 6251159, 6356315, 6535245, 6635110, 6849151, 7005157, 7280025, 7600209, 7665820, 7977546, 8598472, 8985489, 9400696, 9995196, 10736515, 11499362, 12267720, 13303176, 14357748, 15536565, 16798074, 18405637, 20402960, 22668467, 25645488, 29144687, 33161808, 37136600, 41535362, 46371296, 51392853, 56200401, 60947674, 64584645, 63419718, 56122307, 46694669, 38497813, 32378319, 27801779, 24603765, 22044004, 19998629, 18507400, 17199736, 16098364, 14902593, 14035950, 13292864, 12908363, 12292043, 12020173, 11896011, 11576559, 11324740, 11075867, 10868512, 10563717, 10459397, 10517127, 10720864, 10799856, 10751565]
4489A0751565o4907P1207R345k7648K06154J95169j43723k17122k81800k5141
4479A0473099p8122k65116j3654K03870J71297P4975K51824K05125J39905P3974
4469A1237177J84260K44919L44632M10895P05975P02966Q11180Q57841Q66653
4460A6366498Q70470P45779R06925Q09086Q41698R86647P51815N03464K9977k60610
4450B2551749l0330K38761N87330J095503J562316J782299K318061K941973L440981
4441C6488643L652120M147673M654507M606838M692780M693938M053650J145177
4433F8135326m515782q247312p594812n493922m104698l041104k377664j766277
4425C0993755j582167j759651j627570k169885j807851j744322j274228j271218
$$ y = [10751565, 10686658, 10757865, 10767210, 10739562, 10945716, 11140885, 10997162, 10780040, 10498240, 10473099, 10394977, 10129861, 10116207, 10320077, 10491374, 10566349, 10818173, 11023298, 11163203, 11237177, 11421437, 11666356, 12010988, 12421883, 13127858, 13830824, 14642004, 15499845, 16366498, 17236968, 17982747, 18889672, 19698758, 20540456, 21527103, 22278918, 22782382, 22812359, 22551749, 22521419, 22760180, 23347510, 24443013, 26005329, 27787628, 30105689, 33047662, 36488643, 40140763, 44288436, 48942943, 53549781, 58242561, 62936499, 66990149, 68135326, 63619544, 55372232, 47777420, 42283498, 38178800, 35137696, 32760032, 30993755, 29411588, 27651937, 26024367, 23854482, 22046631, 20302309, 19028081, 17756863]
4417A7756863r25146r85222o59192o34630p57126m39498k78467j89432m47856
4408A2440294m22376k87863m03700m11663k96968m29325r9671m53048l57202k91862
4398H986616j16141l00943j50778m697j14445j84263j16799j51240L9502J55257
4388H042069l47768j63345k33537j10428j72427l2952k32943j31270J90681j61095
4378F646985J000M6931J69894L1887j71202k12015j58195k2775m0941j64032j11180
4367F016357L199j26523k24807l7060Q7587J3191K48801J24702j37837P8262R8720
4356F144592n650j63588l0468k8548P0669Q689J4039N394j1670J5685j19295J12043
4344F011892J22885j62278M7011K40785K45748r1948L28919L8576m1200K95657
$$ y = [17756863, 16831717, 15846495, 15187303, 14552673, 13795547, 13356049, 13077582, 12888150, 12440294, 12017918, 11730055, 11326355, 10914692, 10617724, 10188399, 10088728, 9635680, 9278478, 8986616, 8870475, 8569532, 8418754, 8414057, 8299612, 8115349, 7998550, 7847310, 7886812, 8042069, 7694301, 7530956, 7297419, 7186991, 7014564, 6981612, 6748669, 6617399, 6808080, 6646985, 6647985, 6694916, 6864810, 6896697, 6725495, 6513480, 6355285, 6332510, 6291569, 6127537, 6016357, 6019556, 5893033, 5668226, 5631166, 5718753, 5731944, 5980745, 6105447, 5967610, 6045872, 6144592, 6138942, 5975354, 5944886, 5916338, 5987007, 5995696, 6009735, 6015129, 6003459, 6019144, 5899849, 6011892, 6134777, 5972499, 6019510, 6260295, 6506043, 6414095, 6743014, 6781590, 6740390, 7036047]
4334G036047l791K23434J1267L2450L8499k1453L12361P4608K20692K29166j5552
4323H137728K71586R6000j42521K9048J32791p949j89299M7837Q6213J23048K60968
4312H845450Q7406J06054J79727Q8499p1444M8842K08167K33945L03778L86433
4302A0416857J55309J40521P8065R4213L58934K33642K36370j1221O7650L14399
4292A2084739M79489J91161K9623M25485K75827M52718K57602L18191N65085N03558
4282A5583478P57356O36950N06466P06007J041483J066503P41561J261341J213903
4273B3515048R94599J351828J882470K076843K535006K533058L055650L906889
4265D1851391M205553M375531M559527N261300N353324N151679M866640P56802
$$ y = [7036047, 7032256, 7255690, 7266957, 7299407, 7337906, 7316453, 7628814, 7703422, 7924114, 8153280, 8137728, 8409314, 8505314, 8362793, 8391841, 8524632, 8516683, 8327384, 8375221, 8461434, 8584482, 8845450, 8932856, 9038910, 9218637, 9307136, 9235692, 9284534, 9492701, 9726646, 10030424, 10416857, 10572166, 10712687, 10790752, 10884965, 11243899, 11477541, 11713911, 11702690, 11770340, 12084739, 12564228, 12755389, 12785012, 13210497, 13486324, 13939042, 14196644, 14514835, 15079920, 15583478, 16340834, 16977784, 17484250, 18190257, 19231740, 20298243, 21039804, 22301145, 23515048, 24509647, 25861475, 27743945, 29820788, 32355794, 34888852, 37944502, 41851391, 46056944, 50432475, 54992002, 60253302, 65606626, 70758305, 75624945, 76381747]
4257G6381747o989982j0336848q287397n643189l951409l162521k774609k040412
4249C3195380j405109j254610n00455l06334j90464k84587k31152L72166K16161
4240B9610996K46502m03005r58055j592807j219009r08581n48544l69395m10646
4231B3447456k81720j46281l50981j31129K17703j7597j69819j11860K63871q2089
4221B2637554M21524J94939J95949M66173K36859L11022M35161L95911L44600
4212B5639692L93638M59939L26362L14004O46227P44547O91704N71250R91558
4203C0778921J254820J134995J381751J627216J835901K129631K506367K517627
4195D5167229K675679L360051L639810M312635M795751N305777O283510P163894
$$ y = [76381747, 69391765, 59054917, 50767520, 45124331, 41172922, 38010401, 35235792, 33195380, 31790271, 30535661, 30035206, 29728872, 29538408, 29253821, 29022669, 29394835, 29610996, 29857498, 29454493, 28496438, 26903631, 25684622, 24776041, 24227497, 23858102, 23447456, 23165736, 23019455, 22668474, 22537345, 22755048, 22737451, 22567632, 22455772, 22719643, 22637554, 23059078, 23254017, 23449966, 23916139, 24152998, 24464020, 24899181, 25295092, 25639692, 26033330, 26493269, 26819631, 27133635, 27779862, 28524409, 29216113, 29787363, 30778921, 32033741, 33168736, 34550487, 36177703, 38013604, 40143235, 42649602, 45167229, 47842908, 51202959, 54842769, 59155404, 63951155, 69256932, 75540442, 82704336]
4187H2704336Q143970J0001645J1450772J2733831J4787712J7481451K0331477
4180A77635194K2417495K4434421K6558575K8053705K9067651K8295140J5343896
4173C51806077j0468361l6645363m9113343m3414555l0945413k2127395j7421539
4166A41670108j4610595j2563935j0672956r487715p962955o702836n674526m822035
4158F9172555m211978l515876l161835k526887k024061k062804j576980j156371
4150D8935763j217483j207761j018425r94487r75238n84209k67557n21885n20472
4141D1628246k87990j37492J06005j12956m63602j574354k655842l107715k547398
4132C0846902j704333j618530j568947j213761p92936o18043q83414q00008o17302
$$ y = [82704336, 90848306, 100849951, 112300723, 125034554, 139822266, 157303717, 177635194, 200052689, 224487110, 251045685, 279099390, 308167041, 336462181, 351806077, 341337716, 304692353, 255579010, 212164455, 181219042, 159091647, 141670108, 127059513, 114495578, 103822622, 94334907, 86371952, 79669116, 73994590, 69172555, 64960577, 61444701, 58282866, 55755979, 53731918, 51669114, 50092134, 48935763, 47718280, 46510519, 45492094, 44497607, 43522369, 42938160, 42670603, 42148718, 41628246, 41340256, 41202764, 41308769, 41195813, 40732211, 39157857, 36502015, 33394300, 30846902, 29142569, 27524039, 25955092, 24741331, 23948395, 23330352, 22446938, 21646930, 21029628]
4123B1029628o38042o20219l00780k30400k70838k27745l87039k30098k86355
4114A7838112j54374l6902j99542j80439K76402L44044O3762M09680L73348L79280
4104A9113371L76925N74601L87202O68115J90499r3618o88741q04683p95069r33108
4094A7995494q42828o88955j8061k46520j95003m93318n30432p02895o91885n81024
4084A3004573m00492m54707k01905l05935k34019k8976j55045k88443k13606k36251
4074A0485194k60748l51438k57937j14403Q7535j99674k61812o2340m5270l2626
4064H986481k18001l85773L9199l7595j85799j43902n8448m7615J04595j93827
4054G859315j30431m1473L4138K4911k09481J38056p3323m4901J55818O1388J17988
$$ y = [21029628, 20391586, 19771367, 19470587, 19240187, 18969349, 18741604, 18354565, 18124467, 17838112, 17683738, 17646836, 17447294, 17266855, 17543257, 17887301, 17951063, 18360743, 18734091, 19113371, 19490296, 20064897, 20452099, 21120214, 21310713, 21217095, 20528354, 19723671, 18928602, 17995494, 17152666, 16463711, 16445650, 16199130, 16004127, 15510809, 14980377, 14277482, 13585597, 13004573, 12604081, 12149374, 11947469, 11641534, 11407515, 11378539, 11223494, 10935051, 10721445, 10485194, 10224446, 9873008, 9615071, 9500668, 9588203, 9388529, 9126717, 9064377, 9019107, 8986481, 8768480, 8382707, 8421906, 8384311, 8198512, 8054610, 7996162, 7948547, 8053142, 7859315, 7728884, 7687411, 7721549, 7746460, 7536979, 7675035, 7601712, 7556811, 7712629, 7774017, 7892005]
4043G892005q2847J63484K38306r8927R2118k28340K44451p0157l7362L13538
4033H426269j7763R7503j17453k87409O6147J17284K41744J22749J8888j2545
4023H655414J38105j07635Q3152J94513J71774K19076L47705J59468L64910L54635
4013A0581117L23639N34981N16955L98587N22190O25813K42808J27055o54220
4004A3218925n65395k63327k88485j6831R9606J62027K99234L25579J26944J91839
3994A3290116L00315L37297K12696L39332M30564O42464P82595O46515J024179
3985A8006073J193934R45591R39423J150006J062323J571329J494721J110966
3977B7474366K30011l16546p33465o19632J72447P28774J063423J330476J526926
$$ y = [7892005, 7809158, 7972642, 8210948, 8112021, 8204139, 7975799, 8220250, 8150093, 8112731, 8426269, 8408506, 8506009, 8388556, 8101147, 8167294, 8284578, 8526322, 8649071, 8667959, 8655414, 8793519, 8685884, 8769036, 8963549, 9135323, 9354399, 9702104, 9861572, 10226482, 10581117, 10904756, 11439737, 11956692, 12355279, 12877469, 13503282, 13746090, 13873145, 13218925, 12653530, 12390203, 12101718, 12084887, 12184493, 12346520, 12645754, 12971333, 13098277, 13290116, 13590431, 13927728, 14140424, 14479756, 14910320, 15552784, 16335379, 16981894, 18006073, 19200007, 20145598, 21085021, 22235027, 23297350, 24868679, 26363400, 27474366, 27704377, 27387831, 26654366, 26034734, 26207181, 26935955, 27999378, 29329854, 30856780]
3968C0856780J670113N80428j442928l025767k385487j469518j478217p54254
3960B2551150j89599o0944k2404K41002N46830P66667R51221J057513J344101
3951B7185537J515767J082079M09780j70161m11825L60578Q04951P92516R52628
3942C2521850L21592j384528k247645j738122j226994p19149m48577j43305k8512
3933B4906610M65100O30544O98636K18234J51200L28669P23517P81659Q96161
3924B9800330R84131J188561K84946p21146j027861p78427j04713R5686L41253
3915C0062760L53080M76295Q19118P13971M55734M78435P30482O90386N97893
3906C5378154O42161M83284R47525J058859J185438J083480J154965J071736J415745
$$ y = [30856780, 32526893, 33107321, 31664393, 28638626, 26253139, 24783621, 23305404, 22551150, 22361551, 22300607, 22278203, 22519205, 23066035, 23832702, 24783923, 25841436, 27185537, 28701304, 29783383, 30193163, 30023002, 29611177, 29971755, 30776706, 31569222, 32521850, 32843442, 31458914, 29211269, 27473147, 26246153, 25527004, 25078427, 24935122, 24906610, 25371710, 26002254, 26700890, 26919124, 27070324, 27398993, 28122510, 28904169, 29800330, 30784461, 31973022, 32257968, 31536822, 30508961, 29730534, 29625821, 29721507, 30062760, 30415840, 30892135, 31711253, 32425224, 32880958, 33359393, 34089875, 34780261, 35378154, 36020315, 36503599, 37451124, 38509983, 39695421, 40778901, 41933866, 43005602, 44421347]
3897D4421347J653964J652248K000623K103737K413223K499444K412027J973629
3889F1130242K295155K421714K942349L305448L118488L072668K800320K988136
3881H4074520K862566K720465L360910L784613M164323M246986M494054M812091
3873A14520528M863421L992138J540041q33044j784632q05709L16992J388584
3865A23198319J963720J803526J210550J202032J099976R75760J060476O83980
3857A33198339m03816j341823k073580k083747j480970j299195j246448j464169
3849A21804591j100222j124942r63638n50994j469113l508664n914328o555100
3841A00617590n396460l959487l459470k986248k750003k482326k522760k288571
$$ y = [44421347, 46075311, 47727559, 49728182, 51831919, 54245142, 56744586, 59156613, 61130242, 63425397, 65847111, 68789460, 72094908, 75213396, 78286064, 81086384, 84074520, 86937086, 89657551, 93018461, 96803074, 100967397, 105214383, 109708437, 114520528, 119383949, 123376087, 124916128, 124083084, 122298452, 121492743, 121809735, 123198319, 125162039, 126965565, 128176115, 129378147, 130478123, 131453883, 132514359, 133198339, 132794523, 131452700, 129379120, 127295373, 125814403, 124515208, 123268760, 121804591, 120704369, 119579427, 118615789, 118064795, 116595682, 113087018, 107172690, 100617590, 95221130, 91261643, 87802173, 84815925, 82065922, 79583596, 77060836, 74772265]
3833G4772265k491839k943020k471681k761097k743421k538631k114520j849683
3825E4858373j398641j054346j505875j877641j761449j854859j306890q96977
3817D3201695r17438p77246r34318p25045r65615j004198r59654q44788o79042
3808C5394351p34216n71866p18801j065929q31865o18919p00882n87638r0407
3799B9473828j99868j18962n8759j33642k40212N7255J39362M9185j14245k56221
3789B8597721q4738L602j21767o2748l3693j08996r3674j63989o6194p2311O7193
3778B7860406L53942J43531K74294M58009N24831M48426P13773J258710R69331
3769C3005253J088090J540367J427117J352025J703873J439935J668765J380020
$$ y = [74772265, 72280426, 69337406, 66865725, 64104628, 61361207, 58822576, 56708056, 54858373, 53459732, 52405386, 50899511, 49021870, 47260421, 45405562, 44098672, 43201695, 42284257, 41507011, 40572693, 39847648, 38882033, 37877835, 36918181, 36073393, 35394351, 34660135, 34088269, 33369468, 32303539, 31471674, 30852755, 30151873, 29564235, 29473828, 29273960, 29154998, 29096239, 28962597, 28722385, 28779640, 28919002, 28968187, 28853942, 28597721, 28512983, 28516585, 28394818, 28332070, 28298377, 28189381, 28095707, 27931718, 27865524, 27793213, 27860406, 28214348, 28357879, 28632173, 29090182, 29615013, 30063439, 30777212, 32035922, 33005253, 34093343, 35633710, 37060827, 38412852, 40116725, 41556660, 43225425, 44605445]
3761D4605445J167621O02240j62320j102308j837566k233040k709241k631026
3753C5699805k216799k167725j766599j452121j174014j064589r80979p08452
3745B4168527o16779n75861o08013m63891l93956k61389k64442l64746j51288
3736B0468162n22034l44332l31366l90020k95989l74115m15691m19725j7140l35846
3726A7021904l48685l74009k93424j31414k60354m10380k62253q3882k00234m1852
3716A4615417N2562j16490k14177j97530j61455O3301L0669j27471j03552r3305
3706A3747969j79579K18775r9887M29J15681j40680p8347n7449J35993m2911L4886
3695A3654880P2109J19904j23700l5184P8451O3289j48498l14430J7064R86K6774
$$ y = [44605445, 45773066, 46375306, 46212986, 45110678, 43273112, 41040072, 38330831, 35699805, 33483006, 31315281, 29548682, 28096561, 26922547, 25857958, 24876979, 24168527, 23551748, 22975887, 22367874, 21903983, 21510027, 21248638, 20984196, 20619450, 20468162, 19946128, 19601796, 19270430, 18880410, 18584421, 18210306, 17794615, 17374890, 17357750, 17021904, 16673219, 16299210, 16005786, 15874372, 15614018, 15203638, 14941385, 14857503, 14657269, 14615417, 14667979, 14551489, 14337312, 14139782, 13978327, 14041628, 14072297, 13944826, 13841274, 13747969, 13568390, 13787165, 13687278, 13687707, 13803388, 13662708, 13584361, 13526912, 13662905, 13619994, 13654880, 13726989, 13846893, 13723193, 13688009, 13766460, 13829749, 13681251, 13366821, 13383885, 13384871, 13411645]
3684A3411645n8885J41825P5996o8731K4874o3525R4252m0343L58658J45940K37375
3673A4259081M67260K49018K06877J00477Q8259J23314K63628L29569N48976L84175
3663A7020634J52719M93072J87773P3688M3017j28010r2176M7528L7563j74201
3653A7661607J41441m6949j25529k56751j35478O7809j50913O916j02661N116
3643A7064608k86320k46949j96891j39671K9979J29758L1278K25996J05187Q4953
3633A6801928J80313J03185J45211K25445O2357L7211j86019k48328o6870l43518
3623A6710915k77559j58701k86316k59381k23135l00237k59607m94978j98065
3614A4252936k53699k64231j65679n71257j57849o8068m7330j81195j03580P7879
$$ y = [13411645, 13352760, 13494585, 13570581, 13501850, 13526724, 13463199, 13557451, 13517108, 13875766, 14021706, 14259081, 14726341, 14975359, 15182236, 15282713, 15370972, 15494286, 15757914, 16087483, 16636459, 17020634, 17173353, 17666425, 17854198, 17927886, 17970903, 17842893, 17750717, 17798245, 17835808, 17661607, 17803048, 17756099, 17630570, 17373819, 17238341, 17306150, 17155237, 17162153, 17059492, 17064608, 16778288, 16531339, 16334448, 16194777, 16224756, 16354514, 16385792, 16611788, 16716975, 16801928, 16982241, 17085426, 17230637, 17456082, 17518439, 17555650, 17369631, 17121303, 17054433, 16710915, 16433356, 16274655, 15988339, 15728958, 15505823, 15205586, 14945979, 14451001, 14252936, 13999237, 13735006, 13569327, 12998070, 12840221, 12772153, 12724823, 12543628, 12440048, 12517927]
3604A2517927q4628R0247R770q8373J24492J66051j85329q4028j7888L2918q9506
3593A2391653m3009K8705K4300j67617k59817l15659J16795l50543m00695p05479
3583A0318634k74578J92770K6649j69444k97488k88892r1632k40096j09323J06836
3573I173436P864j26161n9565Q038j23034n8928O9586J94168j03161j61957R7639
3562H917925K9034l32108J3815m0181j09008l29438m1664L3351j02003l7244o3419
3551G939060j65982J32262j38352l73752J06595r3307l01390L7070j62968n8135
3541F921101J01622k63170k47009j04462R6612k9756j72199J29381j18283j01218
3531F212619j24284q7476L7238J25862J13291J9674k20574j85802J34177J87094
$$ y = [12517927, 12433299, 12523546, 12533316, 12444943, 12569435, 12735486, 12550157, 12466129, 12448241, 12481159, 12391653, 12348644, 12377349, 12401649, 12234032, 11974215, 11658556, 11775351, 11424808, 11024113, 10318634, 10044056, 10236826, 10263475, 10094031, 9796543, 9507651, 9416019, 9175923, 9066600, 9173436, 9181300, 9055139, 8995574, 9003612, 8880578, 8821650, 8891236, 9085404, 8982243, 8820286, 8917925, 8946959, 8614851, 8628666, 8588485, 8479477, 8150039, 8108375, 8141726, 8039723, 8002479, 7939060, 7773078, 7905340, 7766988, 7393236, 7499831, 7406524, 7105134, 7142204, 6979236, 6921101, 7022723, 6759553, 6512544, 6408082, 6504694, 6474938, 6302739, 6432120, 6313837, 6212619, 6088335, 6000859, 6038097, 6163959, 6277250, 6296924, 6076350, 5890548, 6024725, 6211819]
3521F211819J5145j01440L3315n0104m6393j69285q9620J55n7950J0095K0608
3510E776345J51267j06015l73773O4175K35261j04231j67419K6023j60290q6621
3500E254722J03368k73509L9455L49957J09550J07920n1249o4508n5600P2532
3490E592638l1829o8064m9846J12522M2507m8116K05358M0472m3465o0270K0304
3479E712211K59075K02468p1470J41493J10994L4501j2148J58487J10569j19133
3469F527047P4729J51068J43300K57639K04704L931M03172Q841J30603J96745
3459H101779j82425Q3099M01233M83105J33993J92266L89652K04109K06877O35728
3449A0649416N38812L03502M14834L80052Q19889O65726N86963J013717J310824
$$ y = [6211819, 6226964, 6125524, 6158839, 6108735, 6062342, 5893057, 5803437, 5803592, 5745642, 5755737, 5776345, 5927612, 5821597, 5447824, 5511999, 5747260, 5643029, 5475610, 5501633, 5341343, 5254722, 5358090, 5084581, 5124036, 5473993, 5583543, 5691463, 5640214, 5575706, 5520106, 5592638, 5560809, 5492745, 5442899, 5555421, 5597928, 5549812, 5755170, 5795642, 5752177, 5691907, 5712211, 5971286, 6173754, 6102284, 6243777, 6354771, 6389272, 6377124, 6535611, 6646180, 6527047, 6601776, 6752844, 6896144, 7153783, 7358487, 7362418, 7765590, 7774431, 7905034, 8101779, 7919354, 8002453, 8403686, 8886791, 9020784, 9213050, 9602702, 9806811, 10013688, 10649416, 11188228, 11491730, 11906564, 12286616, 13106505, 13772231, 14359194, 15372911, 16683735]
3440A6683735J499069J328881J694581K095366K444579K953529L042873L580867
3432C5323480L932696M029760M337019M380370M616096m14382p724945q864894
3424C9615200o273551l860508k357471j818346j017666n08172n48024k56221l1529
3415B2943712L5295K62470N59751N32691Q02527J133901J859873J987027K541305
3406C2658552L066184L449877M401659N312195N898759O288101O877281P515418
3398G5468026P979723P901633R334284K045180j3863298j8537025j3685949r321369
3390D7321205o095748m327332k959820k468495j889033j548283j174358j193372
3382B5664764j022854p72152m64987j21095Q9710K68967M95099Q16364J078851
$$ y = [16683735, 18182804, 19511685, 21206266, 23301632, 25746211, 28699740, 31742613, 35323480, 39256176, 43285936, 47622955, 52003325, 56619421, 56205039, 48480094, 39615200, 33341649, 29481141, 27123670, 25305324, 24287658, 23779486, 23231462, 22975241, 22943712, 22979007, 23241477, 23801228, 24333919, 25136446, 26270347, 28130220, 30117247, 32658552, 35724736, 39174613, 43576272, 48888467, 54787226, 61075327, 67952608, 75468026, 83447749, 91349382, 100683666, 102728846, 88865548, 70328523, 56642574, 47321205, 41225457, 36898125, 33938305, 31469810, 29580777, 28032494, 26858136, 25664764, 24641910, 23869758, 23404771, 23283676, 23373386, 23642353, 24137452, 24953816, 26032667]
3373B6032667J454120J740582K240545K236672K728619L100603L392017L557573
3365D6483398L704065M139833J890070n214888r257685p591091n317348l772497
3357B5063857k406855j742061j332747j187622j143646j121346p16295o01998
3349A4811287p15053n41671n20792n34824k94796m97484l20794j43476j2306k14856
3339A1015235l65307j32419l05895j57701J7215k508j47348k3807k09121j98392
3329I489952j90827o0901j49760K4436q2751O3754k14001j55888J6433k39651
3319H500796j13618j3361o8596J52232j33850j7157Q0502l9283j51434J1606R9614
3308H307451K18672K55467j03075J25496J84730K57361q3502q3219J78807R4406
$$ y = [26032667, 27486787, 29227369, 31467914, 33704586, 36433205, 39533808, 42925825, 46483398, 50187463, 54327296, 56217366, 51002478, 41744793, 34153702, 28836354, 25063857, 22657002, 20914941, 19582194, 18394572, 17250926, 16129580, 15413285, 14811287, 14096234, 13554563, 13033771, 12498947, 12204151, 11706667, 11385873, 11242397, 11230091, 11015235, 10649928, 10517509, 10211614, 10053913, 10071128, 10068620, 9921272, 9897465, 9688344, 9489952, 9299125, 9238224, 9088464, 9112900, 9030149, 9093903, 8879902, 8724014, 8740447, 8500796, 8387178, 8373817, 8305221, 8457453, 8323603, 8306446, 8386948, 8347665, 8196231, 8207837, 8307451, 8526123, 8781590, 8678515, 8804011, 8988741, 9246102, 9162600, 9079381, 9258188, 9352594]
3298I352594l7903r2347L18989J07784j30150m4353J24700K49324K45792l0083
3288A0064347q1406J84275K90621L36646J07066L1224L16940j10281K89633L23552
3278A1752617K67298J24968K39004N41481J20626L16268N49599O08289M40487
3269A4960637Q04485O88767R58625R83214R57097J082984Q76093J315126J535693
3260B4162721J344072J486455J285344J396465J170378J023022Q55946M20122
3252C3144525k4889m87825q23881q53028j557827j799342j743347j630791j455146
3243B2768449j536229j087307r69374j183040j038984p62125p46121p27815n63770
3234A4153684q17303m71148k76140l72270m94667m65498k11045k61506l34256
$$ y = [9352594, 9314691, 9222344, 9541333, 9649117, 9518967, 9474614, 9599314, 9848638, 10094430, 10064347, 9982941, 10167216, 10457837, 10794483, 10901549, 10932773, 11249713, 11139432, 11429065, 11752617, 12019915, 12144883, 12383887, 12925368, 13045994, 13362262, 13911861, 14520150, 14960637, 15765122, 16453889, 17412514, 18395728, 19352825, 20435809, 21311902, 22627028, 24162721, 25506793, 26993248, 28278592, 29675057, 30845435, 31868457, 32724403, 33144525, 33119636, 32631811, 31807930, 30954902, 29397075, 27597733, 25854386, 24223595, 22768449, 21232220, 20144913, 19175539, 17992499, 16953515, 16191390, 15445269, 14717454, 14153684, 13336381, 12865233, 12589093, 12216823, 11722156, 11256658, 11045613, 10784107, 10449851]
3225A0449851j50380Q5677j42838l26719j63653j73999o1163j06454k68598J06925
3215I248649L35795l8671o3571j75957l4767K32880r1290r0326k60066j47542
3205H915134p5409k01566l61310k91106l23718k01126j74973R103l2508k53670
3195G008851j45090j4362j79645l5909N7918n0063J1562j379j288l0774m7849
3184F571972k4999j1331J50843m4002J18547j04393r8924J08695M9216J5027k42011
3173F488640N9124k49038j76224p1816l2176M607j40622l5296J1703j97485j78426
3162E482991p0517O1720k0673k66081k32140k02770K37845j82008k7701K04764
3152D985430j63071J7450j13469J32679q3315J8622k7980Q6719o8035j5374J32327
$$ y = [10449851, 10299471, 10385148, 10242310, 9915591, 9751938, 9577939, 9516776, 9410322, 9141724, 9248649, 9584444, 9545773, 9482202, 9306245, 9271478, 9504358, 9413068, 9322742, 9062676, 8915134, 8839725, 8638159, 8276849, 7985743, 7662025, 7460899, 7285926, 7295029, 7262521, 7008851, 6863761, 6849399, 6669754, 6633845, 6691763, 6641700, 6653262, 6651883, 6650595, 6619821, 6571972, 6546973, 6535642, 6686485, 6642483, 6761030, 6656637, 6557713, 6666408, 6715624, 6730651, 6488640, 6547764, 6298726, 6122502, 6050686, 6018510, 6023117, 5882495, 5847199, 5858902, 5661417, 5482991, 5412474, 5474194, 5453521, 5187440, 4955300, 4752530, 4990375, 4808367, 4780666, 4985430, 4822359, 4839809, 4726340, 4859019, 4775704, 4794326, 4766346, 4853065, 4785030, 4769656, 4901983]
3141D901983l16472K01910N5567L125n2571l9770N3683l10681j96251r2243M3120
3130D251400J02424j80922k03984o2835J3007J15359j08742r9006Q4457L3339
3120C944497J83547j69421K6671O4400J5995j2205Q0644O7061K9837n3736m2430
3109D134860r3656O6140l8349k70279R4229Q4377k36086N6044j63265j04007j89712
3098C340296j82271j584N1842r23j44237j2058q676L7387k91127Q4279j54417
3087B718511M9163l3995k0480N0728j11143M5036J17480l8025q6272Q0309j63980
3076B607332r8215m0938p2437J21284n7357K24400K5953k33938r6696k3395k04037
3065B151956j75191j00874o6872J67369j00154L4328r0623K4667j77286q3814
$$ y = [4901983, 4585511, 4787421, 4842988, 4846113, 4793542, 4753772, 4807455, 4496774, 4300523, 4208280, 4251400, 4353824, 4172902, 3968918, 3906083, 3919090, 4034449, 3925707, 3826701, 3911158, 3944497, 4128044, 3958623, 3985294, 4049694, 4065689, 4053484, 4134128, 4201189, 4231026, 4177290, 4134860, 4041204, 4107344, 4068995, 3798716, 3892945, 3977322, 3741236, 3797280, 3634015, 3530008, 3340296, 3158025, 3156441, 3208283, 3207360, 3063123, 3051065, 3042389, 3079776, 2788649, 2872928, 2718511, 2767674, 2733679, 2713199, 2763927, 2652784, 2697820, 2815300, 2777275, 2691003, 2771312, 2607332, 2509117, 2468179, 2395742, 2517026, 2459669, 2684069, 2710022, 2476084, 2379388, 2355993, 2151956, 1976765, 1875891, 1809019, 1976388, 1876234, 1910562, 1819939, 1844606, 1667320, 1583506]
3055A583506J24914j04059J02378J10649m2537k15832R4094o5763j22953j1988
3045A452409J78326J12132k31251k09504O7005J20065n6519K1519L14613J63366
3035A932161j66624j00657M2167j03714P0499J68429m6758Q1079k24012j51532
3025A501038k155k2662m4902j837J15112J56412J3773J7509R8879q8406j21218
3014A621543J27567r05n367k6358J35256j65965j03116J0084q3553L57738j5836
3003A851088k14400q2071K91777Q8425K8420k06194L7894J8528K58927J03523
2993B175917p5112Q716l4208j01999Q5157J51692j52128K08685K34346P1329j21786
2982B450609M4413j05271P0023j16171J08713J59392j32777J91831M0925J4768
$$ y = [1583506, 1708420, 1604361, 1706739, 1817388, 1774851, 1559019, 1653113, 1587350, 1464397, 1452409, 1630735, 1742867, 1511616, 1302112, 1369117, 1489182, 1432663, 1454182, 1768795, 1932161, 1765537, 1664880, 1707047, 1603333, 1673832, 1842261, 1795503, 1876582, 1652570, 1501038, 1498883, 1476221, 1431319, 1429482, 1544594, 1701006, 1714779, 1732288, 1831167, 1742761, 1621543, 1749110, 1748205, 1742838, 1716480, 1851736, 1685771, 1582655, 1592739, 1509186, 1866924, 1851088, 1636688, 1554617, 1846394, 1934819, 1963239, 1757045, 1794939, 1813467, 2072394, 2175917, 2100805, 2109521, 2075313, 1973314, 2058471, 2210163, 2058035, 2266720, 2501066, 2572395, 2450609, 2495022, 2389751, 2459774, 2343603, 2452316, 2611708, 2478931, 2670762, 2711687, 2726455]
2972B726455k14582j07264Q1102P6542P7183m7356j57682m0342R6333M9770M8056
2961B588215m2992o5698k1609J94906j1130r4541K09579P3922o4433K23814k69566
2950B720467j58003L24772J17391J25059K61703j33685j61644J23944K63181J45963
2940C629148p7059l41763K05205j20441J34684K0457N663P9774j14674J19543
2930C540537j85201J89801j04231M7820P1233J24649O8992J14086q1712j48753
2920C637221J16936Q5772J07850K07875J46290J45871J62004N7505K5579j63494
2910D529409J66962L464m67404l12551j95768j46403l11049l6054l1622j83611
2900C015373j05335j57420l8689j9267k50687q9638M00193J95165j15582q3120
$$ y = [2726455, 2511873, 2404609, 2485711, 2562253, 2639436, 2592080, 2434398, 2394056, 2490389, 2540159, 2588215, 2545223, 2479525, 2457916, 2652822, 2641692, 2547151, 2756730, 2830652, 2766219, 2990033, 2720467, 2562464, 2887236, 3004627, 3129686, 3391389, 3257704, 3096060, 3220004, 3483185, 3629148, 3552089, 3210326, 3415531, 3295090, 3429774, 3450231, 3455894, 3535668, 3420994, 3540537, 3355336, 3545137, 3440906, 3488726, 3559959, 3684608, 3753600, 3867686, 3785974, 3637221, 3754157, 3839929, 3947779, 4155654, 4301944, 4447815, 4609819, 4667324, 4692903, 4529409, 4696371, 4699835, 4232431, 3919880, 3724112, 3577709, 3266660, 3230606, 3198984, 3015373, 2910038, 2752618, 2713929, 2694662, 2443975, 2354337, 2754530, 2949695, 2834113, 2750993]
2890B750993M0563p1606J4548P0623R2247J51169j59361j07660p9370J8703k9324
2879B691525j33463j86802M4053n1724k32295k01514k17825p110Q5483P102q9748
2868A707682q1238l4420M4118j42994J70518R6570k46469l77309j82753K04836
2858A158541J66762j18585M9093o6139m0505o9198n2695K1501j33790J06546j03978
2847I17553j61002o2331L0642J18863O718m2130j62356P6703j6244R0824R7371
2836H94611k53078o1581O8929q7803p2306O8588J19061j34465J90463O4148k35455
2825E61112L32369k21943j23717l3859m1355M4011N4562L6257R25j69784j27478
2814C11100l8448l1692k04854K39837K69904K9655j08965k75671J33348K2699
$$ y = [2750993, 2791556, 2719950, 2734498, 2805121, 2897368, 3048537, 2889176, 2781516, 2702146, 2720849, 2691525, 2558062, 2371260, 2415313, 2363589, 2131294, 1929780, 1711955, 1704845, 1790328, 1797430, 1707682, 1626444, 1592024, 1636142, 1493148, 1663666, 1760236, 1513767, 1136458, 953705, 1158541, 1325303, 1206718, 1255811, 1189672, 1149167, 1079969, 1027274, 1048775, 914985, 1021531, 917553, 756551, 694220, 724862, 843725, 850443, 808313, 645957, 722660, 706416, 797240, 894611, 641533, 579952, 648881, 561078, 488772, 557360, 676421, 541956, 732419, 796567, 561112, 893481, 671538, 547821, 513962, 472607, 516618, 571180, 607437, 608362, 438578, 311100, 272652, 240960, 36106, 275943, 545847, 575502, 466537, 190866, 324214, 346913]
2804C46913m2843K03532N1399j06810k87895k602k7922j5540J07561J40808J66584
2793E33185j83543L041l4343n3507k5441j58462j01595K27835p2705l9688L551
2782I8328L5970J65942L4189J8854j11579Q9959J00586j80617K5827j12560j4730
2771A50169J9951l201j27505K14050l1549l9546J4750j83514J39693n9572n238
2760H8488K5299J07573O2554j79238M0255p2520O3493J49473j05350R2406j37765
2749A34668n8739J57917N7573k8613j81707J41661J11770k57735L3748m5411j40809
2738g5677j32M3657Q8586J42951O7080R3163M2620m7083m059j38755J433n1576
2726A62208j03004O1768O9933m9088Q9071R989p0413n8710Q9872J6052k93790
$$ y = [346913, 304070, 507602, 559001, 452191, 164296, 161694, 133772, 118232, 225793, 366601, 533185, 349642, 352683, 318340, 264833, 239392, 80930, -20665, 207170, 134465, 94777, 98328, 134298, 300240, 334429, 353283, 241704, 331663, 432249, 251632, 277459, 164899, 150169, 170120, 166919, 39414, 253464, 221915, 182369, 197119, 13605, 153298, 93726, 88488, 113787, 221360, 283914, 104676, 144931, 72411, 135904, 285377, 180027, 272433, 134668, 75929, 233846, 291419, 262806, 81099, 222760, 334530, 76795, 110543, 65132, -75677, -75809, -32152, 56434, 199385, 266465, 359628, 402248, 355165, 351106, 212351, 213784, 162208, 59204, 120972, 190905, 141817, 230888, 240877, 170464, 111754, 201626, 217678, -76112]
2715g6112R6457q0297L7900J03530R3259p2323k24679l2223L08821o005O4256
2704B12584j35983j75052Q6364o2624r669P8298q3589K48286L0059j56586J12988
2693A45076L2248O1017r4402m7644K8211q6455K1674M6026l4553J12053k44177
2682f0926p9843R29K23201J06715J207l8694J30293k34362j543J11984L9512R2215
2670B90688q4067n439o5134J05453o8973o0337K7072j23708j21054N8666K19079
2659A72246m3726r3062j73589K50735L0983j67753R5833L4373O6007n4117j01483
2648A6447Q0045L18648l6987j92404q4873R9090p2070j2454O2329K55614o3319
2637C70066k85633J22110N3073q5349q1727J24588J03840J852k02482P6512q751
$$ y = [-76112, 20345, -59952, -22052, 81478, 174737, 102414, -122265, -154488, 154333, 148328, 212584, 76601, -98451, -12087, -74711, -84380, -6082, -89671, 158615, 188674, 32088, 145076, 177324, 238341, 143939, 96295, 124506, 38051, 59725, 105751, 71198, 183251, -60926, -140769, -139840, 83361, 190076, 191283, 152589, 282882, 48520, 46977, 158961, 198473, 290688, 206621, 201182, 136048, 241501, 172528, 112191, 139263, 15555, -105499, -46833, 172246, 128520, 35458, -138131, 112604, 143587, -24166, 71667, 106040, 172047, 117930, 16447, 96492, 415140, 378153, 185749, 100876, 199966, 127896, 115442, 177771, 433385, 370066, 84433, 206543, 259616, 174267, 92540, 217128, 320968, 322820, 120338, 196850, 188099]
2626A88099J7306j31816j57899K56512J27284L1123L821r206j33606P101j4750
2615A83969m6723J08700j24200j61356J56149J47153o9952K48732m7350r6151
2605B98971J99393j96654q0432K0157J28418k03763q7193J64412L83969N6144
2595F83422j54102j18594j55422N088Q6364n5577j9843o8819K1144k10489J35663
2584A48835L0859q7416R45R0834Q7711J10792R8282j90830R7466n3219k17487
2573A16772M2931J34826j46099J23177j33548n1230J3091Q2339K29125q2552j22787
2562B06045k11234L6290J56808K16593o8236k33922Q4007q213P3114r2932p467
2551A50853j42730N7797J15807j45346k25781L04490p2062j36992q7239J42059
$$ y = [188099, 205405, 73589, -84310, 172202, 299486, 330609, 334430, 325224, 191618, 198719, 183969, 137246, 245946, 121746, -39610, 116539, 263692, 193740, 442472, 395122, 298971, 498364, 301710, 221278, 241435, 369853, 166090, 78897, 243309, 627278, 683422, 529320, 410726, 255304, 260392, 346756, 291179, 271336, 202517, 223661, 13172, 148835, 179694, 92278, 93223, 184057, 271768, 382560, 480842, 290012, 387478, 334259, 116772, 159703, 294529, 148430, 271607, 138059, 86829, 99920, 182259, 411384, 328832, 206045, -5189, 31101, 187909, 404502, 336266, 102344, 186351, 178138, 251252, 158320, 150853, 8123, 65920, 181727, 36381, -189400, 115090, 43028, -93964, -181203, -39144]
2541c9144M8328m6553J23642J10309k21832K9489j16322O7166K94758o7986K4924
2530B06779j84176J41524q2478j63895P9338Q7760R7952N5313k61014K9793m4547
2519c7651j59588N9394K36008m0280j36202o9992K99474k1431P979J8405Q7407
2508B43523n0701J15236l01479k20020j921J08874K85577K5218j29720J1697m3243
2497D3041k86545K40359K00588j98230k5981j0402N8671N6292n4905k87396K297
2486b62211J56241J48843P5533r5301J13812K399l7234k13635K43871p1446j04723
2475d3851P7269P0640Q792k2542j15197Q0806O9728j18999K9955p2155n8785r4571
2463a88910J05409L9224j5230J6445J9259N7399q4225K0211J33710o7851L924
$$ y = [-39144, 9184, -37369, 86273, 196582, -25250, 4239, -112083, -44917, 249841, 181855, 206779, 22603, 164127, 81649, -82246, -2908, 84852, 182804, 238117, -22897, 6896, -37651, -197239, -137845, 98163, 57883, -78319, -148311, 151163, 129732, 137711, 156116, 243523, 192822, 308058, 6579, -213441, -215362, -106488, 179089, 204307, 74587, 86284, 43041, -243504, -3145, 197443, -787, -26768, -37170, 21501, 77793, 22888, -264508, -262211, -105970, 42873, 118406, 23105, 136917, 139316, 102082, -111553, 132318, 60872, -43851, 33418, 104058, 112850, 90308, -24889, 55917, 125645, 6646, 36601, -35554, -94339, -188910, -83501, -44277, -59507, -43062, -23803, 33596, -50629, -30418, 103292, 35441, 39365]
2452C9365J71125r463j10088l1468j6806q9691r5548j19220K48136k08658M9057
2441a73259J41721m0449J04746J22878o8810q8671p2256K32635J53975k57643
2431E4867k03537J29036q2771j2002k8119Q5408l1582q8687j8240q9972L0586
2420b55013j06052r412K19702J52091m0440J07405n7297P1587m7636l7988l5402
2409c8455o0576M2338j83772J90137J61530m1621J39762O590k12637N2399N8231
2398A13926P3743J2459N9679J35026l88209j54893m2310J49572L04194M5364j02206
2387B06345L3998K5286R4065P571O3246j801J63733l8137m6625l3479j59352K6986
2375C41836O2j74797P1732L7635M5550j43010Q135N9856J22203j96381j17543
$$ y = [39365, 210490, 201027, 90939, 59471, 42665, -47026, -142574, -261794, -13658, -222316, -173259, -31538, -71987, 32759, 155637, 86827, -1844, -74100, 158535, 312510, 54867, -148670, -19634, -102405, -114407, -142526, -57118, -88700, -177387, -195627, -285599, -255013, -361065, -370477, -150775, 1316, -39124, 68281, 10984, 82571, 34935, -3053, -38455, -99031, -56693, -240465, -50328, 111202, 69581, 209343, 215933, 3296, 55695, 113926, 187669, 200128, 259807, 394833, 6624, -148269, -190579, -41007, 263187, 308551, 206345, 240343, 265629, 359694, 367265, 430511, 428710, 592443, 554306, 507681, 474202, 314850, 341836, 341898, 167101, 238833, 276468, 322018, 179008, 187143, 246999, 369202, 172821, 55278]
2364E5278J37877l6589Q9920l08021N0886J31415m489N3953n3524j7830N2603
2353A51479R1869R4383j53659O5447l8132J8115R1580j82383k51001Q3080J11035
2342H1813Q6841j33827M7702L12347j79493K1546r1143k8075o1432J33934J70853
2331C61066j43411k81134R2705m5081r2824N7558J26414Q7144J1634n7416j41516
2320b4861J79905J38569N717l92k72574m6635J19425K24616J90622j45399j26148
2309B42845m9152j41299j34105k22545K44503L45372Q0025O2949m1151k20139
2299A67303p7435Q3150L7611O1807r1363O604N8989Q3671p7881J16985j3924o7958
2287B87559K378J04106j49636L7415k3936O4744q4889l123J25151m6014q6418
$$ y = [55278, 193155, 156566, 246486, -61535, -10649, 120766, 116277, 170230, 116706, 98876, 151479, 243348, 337731, 184072, 249519, 211387, 229502, 321082, 138699, -112302, -29222, 81813, 168654, 34827, 82529, 394876, 215383, 236929, 145786, 117711, 56279, 190213, 361066, 217655, -63479, 29226, -15855, -108679, -51121, 75293, 162437, 174071, 116655, -24861, 155044, 293613, 299330, 298938, 26364, -20271, 99154, 323770, 514392, 368993, 242845, 193693, 52394, -81711, -304256, -59753, 285619, 365644, 428593, 387442, 167303, 89868, 173018, 210629, 272436, 181073, 187677, 246666, 330337, 252456, 369441, 355517, 287559, 289937, 394043, 244407, 281822, 257886, 322630, 237741, 234618, 359769, 313755, 227337]
2276B27337L9893K9965j90804Q1155P9393J2736p80Q5058k25536j85099J71297
2265A24615J58180o4969J92118K34898n1240J03933k81119r4806J03807j0924
2255D14493l0623m2022o0826M3943J25734J77813q1138M4192q9863O4919Q9834
2244F56456j06935m2547L7336p881j04051j98053R8331N0159j56523o5377J01942
2233B62857K73070K21087J5464L5374j87900q9701m2483P315m2700J99151J50853
2222H02387j38977j30319N3376M5779r6947L7166M0388J23724M998K235k27755
2211E16055R7498q6430K64818L7499q1834O1135J81557K23854L74j04178K8468
2200A138816J3569J48392P0104j8199Q3707J73508j65922J23625r824Q3210O017
$$ y = [227337, 267230, 297195, 106391, 187546, 266939, 279675, 278895, 363953, 138417, -46682, 124615, 282795, 217826, 409944, 644842, 593602, 697535, 416416, 321610, 425417, 414493, 383870, 341848, 281022, 324965, 450699, 628512, 547374, 591566, 501703, 566622, 656456, 549521, 506974, 544310, 536429, 432378, 234325, 332656, 382815, 226292, 160915, 262857, 535927, 757014, 772478, 807852, 619952, 530251, 487768, 495083, 452383, 651534, 802387, 663410, 533091, 586467, 632246, 535299, 572465, 612853, 736577, 741575, 743810, 516055, 613553, 527123, 791941, 829440, 747606, 808741, 990298, 1214152, 1214526, 1110348, 1138816, 1152385, 1300777, 1370881, 1352682, 1436389, 1609897, 1443975, 1567600, 1557776, 1640986, 1647003]
2189A647003J01874j6595K0582O4729J36414q9050j80520K50280J02803J23072
2179B160592p9189J05894R0144Q2474N1183J78695K18979O6154N9626k4030J09172
2168C019694J45204K18141J6379L8595J10920J45418K05071P7036j31136O8511
2158C913833L36853Q9741K22531Q960O7204J0591K76995L02200J64162K32561
2148E625631Q7305L04553Q5934P5523J61291M03110M77293L17528M76611K98544
2138H313323O63325P72117O90953N98305J050146J074144J251584J424979J683345
2129A7522221J624005J783878K168096J791923K185849L349541L955329M827191
2121C9208033N672334O915351P908598Q330946Q588616R721649R878527J0451050
$$ y = [1647003, 1748877, 1732282, 1752864, 1817593, 1954007, 1864957, 1684437, 1934717, 2037520, 2160592, 2081403, 2187297, 2277441, 2359915, 2411098, 2589793, 2808772, 2874926, 2934552, 2910522, 3019694, 3164898, 3383039, 3399418, 3438013, 3548933, 3694351, 3899422, 3976458, 3845322, 3913833, 4250686, 4340427, 4562958, 4571918, 4639122, 4649713, 4926708, 5228908, 5393070, 5625631, 5712936, 6017489, 6103423, 6178946, 6340237, 6743347, 7220640, 7538168, 8014779, 8313323, 8976648, 9748765, 10439718, 11038023, 12088169, 13162313, 14413897, 15838876, 17522221, 19146226, 20930104, 23098200, 24890123, 27075972, 30425513, 34380842, 39208033, 44880367, 51795718, 59704316, 68035262, 76623878, 86345527, 96224054, 106675104]
2113A06675104J2457311k331461k3067817k3085957j4619184r798671o952969
2106C9276356n228897l740355k737956j958853k080873j901044j412367j394082
2098A8821929p98270r95807j391122j123785r37002p16371p92512o14069m54102
2089A0998889n39361m98333m44868l72676l71189m18471l10903k58400k56445
2080G528243l51743m18370m13777j12247k67190l0050k98627k08870j96174k07608
2070E023587k20074l00232j11464j06700j25191j18550j20070j01813q4702j82780
2060C552011j22485j45742j15622J16824o972m0747j24528j63788j6699k23436
2050B708816k612o7357K7052Q8082l15969l10346J47038O0475M0066Q2248j35335
$$ y = [106675104, 119132415, 116800954, 93733137, 70647180, 56027996, 46229325, 39276356, 34047459, 30307104, 27569148, 25610295, 23529422, 21628378, 20216011, 18821929, 18023659, 17027852, 15636730, 14512945, 13575943, 12859572, 12067060, 11452991, 10998889, 10459528, 9961195, 9516327, 9143651, 8772462, 8353991, 8043088, 7784688, 7528243, 7176500, 6758130, 6344353, 6232106, 5964916, 5934866, 5636239, 5427369, 5231195, 5023587, 4803513, 4503281, 4391817, 4285117, 4159926, 4041376, 3921306, 3819493, 3734791, 3552011, 3429526, 3283784, 3168162, 3284986, 3278014, 3237267, 3112739, 2948951, 2932252, 2708816, 2706204, 2638847, 2665899, 2753981, 2438012, 2127666, 2274704, 2335179, 2375245, 2457493, 2322158]
2039B322158j37162p3645q4915P2071m6180n7210P8401j17279q7948O726l7842
2028A837175L3006m1941k60075k39607K33854l0012o7915n830k43506j51340N2461
2017A116270k3263j21989J17629J01477k411n4512l5722j11933J01668O3802k00990
2006I50026j63002K2223J11756j72079R6974O2637q4453j42464m8587K22952J19278
1995I75261k31704j27179L14568p3097p8943l2505j06019j10022J99293J3587
1985G43240L2787r7028P565k49427o4441J86353J56765N1533p749q716j24632
1974F26250o310j78643q9210k18340L07240m0721j09830M9556m9086M7265j6806
1963C21365Q2592O2577l7033m0731J05281J9446j4884k1397r3749K17657j92966
$$ y = [2322158, 2184996, 2111351, 2026436, 2098507, 2052327, 1995117, 2073518, 1956239, 1868291, 1875017, 1837175, 1870181, 1828240, 1568165, 1328558, 1562412, 1532400, 1464485, 1458655, 1215149, 1063809, 1116270, 1093007, 971018, 1088647, 1190124, 1187713, 1133201, 1097479, 985546, 1087214, 1151016, 950026, 787024, 809247, 921003, 748924, 845898, 908535, 824082, 681618, 633031, 855983, 975261, 743557, 616378, 930946, 857849, 778906, 746401, 640382, 530360, 729653, 743240, 776027, 678999, 686564, 437137, 372696, 559049, 715814, 767347, 759598, 750882, 626250, 619940, 441297, 352087, 133747, 440987, 400266, 290436, 339992, 290906, 338171, 321365, 403957, 466534, 429501, 388770, 494051, 513497, 498613, 477216, 383467, 601124, 408158]
1952D08158M712K03185j06238r0618k10579P8844J30567j10229Q2019k4604K6939
1941C92156j85427J26782J87285k81448r0065J17938J37666n3383k9217j27122
1931A95165j45128J68383J29672J9664Q4104k10759J39404J00172J983q4137l23449
1920G5074N6488R4069J9493J940j7830L5399o2804j34180j20166L39491J04141
1909C91115J4327m09904j31861N3944L0436K17051O3691Q4072l7736O0965o3236
1898B72864k00576N3755K0964q6146k25913J7068J28393P299l1244j5978J37559
1887G8045J53213O2130n0469M2987N6921j92305j46287Q1727J16960L8060o1884
1876A79098J41437o2381M7744j13508p6791j26855J96252o5756L1865J01605M7887
$$ y = [408158, 412870, 616055, 509817, 419199, 208620, 287464, 418031, 307802, 389821, 365217, 392156, 206729, 333511, 520796, 239348, 149283, 267221, 404887, 351504, 322287, 195165, 50037, 218420, 348092, 367756, 451860, 241101, 380505, 480677, 482660, 398523, 75074, 131562, 225631, 245124, 247064, 229234, 264633, 201829, 67649, -52517, 286974, 391115, 405442, -4462, -136323, -82379, -51943, 165108, 228799, 312871, 275135, 336100, 272864, 72288, 126043, 147007, 60861, -165052, -147984, -19591, -12292, -43536, -59514, 78045, 231258, 293388, 242919, 285906, 342827, 150522, 4235, 85962, 202922, 240982, 179098, 320535, 258154, 305898, 192390, 115599, -11256, 184996, 119240, 151105, 252710, 300597]
1865C00597N0053K724m468p7097j69247l1874J17117m5112J16823L3250J36924
1854D29690p8506j7652K39798n4584j01992m1636J46103J29495O2554M2770j08300
1843F47740J21947K9203j47103j88481k08181n318m0498m6146J58651q2348N9377
1832B98843o6927j94656J96334j19552n6497l2591k19861o8710O4534J93901N8803
1821E3621J72049j37832k42122K16807K37950j53674l13588R3413J75157o3888
1811C7893r9162p326J40160j44267l4826N8237P0599j02170O8828L9172K8622
1800E5760J92875K4773j41803j08477P7349k9547J66238r3850o0778J39194J2843
1789B34577j18780j68132o3194J16968m450k4867Q3181k2472j55804J39914J30445
$$ y = [300597, 350650, 353374, 348906, 271809, 102562, 70688, 187805, 142693, 259516, 292766, 429690, 351184, 333532, 573330, 518746, 416754, 375118, 521221, 650716, 713270, 756040, 647740, 769687, 798890, 651787, 463306, 255125, 249807, 209309, 163163, 321814, 239466, 298843, 231916, 37260, 233594, 114042, 57545, 24954, -194907, -263617, -199083, -5182, 53621, 225670, 87838, -154284, 62523, 300473, 146799, -166789, -73376, 101781, 37893, -61269, -68595, 71565, -72702, -107528, -49291, 21308, -80862, -12034, 27138, 55760, 248635, 273408, 131605, 23128, 100477, 70930, 237168, 143318, 82540, 221734, 234577, 115797, -52335, -115529, 1439, -3011, -27878, 55303, 32831, -122973, 16941, 147386]
1778A47386n3590j01643j97270J37493P7388n503j80081O0965J48823J49475k1126
1767A62317K034j36479m5476J33920J26285j8106j02196J8214j9826j23925J526
1756a712M1530j27105J80327J53869j09697K264n6146P6314P1198o4056o5731
1745A01055o3956j8384K13163P7004j76529o552j51435O4549l4084p4203j27559
1734a96931J28499n4558j43752J37499L3521k0460m6399O6005J21505J4743R5619
1723A35291o5516k5197j93467K29405M4897l5007J98720j49337l017J10216j20798
1712A26190J5804n3627j10701J45287r0080n4039J67672k6321q9259L6452l8004
1701B9374q2314J8889J24717l0790K32m7196N8918m685k67930K2769M5870P7546
$$ y = [147386, 93796, -7847, -205117, -67624, 9764, 4261, -175820, -114855, 33968, 183443, 162317, 164351, 27872, -17604, 116316, 242601, 224495, 122299, 140513, 120687, -3238, -1712, 39818, -87287, 93040, 246909, 137212, 139476, 83330, 159644, 230842, 166786, 101055, 37099, 18715, 231878, 308882, 132353, 125801, -25634, 38915, 4831, -69372, -196931, -68432, -122990, -266742, -129243, -95722, -116182, -162581, -96576, 24929, 39672, 135291, 69775, 44578, -148889, 80516, 125413, 90406, 289126, 139789, 136772, 246988, 126190, 141994, 88367, -22334, 122953, 32873, -21166, 146506, 120185, 30926, 67378, 29374, -52940, -34051, 90666, 59876, 60108, 12912, 71830, 67145, -200785, -178016, -132146, -54600]
1689e4600l487l0719K30234K02718j92377n3564M1955l02003P6827Q5439N2718
1678E3141l8451j18423J09608L0132m6564J86874j91885k41328K61647K2752p1685
1667d4182q9509R0979J0147p0278o8338J84906o445j08987N3750j09088n0271
1656b07316O2839J89257k8893N2799k3124M9243j94258k1092N0299J60209l5213
1645E4750N9868r3127j84452K88338p3810j48870j14678m1653K24761n3162n8787
1634a40822k9949O6709K00612j80781K829M1026Q9399R0677p3244N4306O1901
1623A82663O4439q2808k0078r8894j52008o1267J12301p3817O8821l7132P8963
1612a8817j12030k6082J49856j50330M9164P7296J04634j09767J74849j46828
$$ y = [-54600, -58087, -88806, 141428, 344146, 151769, 98205, 140160, -161843, -85016, 423, 53141, 14690, -103733, 5875, 36007, -10557, 176317, -15568, -256896, 4751, 27503, -44182, -133691, -42712, -32565, -102843, -171181, 13725, 7280, -101707, -47957, -157045, -207316, -144477, 44780, 15887, 68686, 45562, 94805, -99453, -120545, -70246, 89963, 54750, 114618, 21491, -162961, 125377, 51567, -97303, -211981, -253634, -28873, -82035, -140822, -170771, -104062, 96550, -84231, -81402, -40376, 49023, 139700, 66456, 120762, 182663, 247102, 164294, 144216, 45322, -106686, -167953, -55652, -129469, -60648, -97780, -18817, -130847, -156929, -7073, -157403, -108239, -30943, 73691, -36076, 138773, -8055]
1602h055l75819K00289J39239n8037J06259J18312j92n7318k3397k29859j017
1591a89595J52129q4173Q1718o7210n1801L9170q2599L5364L3075P4041R2545
1580C2664j4600r9441m1301P0185r147R0208m6244j36701P3863P3441J85404j24329
1568E4002k25908N566J85218J15438q4280k52220J78649J32399l2528n3050q824
1557A4462j33800J03518k22852J6126K6463j26367L59762R5757j92972L3455O7560
1546D1112k5843m0820k8760P4068l5899M7682L1764m7903P7578O877j53205N9767
1534F418m8225o5712K15194n621k40641J05960M6591K5345j28264J04498J4282
1523B9825R5349K3312j89377Q3357l040j01274j7637j6070j38494L07662J15495
$$ y = [-8055, -383874, -183585, -44346, -102383, 3876, 122188, 121996, 64678, 41281, -188578, -189595, -37466, -121639, -39921, -107131, -158932, -119762, -202361, -166997, -133922, -59881, 32664, 18064, -81377, -122678, -52493, -61640, 28568, -17676, -154377, -80514, -7073, 178331, 54002, -171906, -166340, 18878, 134316, 50036, -202184, -23535, 108864, 76336, 23286, 14462, -119338, -15820, -238672, -222546, -196083, -322450, 37312, 133069, -59903, -26448, 41112, 15269, -25551, -54311, 19757, -16142, 31540, 63304, 15401, 92979, 99856, -53349, 6418, -41807, -107519, 107675, 102054, -138587, -32627, 13964, 39309, -88955, 15543, 29825, 125174, 148486, -40891, 42466, 39426, -61848, -79485, -95555, -234049, 73613, 189108]
1512A89108k30650m745J15850O6788j70958k16667J01193l3405Q9619K4866k3635
1501i2636P0686n3223m7043N3459J02115O9358j5978O2024r9568J44406k2699
1490A70901k26802j30098J07320K3710j38069K78562j0808n2392k87602R1324
1480a73954K2873R0431r836R2344l4893k33147l5472O8556J14729l0096J53381
1469B4916K84701j40242k4335q9025J7475L8878M630j51942O1217l4922o202r8067
1457a12918j423P6997K01131l3791k71524N0086J18797r8346j286J54638K2199
1446A04560J84103k97927K3596k32985O8906Q9613j05895q0488M8455j80191Q9735
1435b88518J38114l289J03819j06600L3995J26138M899n3426N4280j19656L9395
$$ y = [189108, -41542, -46287, 69563, 136351, -34607, -251274, -150081, -183486, -93867, -69001, -92636, -21950, -75173, -122216, -68757, 33358, 102716, 86738, 148762, 49194, 193600, 170901, -55901, -185999, -78679, -54969, -193038, 85524, 74716, 22324, -265278, -173954, -151081, -60650, -70486, 21858, -13035, -246182, -281654, -213098, -98369, -128465, 24916, 309617, 169375, 145040, 56015, 73490, 112368, 116998, -34944, 26273, -8649, -14851, -112918, -114341, -37344, 163787, 129996, -141528, -91442, 27355, -70991, -72277, 82361, 104560, 288663, -9264, 14332, -218653, -149747, -60134, -166029, -246517, -198062, -378253, -288518, -150404, -153693, -49874, -156474, -122479, 3659, 8558, -44868, 9412, -110244, -70849]
1424g0849J55213J65792j0430k12398j73942K06489l1560J59953K5826j78713
1414C5381l864K202j00083L9185J17395k10787k4731j02697J83503o0592O6287
1403e8801j51406O1182Q5536k4498K9288J568o8518K9980J41172l7753j37978
1392a30228l100j47502Q1521K41422K46783k11266m3057R6421k14318k4735J1433
1381i6626K70908o9904p6545j06305j64580R3464K2358P5544Q8797j13632N6662
1370a9859K2645K6330n5840j45082K01079o8766j11450n0932M14362P476k93932
1359g3969K57981O5636k53282k85094P8749J46833o7480j49741P8962L26324k5177
1348I9742q3356o4492M823R6145q3813j6966p0495J5944l6843O7680j69290P1230
$$ y = [-70849, 84364, 250156, 239726, 27328, -146614, 59875, 28315, 188268, 214094, 35381, 31517, 33719, -66364, -27179, 90216, -120571, -145302, -247999, -64496, -125088, -58801, -210207, -149025, -63489, -87987, -58699, -57131, -125649, -95669, 45503, 7750, -130228, -133328, -280830, -199309, 42113, 288896, 77630, 34573, 130994, -83324, -108059, -96626, 174282, 104378, 27833, -78472, -243052, -149588, -127230, -51686, 37111, -76521, -19859, 2786, 29116, -26724, -171806, 29273, -39493, -150943, -201875, 212487, 219963, -73969, 184012, 249648, -3634, -288728, -209979, -63146, -130626, -280367, -201405, 124919, 99742, 16386, -48106, -43283, 52862, -30951, -47917, -118412, -102468, -139311, -71631, -240921, -169691]
1336a69691P4493Q3476M8939k9k49381o1648J49625P7205k79598K15195k3531
1325a34945J19438R5004j13764o5286Q6936J02101P8566l2131k19852q8006J160
1314a70779J27448q7957j85289M5647K9004j11837K81782K0842m9161N8418J71713
1303A29831M9234k82067N3162P346o3906J10428J19705Q074j55040j23276J77417
1292C0908j41224j04864J12438o555m6075K47853L7514l49112J865q475K52324
1281B6597r7391q4610J40685M3932K4228m0019L0336m356l2819m1760Q010K0629
1269f538M7372N8040m6082L018j51373M9972k341k8180K7963L7216r8117Q2129
1257b6921P439o2163r1606M4551J31158K5572j27745M1549J7720M7116K28805
$$ y = [-169691, -95198, -11722, 37217, 37188, -212193, -273841, -124216, -47011, -326609, -111414, -134945, -15507, 79497, -34267, -99553, -12617, 89484, 168050, 135919, -83933, -171939, -170779, -43331, -131288, -316577, -270930, -241926, -353763, -71981, -51139, -100300, -41882, 129831, 179065, -103002, -49840, -42494, -106400, 4028, 123733, 131807, -23233, -146509, 30908, -110316, -215180, -102742, -109297, -155372, 92481, 129995, -219117, -217252, -225727, 26597, -70794, -155404, -14719, 29213, 53441, 13422, 43758, 39402, 6583, -35177, -27167, -6538, 40834, 98874, 52792, 55810, -95563, -45591, -47932, -76112, -48149, -10933, -109050, -26921, -19482, -81645, -173251, -128700, 2458, 28030, -99715, -58166, -40446, 6670, 235475]
1246B35475N9793l7048j04316k49473j25023q278l6227p3661J1218K18746J24500
1235A5706j55331N4565K5526j59777N6065R5536m7433K55971l04253R9697p797
1224g1525j45646l9127J2743R0297J52390k1977j75075J34785k9471Q6082o5930
1213g2454O8868J5274k10114m014L5777J02052L6219n1880J53856j24372p877
1202e8665J25507M4722m6465o9409n9281l7176r578M538j18285p6426o8746K51714
$$ y = [235475, 295268, 258220, 153904, -95569, -220592, -228870, -265097, -338758, -327540, -108794, 15706, -139625, -85060, -59534, -219311, -163246, -67710, -115143, 140828, -163425, -63728, -71525, -217171, -256298, -243555, -153258, -868, -22845, -197920, -63135, -92606, -6524, -72454, -3586, 11688, -198426, -202440, -166663, -64611, -28392, -80272, 73584, -50788, -58665, 66842, 111564, 65099, -4310, -63591, -100767, -110345, -105807, -224092, -300518, -369264, -117550]
$$ [...]
##END NTUPLES=NMR SPECTRUM
##END=
