##TITLE=1H_EC-3265(05)
 CDCl3
 8 sc, 
 14.12.2021
##JCAMPDX= 6.0         $$ Bruker NMR JCAMP-DX V2.0
##DATA TYPE= NMR SPECTRUM
##DATA CLASS= NTUPLES
##ORIGIN= UXNMR, Bruker Analytische Messtechnik GmbH
##OWNER= root
$$ XWIN-NMR		Version 3.5
$$ Tue Dec 14 13:01:09 2021 Russian Standard Time (UT+4h)  she@DPX200
##.OBSERVE FREQUENCY= 200.131346
##.OBSERVE NUCLEUS= ^1H
##.ACQUISITION MODE= SIMULTANEOUS
##.ACQUISITION SCHEME= undefined
##.AVERAGES= 8
##.DIGITISER RES= 18
##SPECTROMETER/DATA SYSTEM= spect
##.PULSE SEQUENCE= zg30
##.SOLVENT NAME= CDCl3
##.SHIFT REFERENCE= (INTERNAL, CDCl3, 0, 15.7205)
##AUDIT TRAIL= $$ (NUMBER, WHEN, WHO, WHERE, WHAT)
$$ ##TITLE= Audit trail, XWIN-NMR		Version 3.5
$$ ##JCAMPDX= 5.01
$$ ##ORIGIN= Bruker BioSpin GmbH
$$ ##OWNER= she
$$ F:/spectra/data/she/nmr/H-F/1/pdata/1/auditp.txt
$$ ##AUDIT TRAIL=  $$ (NUMBER, WHEN, WHO, WHERE, WHAT)
(   1,<2021-12-14 12:59:46.12 +0400>,<she>,<DPX200>,
      <created by zg, POWCHK disabled, PULCHK disabled
       configuration hash MD5:
       00 E9 B6 7A A2 85 ED C7 34 08 36 98 17 FE 4E 26
       data hash MD5: 16K
       B7 47 68 E7 9D 78 C0 E4 50 40 4C 72 08 70 7F 78>)
(   2,<2021-12-14 12:59:48.78 +0400>,<she>,<DPX200>,
      <Start of raw data processing
       efp BC_mod = 2 LB = 0.24 FT_mod = 6 PKNL = 1 PHC0 = -15869.97 PHC1 = 9.000799 SI = 16K 
       data hash MD5: 16K
       D3 93 B9 A7 DE 40 00 0B 48 A4 13 BF 63 E1 EE 49>)
(   3,<2021-12-14 13:00:07.68 +0400>,<she>,<DPX200>,
      <pk PHC0 = 0.2425147 PHC1 = 0 
       data hash MD5: 16K
       4B 5E F1 3C 7F 8E 09 DD BD 01 9B 91 38 2C 0F E4>)
(   4,<2021-12-14 13:00:11.12 +0400>,<she>,<DPX200>,
      <abs ABSG = 5 
       data hash MD5: 16K
       12 FC BC 43 E8 BC 2E A8 E5 F3 6A D9 07 50 80 1D>)
(   5,<2021-12-14 13:00:41.89 +0400>,<she>,<DPX200>,
      <abs ABSG = 5 
       data hash MD5: 16K
       FC 81 6E 8E 6F 67 C7 4A 23 0E 09 01 A4 A7 0E 90>)
$$ ##END=
$$ 
$$ hash MD5
$$ 5B 6E F3 C8 74 DE 8A 6F A3 D1 05 6F 6E B9 E4 DA
##$RELAX= 
##$RELAX= 
##$RELAX= 
##$RELAX= 
##$RELAX= 
##$RELAX= 
$$ Bruker specific parameters
$$ --------------------------
##$DU= <F:/spectra>
##$EXPNO= 1
##$NAME= <H-F>
##$PROCNO= 1
##$TYPE= <nmr>
##$USER= <she>
##$AMP= (0..31)
100 100 100 100 100 100 100 100 100 100 100 100 100 100 100 100 100 100 
100 100 100 100 100 100 100 100 100 100 100 100 100 100 
##$AQSEQ= 0
##$AQ_mod= 1
##$AUNM= <au_zg>
##$AUTOPOS= <>
##$BF1= 200.13
##$BF2= 200.13
##$BF3= 200.13
##$BF4= 200.13
##$BF5= 200.13
##$BF6= 200.13
##$BF7= 200.13
##$BF8= 200.13
##$BYTORDA= 1
##$CFDGTYP= 0
##$CFRGTYP= 5
##$CHEMSTR= <none>
##$CNST= (0..31)
1 1 145 1 1 1 1 1 1 1 1 1 1 1 1 1 1 1 1 1 1 1 1 1 1 1 1 1 1 1 1 1 
##$CPDPRG= <>
##$CPDPRG1= <>
##$CPDPRG2= <>
##$CPDPRG3= <>
##$CPDPRG4= <mlev>
##$CPDPRG5= <mlev>
##$CPDPRG6= <mlev>
##$CPDPRG7= <mlev>
##$CPDPRG8= <mlev>
##$CPDPRGB= <>
##$CPDPRGT= <>
##$D= (0..31)
0 1.2 0 0 0 0 0 0 0 0.06 0 0.03 0 0 0 0 0.0002 0 0 0 0 0 0 0 0 0 0 0 0 
0 0 0 
##$DATE= 1639472385
##$DBL= (0..7)
$$ [...]
##$SUBNAM2= <"">
##$SUBNAM3= <"">
##$SUBNAM4= <"">
##$SUBNAM5= <"">
##$SUBNAM6= <"">
##$SUBNAM7= <"">
##$SUBNAM8= <"">
##$SUBNAM9= <"">
##$SW= 18.0517287032376
##$SWIBOX= (0..15)
0 0 2 0 0 0 0 0 0 0 0 0 0 0 0 0 
##$SW_h= 3612.71676300578
##$TD= 16384
##$TD0= 1
##$TE= 0
##$TE2= 300
##$TE3= 300
##$TEG= 300
##$TL= (0..7)
0 120 120 120 120 120 120 120 
##$TP= (0..7)
150 150 150 150 150 150 150 150 
##$TP07= 0
##$TPNAME0= <>
##$TPNAME1= <>
##$TPNAME2= <>
##$TPNAME3= <>
##$TPNAME4= <>
##$TPNAME5= <>
##$TPNAME6= <>
##$TPNAME7= <>
##$TPOAL= (0..7)
0.5 0.5 0.5 0.5 0.5 0.5 0.5 0.5 
##$TPOFFS= (0..7)
0 0 0 0 0 0 0 0 
##$TUNHIN= 0
##$TUNHOUT= 0
##$TUNXOUT= 0
##$USERA1= <user>
##$USERA2= <user>
##$USERA3= <user>
##$USERA4= <user>
##$USERA5= <user>
##$V9= 5
##$VALIST= <valist>
##$VCLIST= <CCCCCCCCCCCCCCC>
##$VD= 0
##$VDLIST= <DDDDDDDDDDDDDDD>
##$VPLIST= <PPPPPPPPPPPPPPP>
##$VTLIST= <TTTTTTTTTTTTTTT>
##$WBST= 1024
##$WBSW= 4
##$XGAIN= (0..3)
0 0 0 0 
##$XL= 0
##$YL= 0
##$YMAX_a= 163245
##$YMIN_a= -269784
##$ZGOPTNS= <>
##$ZL1= 120
##$ZL2= 120
##$ZL3= 120
##$ZL4= 120
##$ABSF1= 15.72045
##$ABSF2= -2.331399
##$ABSG= 5
##$ABSL= 3
##$ALPHA= 0
##$AQORDER= 0
##$ASSFAC= 0
##$ASSFACI= 0
##$ASSFACX= 0
##$ASSWID= 0
##$AUNMP= <proc_1d>
##$AZFE= 0.1
##$AZFW= 0.1
##$BCFW= 0
##$BC_mod= 2
##$BYTORDP= 0
##$COROFFS= 0
##$CY= -3
##$DATMOD= 1
##$DC= 0
##$DFILT= <>
##$DTYPP= 0
##$F1P= 0
##$F2P= 0
##$FCOR= 1
##$FTSIZE= 16384
##$FT_mod= 6
##$GAMMA= 0
##$GB= 0
##$INTBC= 1
##$INTSCL= 0
##$ISEN= 128
##$LB= 0.24
##$LEV0= 0
##$LPBIN= 0
##$MAXI= 10000
##$MC2= 0
##$MEAN= 0
##$ME_mod= 0
##$MI= 1.114404
##$NCOEF= 0
##$NC_proc= -7
##$NLEV= 6
##$NOISF1= 3.799351
##$NOISF2= 2.8
##$NSP= 0
##$NTH_PI= 0
##$NZP= 0
##$OFFSET= 15.72045
##$PC= 1
##$PHC0= -15869.73
##$PHC1= 9.000799
##$PH_mod= 1
##$PKNL= yes
##$PPARMOD= 0
##$PSCAL= 0
##$PSIGN= 0
##$REVERSE= no
##$SF= 200.130006225099
##$SI= 16384
##$SIGF1= 3
##$SIGF2= 2
##$SINO= 5.538805
##$SIOLD= 16384
##$SREGLST= <1H.CDCl3>
##$SSB= 0
##$STSI= 16384
##$STSR= 0
##$SW_p= 3612.71676300578
##$SYMM= 0
##$S_DEV= 0
##$TDeff= 16384
##$TDoff= 0
##$TI= <>
##$TILT= no
##$TM1= 0
##$TM2= 0
##$TOPLEV= 0
##$USERP1= <user>
##$USERP2= <user>
##$USERP3= <user>
##$USERP4= <user>
##$USERP5= <user>
##$WDW= 1
##$XDIM= 16384
##$YMAX_p= 356341511
##$YMIN_p= -1134604
$$ End of Bruker specific parameters
$$ ---------------------------------
##NTUPLES= NMR SPECTRUM
##VAR_NAME=  FREQUENCY,     SPECTRUM/REAL,   SPECTRUM/IMAG
##SYMBOL=    X,             R,               I
##VAR_TYPE=  INDEPENDENT,   DEPENDENT,       DEPENDENT
##VAR_FORM=  AFFN,          ASDF,            ASDF
##VAR_DIM=   16384,         16384,           16384
##UNITS=     HZ,            ARBITRARY UNITS, ARBITRARY UNITS
##FACTOR=    0.220516191357247, 1,           1
##FIRST=     3146.13383667476, 0,            0
##LAST=      -466.58292633102, 0,            0
##MIN=       -466.58292633102, -1134604,     0
##MAX=       3146.13383667476, 356341511,    0
$$ Real data points
##PAGE= N=1
##DATA TABLE= (X++(R..R)), XYDATA
$$ [...]
7082A4479511q77430q45219q90026p36138n80549m39062l69641m39056k92281
7073I010109k59530m97185j70035o5268m15719j75980j20573l24600j84284m25012
7063F371923k65539k86276l75421l10508j2767j17753k59204l52940l2391j45425
7053D213699j76000k14429r3637P0418r2098k05126j9942J19340J9434J79239
7043C800898m091j3048k4255l040O6764r8263l0913j34172m69091n8081q885j07811
7031B916012k21642k21227j10748K8293j8908k18526O7412O1609k18795l5138
7021B028342k1537j8247k92369J00516p654m3358l9176N0186k2468j8867j53374
7010A561994M455R1027K4942p2487k48827o5484K06073M2872j39375m6907k66004
$$ y = [14479511, 13602081, 12756862, 11866836, 11130698, 10550149, 10111087, 9741446, 9302390, 9010109, 8750579, 8253394, 8083359, 8018091, 7602372, 7426392, 7305819, 6981219, 6796935, 6371923, 6106384, 5820108, 5444687, 5134179, 5121412, 5003659, 4744455, 4391515, 4359124, 4213699, 4037699, 3823270, 3729633, 3800051, 3707953, 3502827, 3482885, 3602225, 3621659, 3800898, 3796807, 3783759, 3759504, 3756464, 3823228, 3724965, 3694052, 3559880, 3090789, 3032708, 3023823, 2916012, 2694370, 2473143, 2362395, 2390688, 2371780, 2153254, 2220666, 2282275, 2063480, 2028342, 2006805, 1988558, 1696189, 1796705, 1789051, 1745693, 1706517, 1756703, 1734235, 1715368, 1561994, 1566449, 1657476, 1682418, 1609931, 1361104, 1295620, 1501693, 1544565, 1405190, 1358283, 1092279]
6999A092279j02616K2438j23155k26799J34439M7484m7015P877p156m7754L9022
6988G89044k703J48464k03494R9695P0261j66341K3810J67036j86749k47106L24804
6977H16721o3176n7635J82475j68782o5146j33132J51822p5404j64119J8017o1098
6966C80543l5119J80064K34825j88578j60772O1578K7184J44264k4598M4801J65658
6955H29850m0003k22829J5602R9890j57399k56j46844M925R2336o493p2267J23255
6943E19767q8583j70854P9175J10306j813R1107o8800o0849j62706N99q0833J10632
6931B77148J30438n0079Q8566J36l9495k5925j52276K6499L1094o7614N6444O762
6919B81698J05348q9715j74949K24680q9617k94183p6437K41557J40795N5934
$$ y = [1092279, 989663, 1012101, 888946, 662147, 796586, 844070, 797055, 804932, 797776, 750022, 789044, 786341, 934805, 731311, 831006, 901267, 734926, 758736, 925772, 739023, 491917, 816721, 753545, 695910, 878385, 709603, 644457, 511325, 663147, 587743, 423624, 441641, 380543, 345424, 525488, 760313, 571735, 410963, 472541, 499725, 643989, 619391, 664192, 829850, 789847, 567018, 582620, 682510, 525111, 524855, 378011, 382936, 475272, 468779, 396512, 519767, 431184, 260330, 339505, 449811, 447998, 539105, 470305, 409456, 246750, 247349, 166516, 277148, 407586, 357507, 446073, 446209, 406714, 380789, 228513, 255012, 286106, 218492, 274936, 281698, 387046, 297331, 122382, 347062, 257445, -36738, -113175, 128382, 269177, 325111]
6909C25111J10289j65175K0432L4791L293J35609n8034k84188k4236o2960J51387
6898A86319J21544j16328j65626J51458O9690J04575J31351j9212M7837l5317
6888D76291k59876K3033l953J31755L5921n6413J42606j1428j18618k22962J26461
6877B62817n3987M7705J27311m8747q2008k0599j07326j6740J9428M8752r6066
6866H0540J13870m9886n5237P4725j18348K20591K17020k67185O6155L111j14775
6855A70581R8444p4954j72816l193J08915j63083J10595K9710j93666J9119O7534
6844b814J2122M1355J2467P2471m5132k8581J09698J44552n3882n3646j53474
6833E5136P7538p5800L1570J35394p6488r407Q2670q8123r9154p3048J40013q7243
$$ y = [325111, 435400, 270225, 290657, 325448, 328741, 464350, 406316, 122128, 97892, 34932, 186319, 307863, 191535, 25909, 177367, 247057, 351632, 482983, 463771, 511608, 476291, 216415, 239448, 235495, 367250, 403171, 346758, 489364, 477936, 359318, 136356, 262817, 208830, 256535, 383846, 335099, 253091, 232492, 125166, 108426, 127854, 176606, 80540, 194410, 144524, 89287, 164012, 45664, 266255, 483275, 216090, 282245, 285356, 170581, 269025, 194071, 21255, 18062, 126977, -36106, 74489, 104199, -89467, -70348, -2814, 9308, 50663, 63130, 135601, 90469, 61888, 171586, 316138, 262256, 208610, 55136, 132674, 56874, 88444, 223838, 147350, 137943, 220613, 132490, 33336, -39712, 100301, 13058]
6821A3058J27887R4035j38095J28610q1762O9632j67834j18712J89802l1410j55494
6810g0283q809J31572m7924L9673R3977m9417j75848r1964J22306J76920o9976
6799E0227j16493p193J00114M2948O8875l4927P7712k5095j26363O4859K6153
6788A20817P200J91755J9802k43591J32745l33972L61307J85940r2586r4143j46763
6777A08511j82233Q7598P8405O0040J99074q6439k36402k9165n3231O3798J17874
6766A27830o1143L8751K21746j72809n3595J68386P7285Q2713k92218j92392l1544
6755h6990K06855p2912K1343m4281J07185m5752Q4978J01279n1830l5962l3360
6744A50553r7902o7581K27763L3359k31098k78380N2151J85041N8655j08370Q2354
$$ y = [13058, 140945, 234980, 96885, 225495, 143733, 213365, 45531, -73181, 116621, 85211, -70283, -79092, 52480, 4556, 44229, 138206, 88789, -87059, -179023, -56717, 120203, 50227, -66266, -73459, 26655, 69603, 138478, 103551, 181263, 156168, 29805, 94664, 120817, 128017, 319772, 339574, 95983, 228728, -105244, 256063, 442003, 349417, 255274, 108511, -73722, 13876, 92281, 152321, 351395, 264956, 28554, -611, -53842, 9956, 127830, 66687, 105438, 327184, 154375, 100780, 269166, 346451, 429164, 136946, -55446, -86990, 119865, 46953, 68296, 24015, 131200, 85448, 170426, 271705, 219875, 183913, 150553, 52651, -14930, 212833, 246192, 15094, -263286, -211135, -26094, 32561, -75809, 6545]
6733F545o343m6862o4475j4376J43760J63351J02451j91253m7699O8421L26M0440
6721A54286o4443p9224P2276J1749j19031R5569L20946r8131M7313R7211J5268
6710D53789P3736j93010q5561J42456O8217o3515k2255L0024n0659k0555M9039
6699C81706J40547k9074p8322O6989O0254j10560J4603p2401j47225Q7119j29006
6688A84630n5907j80565n2982K16405Q8991j16949P6848R195Q8614j21812N9581
6677A96049J274O8727o4640J5856n1390K3258q7238O8973M7996k74719J2504q848
6665e2198J01831J0155O3141r3722Q7223k1806J20166K27645q3203k78561K19100
6654B99771Q068j58956n9794j88363m1686L01343k5030j278j03836J72791n1508
$$ y = [6545, 202, -46660, -111135, -125511, 18249, 181600, 284051, 92798, 45099, 113520, 113846, 154286, 89843, 10619, 82895, 94644, -24387, 71182, 392128, 293997, 341310, 438521, 453789, 527525, 334515, 248954, 391410, 459627, 396112, 373857, 403881, 353222, 332667, 381706, 522253, 493179, 414857, 481846, 542100, 431540, 446143, 373742, 226517, 313636, 184630, 128723, -51842, -104824, 111581, 200572, 83623, 160471, 169666, 258280, 136468, 196049, 197323, 266050, 201410, 217266, 165876, 189134, 101896, 170869, 218865, -55854, -43350, -52198, 49633, 59788, 122929, 29207, 116430, 94624, 214790, 442435, 359232, 80671, 299771, 307839, 148883, 89089, -99274, -140960, 160383, 135353, 134075, 30239, 203030, 151522]
6643A51522j08528J56770p0157p2099l6128N8599J06425l8741j81917M3419J87918
6632A97083r0372j18663N6418R5533N2162l4486p5180j37000J28720J52728j98592
6621B8351o8716P9170o0968J06156P7686q6543Q964j10943k5938j6947k9987J77005
6609G7290k9040J41951r1831k9753J84717j32662j13191r7953N9398N4310o4040
6598d0804R4723n7019P0988k13215J21760R02j98967J93314O3629q645K5077J22336
6586A74079J5011p7666l6346r1315j14564J04534K42118j24061k33880J07816
6576c4274J33138M0820j15160o8394K64190j64182O1351J4471p8255O2501K8015
6565A44221j17816q8206J24522O2766J73498k57154M4018M4309k6938r1347j36002
$$ y = [151522, 42994, 199764, 129607, 57508, 21380, 79979, 186404, 147663, -34254, 9165, 197083, 106711, -11952, 44466, 139999, 192161, 157675, 82495, -54505, 74215, 226943, 28351, -40365, 38805, -22163, 83993, 161679, 75136, 84100, -26843, -52781, -69728, -99715, 77290, 48250, 190201, 98370, 68617, 253334, 120672, 7481, -90472, -31074, 23236, -40804, 53919, -3100, 67888, -145327, -23567, -22665, -221632, -28318, 35311, 26666, 51743, 174079, 189090, 111424, 75078, -16237, -130801, -26267, 215851, 91790, -142090, -34274, 98864, 139684, 24524, -43870, 220320, 56138, 117489, 131960, 53705, 116206, 144221, 26405, -61801, 62721, 125487, 298985, 41831, 85849, 130158, 103220, 11873, -124129]
6554a24129L2980Q578R0201K5246k4471j1115Q1639L1629k4567j56003J40945
6543G0933K04657k9016N2718k20916j73269O0117q6821N9721J14923Q8900J69546
6532C11493j87845O7648n7460j24777J17752J44963p6916r3317n9913j00279P4171
6521A5520q0834O2596p3749J3949P1597j0336N2137L2462j20565J29110M6279
6510A38166j11817l6123J07675M1991j35672n4181J3601K2906m7451J60070N8238
6499A57403J45284l16971j30263J79662L1188n1515o685K2107K9313O2089l3056
6488H8556m754o3899O0175J68714P8694L7734l4873j44374l9944j7582j8223j18423
6476h199J8613k4538J22671L5036J27525p2764K8687j5026k71934J3345R9960
$$ y = [-124129, -91149, -82571, 7630, 32876, 8405, -2710, 78929, 110558, 85991, -70012, 70933, 275590, 246574, 299292, 78376, -94893, -34776, -121597, -61876, 53047, 141947, 311493, 123648, 191296, 133836, 9059, 126811, 271774, 194858, 101541, 41628, -58651, 15520, -65314, -2718, -76467, -62518, 9079, -1257, 50880, 83342, -37223, 91887, 138166, 26349, -9774, 97901, 139892, 4220, -49961, -36360, -13454, -60905, 99165, 157403, 302687, -14284, -144547, 35115, 66303, 14788, 8103, 30210, 59523, 121612, 88556, 83802, 19903, 80078, 248792, 327486, 365220, 330347, 185973, 146029, 128447, 110224, -8199, 10414, -14124, 108547, 143583, 271108, 198344, 227031, 212005, -59929, -46584, 53376]
6465E3376k57265j8372J81071m792j0096K0592L4097l9080j46136p737K24727
6454C0385l2198Q4076J35832Q8210M925k37162N5694R9813j43049P3917k2187
6443A38256P66p2903o9191N758K57915r712r6317j00620N1140J01339j13510o1113
6431C1808J22918P298k50103K33942J31287j5881j23653L1399K27724j77941L8044
6420B56842p1865J19040J19516k84976K3207J1446n6319r508J48565Q3137o5735
6409B73350J32922O3535p8339j26076Q5635j36803P8508J69315K3346j79537j72187
6398A33669J09382J65307p814j15095j5787p5188P0056Q6281m1112O7274L4066
6387D11039p8768q1636N7741J79374k7315M3500k3571j01171l4123J33988k92167
$$ y = [53376, -203889, -222261, -41190, -45982, -56078, -35486, -1389, -40469, -186605, -194342, 30385, -1813, 82263, 218095, 306305, 311230, 74068, 129762, 229575, 86526, 160443, 138256, 139022, 66119, -3072, 2686, 260601, 250889, 154572, 53952, 105092, 206431, 92921, 31808, 154726, 162024, -88079, 145863, 277150, 261269, 137616, 169015, 396739, 218798, 256842, 184977, 304017, 423533, 138557, 161764, 173210, 116891, 107383, 255948, 339085, 273350, 406272, 469807, 391468, 265392, 351027, 214224, 292732, 462047, 485393, 305856, 133669, 243051, 408358, 400544, 285449, 269662, 194474, 264530, 350811, 309699, 376973, 411039, 332271, 250635, 308376, 487750, 460435, 503935, 480364, 379193, 345070, 479058, 186891]
6376A86891j1280J95077k1177L8221J12117J22836k32214N5263n6395m3344J76562
6365E22557m9068j92859r3254P7008J15949J68711r8248J01420K2902k07138j63988
6354B03992J09736J16419J08886N6717k8949j381m8280j53000M8361J84509J73255
6343G70265J08070j94197N6036J59352l1506j2358j13614j23486J37927l2071
6333G24418m7678M1388p9785J9117k17724J59924J19039m8723O709J01812J3224
6322G91721J2125m4073j0179N9158m3186j43001k795O8459m6372L6554N182r0736
6310E92857n9978J54127j41026J22499J44042J21712l60148j3462r7P7967R5967
6299G34460r4426j47078J36223L0592J38963r9327j76482R2101l6324K62182l27064
$$ y = [186891, 175611, 370688, 349511, 387732, 499849, 622685, 390471, 445734, 389339, 345995, 522557, 473489, 280630, 187376, 264384, 380333, 549044, 450796, 552216, 575118, 367980, 203992, 313728, 430147, 539033, 595750, 566801, 565420, 517140, 364140, 412501, 597010, 770265, 878335, 684138, 740174, 899526, 868020, 855662, 742048, 618562, 756489, 724418, 676740, 718128, 638343, 657460, 439736, 599660, 718699, 669976, 676685, 778497, 791721, 803846, 759773, 749594, 808752, 765566, 622565, 619770, 688229, 641857, 678411, 683593, 592857, 532879, 687006, 545980, 668479, 812521, 934233, 574085, 560623, 560526, 638493, 734460, 640034, 492956, 629179, 659771, 798734, 699407, 522925, 615026, 578702, 840884, 513820]
6288E13820m6618J82532j22916k3447o7039n4688R1320K05672M1479j25018Q3272
6277F78369J885l3023J90985k13380p8057J72047k49843K2923J59683M0635j71001
6266E21223P7868j29543J12069o3467l5373K20574p0838j51302m4642J04004O1739
6255F02312j6511P4321O4983k96071k9807J44204J610R8982J34755J08501l00476
6244E86803j38537L04059M5138L7505j09801o5786J6630Q3300l0106j07858K7747
6233F49094K7303k31439j9365P759J18525q7674J60066K40063j56409m0936O9723
6222G36710P6113j74068J63103J8722J01032L2833j56803J11110J21031j25716
6212I04067m815J9808j9605L121M8995J46142k0902j50608O4833k4953j8911L3120
$$ y = [513820, 467202, 649734, 526818, 503371, 436332, 381644, 472964, 678636, 720115, 595097, 678369, 680254, 647231, 838216, 624836, 546779, 718826, 468983, 491906, 651589, 692224, 521223, 599091, 469548, 581617, 518150, 482777, 703351, 632513, 481211, 436569, 540573, 602312, 585801, 660122, 725105, 429034, 399227, 543431, 545041, 644023, 778778, 887279, 586803, 448266, 752325, 797463, 834968, 725167, 659381, 676011, 759311, 729205, 621347, 649094, 676397, 444958, 425593, 433352, 551877, 464203, 624269, 864332, 707923, 666987, 736710, 812823, 638755, 801858, 820580, 921612, 954445, 797642, 908752, 1029783, 904067, 899252, 919060, 899455, 902576, 951571, 1097713, 1076811, 926203, 991036, 966083, 947172, 980292]
6200I80292K03118m1734l178J06190n1996o8990m1020J663J10547N1168J77441
6189A423501O9237J31874o8426j43544J48829J17281O1640j28182P7140J02933
6179A792283k26959l09860J64016J26981K5580L453J49983p0094K41153k02380
6169A694156j19739Q3044K72427q6013o0151M925l1386l511n0944Q8369O8962
6158A860139Q0940O664m2142k52401K36952j11661R8026l4305O2707J91068l0608
6147B065379j8913r5857j08569J89143J40926k24P2476J3052J5814l3481p1417
6136B168329P2306J37482M3218N0179M8162j07325K57878j23273o0209J82414
6126B669161q1205J90504O3746J62942K0710j0596K4065J17166P2960L7821o4198
$$ y = [980292, 1183410, 1141676, 1138498, 1244688, 1192692, 1123702, 1082682, 1084345, 1194892, 1246060, 1423501, 1492738, 1624612, 1556186, 1412642, 1561471, 1678752, 1740392, 1612210, 1689350, 1792283, 1565324, 1255464, 1419480, 1546461, 1572041, 1575494, 1725477, 1655383, 1896536, 1694156, 1574417, 1657461, 1929888, 1843875, 1783724, 1788649, 1757263, 1753752, 1702808, 1791177, 1860139, 1941079, 1947743, 1905601, 1653200, 1890152, 1778491, 1876517, 1842212, 1904919, 2095987, 2065379, 2046466, 1950609, 1842040, 2031183, 2172109, 2171885, 2244361, 2257413, 2273227, 2239746, 2168329, 2240635, 2378117, 2421335, 2471514, 2519676, 2412351, 2670229, 2546956, 2486747, 2669161, 2587956, 2778460, 2842206, 3005148, 3025858, 3015262, 3039327, 3156493, 3229453, 3267274, 3203076]
6115C203076K55253O3628J97822K43135R8081k34943m1198P5391L69637m7692
6105D182190j0593L5103J28395J05712m0120J23505J76783K04023p1846L01803
6095E134955O6992J56971P4473K19465N020L07041L55437J9494L69713o1346K55380
6084F903595K65651L54552M19915J82450M33097L27002N46360O55920N28168P63797
6074A1380507R03888O82068J238978J347777J354341J706992J995689K160924
6066B2771164J319769j352083j896523j467565j510322j246965p62155n33887
6058A5321433k8996J60882j71682J04583K75570K37735K51865N74592N40236P09366
6048A7975584P97516J181177J234183J443438J646364J752846K174298K470979
$$ y = [3203076, 3458329, 3521957, 3719779, 3962914, 4060995, 3826052, 3784854, 3860245, 4229882, 4182190, 4171597, 4206700, 4335095, 4440807, 4400687, 4524192, 4700975, 4904998, 4833152, 5134955, 5201947, 5358918, 5433391, 5652856, 5657876, 5964917, 6320354, 6339848, 6709561, 6648215, 6903595, 7169246, 7523798, 7943713, 8126163, 8559260, 8886262, 9432622, 10088542, 10616710, 11380507, 12284395, 12966463, 14205441, 15553218, 16907559, 18614551, 20610240, 22771164, 24090933, 22738850, 20842327, 19374762, 17864440, 16617475, 15855320, 15321433, 15292437, 15453319, 15281637, 15386220, 15661790, 15899525, 16151390, 16725982, 17266218, 17975584, 18773100, 19954277, 21188460, 22631898, 24278262, 26031108, 28205406, 30676385]
6040C0676385K953720L240234L762893M515497N739792P005787N014423l226236
6032E9682495o671551m855644m645404m460867k934618k061362j466832p06238
6024C1879979k85432Q5272L28224P83177J109144R61543J307618J469312K070524
6015C9709361K215559K809725L459071L895578M497567M758214M138147L158957
6007F8642179L533580L554637L823021M871706O254804N342612j903146p554197
5999H6565196n723349n046203m363319k891989j462850p54602N72126Q27774J035680
5990F8758464J154879J597645J906630K218545K819639L571894M358498M992324
5982I1378518K877184j484672l648142l640962l266262l027679k136756j521452
$$ y = [30676385, 33630105, 36870339, 40633232, 45148729, 50888521, 57894308, 62908731, 59682495, 53010944, 48155300, 43509896, 39049029, 36114411, 34053049, 32586217, 31879979, 31594547, 31679819, 32008043, 32791220, 33900364, 34861907, 36169525, 37638837, 39709361, 41924920, 44734645, 48193716, 52089294, 56586861, 61345075, 65483222, 68642179, 72175759, 75730396, 79553417, 84425123, 90679927, 96022539, 94119393, 86565196, 80841847, 75795644, 71432325, 68540336, 67077486, 66322884, 66895010, 67722784, 68758464, 69913343, 71510988, 73417618, 75636163, 78455802, 82027696, 86386194, 91378518, 94255702, 92771030, 89122888, 85481926, 82215664, 79187985, 77051229, 75529777]
5974G5529777j232131o55189K48464O13437K30694k162395m389942l600797k937291
5965F1644627k954660k493665j972256j509537j295568q74741j029456p93594
5957D8721150o09343q40659j485779k346431l133657l069768k684093k503192
5949C2048228k191677j625291j201324j214418o88392p67727o01065m57037p25046
5940B2576251p63416n17823l62903n88159m92453m40373m88877l16671j60157
5931A8445419k91525m19768j69068m1533j13928k76975J28282j65211l15707k42429
5921A6537557j55025j39544j04416n3074N1448q9369k56366J05188K27535J12533
5911A6236467J0503j6734J60843K09977J94895K38670K26739K75653J6346K32811
$$ y = [75529777, 74297646, 73642457, 73890921, 74504358, 74735052, 72572657, 68182715, 64581918, 61644627, 58689967, 56196302, 54224046, 52714509, 51418941, 50544200, 49514744, 48721150, 48111807, 47271148, 45785369, 43438938, 40305281, 37235513, 34551420, 32048228, 29856551, 28231260, 27029936, 25815518, 25127126, 24359399, 23758334, 23301297, 22576251, 21812835, 21295012, 20932109, 20343950, 19851497, 19411124, 18922247, 18605576, 18445419, 18153894, 17734126, 17565058, 17523525, 17409597, 17132622, 17260904, 17095693, 16779986, 16537557, 16382532, 16242988, 16138572, 16085498, 16136946, 16047577, 15791211, 15896399, 16123934, 16236467, 16246970, 16230236, 16391079, 16601056, 16795951, 17034621, 17261360, 17537013, 17553359, 17786170]
5901A7786170K43524M84334J62618M37525M32768L53483O17199M54900O94418
5892B1666939N73076M36943R34253R28529R76168R63701J103851J099864J416525
5883C0099849J721377K052619K299668K489719K901324K782352K195238J745189
5875D8287335J127455O58102N33467O19398Q15109P76095P04952J055481J189272
5866E5766666J443717J714495J827659K187134K250957K054259J785593K016939
5858G1047419K008550J819960K186476K450335K669466L183749L311758K623525
5850I1301238L94730k529499l688682l810626l802918l682964l114696k278463
5842F8788120k141641j775979j816570j645404j485681j238338r84235p57803
$$ y = [17786170, 18029694, 18514028, 18676646, 19114171, 19546939, 19900422, 20517621, 20972521, 21666939, 22240015, 22676958, 23611211, 24539740, 25515908, 26479609, 27583460, 28683324, 30099849, 31821226, 33873845, 36173513, 38663232, 41564556, 44346908, 46542146, 48287335, 49414790, 50072892, 50606359, 51225757, 52040866, 52816961, 53521913, 54577394, 55766666, 57210383, 58924878, 60752537, 62939671, 65190628, 67244887, 69030480, 71047419, 73055969, 74875929, 77062405, 79512740, 82182206, 85365955, 88677713, 91301238, 91695968, 89166469, 85477787, 81667161, 77864243, 74181279, 71066583, 68788120, 66646479, 64870500, 63053930, 61408526, 59922845, 58684507, 57700272, 56942469]
5834E6942469o66499q56411p33501k08066o33471m97930m74897o19492m72895
5825E1779307q66826j094984k189290l129911k956173k604112k339533k051630
5817C4546848k033598j728555j425825j072921j025224j065442q88046p93223
5809B4514014p55261q50937r99786o32877r74995p26456q21542p82451p28965
5800A7240744q55090o99790m06034l58199k71445k70031k75622k02371k13213
5791A3688949j47399j67162K7527k10947j52506R0136K49760J14964j18884k0994
5781A3353444k13644k21747l72913n59897m25401m50864m14377l74846k63845
5772A0055910l14991j68813j73337l04268k41875L8579P3722J34665k80014o1569
$$ y = [56942469, 56275970, 55419559, 54686058, 54477992, 53844521, 53346591, 52871694, 52252202, 51779307, 50912481, 49817497, 47628207, 44498296, 41542123, 38938011, 36598478, 34546848, 32513250, 30784695, 29358870, 28285949, 27260725, 26195283, 25307237, 24514014, 23758753, 22907816, 21908030, 21275153, 20300158, 19573702, 18752160, 17969709, 17240744, 16385654, 15685864, 15279830, 14921631, 14650186, 14380155, 14104533, 13902162, 13688949, 13541550, 13374388, 13401915, 13190968, 13038462, 13128598, 13378358, 13493322, 13374438, 13353444, 13139800, 12918053, 12545140, 11985243, 11559842, 11108978, 10694601, 10319755, 10055910, 9740919, 9572106, 9398769, 9094501, 8852626, 8891205, 8964927, 9099592, 8819578, 8758009]
5762H758009m7568p1398Q0619M8561k30419j31929j05792K9556O6314M6635r4253
5751H348335l50370p0902m54426l38020m13950l26245k55596k75683k56987j38423
5741E467733J26188j17902l7669r0227N1905o8927p9486j41537M3011o8818P347
5730E091618j70115k1328O8708o2732j10222k08875j70977j69789j75562r4810
5720C975916j44843l406k33121k04678j15420j25093j11367J0928q2977K5497
5710B991436J4352q7540k91935Q0007J25682J5257N2585l376J17205O8880j43910
5699B938643j39884K42068K671p2231J1754O3716l20846m8323m4265n3827j07415
5688B472061k6466k14696j9140K11061j11235o0868n9692j86214P5525j38861
$$ y = [8758009, 8710441, 8639043, 8719662, 8768223, 8537804, 8405875, 8300083, 8329639, 8395953, 8442588, 8348335, 7997965, 7927063, 7472637, 7134617, 6720667, 6394422, 6138826, 5863143, 5606156, 5467733, 5593921, 5476019, 5438350, 5348123, 5400028, 5331101, 5251615, 5110078, 5153089, 5084271, 5091618, 4921503, 4900175, 4968883, 4906151, 4795929, 4587054, 4416077, 4246288, 4070726, 3975916, 3831073, 3827667, 3594546, 3389868, 3274448, 3149355, 3037988, 3048916, 2965939, 2991436, 3005788, 2918248, 2626313, 2706320, 2832002, 2847259, 2899844, 2896468, 3013673, 3082553, 2938643, 2798759, 3040827, 3043498, 2971267, 2983021, 3046737, 2725891, 2677568, 2633303, 2579476, 2472061, 2445595, 2230899, 2211759, 2422820, 2311585, 2250717, 2191025, 2004811, 2080336, 1941475]
5678A941475O1326R0239P7872q0604o7925K0325J10692m7912q5280n3793j01843
5667A864572J09824L97711o8481j26632R8169L0606K66899J39597k34502J6792
5657B494555J30823n7656k00897O3274p8757j7782L8581R2426J9301j67783J72394
5646B488479J35694r6458J37965l28843j15087Q8540K72541P1970j44119L4235
5636B544917J4039j53924J52994J62511N2517N7815j09944m4425l2565P9601L15963
5625C039499J86863j08965m9153j47855J79633K7387J0495p0958K3384j65714
5615B924616R3989J52899R0120j07792j71706q4986j73j31981k6700l7702J60068
5604B860652N329p0872n7796j24632j35472k86454O3858K34705j10690j69011
$$ y = [1941475, 2002801, 2093040, 2170912, 2090308, 2022383, 2042708, 2153400, 2105488, 2020208, 1966415, 1864572, 1974396, 2372107, 2303626, 2176994, 2275163, 2305769, 2572668, 2712265, 2477763, 2494555, 2625378, 2567722, 2366825, 2430099, 2351342, 2333560, 2372141, 2464567, 2483868, 2316085, 2488479, 2624173, 2527715, 2665680, 2336837, 2221750, 2310290, 2582831, 2654801, 2510682, 2544917, 2558956, 2405032, 2558026, 2720537, 2773054, 2830869, 2720925, 2676500, 2643935, 2723536, 3039499, 3226362, 3117397, 3068244, 2920389, 3100022, 3127409, 3137904, 3066946, 3090330, 2924616, 3018605, 3171504, 3261624, 3153832, 2982126, 2897140, 2896967, 2764986, 2738286, 2700584, 2860652, 2865981, 2795109, 2737313, 2612681, 2477209, 2190755, 2254613, 2489318, 2378628, 2209617]
5594B209617K3652O812k36378l2771j23365K7534l0730p9892n4118K3708q0118
5583A653951r7173J6143J13614M1764j03193K4149k18491M7404M3450n551k10410
5572A305657m0535L2742L8040j16968o6541L2423L3287J15855n4854j8333J63079
5561A423852n5559j36025l1532P734J08870j22557m2358o6895M6350j44148n3556
5550I34176J89555J85026k6476J61052l1443p4981J23457j35988j46424J69190
5540A347144L0007j42398Q2267J87021j3580n6795r3280k0514p896r4872j57959
5529A059145J42630J49411Q624J3075l05619j07769L46974J29318n4689m2606
5519A338494o0430N5925j20473P4739j46116q6953K1406Q547k5441J5438l0538
$$ y = [2209617, 2233269, 2240081, 2003703, 1970932, 1847567, 1875101, 1844371, 1764479, 1710361, 1734069, 1653951, 1556778, 1572921, 1686535, 1728299, 1625106, 1649255, 1430764, 1478168, 1521618, 1516067, 1305657, 1265122, 1297864, 1335904, 1218936, 1152395, 1184818, 1218105, 1333960, 1279106, 1260773, 1423852, 1368293, 1232268, 1200736, 1208470, 1317340, 1194783, 1152425, 1085530, 1131880, 987732, 934176, 1123731, 1308757, 1282281, 1443333, 1411890, 1336909, 1460366, 1324378, 1177954, 1347144, 1377151, 1234753, 1317020, 1504041, 1490461, 1433666, 1340386, 1319872, 1311976, 1217104, 1059145, 1201775, 1351186, 1359810, 1372885, 1067266, 959497, 1306471, 1435789, 1381100, 1338494, 1278064, 1333989, 1213516, 1288255, 1142139, 1055186, 1076592, 1085139, 1059698, 1075136, 1044598]
5508A044598j15870O4373K1241q9969k7296m2989N9039L0734j2060k9305Q9469
5497I91965j86409J9468j4050j8139J07893q0661j11545O5515J6521n3004k05935
5486E31619P577L64313P445J9808O3500q3391j40270o4568J02228R4155M1303
5475I43719j59505r6320Q0088J03115p6219P8279O1898l02840L1251K19218o8062
5464H14622M9453j5080L2074R2819p7724K9432P3437n6703o6856j35751O9171
5453H08894J38422k4899j19395o8326O2293N2263n2535q335q2969Q0202J91126
5442I76741O6030J2652k08854K83202l9512k10853J17224r2897l2604j68328J82285
5431H85086K65738k21522M8619N7876K28695K8150N1702k48059Q0335R6611l9641
$$ y = [1044598, 928728, 993101, 1014342, 924373, 897077, 854088, 913127, 943861, 931801, 902496, 991965, 805556, 825024, 810974, 792835, 900728, 820067, 708522, 774037, 790558, 737554, 531619, 539196, 903509, 910954, 930762, 994262, 910871, 770601, 706033, 808261, 902416, 943719, 784214, 687894, 767982, 871097, 794878, 873157, 935055, 632215, 663466, 882684, 814622, 864075, 848995, 881069, 973888, 896164, 925596, 999033, 942330, 875474, 739723, 808894, 947316, 922417, 803022, 734696, 796989, 849252, 796717, 788382, 705413, 785615, 976741, 1042771, 1055423, 846569, 1129771, 1090259, 879406, 996630, 903733, 871129, 702801, 885086, 1150824, 929302, 977921, 1035797, 1264492, 1292642, 1344344, 1096285, 1176620, 1273231, 1233590]
5420A233590R2071L3696j6618o1755j33299J44976J39866q0638K40538J0594J153
5409A604174J68787R5705j21501K03487J25184p5049J66963K19556L7297P9339
5399B503942j33789K92839M06882J28765J0165o4409q1249N3384j53512j17640
5389B845378R2861P5900p8532k32181M00085r8370m4075K31939K67164j07431
5379C352738J19651J75227K21075K20312P5499K17612J28510K28K31013L81924
5369E123789J29973P8373j67326k10805k10536p8589n6612j66321k35301J2542
5359D219187J59422l8582l72542k8463l7142j57538M5835K50o1829m9117O6449
5348C745930J58351j71841M936p9033k15506l9097K46684j8995k13867k69040
$$ y = [1233590, 1325661, 1359357, 1342739, 1280984, 1147685, 1292661, 1432527, 1351889, 1592427, 1603021, 1604174, 1772961, 1868666, 1747165, 1950652, 2075836, 2000787, 2167750, 2387306, 2424603, 2503942, 2370153, 2662992, 3069874, 3198639, 3208804, 3144395, 3063146, 3116530, 2963018, 2845378, 2938239, 3014139, 2935607, 2703426, 3103511, 3005141, 2961066, 3193005, 3460169, 3352738, 3472389, 3647616, 3868691, 4089003, 4164502, 4382114, 4510624, 4510852, 4741865, 5123789, 5253762, 5332135, 5164809, 4954004, 4743468, 4664879, 4608267, 4441946, 4206645, 4219187, 4378609, 4340027, 3967485, 3939022, 3901880, 3744342, 3790177, 3790427, 3728598, 3679481, 3745930, 3904281, 3732440, 3737376, 3658343, 3442837, 3403740, 3650424, 3631429, 3417562, 3148522]
5338C148522l56753l60462l9547M0041L433k17380p502j25436j18292O4668q5312
5327A945980j9038L8705q9422j90551K03609O9630o9809M3957j4783j32110K378
5316A788546o0467k8395Q0319J30466k0844l13417j42706J7900K9891K9763j22787
5305A388269K2232p7805J45715o1813j08898O3000K1073K64707J18862o6635K06021
5294A914728j37872j59811j67916N4988L1574K1549N2042J27001j1629M8685J04825
5283A878164m3736O3317N918K20352P3751o4935R9335J55792J3765k0922K58807
5272B639608R1568q0723Q6917J24629J03092k36346j65012P5219k7638M5990J89466
5261B846770Q917k29598L3885J30793M854K84631J07497K72943R6397j4204K11887
$$ y = [3148522, 2791769, 2431307, 2391760, 2431801, 2435234, 2217854, 2210352, 2084916, 1966624, 2031292, 1945980, 1926942, 1965647, 1876225, 1685674, 1889283, 1958913, 1889104, 1933061, 1918278, 1786168, 1788546, 1728079, 1699684, 1780003, 1910469, 1889625, 1576208, 1433502, 1451402, 1481293, 1511056, 1388269, 1410501, 1332696, 1478411, 1416598, 1307700, 1370700, 1391773, 1656480, 1775342, 1708707, 1914728, 1776856, 1617045, 1449129, 1504117, 1535691, 1557240, 1609282, 1736283, 1724654, 1773339, 1878164, 1834428, 1897745, 1903663, 2124015, 2197766, 2132831, 2232166, 2387958, 2401723, 2380801, 2639608, 2731176, 2650453, 2737370, 2861999, 2965091, 2728745, 2563733, 2638952, 2611314, 2657304, 2846770, 2855687, 2626089, 2659974, 2790767, 2795621, 3080252, 3187749, 3460692, 3557089, 3542885, 3754772]
5250C754772n3655K15287J2058k6927K34475o5750O088K74393K78551q4789j42822
5239D401681n9276j11743k96912o1887n4738L7305j13233P697m2376j8733J43246
5228C831031N9707J3619J22900K60731o1869J03137O3615R028j62777j14011K9019
5217D154130P2056k44510j35132O4818j9538l29915j92707j49143j8825o0921
5207C140313j9322j50726J66423l3580j03283J06794k8517N3973j95850j8740
5197B917485k7744p4994P5029l0016k48243J32248l3411j14315n378J960k55399
5186B337222j31117m3784j73640J07086O6729j08060J12099p4530p7524K31745
5176B246226J06795r8072n6847j83422O3937l3440j81080M7338J09547p5505p303
$$ y = [3754772, 3701117, 3916404, 3928462, 3901535, 4136010, 4070260, 4076348, 4350741, 4629292, 4544503, 4401681, 4342405, 4230662, 3933750, 3871863, 3817125, 3854430, 3741197, 3748894, 3706518, 3687785, 3831031, 3890738, 3904357, 4027257, 4287988, 4226119, 4329256, 4392871, 4401899, 4239122, 4125111, 4154130, 4226186, 3981676, 3846544, 3911362, 3891824, 3561909, 3369202, 3220059, 3201234, 3140313, 3120991, 2970265, 3136688, 3103108, 2999825, 3106619, 3078102, 3132075, 2936225, 2917485, 2889741, 2814747, 2889776, 2859760, 2611517, 2743765, 2710354, 2596039, 2590661, 2592621, 2337222, 2206105, 2162321, 1988681, 2095767, 2162496, 2054436, 2166535, 2092005, 2014481, 2246226, 2353021, 2254949, 2198102, 2014680, 2078617, 2045177, 1864097, 1911435, 2020982, 1945477, 1938174]
5165A938174J0362Q5709j08458Q217J16331J23225L0290J32884J46433K4431K09234
5154B716832m5932N9766J38412O7137J55548J15696j60813j72339k13190k45557
5144B415560M3766P4494J66638k9510n3050j47441J01146R0505K29133j6034j50029
5133B725178J8109j35067L8130n6384o4363J40929K44332K9314J62930Q5456q9653
5122C098911M1726J78908M19785K14857K66839K04484l19777k62240q7127j07947
5112C648419k56063j24294j5325R3049K1074J90257P6178J46723O5075M59934
5102D305027J66113k28025l2149k08043k49157j46015k15084j93304L551K11863
5092C414777O8375k8780k56138p4830J86963J70422R9869l1197K03239O5444P4037
$$ y = [1938174, 1948536, 2034245, 1925787, 1934004, 2050335, 2173560, 2203850, 2336734, 2483167, 2507598, 2716832, 2670900, 2730666, 2869078, 2936215, 3091763, 3207459, 3046646, 2874307, 2661117, 2415560, 2459326, 2533820, 2700458, 2670948, 2617898, 2470457, 2571603, 2662108, 2891241, 2875207, 2725178, 2743287, 2608220, 2646350, 2589966, 2525603, 2666532, 2910864, 2940178, 3103108, 3188564, 3098911, 3140637, 3319545, 3739330, 3954187, 4221026, 4425510, 4105733, 3843493, 3756366, 3648419, 3392356, 3268062, 3252737, 3345786, 3366860, 3557117, 3633295, 3780018, 3845093, 4305027, 4471140, 4243115, 4210966, 4002923, 3753766, 3607751, 3392667, 3199363, 3202914, 3414777, 3483152, 3454372, 3198234, 3123404, 3310367, 3480789, 3580658, 3549461, 3752700, 3818144, 3892181]
5081C892181o0667N2011K11643K42881L33405J49662K24572L17333K53614L16816
5071E933451L29158J68085L67045K70203K43166L31395N42210M94682Q16589P82736
5061A0278720Q19679R76916J228849J562426J894662K097883K084035J466605
5053B2409775r04089k376327k282523k143885j878978j673580j474893p95687
5045H879813o60826o75320n69071j82062l09542l41945n1455l2608j63797j30693
5035E762494j70956k41526p4968M6767p2248p6853n1529l5723j5866N1764L69780
5024E491136R9048J10600l03459l68003k47363k70990k97819k00590k36963p6929
5014C698668j79235N77O0568k26685M0434k48337j08593M2020Q8638k6533j10617
$$ y = [3892181, 3831514, 3883525, 4095168, 4338049, 4671454, 4821116, 5045688, 5363021, 5616635, 5933451, 6262609, 6430694, 6797739, 7067942, 7311108, 7642503, 8184713, 8679395, 9495984, 10278720, 11098399, 12075315, 13304164, 14866590, 16761252, 18859135, 20943170, 22409775, 21505686, 19129359, 16846836, 14702951, 12823973, 11150393, 9675500, 8879813, 8218987, 7543667, 6974596, 6792534, 6482992, 6141047, 6089592, 6056984, 5893187, 5762494, 5591538, 5350012, 5275044, 5321811, 5249563, 5172710, 5121181, 5085458, 5069592, 5121356, 5491136, 5590184, 5700784, 5397325, 5029322, 4781959, 4510969, 4213150, 4012560, 3775597, 3698668, 3519433, 3520010, 3580578, 3353893, 3394327, 3145990, 3037397, 3079417, 3168055, 3141522, 3030905]
5003C030905j56410j10073J91224J09673l8325k4222j30760p3721J65855K12849
4993C176995j9961p2747M5720j3650j11626L9609m5019J26827o4785k02395Q1338
4982B940306R0927j30172r3976J55142L8537P0072o8111j4804J82640K18303K5038
4971C413902k2944J90666n3483m5965J5669L3553R6674L60178K02389r4042k65703
4960C830894M599N6367J36421J22479R4750P5493n1668R7071Q8177m0267J71404
4949D585720j4538J75359K05697J4459l86806l5608j36798m973J25808N8101j27661
4938D458760j86326N4283L78489k4244j79515J57017P2511Q9825K06875K12367
4928E240042o6145J03091K11360K02945K56494Q5923Q5591o7576K03289K22484
$$ y = [3030905, 2874495, 2764422, 2955646, 3065319, 3026994, 3002772, 2872012, 2798291, 2964146, 3176995, 3157034, 3084287, 3130007, 3116357, 3004731, 3044340, 2999321, 3126148, 3061363, 2858968, 2940306, 3031233, 2901061, 2807085, 2962227, 3000764, 3070836, 3002725, 2987921, 3170561, 3388864, 3413902, 3390958, 3581624, 3528141, 3482176, 3497845, 3531398, 3628072, 3988250, 4190639, 4096597, 3830894, 3835493, 3891860, 4028281, 4150760, 4245510, 4321003, 4269335, 4366406, 4454583, 4414316, 4585720, 4571182, 4746541, 4952238, 4966697, 4579891, 4544283, 4407485, 4402512, 4528320, 4586421, 4458760, 4272434, 4326717, 4705206, 4680962, 4501447, 4658464, 4730975, 4820800, 5027675, 5240042, 5173897, 5276988, 5488348, 5691293, 5947787, 6033710, 6119301, 6051725, 6255014, 6477498]
4918F477498J71488J72721J15137K49586J94792j77025J78600K18112m2796J33086
4908G691199J34502K18878N4392K42540K24691J42732J96299K68224R2703K06830
4898I472990K78173K40950K15761M24045J55817K15007K25675M55501K01539L08042
4888A2193500J21874M32758K18672L99912J40544M80794J44592L18733L06944
4879A4758323M21817N16783L56786M41778P98804N26794J95640M99482Q83764
4870A9399971N00269N94108N05356P31122P80261Q85023J174440J085159Q83840
4861B6539549J117153J101408J157525J149066J359449J620458J883547K205823
4853C8133978K215943K443900K946608L371049M132571N193049N893649O725435
$$ y = [6477498, 6648986, 6821707, 6936844, 7186430, 7381222, 7204197, 7382797, 7600909, 7558113, 7691199, 7825701, 8044579, 8098971, 8341511, 8566202, 8708934, 8905233, 9173457, 9266160, 9472990, 9751163, 9992113, 10207874, 10631919, 10787736, 11002743, 11228418, 11683919, 11885458, 12193500, 12315374, 12748132, 12966804, 13366716, 13507260, 13988054, 14132646, 14451379, 14758323, 15180140, 15696923, 16053709, 16495487, 17294291, 17821085, 18016725, 18516207, 19399971, 19900240, 20494348, 20999704, 21730826, 22511087, 23396110, 24570550, 25655709, 26539549, 27656702, 28758110, 29915635, 31064701, 32424150, 34044608, 35928155, 38133978, 40349921, 42793821, 45740429, 49111478, 53244049, 58437098, 64330747, 71056182]
4845G1056182Q015834R135325R540254J2396701J3856211J5046196J7302219K2788748
4837A79137670L0198672K7215388j3573170l4183694k2811318k2516630k1293684
4830A22173234j6749667j1110536p576510m466624l121158j851954j014886L13252
4822G6595151J081916K090632K258762K615466L583049N529826O727730Q675258
4814A09157790J0145382J2398930J3094011J6298643J9882838K2991808K4462437
4807B28431839K9688415L8499216M6767410J2954631m4142610m6157231l6583507
4800B29458163l7235965l2804330k4226884j7215581j1827203q187400n788324
4793I2172476m402613k455659j100175n8727j201012k650003l951589n687042
$$ y = [71056182, 79072016, 88207341, 97747595, 110144296, 124000507, 139046703, 156348922, 179137670, 209336342, 236551730, 222978560, 188794866, 165983548, 143466918, 122173234, 105423567, 94313031, 86736521, 82269897, 79148739, 77296785, 76281899, 76595151, 77677067, 79767699, 82026461, 84641927, 88224976, 93754802, 100482532, 109157790, 119303172, 131702102, 144796113, 161094756, 180977594, 203969402, 228431839, 258120254, 296619470, 343386880, 356341511, 312198901, 266041670, 229458163, 192222198, 159417868, 135190984, 117975403, 106148200, 97960800, 92172476, 87769863, 85314204, 84214029, 84155302, 82954290, 80304287, 76352698, 70665656]
4785G0665656n633592n414175n177815m681538l724707l050100k547977k190081
4777C8245671j708208j725288j422866j226443j094015j243034j064411r28704
4769B7832702j146130j109136p95556q91790q00674l85144k73220n73776k66924
4760B1590352o81589n52201m82799l84925m74613M697m5221p486J72020O0730
4750A9198965J41428N09280J03800m65495m84205n13139l47031n00443l84483
4741A7258677p4311m7272J22141J95194N98791O85974J028269Q21880J075930
4732B1665273J394708J732938J775120K217939L114754K932525Q84377k04878
4724C5512756n52358k774400m201306l526942k857558k541734j828769j341031
$$ y = [70665656, 65032064, 59617889, 54440074, 49758536, 46033829, 42983729, 40435752, 38245671, 36537463, 34812175, 33389309, 32162866, 31068851, 29825817, 28761406, 27832702, 26686572, 25577436, 24781880, 23890090, 23089416, 22704272, 22431052, 21857276, 21590352, 20908763, 20356562, 19873763, 19488838, 19014225, 19018922, 18973701, 18966215, 19138235, 19198965, 19340393, 19849673, 19953473, 19487978, 19003773, 18490634, 18143603, 17643160, 17258677, 17184366, 17137094, 17259235, 17454429, 18053220, 18739194, 19767463, 20589343, 21665273, 23059981, 24792919, 26568039, 28785978, 31900732, 34833257, 35717634, 35512756, 34960398, 32185998, 27984692, 24457750, 21600192, 19058458, 17229689, 15888658]
4716A5888658j122695j085407q15488o70712p95787n17545m33572j41527k92977
4707A0012948k70401k21465k57505k99390k97642j21388p6266j83803j53762p7689
4697H053637k24094p8229r8254k15953k79138n3474m2320k87996R1733J93458
4687G059370o2756p9610q8999j5022J42144K47472J73784K03011J39375M36302
4677H155071N29652L95682L9887j71612m01593m56814p07987m80146l99992l40061
4667F162087q7479l12687r8426k41288k28632j35678K217o2064k9520m2024n8703
4656D867803o910j84634j53204r6691J16243l7128N5825M4791L7257J43637N6493
4645D843482k87672Q3923J35854j30140n2790J27447Q3652Q5029j32006N9820
$$ y = [15888658, 14765963, 13680556, 12865068, 12194356, 11398569, 10881024, 10447452, 10305925, 10012948, 9742547, 9521082, 9263577, 8964187, 8666545, 8545157, 8468891, 8285088, 8131326, 8053637, 7829543, 7751314, 7653060, 7437107, 7157969, 7104495, 7062175, 6774179, 6865912, 7059370, 6996614, 6917004, 6828005, 6812983, 6955127, 7202599, 7376383, 7579394, 7718769, 8155071, 8684723, 9080405, 9120292, 8948680, 8547087, 8090273, 7382286, 6902140, 6502148, 6162087, 6074608, 5761921, 5663495, 5422207, 5193575, 5057897, 5060114, 4998050, 4968530, 4926506, 4867803, 4860893, 4676259, 4523055, 4426364, 4542607, 4505479, 4561304, 4606095, 4643352, 4786989, 4843482, 4555810, 4639733, 4775587, 4645447, 4592657, 4720104, 4803756, 4888785, 4756779, 4816599]
4635D816599p2381p0101K58668R3918J04588K60597L8414J97722J5198j63603
4625E479619n7616l59106p9314m24561q7291q5403j94898k45455K06140J79057
4615D331172p9667j35834j05708Q7604J27858r5424j12233L79528L22623J6982
4605D736901o4622j07599J19582J18763m2875L09611J67346J42890N4217J57864
4595E592078J88651J81256R2002K80405m6390k03288l62661j71418k82093j1373
4585E257169l7211p2010J87393K51384K6490k55262j8995R6483o6374p7616N9194
4574E350645M0917R7132L3402M5460j48365p76J52056J75073p9109m7469K37122
4563E856088J25530J47225K12994J09139J28456J24687K37131J47617K53612J51827
$$ y = [4816599, 4744218, 4674117, 4932785, 5026703, 5131291, 5391888, 5430302, 5628024, 5643222, 5479619, 5422003, 5062897, 4983583, 4559022, 4471731, 4386328, 4191430, 3945975, 4152115, 4331172, 4251505, 4115671, 4009963, 4097567, 4225425, 4130001, 4017768, 4397296, 4719919, 4736901, 4672279, 4564680, 4684262, 4803025, 4760150, 5069761, 5237107, 5379997, 5434214, 5592078, 5780729, 5961985, 6053987, 6334392, 6288002, 6084714, 5722053, 5550635, 5268542, 5257169, 5219958, 5147948, 5335341, 5586725, 5613215, 5357953, 5338958, 5435441, 5369067, 5291451, 5350645, 5391562, 5488694, 5522096, 5567556, 5419191, 5418415, 5570471, 5745544, 5666435, 5618966, 5856088, 5981618, 6128843, 6341837, 6450976, 6579432, 6704119, 6941250, 7088867, 7342479, 7494306]
4553G494306Q3392L39507M62129L33012o325M73219M10834J92036M72848L44683
4543A0599641K25434P00368P84556N31619Q19858J090553J110213J345270J629799
4534A8837311J899587K284500K550257L029789L230710L607136M647826N276754
4526D5363870N995281O602665P616941P219915J186766o186676q091740p716572
4518E1990450p806955o794268n479382m146980l259858k495886j765044j321982
4510A8920095j189771j097399r49221m73922o65112o25656n65930n87803m76520
4501A2288761l01983l52252q7671l51832l02503q7221k5248j43957K92787k20544
4491A0708337r80M02960K24282L42713j40718l81470k88673j54028k73247r5046
$$ y = [7494306, 7577698, 7917205, 8379334, 8712346, 8706021, 9179240, 9590074, 9782110, 10254958, 10599641, 10825075, 11525443, 12309999, 12841618, 13661476, 14752029, 15862242, 17207512, 18837311, 20736898, 23021398, 25571655, 28601444, 31832154, 35439290, 40087116, 45363870, 51359151, 57961816, 65578757, 72798672, 73985438, 67798762, 59707022, 51990450, 44183495, 37389227, 31909845, 27762865, 24503007, 22007121, 20242077, 18920095, 17730324, 16632925, 15683704, 15209782, 14544670, 13919014, 13353084, 12765281, 12288761, 11986778, 11634526, 11546855, 11195023, 10892520, 10805299, 10780051, 10636094, 10928881, 10708337, 10707357, 11110317, 11334599, 11677312, 11536594, 11155124, 10866451, 10712423, 10439176, 10344130]
4481A0344130j14950K6760L2812M8902R0113L47485K0028j95363N15857L14686
4471A1430460K60276J45996L70021P09956O00806N86470M21106N77141O47202
4462A5749434N06678P38844P76484O21348O99593P08809L69102K85735N62042
4453B1018069Q62913R10465J624846J831104J960340K515759K695211L207812
4445C6626519L760754M626531N203802N887923O900426P252664M113965l183403
4437G1189181p337459o966045o941731o319781n719108m080245l289057k559834
4429B7975921j955940j680719j566784j581705j404736j389861j177337j099842
4421A6118997r63983p04801q29259n22609o56667n07623m51067m75018k31763
$$ y = [10344130, 10229180, 10255940, 10288752, 10337654, 10427767, 10775252, 10795280, 10599917, 11115774, 11430460, 11690736, 11836732, 12206753, 12916709, 13517515, 14103985, 14525091, 15102232, 15749434, 16256112, 16994956, 17771440, 18392788, 19092381, 19801190, 20170292, 20456027, 21018069, 21880982, 22791447, 24416293, 26247397, 28207737, 30723496, 33418707, 36626519, 40387273, 45013804, 50217606, 56105529, 63005955, 70258619, 74372584, 71189181, 63851722, 56885677, 49943946, 43624165, 37905057, 33824812, 30535755, 27975921, 26019981, 24339262, 22772478, 21190773, 19786037, 18396176, 17218839, 16118997, 15155014, 14450213, 13620954, 13098345, 12441678, 11934055, 11482988, 11007970, 10776207]
4412A0776207j51099m03663m10786k50531k30817k10819k68626k56542k38582
4403H354742l32140j66797k3134k82406j55384m142j54137k11072k28478J47293
4393F944345p512k25907j22850j31173O4514m4422K0488j0787o8691j06586k52239
4382F059180j1810O6391j29671J5499j09882j42311m2262J06532L5484j00425
4372E746725K5831N48j17520j38462R2189q8366k7295j1813P4415L7923P3581
4361E667756R5592M7047k34395j28442J09440L8171J6167M2846R5471J08913J51133
4350F009699j96053Q2880K84259J01944n9868o630K9726P6592R837J30223J90806
4339F653415K88968j42496N8536J30547J19506j5834N5311K08309R1888j28931
$$ y = [10776207, 10625108, 10221445, 9810659, 9560128, 9329311, 9118492, 8849866, 8593324, 8354742, 8022602, 7855805, 7832671, 7550265, 7394881, 7390739, 7236602, 7025530, 6797052, 6944345, 6936833, 6710926, 6588076, 6456903, 6521417, 6476995, 6497483, 6486696, 6418005, 6311419, 6059180, 6047370, 6113761, 5984090, 5999589, 5889707, 5747396, 5705134, 5811666, 5847150, 5746725, 5772556, 5773104, 5655584, 5517122, 5609311, 5520945, 5493650, 5481837, 5556252, 5594175, 5667756, 5763348, 5810395, 5576000, 5447558, 5556998, 5595169, 5611336, 5654182, 5749653, 5858566, 6009699, 5813646, 5896526, 6180785, 6282729, 6222861, 6216231, 6245957, 6322549, 6332386, 6462609, 6653415, 6942383, 6799887, 6858423, 6988970, 7108476, 7092642, 7147953, 7356262, 7448150, 7319219]
4329G319219j32191L04668R1468J12052n041p4603J31427R368j214j52916J69307
4318G771544J86850N9705J97002J48459J53596P8046o3706M56699J40456K90072
4308I418723J58473K8122J75041K81810J71159J79422P7026K16747O7179J63076
4298A0936778K07629L03906K56369L53316K87859J14376N01009M65560L81934
4289A3808736L44985O65136N38395N71469O07415K91813O14499J021189R24928
4280A9388565P60883R65758J284213J351594J552783J899034K229910K566127
4272C1998867K948407L117564L799883M356220M907962N556283O248900P516498
4264G0450584Q784917O378553l154816q912495p742678p345275p009234o150015
$$ y = [7319219, 7187028, 7491696, 7583164, 7695216, 7690175, 7615572, 7746999, 7756367, 7755153, 7602237, 7771544, 7958394, 8018099, 8215101, 8363560, 8517156, 8595202, 8531496, 8988195, 9128651, 9418723, 9577196, 9605318, 9780359, 10062169, 10233328, 10412750, 10489776, 10706523, 10773702, 10936778, 11144407, 11448313, 11704682, 12057998, 12345857, 12460233, 12961242, 13426802, 13808736, 14153721, 14818857, 15357252, 15928721, 16536136, 16827949, 17442448, 18463637, 19388565, 20149448, 21115206, 22399419, 23751013, 25303796, 27202830, 29432740, 31998867, 34947274, 38064838, 41864721, 46220941, 51128903, 56685186, 62934086, 70450584, 79235501, 85614054, 82459238, 73546743, 65804065, 58458790, 51449556, 45299541]
4256D5299541m917340l691546k693115k252976j659928j143728p59323p18497
4248B7463088j93014k73252j22572j52384j80914l70181q60862r59947o59056
4239B3690906p42679l87511l45601l49108m09110j50127l68763j40849K96437
4230B1093595O222J41583K62879K95692J73351J72387N01214K32733J76406q585
4220B3047477K28981N33764L29912L81904M77094O35741L77231N06109P88601
4211B7306814Q04262P81861R93911J187278J205606J469561J432915J527490J783392
4202C8493090K170610J878156K093904K445938K777660K964212L579075L972527
4194F0375172M672776N236531O225493P337485Q746649J0222678J1229955J3118225
$$ y = [45299541, 40382201, 36690655, 33997540, 31744564, 30084636, 28940908, 28181585, 27463088, 27270074, 26996822, 26874250, 26721866, 26540952, 26170771, 25309909, 24349962, 23690906, 22948227, 22560716, 22215115, 21866007, 21456897, 21306770, 20938007, 20797158, 21093595, 21099817, 21241400, 21504279, 21799971, 21973322, 22145709, 22646923, 22879656, 23056062, 23047477, 23276458, 23810222, 24140134, 24522038, 24999132, 25634873, 26012104, 26518213, 27306814, 28111076, 28892937, 29886848, 31074126, 32279732, 33749293, 35182208, 36709698, 38493090, 40663700, 42541856, 44635760, 47081698, 49859358, 52823570, 56402645, 60375172, 65047948, 70284479, 76509972, 83847457, 92594106, 102816784, 114046739, 127164964]
4186A27164964J4797982J6600329J9453783K3208609K7167135L2043350L8493391
4179B98929543L6987056J5907650j1969493l4717589m0513831l6259165l2308907
4172A96055264k7479230k3225427j8301101j4284864j1558092r682200p891073
4165H3633277o296334n455569m735068m446116l904844l569437k967409k904345
4157D9354155k460401j976249j714293j546833j268000j212305j089393r29828
4149C7156853p85620o65655o21409m88523k3943M1771j50450j84534o80863j587446
4139C2010181j788459j831452j805901j447168j260450j043112r98642p81139
4131B1053858o94035p77177m16326l49799k72755m5938j45082k12214m77079m66623
$$ y = [127164964, 141962946, 158563275, 178017058, 201225667, 228392802, 260436152, 298929543, 335916599, 351824249, 339854756, 305137167, 264623336, 228364171, 196055264, 168576034, 145350607, 127049506, 112764642, 101206550, 91524350, 83633277, 77336943, 71881374, 67146306, 62700190, 58795346, 55225909, 52258500, 49354155, 46893754, 44917505, 43203212, 41656379, 40388379, 39176074, 38086681, 37156853, 36371233, 35705578, 35084169, 34595646, 34571703, 34613474, 34463024, 34278490, 33597627, 32010181, 30221722, 28390270, 26584369, 25137201, 23876751, 22833639, 21834997, 21053858, 20359823, 19582646, 19166320, 18816521, 18543766, 18497828, 18352746, 18140532, 17663453, 17196830]
4121A7196830m93848m09122l57396l10816n15589k82199j64574j69733n3302J56587
4111A4596838p121j0389j00421J30204O6775N08967J5633R8794N1693m23517l63712
4100A4563744m59070m24999l04461k24657m41707j21677K163J01420q3486q7092
4090A2520178l79412n26666m77547o71977l33086k43910k72530k35035j28878
4081I251137K0073k88614k38876j24649j52563k33727j70325p7167j29875o6894
4071G788520l38817L6279P3114J02023k70749k0948l1885R3514j07715k26165
4061G097171J07114j71558j55625o9872m4924q8890J19044m5540R9917j29851
4051F716986J6591k9846J93814J85671j1153r2394J02029R4457j3649R5104K5569
$$ y = [17196830, 16702982, 16293860, 15936464, 15625648, 15110059, 14827860, 14663286, 14493553, 14440251, 14596838, 14589717, 14579328, 14478907, 14609111, 14675886, 15184853, 15200486, 15299280, 15350973, 14927456, 14563744, 14104674, 13679675, 13375214, 13150557, 12708850, 12587173, 12589336, 12690756, 12607270, 12520178, 12140766, 11614100, 11136553, 10464576, 10131490, 9887580, 9615050, 9380015, 9251137, 9271210, 8982596, 8743720, 8619071, 8466508, 8232781, 8062456, 7985289, 7855414, 7788520, 7449703, 7485982, 7559096, 7661119, 7390370, 7369422, 7337537, 7431051, 7323336, 7097171, 7204285, 7032727, 6877102, 6807230, 6762306, 6673416, 6792460, 6746920, 6846837, 6716986, 6733577, 6703731, 6897545, 7083216, 7072063, 6979669, 7081698, 7176155, 7162506, 7257610, 7283179]
4040G283179M6462J54749j24826R4198P0633K29597J994L090N9200M4408R5306
4029G957990P0486j17208k1646o0744M4679J68608J2134Q2789M50829J17891p743
4018H698065K60814J75932M07178M24283N22973K62100N37954J77355r5739j78891
4008A1192024l37509m61873k63867R1378K14898k72909J22682P5467L07441K45203
3998A0912935O209k3741Q6859L90242L8900J67716L36062L76209N00823K59790
3988A3052004P67996O13884O38699J060774J151303J022415P03145l1952k20774
3979A8757494k55286j10306R1807M59549P92529J229044J386429J325794K70289
3970B3947343j109889j045871j016194q24663r08877l80869j48930q1727J28049
$$ y = [7283179, 7329641, 7484390, 7359564, 7453762, 7524395, 7753992, 7755986, 7759076, 7818276, 7862684, 7957990, 8028476, 7911268, 7889622, 7828878, 7873557, 8042165, 8054299, 8137088, 8587917, 8705808, 8698065, 8958879, 9134811, 9541989, 9966272, 10489245, 10751345, 11289299, 11466654, 11370915, 11192024, 10854515, 10392642, 10128775, 10220153, 10435051, 10162142, 10284824, 10360291, 10667732, 10912935, 10919144, 10895403, 10982262, 11372504, 11411404, 11579120, 11915182, 12291391, 12792214, 13052004, 13820000, 14433884, 15072583, 16133357, 17284660, 18307075, 19010220, 18978268, 18757494, 18502208, 18391902, 18483709, 18943258, 19735787, 20964831, 22351260, 23677054, 23947343, 22837454, 21791583, 20775389, 19950726, 19041849, 18660980, 18512050, 18430323, 18558372]
3961A8558372J92158N91065P22134Q00160J120144J051645J521441R53313L22758
3952B5833190O32646P28815Q69022J054957J649889J924337K01879j622091j900020
3943B9372624j495807j274795j042051q04866m12557L4474J51288K41026K15139
3934B4984475J47015M16386J52100M09114N68974Q65944Q13719O61069K04324
3925B9223120o8160k92840l34974J43799J73026K43715N47954O33048P01809R13939
3915C1884436J051493R69357P93729O26764O01536R12934J013713R76468R58617
3906C9789047J043021J173738J163893J501375J832475J467775J355020J616221
3898E0942565K063992K433838K295359K050955J996305K221779K854493L105980
$$ y = [18558372, 18750530, 19341595, 20063729, 20863889, 21984033, 23035678, 24557119, 25510432, 25833190, 26465836, 27194651, 28063673, 29118630, 30768519, 32692856, 32894735, 31272644, 29372624, 27876817, 26602022, 25559971, 24755105, 24342548, 24377022, 24528310, 24769336, 24984475, 25131490, 25547876, 25699976, 26109090, 26678064, 27544008, 28357727, 29018796, 29223120, 29154960, 28862120, 28527146, 28670945, 28843971, 29087686, 29635640, 30268688, 30970497, 31884436, 32935929, 33905286, 34699015, 35325779, 35927315, 36840249, 37853962, 38830430, 39789047, 40832068, 42005806, 43169699, 44671074, 46503549, 47971324, 49326344, 50942565, 53006557, 55440395, 57735754, 59786709, 61783014, 64004793, 66859286, 69965266]
3890F9965266L460808L246453L098774L054763K504481K585791K516652K923113
3882I3356101L051405L726635M231841M670516N492889N727727M460084J457955
3874A26175153p74526r53511o95779j5101O82273Q80797J060230P58760J149704
3865A28268000J545402J491005J166963N53373n17442j428014j864449j773002
3857A27441836j948792j745770j859457k073263j362053r59897j75870L81594
3849A17698328j323324m101267n568671n574205n315527m740880l950351l404287
3841H3719816l045621k515335k423562k512727k535590k740447l066673k958938
3833F1920923k770800k547021k245719j802851j556723j504022j905126j840787
$$ y = [69965266, 73426074, 76672527, 79771301, 82826064, 85330545, 87916336, 90432988, 93356101, 96407506, 100134141, 104365982, 109036498, 114529387, 120257114, 124717198, 126175153, 125400627, 124447116, 123751337, 123736236, 124418509, 125299306, 126359536, 127118296, 128268000, 129813402, 131304407, 132471370, 133024743, 132507301, 131079287, 129214838, 127441836, 125493044, 123747274, 121887817, 119814554, 118452501, 117492604, 117316734, 117698328, 116375004, 112273737, 106705066, 101130861, 95815334, 91074454, 87124103, 83719816, 80674195, 78158860, 75735298, 73222571, 70686981, 67946534, 64879861, 61920923, 59150123, 56603102, 54357383, 52554532, 50997809, 49493787, 47588661, 45747874]
3825D5747874j812664j593639j506584j040502j094706j013391r13796q20746
3817C5951846q77207r05546q30374j031436q23207n91728n15629q20837q51708
3808B8704174q47339q69823p03826n78882l56234j67388l98990o7065l72728j67916
3798B4173983O1400k2419k88120j09855r2762k50869j61333j32310p9193k78328
3788B2820194m09538o34148j11896j94877m05591l48270j70249r4401q1342K75764
3778B0645646r0167l0156j0758j34025J25736K52053J90427K73538M43079M91634
3768B2157007L97109M16422M69512P29518N07317Q70673J279514J504816J512844
3759B9844732J708666K001000K166602J533620L6959j583512k501163k505165
$$ y = [45747874, 43935210, 42341571, 40834987, 39794485, 38699779, 37686388, 36772592, 35951846, 35074639, 34169093, 33338719, 32307283, 31484076, 30892348, 30376719, 29555882, 28704174, 27856835, 26987012, 26283186, 25704304, 25348070, 25180682, 24781692, 24714627, 24341899, 24173983, 24235383, 24212964, 23924844, 23814989, 23722227, 23471358, 23310025, 23177715, 23098522, 22820194, 22410656, 21776508, 21664612, 21469735, 21064144, 20715874, 20545625, 20451224, 20369882, 20645646, 20555479, 20525323, 20514565, 20380540, 20506276, 20758329, 20948756, 21222294, 21665373, 22157007, 22554116, 22970538, 23440050, 24169568, 24676885, 25547558, 26827072, 28331888, 29844732, 31553398, 33554398, 35721000, 37254620, 37291579, 35708067, 33206904, 30701739]
3751C0701739k349759k274163j954640j699199j494839q62989r33363n07537n13521
3742A8111729o68186l00733n13038m36012k38689m60331n04454k30086j68644
3733A4591556l30089m46822k28594j15901l40402l73499j69568l8616j57248j65631
3723A2225186k50856J84K2015j53249j13278j35565l1872j46677j71754k727j18613
3712A1122794q8445P1188n9812Q2972j28912J27503k6121j70952Q9637R5681M8044
3701A1163577m0059K8147l6769p1951M2664N2042Q5804O6892k02545J15409k48596
3690A0954615j63994J59185J88634j01185j28653j7301J979P2898N6536N8830
3680A1081544J36928L6983J5436J14556J86219M5558K9644K14641R1621J99782
$$ y = [30701739, 28351980, 26077817, 24123177, 22423978, 20929139, 20066150, 19132787, 18625250, 18111729, 17443543, 17142810, 16629772, 16193760, 15955071, 15494740, 14990286, 14760200, 14591556, 14261467, 13814645, 13586051, 13470150, 13129748, 12756249, 12586681, 12548065, 12390817, 12225186, 11974330, 11974514, 11996529, 11843280, 11730002, 11594437, 11562565, 11415888, 11244134, 11241407, 11122794, 11034349, 11105537, 11045725, 11128697, 10999785, 11127288, 11101167, 10930215, 11019852, 11115533, 11163577, 11123518, 11151665, 11114896, 11042945, 11085609, 11137651, 11223455, 11290347, 11087802, 11203211, 10954615, 10790621, 10949806, 11138440, 11037255, 10908602, 10891301, 10893280, 10966178, 11022714, 11081544, 11218472, 11255455, 11270891, 11385447, 11571666, 11617224, 11646868, 11861509, 11953130, 12152912]
3670A2152912L01620J7405K75566M85740m6495Q2755j8103J82324J87710Q398
3660A3629832Q63k6128N9673R178l73596k01904o3499K0733M336k59758o545j02039
3648A2691146k653j73591k07123j02570n0963k3560N24J50407n7290R7490m1624
3637A2280193J89564J71524k2681R8904M2982J56189M0377j8855j21912l0305
3627A2785980j00853l02853j69724k9934q6000l3893k86141m24573k49319p9309
3617A1023381j75307l22194l54004r9224k22872j37101k30699k147j66771J30989
3607I444051Q0249N9700q8958j06496K06641j26487J77840l8782J11838J12519
3597I832115o5947R0471Q134k21393j24616l20027r0116J23331j35491m03943
$$ y = [12152912, 12454532, 12471937, 12747503, 13233243, 13186748, 13269503, 13251400, 13433724, 13621434, 13629832, 13630695, 13604567, 13664240, 13673418, 13299822, 13097918, 13034419, 13055152, 13059488, 12799730, 12793185, 12691146, 12688493, 12514902, 12307779, 12205209, 12154246, 12130686, 12131210, 12281617, 12224327, 12321817, 12280193, 12469757, 12641281, 12618600, 12717504, 12760486, 12916675, 12957052, 12938197, 12816285, 12785980, 12685127, 12382274, 12212550, 12182616, 12096616, 12062723, 11776582, 11352009, 11102690, 11023381, 10848074, 10525880, 10171876, 10072652, 9849780, 9712679, 9481980, 9479833, 9313062, 9444051, 9524300, 9584000, 9495042, 9388546, 9595187, 9468700, 9646540, 9607758, 9719596, 9832115, 9766168, 9856639, 9864773, 9643380, 9518764, 9198737, 9108621, 9231952, 9096461, 8692518]
3587H692518p5021m6123j74136j65679l58831J9270K03132j04700k63137q8619
3577G638674m7692K4657n6363p3794L25142r5316P7886l4580k107P0893l39548
3566G487852J14349k64341k2365P6659k99051j54677K39967P6447k78105l5482
3556F941253j26774P0288P2040n3129K3159M9523k9406j65302k21267j09246M8741
3545F499880R7708J01529m0356j63381j63732r7171L7672q948j57041j37928K00293
3534F168525J69300n826q6356K33334j32520j23572R2583K29116N4089k4133k8345
3523F546195j65187J40472n7932P6781k2625O9902R676m3941j06597o0280J00114
3512F486578j14102K37840L5972k48731M9128J66016N4627J44922j40672j63343
$$ y = [8692518, 8617497, 8571374, 8397238, 8231559, 7872728, 7891998, 8095130, 7990430, 7727293, 7638674, 7590982, 7615639, 7559276, 7485482, 7810624, 7715308, 7793194, 7758614, 7756507, 7827400, 7487852, 7602201, 7337860, 7315495, 7392154, 7093103, 6938426, 7178393, 7254840, 6976735, 6941253, 6814479, 6884767, 6956807, 6903678, 6926837, 6976360, 6946954, 6781652, 6560385, 6451139, 6499880, 6597588, 6699117, 6658761, 6495380, 6331648, 6234477, 6272149, 6263201, 6106160, 5968232, 6168525, 6337825, 6331999, 6245643, 6478977, 6346457, 6222885, 6315468, 6544584, 6598673, 6574540, 6546195, 6381008, 6521480, 6463548, 6540329, 6517704, 6587606, 6597282, 6553341, 6446744, 6386464, 6486578, 6372476, 6610316, 6646288, 6397557, 6446685, 6612701, 6667328, 6812250, 6671578, 6508235]
3502F508235k0942O1097K0816J9787K12534m7665K849J64474R5297k09972j14111
3491F692399L78979J7968M1866J25830Q2457R5628R4242q461N144K08608l992
3480G730668J10562J89736J63490L00063l9499k07252J42290J30373R4195q475
3470H606151K37556J34345L51091J45044j253J85911K93533J79495K58613L60605
3460A0751091J50113J85253L8700L17057M21871N35360K45744M14837J43736L53602
3450A3557364P70915O22898P16687P06917R45061R39517J223517J178144J703857
3441B2364877J791157J963908K155890K653222L397828L736012M142441N468207
3433D7673542O928182P097534q58330p319621n920067n408907n061489l958168
$$ y = [6508235, 6487293, 6548390, 6569206, 6588993, 6801527, 6753862, 6756711, 6921185, 7016482, 6806510, 6692399, 7071378, 7089346, 7131212, 7257042, 7339499, 7435127, 7529369, 7520908, 7526052, 7734660, 7730668, 7841230, 8030966, 8194456, 8494519, 8455020, 8247768, 8390058, 8520431, 8614626, 8606151, 8843707, 8978052, 9329143, 9474187, 9472934, 9658845, 9952378, 10131873, 10390486, 10751091, 10901204, 11086457, 11125157, 11442214, 11864085, 12399445, 12645189, 13060026, 13203762, 13557364, 14328279, 14951177, 15667864, 16374781, 17319842, 18259359, 19482876, 20661020, 22364877, 24156034, 26119942, 28275832, 30929054, 34326882, 38062894, 42205335, 47673542, 54601724, 61699258, 60840928, 53521307, 47601240, 42192333, 37130844, 33172676]
3425C3172676l128179k004610j167961n36631m44874m08074k24065J46208M59640
3416B5864130M23331P46283J239116J352280J721296K027429K405577K881120
3408C8660562L822563L848592M701435N651318O624823P458280R730415J2875586
3400I3373574J4875430J939927j4712063j3153250j0948692j1091427r572160
3393E0711339o797280m952436l309164k526002j862000j598175j069424q72343
3385B7724515q03520p12289m33973k42081k5989M15036P21552Q11342J008631
3376B8463224J163887J633946J996458K398604K765462L160768M110598N641330
3368E1334277O939883L098239o007484p489553n490808n607916n011768l806352
$$ y = [33172676, 30044497, 28039887, 26871926, 26335295, 25890421, 25482347, 25258282, 25404490, 25864130, 26287461, 27033744, 28272860, 29625140, 31346436, 33373865, 35779442, 38660562, 42483125, 46331717, 51033152, 56684470, 63309293, 70767573, 80497988, 93373574, 108249004, 110188931, 95476868, 82323618, 71374926, 60283499, 50711339, 43914059, 38961623, 35652459, 33126457, 31264457, 29666282, 28596858, 27724515, 26920995, 26208706, 25774733, 25532652, 25506663, 25921699, 26643251, 27454593, 28463224, 29627111, 31261057, 33257515, 35656119, 38421581, 41582349, 45692947, 51334277, 58274160, 61372399, 55364915, 47875362, 42384554, 36776638, 31764870, 27958518]
3360B7958518k582647j997651j527188j219349j131205j021712r89507n02220
3352A6987039o55002q85725o11158k80546j81904k45039j63405l67774l08078
3343A3288408k94288r6828n3489j01620l22274k16115p7793J78114j29196N3268
3333A2228187K37909j6550l74641j53576K4406Q4092k0335J55636p4270l46266
3323A1744592k24630J26675J2760k81224j07993J12054J05083N9476k02195o2260
3313A1282338o7942K78271j2229J73716J75412J8912k54614J63571K30868p8439
3303A1909864J68458J39072Q7806l0013P1151N5398L27910J75944J9233L4324
3293A2959147J90961L23742J39422J91183J23333N3901J90191L36264K06985K75149
$$ y = [27958518, 25375871, 23378220, 21851032, 20631683, 19500478, 18478766, 17489259, 16987039, 16332037, 15446312, 14835154, 14554608, 14372704, 14127665, 13964260, 13596486, 13288408, 12994120, 12897292, 12843803, 12742183, 12419909, 12203794, 12126001, 12304115, 12174919, 12228187, 12466096, 12449546, 12074905, 11921329, 11945735, 12029827, 12009492, 12165128, 12090858, 11744592, 11519962, 11646637, 11659397, 11378173, 11270180, 11382234, 11487317, 11546793, 11344598, 11282338, 11214396, 11492667, 11480438, 11654154, 11829566, 11848478, 11593864, 11757435, 11988303, 11909864, 12078322, 12217394, 12305200, 12275187, 12346338, 12401736, 12729646, 12905590, 12924823, 12959147, 13150108, 13473850, 13613272, 13804455, 13927788, 13981689, 14171880, 14508144, 14715129, 14990278]
3283A4990278L61906L85168j77337L46728M01511M88609M88407M41070O69324
3274A8395664M52642P10768O40460R13908R03977P59153J235452J136433J210665
3265B6359122J216070J079532J271933J263572J306961J044523P91658P15561
3257C5048932L21949m08167p86975q84736j272359j400539j605573j660051j495774
3248B5856707j060136j019036r88128q60671p55217p90121j028299n67278m95083
3239A8292738p71951q09849l96894m45587l46871m13340k66514m12281l60582
3230A4068869k58903j87321j54811J2269j45937p9383k63833L082j6337j6254
3220A2961441q5464j28375m3225m1898P6024q0133L57828L63095j3776j72013
$$ y = [14990278, 15352184, 15737352, 15560015, 15906743, 16308254, 16796863, 17285270, 17726340, 18395664, 18848306, 19559074, 20199534, 21113442, 22017419, 22776572, 24012024, 25148457, 26359122, 27575192, 28654724, 29926657, 31190229, 32497190, 33541713, 34333371, 35048932, 35370881, 34962714, 34175739, 33291003, 32018644, 30618105, 29012532, 27352481, 25856707, 24796571, 23777535, 22789407, 21928736, 21173519, 20383398, 19355099, 18787821, 18292738, 17520787, 16710938, 16314044, 15868457, 15521586, 15108246, 14841732, 14429451, 14068869, 13809966, 13622645, 13467834, 13480103, 13334166, 13254783, 12990950, 12994032, 12977695, 12961441, 12875977, 12747602, 12704377, 12662479, 12738503, 12658370, 13016198, 13379293, 13365517, 13193504]
3210A3193504l25341n07074l83561n85026m93369l97776k95044j21609m52224
3201I632480k24297m4877k3776q2225n8291j86597q2259N9984j79051l7561O3131
3190H836661J3093j61882j19569K5008j3806K82686Q7919j14985J52853M4596
3180I032574K3171K49795j95083l87445j74661j91492k01630j28830j39151j18999
3170G768249k31027j96351k80241k15281J37678j7768L6915k52565j33882M5056
3160F660783N300k14171p3129J56224j53766j02975j61137J2103J28705M9647
3150F307584j90267J1229J10568o623j78150m8147j08391n8044M0056L3396J01999
3139F015210j93026n0901k1628q9838Q5375j12926j74059j27706j02932q5463
$$ y = [13193504, 12868163, 12361089, 11977528, 11392502, 10899133, 10501357, 10206313, 10084704, 9632480, 9408183, 9363306, 9339530, 9257305, 9199014, 9012417, 8930158, 8990142, 8811091, 8773530, 8836661, 8849754, 8687872, 8568303, 8593311, 8579505, 8862191, 8950110, 8835125, 8987978, 9032574, 9055745, 9305540, 9110457, 8723012, 8548351, 8356859, 8155229, 8026399, 7887248, 7768249, 7537222, 7340871, 7060630, 6845349, 6983027, 6965259, 7002174, 6749609, 6615727, 6660783, 6666083, 6451912, 6378783, 6535007, 6381241, 6278266, 6117129, 6129232, 6257937, 6307584, 6117317, 6128546, 6239114, 6232491, 6054341, 6006194, 5897803, 5839759, 5879815, 5913211, 6015210, 5822184, 5771283, 5749655, 5659817, 5745192, 5632266, 5458207, 5330501, 5227569, 5142106]
3129E142106K6374N994J2192r6098J08155k7390p149J2206q0347J56371L9194
3118E291608O3007L2732o70j46253o4754q3073k24077m811J42762j18285J43927
3107E032113O4263k43532l5397N913j28527j38525p9949J52081k62515O339j06729
3096D265535j49914J06416N7148j08876p3125K10033J25075k38811n6682L7401
3086D174200k38016j10318J07715k4159k3104p117K5455o1522R0764J54746l3492
3075D055152r0950j1147j28884k16045j69066J43965m1547j13074K7670L2838
3065C488912j2940k0895M7879q3570m7342q4790J4822K06156l1941j70860J35890
3054C441321J07388q1967O2610q5970l7720o1288L3997Q3402J11723j53337k0055
$$ y = [5142106, 5168480, 5174474, 5186666, 5090568, 5198723, 5171333, 5164184, 5176390, 5096043, 5252414, 5291608, 5354615, 5387347, 5386677, 5240424, 5175670, 5092597, 4868520, 4863709, 5006471, 4888186, 5032113, 5096376, 4852844, 4817447, 4823360, 4694833, 4556308, 4476359, 4628440, 4365925, 4372264, 4265535, 4115621, 4222037, 4279185, 4170309, 4097184, 4307217, 4432292, 4193481, 4136799, 4174200, 3936184, 3825866, 3933581, 3909422, 3886318, 3879201, 3904656, 3843134, 3933898, 4088644, 4055152, 3964202, 3953055, 3824171, 3608126, 3439060, 3583025, 3541478, 3428404, 3456074, 3488912, 3475972, 3455077, 3502956, 3419386, 3372044, 3287254, 3302076, 3508232, 3476291, 3305431, 3441321, 3548709, 3466742, 3529352, 3443382, 3405662, 3344374, 3378371, 3461773, 3573496, 3420159, 3400104]
3043C400104j53248J07724K49235j42378k3550j16267K10295J2176m4725P9969
3033C579335P7374k5162R5704O93J78028J73836J46371P9404j07874K49258K08367
3022D655334P1442n3812K37561l8809N3913K74835J16334j2343J49303K4308J2906
3011E490972J38472j5352O2937j79096J100r3970J2480J28757Q6437k19346P290
3000E420681J71610n058R6097K05332J0564J04032J57708L39466J98266K75325
2990F974023J56306J45617J45734K38243M3841K26918M36544J19564J90766J69264
2980H846820K65240L22384k97059j79925j08933j77773m26167o7156K5221j46813
2970H055839o1921J59914k26099l61582j20440l377j09691J8927J92983J70333
$$ y = [3400104, 3246856, 3354580, 3603815, 3461437, 3437887, 3321620, 3531915, 3544091, 3499366, 3579335, 3656709, 3631547, 3727251, 3727944, 3905972, 4079808, 4226179, 4305583, 4197709, 4446967, 4655334, 4726776, 4672964, 4910525, 4871716, 4925629, 5200464, 5316798, 5304455, 5453758, 5478066, 5490972, 5629444, 5614092, 5677029, 5497933, 5499033, 5405063, 5417543, 5546300, 5632737, 5413391, 5420681, 5592291, 5587233, 5683330, 5888662, 5899226, 6003258, 6160966, 6500432, 6698698, 6974023, 7130329, 7275946, 7421680, 7659923, 7703764, 7930682, 8367226, 8486790, 8677556, 8846820, 9112060, 9434444, 9137385, 8957460, 8848527, 8670754, 8244587, 8177431, 8202652, 8055839, 7993918, 8153832, 7927733, 7566151, 7445711, 7442334, 7332643, 7351570, 7544553, 7714886]
2960G714886J60950q3889N8552K67228p7636o4658N5713K93538K02536j22057
2950H405163K34772L73223L21131L89903J76708Q581j59771N0894P5359l33121
2940I542842Q9566m572k06632P1863J44472j00894r2740j52950l1674j204M5486
2929I303563J28597l3406K3203L54052O2759K68987l0794K19014J34366L41783
2919A0772124L42287J98594R2678r6312J1290k4244l11488k50734m10043m20317
2909I903835l62676j95121j52468q1464O4301O5345J34293p8009j91201j39297
2899H967538L18455K9047N9096J33540K03749L2229j12412J76671J70655j1669
2889I966899j49472o2284j99329j21585j24682j38917l36224l78518k75890l10421
$$ y = [7714886, 7875836, 7791947, 7850499, 8117727, 8040091, 7975433, 8031146, 8324684, 8527220, 8405163, 8639935, 9013158, 9334289, 9724192, 9900900, 9909481, 9749710, 9800604, 9875963, 9542842, 9632408, 9627836, 9421204, 9493067, 9637539, 9536645, 9443905, 9290955, 9259281, 9258077, 9303563, 9432160, 9398754, 9421957, 9776009, 9838768, 10107755, 10076961, 10295975, 10430341, 10772124, 11114411, 11313005, 11405683, 11309371, 11320661, 11296417, 10984929, 10734195, 10324152, 9903835, 9541159, 9346038, 9193570, 9112106, 9176407, 9241752, 9376045, 9298036, 9106835, 8967538, 9285993, 9315040, 9374136, 9507676, 9711425, 9743654, 9631242, 9807913, 9978568, 9966899, 9817427, 9755143, 9555814, 9434229, 9309547, 9170630, 8834406, 8455888, 8179998, 7869577]
2879G869577j63326o4405o7246M9907k83147j74870r4987m6348p1620j02005k67955
2868F583575j26383R0445k21520r916l6513k62248j99507j85147j60205o4977
2858E407604r2883k19000k20289k12020k53079j89850J81265o762R3275j13148
2848D375113q5525j84325k34503Q4087N2692j71117l01108J57973J03017L5213
2838C831517k17805k19731k0566k6104k32798j04675Q1857J68285j99504j05491
2828B954985j26342p4854j70787p253l2107k21317k0069J11865J4814j21778q8892
2817B218265R3626P2600n6393O3080k478l20998j73098K09428Q2644q4356P4162
2806B176482j28472K6402q346N9420o0831k65210M8317K35032j50773r6906J16750
$$ y = [7869577, 7706251, 7641846, 7574600, 7624507, 7341360, 7166490, 7071503, 7025155, 6953535, 6851530, 6583575, 6457192, 6547637, 6326117, 6316201, 6279688, 6017440, 5817933, 5632786, 5472581, 5407604, 5314721, 5095721, 4875432, 4663412, 4410333, 4220483, 4401748, 4394986, 4488261, 4375113, 4289588, 4105263, 3870760, 3954847, 4007539, 3836422, 3535314, 3693287, 3796304, 3831517, 3613712, 3393981, 3373415, 3347311, 3114513, 3009838, 3091695, 3259980, 3060476, 2954985, 2828643, 2753789, 2583002, 2575749, 2543642, 2322325, 2302256, 2414121, 2428935, 2307157, 2218265, 2311891, 2384491, 2328098, 2391178, 2388700, 2067702, 1894604, 2104032, 2186676, 2102320, 2176482, 2048010, 2074412, 2066066, 2125486, 2064655, 1799445, 1847762, 2082794, 1932021, 1835115, 1951865]
2795A951865l0323o7782K1341l0533j67526q6832L015K0630o5297l5072p6695
2784A436791q107r4604o0367O4822J01679M3696p6948N9874L4437j25207K0846
2773A396912k23709m9569K084m008L2000J28131K22698k03040j45841j10999j56068
2762H88591Q9322J82670m3577j0987R3969k19032j45519j61P8439j63517O2910
2751H13108R3577J13884N5039j30866k18057q4440K15962J07679r2466j62756
2741G10664J73710r2606j14692r7765p7703J07781J47839j6807N1009j96839J54832
2730G49423q1488j59208q6009N7900Q8982j80963J92514p377R5231J22249q6326
2719G04928k9951j7327K1795M0972j67010J56590o7074j18516J00037m5470m9304
$$ y = [1951865, 1921542, 1853760, 1875101, 1844568, 1677042, 1590210, 1593225, 1613855, 1548558, 1513486, 1436791, 1428684, 1334080, 1273713, 1338535, 1440214, 1483910, 1406962, 1466836, 1501273, 1376066, 1396912, 1173203, 1123634, 1125718, 1121710, 1153710, 1281841, 1504539, 1301499, 1155658, 1044659, 888591, 977913, 1160583, 1117006, 1106019, 1199988, 980956, 835437, 835276, 913715, 750198, 813108, 906685, 1020569, 1075608, 944742, 726685, 642245, 858207, 965886, 873420, 710664, 884374, 791768, 677076, 579311, 501608, 609389, 757228, 740421, 791430, 594591, 749423, 667935, 508727, 422718, 480618, 569600, 388637, 581151, 573774, 669005, 791254, 704928, 674977, 657650, 679445, 720417, 553407, 709997, 642923, 524407, 624444, 578974, 529670]
2708E29670o216P3352R675J0514k41791k7519J35528K8871j31060J92415J31929
2697G05368j504M3634p8435P0567q6523K9720j09862M5578O2503n0907j25242
2686E04897K4299L8621J7650j02141J12939J01507Q2587q593P5042j98764k1531
2675F26513L11040n4620M621q8043k9630R029n2019O1520k2610j24379K73338
2664I14760J96186k6396P6884k9693M4089J18869m0353j43493j06873k9703K3596
2653I97873M4615R2205k1607q0834M7136N3030K19783O6555j4554n6908j54687
2642A192607J20131L9723K8313R5686O9040J33859N1000q3656O0074N2628o6842
2631A692563J22998k3771m4709k28259K9256J21802l2322N2145k8513m4932L647
$$ y = [529670, 523454, 596806, 606481, 616995, 375204, 347685, 483213, 512084, 381024, 573439, 705368, 703864, 747498, 669063, 739630, 653107, 682827, 572965, 618543, 681046, 630139, 504897, 529196, 567817, 585467, 483326, 596265, 697772, 780359, 771766, 846808, 648044, 626513, 937553, 882933, 887554, 799511, 769881, 778910, 726891, 788411, 765801, 641422, 914760, 1110946, 1084550, 1161434, 1131741, 1175830, 1294699, 1254346, 1110853, 1003980, 974277, 997873, 1042488, 1134693, 1113086, 1032252, 1079388, 1132418, 1352201, 1418756, 1404202, 1347294, 1192607, 1312738, 1352461, 1380774, 1476460, 1545500, 1679359, 1730359, 1646703, 1706777, 1759405, 1692563, 1815561, 1791790, 1747081, 1518822, 1548078, 1669880, 1637558, 1689703, 1661190, 1616258, 1619905]
2620A619905K6376k1983R6144j65392N9147L1582Q2586J62362p5113L0914k15586
2609A630942j1284J53899J72498J79057j17338m7712M9987J67849q3505q3846
2599B010547l2029j54168j4722j27944q9316J63600L3540n7446k1817Q8107L516
2588A801868j64241k2750m6802L0679Q7390o9088N9616L6528j94309R3955l1239
2577A581607M9759j47997L0483j9937m2615K1562k8580J68994O477o038m1842
2566A571873J58964J914j77697o7348q8051j35625j65067o8778M0915k018K772
2555A071854j72894N5422j25730k2594J78031L6046K2838r0137K6582p795q729
2544I62894P9512q2915n1911r3286K6004j63610k91830K57599l9895j74456J47063
$$ y = [1619905, 1646281, 1624298, 1720442, 1555050, 1614197, 1645779, 1728365, 1890727, 1815614, 1846528, 1630942, 1619658, 1773557, 1946055, 2125112, 2007774, 1960062, 2010049, 2177898, 2094393, 2010547, 1978518, 1824350, 1809628, 1681684, 1592368, 1755968, 1789508, 1732062, 1710245, 1798352, 1801868, 1637627, 1614877, 1568075, 1598754, 1686144, 1617056, 1676672, 1713200, 1518891, 1612846, 1581607, 1631366, 1483369, 1513852, 1493915, 1451300, 1472862, 1444282, 1613276, 1619753, 1613715, 1571873, 1730837, 1732751, 1555054, 1487706, 1399655, 1264030, 1098963, 1030185, 1071100, 1069082, 1071854, 898960, 954382, 828652, 806058, 984089, 1020135, 1042973, 952836, 979418, 971623, 962894, 1042406, 959491, 907580, 814294, 840298, 676688, 384858, 642457, 602562, 428106, 575169]
2533E75169R5234k16920q2435j26628J73606J18216j32969k061R4335M2515j44949
2522C93113M2299R0988L3373K4872j91246j58553m6481r433j80095k6796K58117
2511B30158M9832o0590p2151Q8628N1966J34508J13q0698j50015P8259K3713j19585
2499A74138J56799j66275R3163J39632k21906o8402K31603O1558r9379n7430k27538
2488A5963p4125L4168K8543O1488k7166J16616J53258j28828n2722K7285k10478
2477e5998P2293p4882N946O295l8669K15872j09713j02338P9061j0873Q4288P8855
2465A50137k24978n9471J10421m8372n8465J48390r3700p6684m251R1401K17478
2454A51906P5164l9280J14645r4218j68232L3542k9122K0271o2227j40836n0379
$$ y = [575169, 670403, 453483, 371048, 244420, 418026, 536242, 403273, 401212, 495547, 538062, 393113, 435412, 526400, 559773, 584645, 393399, 234846, 188365, 178932, -1163, -27959, 230158, 279990, 219400, 147249, 235877, 287843, 422351, 422464, 341766, 191751, 270010, 293723, 174138, 330937, 164662, 257825, 397457, 175551, 107149, 338752, 400310, 300931, 243501, 15963, -58162, -23994, 4549, 66037, 38871, 155487, 308745, 179917, 127195, 154480, -55998, 16295, -58587, -52641, -46346, -85015, 130857, 21144, -81194, -2133, -13006, 71282, 150137, -74841, -134312, -23891, -72263, -130728, 17662, -76038, -152722, -156973, -65572, 151906, 227070, 187790, 302435, 208217, 39985, 73527, 44405, 64676, 2449, -138387, -188766]
2443a88766L52365j3558J3282l897p2689J4208k5603O263O6403j6010m496m7211
2431H0291j13198M7776p3415l5170p6318K61682n553p88J36822J0167k896l05351
2419g5951j02549J13408Q5686k2090P9757l3360J05561M1558Q4343j61489l7414
2408G7460K8373J7315P593j51730k6353J07875Q2292k05744n5689K9361R2327
2397C080n0153J64333O8109K32677J81746k65222k75939L8919j0326L30748P8561
2386D96533p1920R3161K951P25J38912j65274j07021J27041o8443j72915J23394
2375C97144N727n0557j79123P2352O4549k77765n8987P8199K04389K72609r652
2364E18885j90608j03891q7986K9949m2245k5169M5731m6639K10998p0499l0987
$$ y = [-188766, 163599, 150041, 163323, 159426, 86737, 100945, 75342, 81605, 148008, 131998, 127502, 80291, -32907, 14869, -58546, -93716, -170034, 91648, 86095, 85307, 222129, 232296, 229400, -75951, -178500, -65092, 20594, -1496, 78261, 44901, 150462, 192020, 276363, 114874, 77460, 105833, 123148, 130741, -20989, -47342, 60533, 142825, -62919, -118608, -89247, 3080, -47073, 117260, 185369, 418046, 599792, 334570, 58631, 97550, 87224, 417972, 496533, 424613, 517774, 520725, 521450, 660362, 495088, 388067, 515108, 446665, 273750, 397144, 402871, 352314, 173191, 245543, 310092, 32327, -26660, 51539, 255928, 528537, 518885, 328277, 224386, 136400, 166349, 124104, 98935, 144666, 98027, 309025, 238526, 207539]
2353B07539L720j36698n7237P4318K388p2211n143N0249q3306P596J09352K8028
2341A28595j7653j6208j25104P390Q5971J7J43963J2159j38879K2368J3407j60270
2329d4244J87574Q9690L9132j78023O124J95935N7116k37051J08386J63775j07047
2318B81367j74754K74293j029n8207N053j6581l8753j98440M8420Q7894J06989
2307C16252j71048n4260J32488l8801j85036j2818J23623P2417R4470j61137J62736
2296B78886j7251M3779J3688L4135j26364k5450l2903M6506p5751Q2093L859m6717
2284A78510r3371J04447J02626J02466M742q2630J8340l3207q6004L1283L5234
2273B82436j14071q7858J43067J38182j33948L0963n6321k5543J72806Q8995l5109
$$ y = [207539, 211259, 74561, 17324, 91642, 94030, 21819, 16676, 66925, -16381, -8785, 100567, 128595, 110942, 94734, -30370, -22980, 62991, 63008, 206971, 219130, 80251, 102619, 116026, -44244, 143330, 233020, 272152, 94129, 100253, 296188, 353304, 116253, 224639, 388414, 281367, 106613, 380906, 379877, 321670, 326723, 310142, 271389, 72949, 121369, 209263, 316252, 145204, 90944, 223432, 184631, -405, -13223, 110400, 182817, 277287, 116150, 278886, 261635, 305414, 319102, 353237, 226873, 201423, 168520, 215026, 139275, 221368, 225227, 178510, 85139, 189586, 292212, 394678, 399420, 316790, 335130, 301923, 215919, 247202, 282436, 168365, 80507, 223574, 361756, 227808, 258771, 202450, 176907, 349713, 438708, 403599]
2262D03599o7632O654J50646M3506p5833o0210o0004N3795j1095k24K62501j65956
2250D79747j9392J5437Q6597L34232q8407j04468L7281j43721k96873Q9173l7968
2239C51638r956K1140J22819M4052m2274R7693K22417P213k30848K13515J07261
2228I04670O8366k4590p2600p6727l6186n3189J25230n591J08985N6129Q1179
2217A075676j17210R9213j44044r6114K60217M1482q3191J18460m6966m863K06109
2206A308769J62700j8076J19338o2829P5268m1832J43668M6201J53251J1296J51292
2195B049046O1886J0456j64024o4839J99288r3789j6050L35709J74049J18720
2185B610452J7434N2208L13338k94607j03252L11603J56825J3005p54J24903j28165
$$ y = [403599, 335967, 342621, 493267, 536773, 460940, 400730, 340726, 394521, 383426, 383202, 645703, 479747, 460355, 475792, 562389, 896621, 808214, 703746, 741027, 597306, 300433, 389606, 351638, 341682, 362822, 485641, 529693, 487419, 585112, 807529, 814742, 583894, 797409, 904670, 973036, 948446, 875846, 799119, 762933, 709744, 834974, 829383, 938368, 994497, 1075676, 958466, 1057679, 913635, 817521, 1077738, 1119220, 1036029, 1154489, 1107523, 1102660, 1308769, 1471469, 1453393, 1572731, 1509902, 1585170, 1543338, 1687006, 1733207, 1886458, 1897754, 2049046, 2110932, 2121388, 1957364, 1892525, 2091813, 1998024, 1981974, 2317683, 2491732, 2610452, 2627886, 2680094, 2993432, 2698825, 2595573, 2907176, 3064001, 3077006, 3076252, 3201155, 3072990]
2174C072990M7621L16325J07521J0148l434j02530K01064J28670J59822J74108
2164D112305J1440J20083P6182r6733K13950L91230J74392R873K7039O5699J11307
2153E216767K71350L37294J74095J83977K56575M95358M02479L07502M82535O78088
2143H806020M21277P16107O58813N67704N18868P53596Q95025R96140J194532
2134A5528082J376110J701435J748700J400356J757018K324826K756547L288813
2126C1881887M229686M551138N012378O774965P424940Q421415R990459J3210325
2118I1497193J8874921J1578736j5621901j8491249j2123736j3037411j2230005
2111E0446548r375149o534396m695390l320787k678326k030307j620353j121017
$$ y = [3072990, 3120611, 3436936, 3544457, 3554605, 3551171, 3448641, 3649705, 3778375, 3938197, 4112305, 4123745, 4243828, 4320010, 4223277, 4437227, 4828457, 5002849, 5012722, 5039761, 5105460, 5216767, 5488117, 5825411, 5999506, 6183483, 6440058, 6935416, 7337895, 7645397, 8127932, 8806020, 9227297, 9943404, 10602217, 11169921, 11688789, 12442385, 13337410, 14333550, 15528082, 16904192, 18605627, 20354327, 21754683, 23511701, 25836527, 28593074, 31881887, 36111573, 40662711, 45675089, 52450054, 59874994, 68296409, 78286868, 91497193, 110372114, 121950850, 106328949, 87837700, 75713964, 62676553, 50446548, 41071399, 34537003, 29841613, 26520826, 23842500, 21812193, 20191840, 19070823]
2103A9070823q11464n29699j285745j319232j228488j211094r37524n56248p49133
2094A0442196o97963o71567l06334k61226k93941n23016j82546l21162l55243
2085F829198k78976k36449m51372k99521k40352j02529k70129k41074j65964j56530
2075D386302k0281q3625j62337k77221k52600k39504j44871N5927r9498P5344
2065C237636j69746m1301l09702j22579j02720l4297p7351K1250q6863J59048
2055B473375K3289j26444j05537J36372J8103j80968k76575j02219j29164J19016
2045A849248l0210l2625q4112k37409N7763J20434m6403o5206O2428K120k26495
2034A369533J85711k4011m8126P7299R274j1095j82487P2053p43k18499J9096
$$ y = [19070823, 18259359, 17729660, 16443915, 15124683, 13896195, 12685101, 11747577, 11191329, 10442196, 9744233, 9072666, 8766332, 8505106, 8211165, 7688149, 7505603, 7184441, 6829198, 6550222, 6313773, 5862401, 5562880, 5322528, 5219999, 4949870, 4708796, 4542832, 4386302, 4366021, 4282396, 4120059, 3842838, 3590238, 3350734, 3205863, 3261790, 3162292, 3237636, 3067890, 3026589, 2716887, 2594308, 2491588, 2457291, 2379940, 2401190, 2314327, 2473375, 2496664, 2370220, 2264683, 2401055, 2419158, 2238190, 1961615, 1859396, 1730232, 1849248, 1819038, 1786413, 1702301, 1464892, 1522655, 1643089, 1596686, 1531480, 1593908, 1596028, 1369533, 1555244, 1531233, 1483107, 1560406, 1569680, 1558585, 1376098, 1448151, 1447408, 1228909, 1248005]
2023A248005N9913j20644r9152O6471R2762o9569j25534j63897Q7313n7207l9808
2012H78653k1648J02964k05100J6002q7586j57790L6226J18378q1965k7999J64836
2001G34971n758p3709l1679J43874k17447J73914n0809Q5191m6980j54285P7641
1990F34924j77551k1817k71169K2507K01570P3404Q0405m7247J88861l7501l9750
1979F06636M7025j20096p9089l5620N8049k10872r7871J12730J34467J53411j06801
1968D61969j81027m6851J12677J18604m3621j08462L7955j26982O0990o3834n8058
1957A63360J8689R066R9579J45859r5187J7409N2238k5607L5458n4702j7502k46531
1945A02129n6502J88151K1603j2840m9508j32751k6081M0523K66352k14191j7194
$$ y = [1248005, 1307918, 1187274, 1088122, 1154593, 1247355, 1177786, 1052252, 888355, 975668, 918461, 878653, 857005, 959969, 754869, 770871, 683285, 525495, 561721, 680099, 598134, 570135, 734971, 729213, 655504, 623825, 767699, 550252, 724166, 673357, 758548, 711568, 557283, 634924, 457373, 435556, 164387, 186894, 388464, 461868, 542273, 495026, 683887, 646386, 606636, 653661, 533565, 454476, 418856, 476905, 266033, 168162, 280892, 415359, 568770, 461969, 280942, 234091, 346768, 465372, 421751, 313289, 351244, 224262, 285252, 221418, 163360, 182049, 191115, 290694, 436553, 341366, 358775, 411013, 385406, 420864, 366162, 348660, 102129, 45627, 233778, 255381, 242541, 193033, 60282, 34201, 74724, 341076, 126885, 109691]
1934A09691M3708L5487J8828L4996p115l1191K7005p28p6343L8684j11449R6753
1922A78326m3545R1851J836L4800o0241k0250j75927L1835l157J51937J66557
1911C54022q5093j66267J63794j06363q7561K44328m6167j42904K4121k1466K828
1900A33272r0027j87341J46099K9755P1808K27988j4337l5641o2135j70552l5227
1889A3662N8865L515n0461R6939j50497J09123q3793j42501k7152J83879p4723
1878f3144L5306J75566j4886O1254K162r3782m3894l4592M8501Q4q1670J56989
1866A47894J28954o2796m3755k3427P2579k1840j08474J76823p4909o9791o2775
1855E8483j2855J10962P2512J52130p6993J51652j5878O1443J59248o6999o1959
$$ y = [109691, 153399, 188886, 207714, 242710, 235595, 204404, 231409, 230681, 154338, 193022, 81573, 178326, 134781, 226632, 228468, 263268, 203027, 182777, 6850, 38685, 35528, 187465, 354022, 268929, 102662, 266456, 160093, 72532, 316860, 270693, 127789, 151910, 130444, 133272, 43245, -144096, 2003, 31758, 103566, 331554, 317217, 281576, 219441, 48889, 13662, 72527, 76042, 25581, 122520, -27977, 81146, -2647, -145148, -172300, 11579, -63144, -27838, 147728, 132842, 194096, 196258, 102476, 58582, 23990, 72491, 72575, -9095, 147894, 276848, 214052, 170297, 146870, 219449, 197609, 89135, 265958, 191049, 121258, 58483, 45628, 156590, 229102, 381232, 304239, 455891, 440013, 501456, 660704, 593705, 531746]
1844E31746j13041k58007L5138j49735M5602R94r9122J15883R3040k7382j00879
1833G4237j84305J11797n8853O9038Q722l2481m9530J0331o4541J74636j05743
1822d6692k8119K91666j6153n0074j20850J46330j41367o8433J14411J04807K4201
1811B09727l02037n334J34398J36454k22135k26261J49161L3236P7075J51982
1801A36266k0003j62112P7231K9014K2179J12839p4656k6496M8833l19725J15436
1790f1194N4459j07485P2000J27290L1071r9177n6223K6539k2261N4627m9788
1779c0142O4733M2709N6917j08317m3390P4714p0699j06789J99533l1652k08519
1768a60902j45080K03844J56136J4491k0802j5672L8834m5541K04306N102j39217
$$ y = [531746, 418705, 160698, 195836, 46101, 91703, 92697, -6425, 109458, 202498, 175116, 74237, -110068, 1729, -57124, 11914, 20636, -11845, -61375, -51044, -115585, 59051, -46692, -74811, 216855, 200702, 150628, 29778, 176108, 34741, -33692, 80719, 185526, 209727, -92310, -97644, 36754, 173208, -48927, -275188, -126027, -92791, -15716, 136266, 116263, -45849, 31382, 60396, 82575, 195414, 120758, 94262, 143095, -176630, -61194, -6735, -114220, -42220, 85070, 116141, 16964, -39259, -12720, -34981, 19646, -30142, 34591, 77300, 134217, 25900, -17490, 57224, -13475, -120264, 79269, 47617, -160902, -305982, -102138, 53998, 68489, 47687, 32015, 70849, 25308, 229614, 234716, 95499]
1757I5499j12361o6569J19767o5488L4730m3771j0818O4356l004p3155j38651
1746a99465K09663j07693r3266J60895J08777O7370j47822r9040J56673q8371
1736c2279o8681P7169m0636m3141J32895j252P0723m9342R542O3708L8738k84975
1724a27531J26656j8201k01011J74685J05472J15915M1933r9605j31097j8727
1714c1511k4379Q960r894J32830o0801o8538l5759r221P6453J12982j55339q6886
1702a51103K51896j39612L7349K5595l3814K1013r5353J25635k05915j40496J22459
1691a82346K8401Q9618J09304N2475j00946J1661N2883j03830o5986L01823q8078
1680A04979k08572N8738j42749J83172R5436J01844p0704j80627Q3527J36714
$$ y = [95499, -16862, -83431, 36336, -29152, 5578, -38193, -49011, 15345, 12341, -60814, -199465, 10198, -97495, -190761, -29866, 78911, 146281, -1541, -100581, 56092, -32279, -100960, -23791, -64427, -107568, 25327, 24075, 94798, 45456, 54998, 118706, 157444, -127531, -875, -19076, -220087, -45402, 60070, 175985, 217918, 118313, -12784, -31511, -55890, -46930, -56824, 76006, 15205, -53333, -89092, -98313, -21860, 91122, -64217, -151103, 100793, -38819, -1470, 24125, -9689, 11324, -84029, 41606, -164309, -304805, -182346, -153945, -64327, 44977, 97452, -3494, 8167, 61050, -42780, -108766, 193057, 104979, -103593, -44855, -187604, -4432, 91004, 192848, 122144, -58483, 25044, 161758]
1670A61758j40645j36713J68555n1552J7772K77975P5574j21043j99570K30135
1660B82246j20997j99962J10828k33908R133J23893q7979q8977K8461J29304L4282
1649a3676M8418J46561j88664j8440Q126j26139J9818j80950J88759J5440q1269
1638a82016L1098l5296M0888j71912O9866K56399k47753M4553J98962Q8922j13673
1627a9962p5355m2855M0086r8369O5080O0349o0725N7422r829j69611k02734N4200
1615d02303J73314J18567J27309l4749J6984p7282N7813J90401k49652M1966J31234
1604I3602o4847j38947P9441k6799J52342p464n2589J19648n7022n7031M1982
1593H2316k4799p6748k43869l2438J27995J55718n6117p4769o1723J69667o0185
$$ y = [161758, 21113, -115600, 52955, 1403, 19175, 297150, 372724, 251681, 52111, 282246, 161249, -38713, 72115, -161793, -152660, -28767, -116746, -205723, -177262, -47958, -13676, 34742, 181303, -7361, -25801, -17675, -143814, -123996, -304946, -116187, -100747, -182016, -150918, -186214, -145326, -317238, -247372, 9027, -238726, -194173, 4789, 93711, -19962, -95317, -138172, -98086, -196455, -131375, -71026, -131751, -74329, -84158, -253769, -456503, -402303, -228989, -110422, 16887, -17862, -878, -78160, -20347, 170054, -79598, -37632, 93602, 28755, -110192, -30751, -57550, 94792, 87328, 34739, 154387, 97365, 40334, 82316, 57517, -19231, -263100, -295538, -167543, -11825, -67942, -142711, -204434, -34767, -94952]
1582i4952J05444Q6190j82242J962K99237k793r6539m7239r5422k10657Q5161
1571a51850r6963J86447K1848j8735n6482n8038J21839j66491m7546O5160K12996
1560A2185q5145L01497q4457k6022p5001j88040j01534R4314K1052n5066J94882
1549H665M5912j73358k5037K29529J13281N246k16647j05745R3426l974L7471
1538H769K6121l3409O499K0788O2171j02456m5333j18415J03624K40000j68516
1527a57J37435k54261o6430n7482p0944K41319j64675j21670K5748k9054L1190
1516c28981K69418K42979m9627l7869j03876O1639J55394k8880k19626j64388
1506b03817q6241K06126K2452j72146O6856m2128K38676L8839R3679j03975k4102
$$ y = [-94952, 10492, 96682, -85560, -83598, 215639, 212846, 116307, 69068, -26354, -237011, -151850, -248813, -62366, -40518, -59253, -115735, -173773, -51934, -218425, -265971, -200811, 12185, -72960, 228537, 144080, 118058, 43057, -144983, -246517, -152203, -131151, -186217, 8665, 54577, -118781, -143818, 85711, 198992, 204238, -12409, -118154, -24728, -28702, 8769, 34890, 1481, 7980, 28768, 90939, -11517, -56850, -175265, -71641, 168359, -157, 137278, -116983, -183413, -240895, -311839, -70520, -235195, -356865, -331117, -360171, -328981, -59563, 183416, 133789, 95920, -7956, 53683, 209077, 180197, -39429, -203817, -290058, -83932, -61480, -233626, -166770, -208898, 29778, 68617, 162296, 58321, 34219]
1495C4219J73937O1116k20385q390J5775N2355j8270k54165J16101n8893K12987
1484A06387N0484p2827j89993j81996j90909K99506R0769m6825M714j03419K97456
1473F3347k1272j00302p5989l1347J9424M0082k20545j28538L79900K72509R525
1462B06794q4400j13004j20991J02590K3400p3323l4905P589k89037P6765K98123
1451c99O4858j05408o7558P2304j05825M3184J45111n6420L7268J00704m8368
1440G9451K574j93710k806Q1258K7616K36981J23222k79594j83041J80813n7527
1429A5237m7991N5484j00404j956Q2490O8181j28522j72790K11482m224O905P1329
1417E5221o6759N5393J36413n5716l2201m6895k32357k2908n9782J46795O326
$$ y = [34219, 208156, 269272, 48887, 40497, 56272, 108627, 90357, -163808, -47707, -106600, 106387, 156871, 84044, -105949, -287945, -478854, -179348, -88579, -135404, -130690, -234109, 63347, 42075, -58227, -134216, -165563, -146139, -106057, -326602, -455140, -75240, 197269, 206794, 122394, 9390, -111601, -9011, 14389, -58934, -93839, -86250, -375287, -298522, -399, 64459, -40949, -108507, -36203, -142028, -98844, 46267, -10153, 27115, 127819, 79451, 82025, -111685, -114491, -33233, -5617, 231364, 354586, 74992, -108049, 72764, 15237, -32754, 22730, -77674, -79630, 2860, 71041, -57481, -230271, -18789, -23013, -16108, 55221, -11538, 43855, 180268, 124552, 92351, 45456, -186901, -209809, -269591, -122796, -116470]
1406a16470o3767m9564l5433J13174l2157O7937J72655j27519R2077j82369j12601
1395b74037Q8077L7859j4896J10497q1278j18375J71144R0724P5980q5209o4450
1384f3964R2989N5858M4428m3583J3737j1621M8268j6202N9061q5007k75912M7205
1372a34743J08905j08957J13266J44563m7922o9920k8884L5657J31659L0823k180
1361A72267q1211P1052q5233l30391l8951J27287Q1904k4207j00150J44692Q9860
1350B6919l6356R5527O5521j31734Q3254O5384k85752L24506q5220k46177j56207
1339b80335J83943o2800q2680K05775m9128J64417k32993R5868K06345l65502
1329b17090J20420K25819k4582k43339j44459N1884q873n1211J13098k1941N5528
$$ y = [-116470, -180237, -229801, -265234, -152060, -184217, -116280, 56375, -71144, 20933, -161436, -274037, -185960, -148101, -162997, -52500, -133778, -252153, -81009, 9715, 85695, 486, -63964, 29025, 84883, 129311, 85728, 99465, 87844, 136112, 119910, 178971, 93964, -181948, -134743, -25838, -134795, -21529, 123034, 75112, 5192, -23692, 11965, 143624, 174447, 172267, 91056, 162108, 76875, -253516, -292467, -165180, -83276, -107483, -207633, -62941, 26919, -9437, 86090, 151611, 19877, 103131, 168515, -117237, 207269, 122049, -124128, -280335, -96392, -159192, -241872, -36097, -85225, 79192, -153801, -57933, 148412, -217090, -96670, 129149, 104567, -138772, -283231, -231347, -240220, -291431, -178333, -200274, -144746]
1318a44746J6273Q7443O4779j25308M9215J56232k47920L1280J79557J12213l5879
1307A43139j51037K1466n8355j03140k0023K29893j34338o9836J09513L0212j04131
1296a06637Q9463L2411o2497J89826M3870q7747j46064P6295J32860k42957L2100
1285d9077N7918M3472j04790m5496m050n6065J60818K5704j4008Q9854O9429l60110
1273a86401j02973R8935R633j04217J54163K5109r9500J18374K13428J3252j14704
1262B5099K05286J1035m4221j0021j95660n8559n073Q3427P6126L4282j11453
1251A0268l56846N0921J22470l4231N3421J81225n3197j55683O4928J56974r0698
1240e0448J6645j0959j9321R6183j95389n4798P1398N5896J82014m6963m9664
$$ y = [-144746, -128473, -41030, 23749, -101559, -52344, 103888, -144032, -112752, 66805, 179018, 143139, -7898, 13568, -44787, -147927, -167950, 61943, -72395, -142231, -32718, -2506, -106637, -17174, 15237, -47260, 142566, 186436, 98689, -47375, 28920, 161780, -81177, -49077, 8841, 52313, -52477, -97973, -102023, -158088, 2730, 28434, 14426, 104280, 173709, -186401, -289374, -190439, -180806, -285023, -130860, -105751, -205251, -86877, 126551, 139803, 25099, 230385, 241420, 197199, 187178, -8482, -67041, -72114, 11313, 87439, 121721, 10268, -346578, -295657, -173187, -207418, -153997, 27228, -25969, -181652, -116724, 40250, -50448, -33803, -44762, -64083, 32100, -163289, -218087, -146689, -90793, 91221, 44258, -5406]
1229e406J18686j05035J1697k52692j7065l1674M1429P6569j90255N6495r124
1218c06375K52359N8886K7183M8632n8625l4270J46039r6438j20499J21618K09835
1207B48345K9201n5620k40688l489j72325K0597L6316Q7722m3460J08819j61j68891
$$ y = [-5406, 113280, 8245, 19942, -232750, -249815, -281489, -240060, -163491, -353746, -297251, -306375, -54016, 4870, 32053, 80685, 22060, -12210, 133829, 37391, -83108, 38510, 248345, 277546, 221926, -18762, -22251, -194576, -173979, -137663, -49941, -93401, 15418, 15257, -153634]
$$ [...]
##END NTUPLES=NMR SPECTRUM
##END=
