##TITLE=1H_EC-3264(9-4)
 CDCl3
 8 sc, 
 17.1.2022
##JCAMPDX= 6.0         $$ Bruker NMR JCAMP-DX V2.0
##DATA TYPE= NMR SPECTRUM
##DATA CLASS= NTUPLES
##ORIGIN= UXNMR, Bruker Analytische Messtechnik GmbH
##OWNER= root
$$ XWIN-NMR		Version 3.5
$$ Mon Jan 17 10:38:44 2022 Russian Standard Time (UT+4h)  she@DPX200
##.OBSERVE FREQUENCY= 200.131346
##.OBSERVE NUCLEUS= ^1H
##.ACQUISITION MODE= SIMULTANEOUS
##.ACQUISITION SCHEME= undefined
##.AVERAGES= 8
##.DIGITISER RES= 18
##SPECTROMETER/DATA SYSTEM= spect
##.PULSE SEQUENCE= zg30
##.SOLVENT NAME= DMSO
##.SHIFT REFERENCE= (INTERNAL, DMSO, 0, 15.7171)
##AUDIT TRAIL= $$ (NUMBER, WHEN, WHO, WHERE, WHAT)
$$ ##TITLE= Audit trail, XWIN-NMR		Version 3.5
$$ ##JCAMPDX= 5.01
$$ ##ORIGIN= Bruker BioSpin GmbH
$$ ##OWNER= she
$$ F:/spectra/data/she/nmr/H-F/1/pdata/1/auditp.txt
$$ ##AUDIT TRAIL=  $$ (NUMBER, WHEN, WHO, WHERE, WHAT)
(   1,<2022-01-17 10:37:37.54 +0400>,<she>,<DPX200>,
      <created by zg, POWCHK disabled, PULCHK disabled
       configuration hash MD5:
       00 E9 B6 7A A2 85 ED C7 34 08 36 98 17 FE 4E 26
       data hash MD5: 16K
       8B 2B 27 9E FE 31 65 05 40 AD 20 DF 43 13 0B 2A>)
(   2,<2022-01-17 10:37:40.68 +0400>,<she>,<DPX200>,
      <Start of raw data processing
       efp BC_mod = 2 LB = 0.24 FT_mod = 6 PKNL = 1 PHC0 = -15867.9 PHC1 = 13.80078 SI = 16K 
       data hash MD5: 16K
       DB DB 30 A0 B5 9C EE 0E A7 94 9C A8 56 AC 19 1B>)
(   3,<2022-01-17 10:37:57.57 +0400>,<she>,<DPX200>,
      <pk PHC0 = 0.712885 PHC1 = -1.8 
       data hash MD5: 16K
       F9 7A AA 57 95 96 B6 CD 14 8E 3C F4 83 45 5C 13>)
(   4,<2022-01-17 10:38:00.51 +0400>,<she>,<DPX200>,
      <abs ABSG = 5 
       data hash MD5: 16K
       FD 6B 45 22 AA EF 1D 7E 7A E8 42 B8 11 AB 83 B3>)
$$ ##END=
$$ 
$$ hash MD5
$$ CE 58 9E E2 AE 2E 40 A8 8E E2 23 99 08 00 EB 42
##$RELAX= 
##$RELAX= 
##$RELAX= 
##$RELAX= 
##$RELAX= 
##$RELAX= 
$$ Bruker specific parameters
$$ --------------------------
##$DU= <F:/spectra>
##$EXPNO= 1
##$NAME= <H-F>
##$PROCNO= 1
##$TYPE= <nmr>
##$USER= <she>
##$AMP= (0..31)
100 100 100 100 100 100 100 100 100 100 100 100 100 100 100 100 100 100 
100 100 100 100 100 100 100 100 100 100 100 100 100 100 
##$AQSEQ= 0
##$AQ_mod= 1
##$AUNM= <au_zg>
##$AUTOPOS= <>
##$BF1= 200.13
##$BF2= 200.13
##$BF3= 200.13
##$BF4= 200.13
##$BF5= 200.13
##$BF6= 200.13
##$BF7= 200.13
##$BF8= 200.13
##$BYTORDA= 1
##$CFDGTYP= 0
##$CFRGTYP= 5
##$CHEMSTR= <none>
##$CNST= (0..31)
1 1 145 1 1 1 1 1 1 1 1 1 1 1 1 1 1 1 1 1 1 1 1 1 1 1 1 1 1 1 1 1 
##$CPDPRG= <>
##$CPDPRG1= <>
##$CPDPRG2= <>
##$CPDPRG3= <>
##$CPDPRG4= <mlev>
##$CPDPRG5= <mlev>
##$CPDPRG6= <mlev>
##$CPDPRG7= <mlev>
##$CPDPRG8= <mlev>
##$CPDPRGB= <>
##$CPDPRGT= <>
##$D= (0..31)
0 1.2 0 0 0 0 0 0 0 0.06 0 0.03 0 0 0 0 0.0002 0 0 0 0 0 0 0 0 0 0 0 0 
0 0 0 
##$DATE= 1642401457
##$DBL= (0..7)
120 120 120 120 120 120 120 120 
##$DBP= (0..7)
150 150 150 150 150 150 150 150 
##$DBP07= 0
##$DBPNAM0= <>
##$DBPNAM1= <>
##$DBPNAM2= <>
##$DBPNAM3= <>
##$DBPNAM4= <>
$$ [...]
##$SUBNAM2= <"">
##$SUBNAM3= <"">
##$SUBNAM4= <"">
##$SUBNAM5= <"">
##$SUBNAM6= <"">
##$SUBNAM7= <"">
##$SUBNAM8= <"">
##$SUBNAM9= <"">
##$SW= 18.0517287032376
##$SWIBOX= (0..15)
0 0 2 0 0 0 0 0 0 0 0 0 0 0 0 0 
##$SW_h= 3612.71676300578
##$TD= 16384
##$TD0= 1
##$TE= 0
##$TE2= 300
##$TE3= 300
##$TEG= 300
##$TL= (0..7)
0 120 120 120 120 120 120 120 
##$TP= (0..7)
150 150 150 150 150 150 150 150 
##$TP07= 0
##$TPNAME0= <>
##$TPNAME1= <>
##$TPNAME2= <>
##$TPNAME3= <>
##$TPNAME4= <>
##$TPNAME5= <>
##$TPNAME6= <>
##$TPNAME7= <>
##$TPOAL= (0..7)
0.5 0.5 0.5 0.5 0.5 0.5 0.5 0.5 
##$TPOFFS= (0..7)
0 0 0 0 0 0 0 0 
##$TUNHIN= 0
##$TUNHOUT= 0
##$TUNXOUT= 0
##$USERA1= <user>
##$USERA2= <user>
##$USERA3= <user>
##$USERA4= <user>
##$USERA5= <user>
##$V9= 5
##$VALIST= <valist>
##$VCLIST= <CCCCCCCCCCCCCCC>
##$VD= 0
##$VDLIST= <DDDDDDDDDDDDDDD>
##$VPLIST= <PPPPPPPPPPPPPPP>
##$VTLIST= <TTTTTTTTTTTTTTT>
##$WBST= 1024
##$WBSW= 4
##$XGAIN= (0..3)
0 0 0 0 
##$XL= 0
##$YL= 0
##$YMAX_a= 151084
##$YMIN_a= -197845
##$ZGOPTNS= <>
##$ZL1= 120
##$ZL2= 120
##$ZL3= 120
##$ZL4= 120
##$ABSF1= 15.71714
##$ABSF2= -2.334709
##$ABSG= 5
##$ABSL= 3
##$ALPHA= 0
##$AQORDER= 0
##$ASSFAC= 0
##$ASSFACI= 0
##$ASSFACX= 0
##$ASSWID= 0
##$AUNMP= <proc_1d>
##$AZFE= 0.1
##$AZFW= 0.1
##$BCFW= 0
##$BC_mod= 2
##$BYTORDP= 0
##$COROFFS= 0
##$CY= -3
##$DATMOD= 1
##$DC= 0
##$DFILT= <>
##$DTYPP= 0
##$F1P= 0
##$F2P= 0
##$FCOR= 1
##$FTSIZE= 16384
##$FT_mod= 6
##$GAMMA= 0
##$GB= 0
##$INTBC= 1
##$INTSCL= 0
##$ISEN= 128
##$LB= 0.24
##$LEV0= 0
##$LPBIN= 0
##$MAXI= 10000
##$MC2= 0
##$MEAN= 0
##$ME_mod= 0
##$MI= 1.114404
##$NCOEF= 0
##$NC_proc= -7
##$NLEV= 6
##$NOISF1= 3.799351
##$NOISF2= 2.8
##$NSP= 0
##$NTH_PI= 0
##$NZP= 0
##$OFFSET= 15.71714
##$PC= 1
##$PHC0= -15867.19
##$PHC1= 12.00078
##$PH_mod= 1
##$PKNL= yes
##$PPARMOD= 0
##$PSCAL= 0
##$PSIGN= 0
##$REVERSE= no
##$SF= 200.130006887713
##$SI= 16384
##$SIGF1= 3
##$SIGF2= 2
##$SINO= 5.538805
##$SIOLD= 16384
##$SREGLST= <1H.CDCl3>
##$SSB= 0
##$STSI= 16384
##$STSR= 0
##$SW_p= 3612.71676300578
##$SYMM= 0
##$S_DEV= 0
##$TDeff= 16384
##$TDoff= 0
##$TI= <>
##$TILT= no
##$TM1= 0
##$TM2= 0
##$TOPLEV= 0
##$USERP1= <user>
##$USERP2= <user>
##$USERP3= <user>
##$USERP4= <user>
##$USERP5= <user>
##$WDW= 1
##$XDIM= 16384
##$YMAX_p= 303861860
##$YMIN_p= -1063080
$$ End of Bruker specific parameters
$$ ---------------------------------
##NTUPLES= NMR SPECTRUM
##VAR_NAME=  FREQUENCY,     SPECTRUM/REAL,   SPECTRUM/IMAG
##SYMBOL=    X,             R,               I
##VAR_TYPE=  INDEPENDENT,   DEPENDENT,       DEPENDENT
##VAR_FORM=  AFFN,          ASDF,            ASDF
##VAR_DIM=   16384,         16384,           16384
##UNITS=     HZ,            ARBITRARY UNITS, ARBITRARY UNITS
##FACTOR=    0.220516191357247, 1,           1
##FIRST=     3145.47137603164, 0,            0
##LAST=      -467.24538697414, 0,            0
##MIN=       -467.24538697414, -1063080,     0
##MAX=       3145.47137603164, 303861860,    0
$$ Real data points
##PAGE= N=1
##DATA TABLE= (X++(R..R)), XYDATA
$$ [...]
9411 1083189 1053205 1232509 1180671 1054314 1290175 1295138 1272187 1093001 1261265 1168625 1151279
9400 1151279 1345702 1277455 1427275 1557766 1642460 1580748 1414570 1461870 1560044 1620193 1749844
9389 1749844 1918017 1847645 2013453 2115378 2264712 2409267 2537681 2630294 2688211 2966245
9379 2966245 3012316 3407549 3741326 3894389 4069193 4363253 4514054 4664547 4581665 4809289
9369 4809289 4826857 4820563 4763255 4562719 4362888 4064478 3777459 3748077 3606724 3450722
9359 3450722 3129304 3091290 3253078 2935110 2825446 2874950 2645724 2728276 2808038 2751815
9349 2751815 2732709 2795908 2951217 2970996 2915730 3061406 3054287 3136739 3167984 3218128 3418238
9338 3418238 3432475 3654032 3897248 4175182 4395009 4687698 4872836 5183234 5569912 5531222
9328 5531222 5716722 6032107 6266744 6474972 6707567 6919005 6940825 6951643 6828106 6798252
9318 6798252 6710355 6683689 6735197 6978017 7084150 7013178 7310175 7811706 7917814 8219143
9308 8219143 8508745 8642450 8773713 8764268 8690324 8908651 9270035 9208328 9225480 9275198 8974736
9297 8974736 8888093 8909146 9077106 9093575 9316252 9572738 9604481 9578047 9738948 9855409
9287 9855409 10138098 10030287 10020887 10011116 9733728 9594374 9332389 9040772 8783135 8859866
9277 8859866 8806223 8862162 9181214 9533344 9629412 9608651 9609783 9639446 9664041 9943307 9885355
9266 9885355 9949768 10099500 9956440 9685633 9575641 9175314 8861043 8649489 8220339 7860467
9256 7860467 7671206 7465982 7095210 6890777 6787619 6845639 6565796 6351653 6226957 6399744
9246 6399744 6220092 6027659 5836070 5648021 5376281 5195548 5348095 5248892 5321376 5135831
9236 5135831 4954717 5095473 5279373 5440317 5452851 5353911 5563321 5709512 5591523 5562102
9226 5562102 5651288 5495215 5558632 5544097 5473965 5612636 5750479 5701659 5395555 5363436 5417211
9215 5417211 5434636 5300950 5365141 5319509 5077523 5114967 5183057 4870232 4859665 4654192 4805924
9204 4805924 4831522 4861645 4865521 4552088 4519691 4601772 4687783 4658427 4776077 4850206 4913399
9193 4913399 4993692 5016152 4984001 5028269 4879380 5006399 5074042 5092783 5029911 4852194 4799687
9182 4799687 4777637 4782041 4918316 4967885 4839137 4795405 5061664 5132315 4957080 5048182 5088392
9171 5088392 4889279 4844220 4871398 4972910 4985267 4826022 4774968 4985305 5085104 5182532 5246365
9160 5246365 5236073 5180567 5179289 5188549 5226749 5191508 5269080 5520798 5680638 5583108 5578374 5693429
9148 5693429 5859330 5910342 5744790 5800051 5952897 6090085 6092239 6294866 6376485 6399018 6558878
9137 6558878 6612387 6917600 7098099 7472360 7493484 7563526 7859258 8012694 8274639 8444863
9127 8444863 8751590 9154577 9485834 9773926 10273687 10595732 10934023 11224972 11587518 11903237
9117 11903237 12470090 13017877 13454959 14131326 14881198 15753958 16648264 17488039 18830355
9108 18830355 20328909 21937604 23838264 25921170 28352936 31261165 34481717 37586755
9100 37586755 40789125 44229627 48024006 51712288 54604044 55402485 55658531 56869430
9092 56869430 59083565 61554394 62761090 60779820 56326300 51083493 45699579 41810362
9084 41810362 39435848 37942346 37331189 36721663 35849608 34555812 33250116 32434356 32152985
9075 32152985 32548873 32899272 33775930 35235995 37031788 39228825 42171134 45792284 49475686
9066 49475686 53378142 57487364 61258202 65022888 68372791 71569157 74242025 77042054
9058 77042054 80512592 83948735 85741098 84574149 82707528 80767040 77285251 71793177
9050 71793177 64397626 55683411 48380356 43045985 39259443 36583131 34601102 33174177
9042 33174177 31950677 31052411 30063075 29074355 28026158 26920707 26310115 25993273 25657268
9033 25657268 25669182 25228696 24988432 25352292 25598852 25963153 26445337 26615289 26757136 26755253
9023 26755253 26547981 26602032 26320731 25825213 25530029 24729281 24007695 23470774 22927758 22413788
9013 22413788 21603397 20404494 19265811 18058150 17146135 16697656 16098165 15773706 15503448
9004 15503448 15088741 14845613 14562446 14256687 14097482 14003470 13787475 13697372 13549968 13541753
8994 13541753 13591909 13680103 13793234 13899336 13936862 14327028 14595179 14505274 14393654 14353864
8984 14353864 14127067 14274241 14386923 14330629 14341983 14194253 14294911 13865833 13167382 12370941
8974 12370941 11555110 10683899 9967246 9515986 9026886 8798646 8525781 8338600 8124679
8965 8124679 7984099 7812563 7664487 7508197 7262437 7091066 6906770 6855286 7019851 6894194
8955 6894194 6792355 6796331 6858101 6911101 6677151 6596110 6530708 6488386 6480991 6597209 6613350
8944 6613350 6588327 6535535 6942963 7001357 6887876 6816187 6911036 7012922 6934122 6775324 7001214
8933 7001214 7038543 7091939 7134535 7224260 7222391 7532637 7787962 7698661 7843970 7923247 8184670
8922 8184670 8240584 8092598 8237500 8366180 8587156 8768561 9174488 9388025 9439059 9723184
8912 9723184 10000548 10326412 10411852 10554537 11001541 10924062 10993863 11157487 11233800 11382385
8902 11382385 11631758 11945581 12322997 12427801 12744441 13117034 13453998 13956300 14417249
8893 14417249 14751500 15242086 15657718 16120103 16752304 17394975 18219778 18751803 19349052
8884 19349052 20107733 21034508 21826121 23121096 24107583 25225054 26247416 27491346 29023047
8875 29023047 30379655 31922622 33505427 35254419 37184782 38944133 40895225 42595214
8867 42595214 44120682 45677560 47833929 50570788 53727176 57082340 59347739 61007674
8859 61007674 62109199 62322588 60851625 58036058 54986376 52711944 51687244 51187448
8851 51187448 51719911 52691232 52894670 52773480 52244630 52411525 53260431 54238079 55603101
8842 55603101 57294841 59196208 61228932 63171642 65095493 67330124 69027937 70911643
8834 70911643 73449564 76673441 81027518 86372946 91983427 97579096 102865302 107266257
8826 107266257 109738685 110000759 107469870 102613811 96529035 90918551 86893192 84410378
8818 84410378 82473621 79750175 75822759 71601274 68292166 66042068 63983565 62342836
8810 62342836 61066695 59907517 58835153 58112436 57577218 57244950 57068323 57302036 58017032
8801 58017032 59308783 60543977 62004365 63905263 65893674 67850424 68945494 69978843
8793 69978843 71591687 73940581 76487055 78262970 79170438 78676720 75803922 71236384
8785 71236384 66004417 61285596 57459178 54564808 52798880 51654164 50965000 50550867
8777 50550867 49819993 48732972 47489185 46323886 45064215 43946811 42615518 41093816
8769 41093816 39719548 38397546 37128025 36135422 35337962 34788380 34261389 34100569 33750668
8760 33750668 33798080 33983326 34414722 34422289 34399932 34529698 34480021 34274495 33843145 33712250
8750 33712250 33825149 34203853 34450564 35042485 35705364 36464451 37398392 37923676 38554894
8741 38554894 39234199 39754004 39999010 40666768 41319477 41692216 42253474 42735619 43496222
8732 43496222 43887358 44438016 45010896 46360357 47875481 49948351 52437232 55168350 58497976
8723 58497976 62559829 67753814 74140371 82101514 93086803 108142375 125870269 141266431
8715 141266431 151809397 150554905 129127278 103354881 86629313 76783849 70913923
8708 70913923 67614479 65215076 63390044 61859952 60946122 61052704 60971894 60594529 58885576
8699 58885576 55835842 52994683 51040742 49263087 47624844 45458018 42661786 40289211
8691 40289211 38362069 36969608 35707123 34700884 33880734 33312744 33043957 33243757 33666414
8682 33666414 33784326 34502589 35614611 37058230 38404449 39372431 40212721 40830661 41498982
8673 41498982 43280306 45514468 48024378 50869306 52876617 53157899 51629135 48726798
8665 48726798 44925928 40629689 37103836 34948809 33309304 31957553 30969956 30049830
8657 30049830 28804404 27147313 25676422 24323516 23640579 23238869 22801769 22494514 22437853
8648 22437853 22418412 22614188 22765129 23177336 23788147 24335009 24999707 25405672 25954502 26100744
8638 26100744 26263555 26479088 27106510 27321197 27052436 25717690 24028423 22677610 21617719
8629 21617719 20510628 19283020 18165853 16787117 15498980 14546966 13856740 13294063 12718883
8620 12718883 12366297 12001470 11564367 11241847 11122199 10862675 10611293 10342941 10001585
8611 10001585 9952808 9968231 9725627 9577034 9409434 9143467 8947160 8960891 8881075 8655359
8601 8655359 8375432 8239183 7961130 7446526 7432319 7070766 6775839 6536755 6408637 6171406
8591 6171406 5797739 5653234 5652613 5344637 5104400 4862242 4917285 4857604 4735437 4543040
8581 4543040 4365414 4116434 3996957 3993881 3837311 3852553 3814781 3750884 3310906 3215003 3433549
8570 3433549 3250716 3242495 3303823 3110215 3081468 3260449 3039522 2865934 2925235 2786858
8560 2786858 2569352 2410400 2309673 2329342 2266048 2416092 2337376 2377114 2382326 2323704 2116426
8549 2116426 2182369 2243814 2006157 1872365 1597612 1548339 1762742 1858795 1755143 1934919
8539 1934919 1938592 1814483 1638153 1641080 1563702 1548931 1441496 1447597 1619518 1505941 1380313
8528 1380313 1426954 1436077 1539093 1522477 1336801 1365169 1427057 1447712 1349420 1206879 1194708
8517 1194708 1343001 1217788 1034924 1191012 1247750 1045915 936813 841168 925798 987033
8507 987033 1004837 889784 845696 935806 958963 710962 665287 588554 867193 989359 897980
8496 897980 1097174 1052012 1039276 872317 1061250 1144835 1103715 1048678 837140 860551 1005597
8485 1005597 759926 861783 1045849 1081411 1028598 1041219 923558 903666 838120 898108 798916
8474 798916 925245 924026 727148 845562 665874 858531 874298 846443 922009 867789 730961
8463 730961 624713 855564 838254 984928 954478 895311 843394 1025126 954094 713695 746338
8452 746338 693456 655640 643085 598075 691456 629997 621697 676988 592001 388537 449284 546026
8440 546026 654157 592756 706425 731933 553411 633850 772561 803569 457482 331089
8430 331089 580829 634915 524060 609692 747804 532974 531137 383763 406052 729894 550413
8419 550413 400436 525641 488369 485283 450195 173650 120440 45696 257524 349196 494281
8408 494281 413328 306008 283255 227259 171043 399516 233254 223988 166009 273181 410402
8397 410402 483386 518735 527692 504914 448623 424698 554911 377505 106187 112637 131660
8386 131660 192502 179042 274460 181068 104608 59258 39394 186319 296629 331227 267944
8375 267944 158485 200248 117671 48927 354999 275749 201328 349463 241041 64470 101181
8364 101181 286747 301126 244500 163971 259383 224050 -33929 63092 38381 -13503 -90045
8353 -90045 -74602 -38569 39631 34785 44376 71414 -122687 -60165 -6610 -167990 -70980 176569
8341 176569 187313 140569 73690 23785 112566 32811 14597 238652 108808 72913 -4644
8330 -4644 -22858 17898 38937 -2161 -228753 -259191 -27365 -51654 48539 20520 -29353
8319 -29353 122320 197513 140670 -109184 213832 287874 225579 250374 498078 343334 149982
8308 149982 247399 335744 424930 344624 233479 177296 82853 106866 -69073 122104 303830
8297 303830 153710 294348 103128 87143 -10395 153455 214061 162984 110025 35587 45725
8286 45725 221316 245810 218471 -18499 121106 134972 64236 252905 146281 35555 302954
8275 302954 84468 63427 -9324 124140 245437 72171 38794 5396 185658 218612 174609
8264 174609 262537 282101 174288 -92858 -80941 29047 -95708 -138092 -255435 -139903
8254 -139903 -156281 -242832 -1282 186099 203558 286132 273770 107651 135795 218591 288079
8243 288079 301433 165422 347385 553413 462446 399375 590185 565107 438901 56163
8233 56163 56608 128957 189375 65948 54079 49698 65764 7025 137036 169770 172455 300175
8221 300175 198909 -55500 -146070 -1955 101333 -102273 -223744 -44713 -157091 28136
8211 28136 205813 44458 -173220 -17487 -38821 -93070 -240771 -272250 -198277 125185 33632
8200 33632 74502 -45751 -256596 -489123 -405374 -397053 -71629 -545757 -491302 286168 79911
8189 79911 317543 236973 231684 -110762 81879 -21868 -89489 -155188 -60287 230852 130155
8178 130155 32986 -97884 -71196 -228479 -245555 46 -31629 143351 82392 144106 173091
8167 173091 -5805 -78126 -126120 155 -97820 -254048 -159692 -18853 8405 -31047 4632
8156 4632 -35032 -90245 -359455 -422471 -249019 -355550 -176358 -175455 38862 -34037 -149133
8145 -149133 -234179 -225853 -266595 -173665 -63693 -147808 -28524 -44395 -101220 -132827 -47205
8134 -47205 -41602 190572 97159 -133275 -341470 -251651 -399798 -434634 -403004 -283095 -56953
8123 -56953 -35322 -91937 -151388 19221 24571 -149160 -276371 -350558 -334378 -152170 -46326
8112 -46326 -77164 27381 193282 65071 -12941 -174746 -268444 -269651 -52071 -89163 -131083
8101 -131083 -123406 -296483 -80189 -64483 -83769 9152 69571 24812 -222522 -361058 -42691
8090 -42691 -174406 -113119 130221 -41874 -213238 -174661 10539 -71244 -226699 5023
8080 5023 52975 28547 103500 -103571 -337692 -407522 -570977 -523153 -268910 -349110 -270750
8069 -270750 -237679 -335368 -367334 -234011 -194142 -179059 -160026 -32204 114689 35313 -178767
8058 -178767 -272698 -87062 -63786 -103215 -92550 -184202 -66009 -131106 -267196 -401928 -338011
8047 -338011 -321367 -33664 38571 -237988 -99200 -274089 -227572 -339190 -255718 -57465
8037 -57465 -147903 -218407 -51249 35952 -281632 -365321 -430851 -431425 -332669 -194557 -410154
8026 -410154 -236555 -216963 -253328 -202458 -143673 -122584 -262546 -37914 -124939 -342789 -257893
8015 -257893 -143925 -48445 -103244 -204891 -233657 -303501 -117732 71245 -63205 -382 -223922
8004 -223922 -324503 -288455 -34647 -112250 -359000 -329617 -6183 -121108 -214940 -283550 -158162
7993 -158162 -248933 -249929 -136629 -230250 -62819 -269375 -124133 -84458 -57905 -23061 7983
7982 7983 -172563 -160087 120712 152903 69515 -51950 -85264 -186618 -154654 -143534 -62886
7971 -62886 -196142 -97819 -107289 -242622 -40471 -91648 -190481 -321832 -266908 -446491 -363627
7960 -363627 64187 206292 -20807 27521 -85827 -196479 -172509 -96170 -100292 -102555 -134161
7949 -134161 -116080 -4448 49761 180155 299004 120520 -37817 5168 29067 59976 116111
7938 116111 51292 113714 -581 -54534 -154382 -245564 -280780 -206749 -138838 -322451 -265730
7927 -265730 120670 76076 -32259 -66277 -104327 -275777 -312813 -149502 -54661 -127685 -199886
7916 -199886 -273478 -212353 -62866 -164551 -275060 -131405 -129187 -114326 52800 165116 22873
7905 22873 -125690 -166431 -282025 -262688 -216019 -193217 -191543 -335100 -281454 -356326 -274985
7894 -274985 -165512 -216507 -182756 -328793 -85479 -80302 -20835 -4174 29231 8223 59394
7883 59394 11502 -85939 -169778 -265697 -254551 -124114 41320 -62799 -202153 -136372 -28773
7872 -28773 -129124 -214524 -276982 -137611 -73307 -210103 -321700 -265458 -45534 -29322 -64253
7861 -64253 54280 -201126 -195988 -128074 -209901 -243006 -98711 199243 -68429 -181284 -171556
7850 -171556 -25686 9280 -93514 -127708 -230807 -321251 -159612 -196810 -96464 -85786 -154616
7839 -154616 -212781 -126540 8550 -92638 -141681 -171800 -189862 -17628 -134715 -201805 -59397
7828 -59397 -142788 -457162 -616674 -412629 -391833 -304568 -215968 -240274 160830 97421 -22068
7817 -22068 -25835 -83856 -20727 115148 193272 42009 -241800 -206895 -47213 29326 64724
7806 64724 32128 -206293 -151672 8006 121983 157776 396880 -472304 -1063080 -477923
7796 -477923 -512029 -164697 -159317 105422 64174 -68834 -81727 -54260 13093 -17545 38895
7785 38895 -154360 -45452 -49932 -188262 -170078 -194402 -237881 -309089 -193652 -314197 -376216
7774 -376216 -303875 -366516 -363749 -352936 -399583 -235837 -255150 -320802 -49585 -140442 -250024
7763 -250024 -357152 -346178 -191188 -193247 -178945 -67167 -199197 -311823 -204913 -53217
7753 -53217 3490 -218580 -246015 -112622 31841 68259 -128606 -141395 75015 -160557 -355684
7742 -355684 -399537 -61976 -221793 -417987 -309312 -324443 -301977 -143333 -219641 -225193 -331732
7731 -331732 -310706 -161385 -339387 -257213 -277086 -217273 -85382 -69852 -137264 -137615 -32923
7720 -32923 -55058 -60085 -231813 -233604 -178064 -110880 -112776 34577 111703 -78483 -76442 -235281
7708 -235281 -149866 -45969 -97808 -141771 -80583 -141998 -108710 -221880 -90904 28473 -176873
7697 -176873 -191806 -286379 -247984 -252564 -251019 -257527 -251278 -291898 -185910 -95611 -29676 -203066
7685 -203066 -281448 -5859 -32151 -31826 -11107 -32697 -20685 -35133 -62711 -176849 -58014
7674 -58014 -122050 114960 89816 44024 35672 20580 -129210 -267280 -97488 -239161 -316633
7663 -316633 -153557 -113446 -205190 80757 155441 2501 69694 24980 -15252 -6786 -100534
7652 -100534 -162854 -295622 11693 -64316 11167 75318 21228 -69870 -20661 56916 -76684
7641 -76684 -119418 -8180 -270103 -203295 -275286 -160067 -113062 -59946 15944 153268 189085
7630 189085 67048 -21840 52619 165523 213299 120697 88827 249887 147308 70591 186841
7619 186841 39825 131603 132997 -75689 -1175 -40869 -120329 -87497 -24626 -200718 -303921
7608 -303921 -201844 -102921 -21042 204154 56671 134915 165098 8350 65817 153090 -100634
7597 -100634 155462 270274 160593 192510 117489 23078 103696 -37980 35911 170731 106786
7586 106786 21571 -78922 -71001 95919 49416 78247 -8588 149747 207215 -92375 -176507
7575 -176507 -126933 -5093 -41881 -53569 -170496 -70604 -76179 -220317 -24014 -106487 -76004
7564 -76004 -119215 -94974 -220898 -211072 -82978 -7999 -30473 -274767 -248626 -179128 -160463
7553 -160463 36226 88304 -76698 -110803 -99965 -66156 3630 16169 -60280 87034 -40204
7542 -40204 113937 103343 -110426 -92214 -204280 -186555 -154349 -115061 -29408 -32430 -13539
7531 -13539 -173505 -143785 31042 113031 37767 67264 -17817 11853 -15726 126738 -105492
7520 -105492 -28455 -51893 -216750 -77120 -115184 -268582 -263787 -145941 -66391 -14613 -45313
7509 -45313 92502 -1980 31677 35621 20794 8687 -74055 -31264 92303 152422 239315 26192
7497 26192 -189854 -91712 175959 454932 385154 197499 298371 -72558 -26524 272382
7487 272382 339810 376045 293814 81186 179283 428605 414826 193158 275432 348363 215263
7476 215263 189360 9325 56456 -19806 -51338 -119691 -59934 -42757 133159 147685 -162242
7465 -162242 -90315 -107804 -61653 -121284 -58589 -76456 -93340 184048 171158 87816 158978
7454 158978 125596 143204 121282 256730 244543 80886 111540 170617 158162 95912 173077
7443 173077 67830 18680 56748 223410 -17697 -114884 65422 87454 77313 43066 59946
7432 59946 -121479 98835 199327 131600 -45257 -275261 -255659 -238161 143850 56216 -105802
7421 -105802 -128832 1418 -153656 -262636 -163778 -142658 -143643 6003 -35312 -121825 6935
7410 6935 -162329 -116371 -70747 -50054 33647 -2319 -144812 -148862 -88915 11895 -112579
7399 -112579 -194746 -349111 -217424 -39224 5059 -112034 -42750 -144730 -133285 -194613 13956
7388 13956 178153 50245 61182 5207 -4675 36004 98268 86868 183601 137401 106037 84748
7376 84748 24719 77463 209702 -21417 49194 181360 328743 217517 311057 69855 -77427
7365 -77427 -65914 -106510 -133302 -183995 -243405 -113316 20833 38380 43087 107702 348464
7354 348464 285803 133410 -141798 -7876 111789 -27312 -256023 -133449 -12820 24687
7344 24687 45397 78158 75403 29249 59913 35151 23015 157430 81855 23531 -38468 -18166
7332 -18166 -28531 28899 192524 30435 -74234 -160648 -47362 31899 112923 26115 42951
7321 42951 75313 45623 56890 135382 281923 58241 -96964 46208 -49286 -78470 -166775
7310 -166775 -200447 -194679 -53783 -158996 133752 435118 449238 260819 133811 -136736
7300 -136736 -73033 159408 45160 4716 -17559 63709 1128 16190 95948 282988 147625
7289 147625 214857 76195 127521 151777 61505 -21412 6968 206004 156763 121830 308588
7278 308588 76495 180667 188945 208275 362976 237858 289587 280072 348914 393770 238590
7267 238590 402097 351343 321895 198196 145530 82455 139604 159835 41646 -8759 109374
7256 109374 133322 91901 229949 181942 147609 27337 117549 242175 178331 219859 162345
7245 162345 131881 250003 294933 424520 253339 153113 251656 350846 131481 163239 307420
7234 307420 139614 243687 404950 300229 82407 41570 -110366 -119269 89183 330560
7224 330560 229379 299033 243051 147654 192880 289650 459629 338655 226207 258359 380060
7213 380060 337599 442594 208979 343056 358470 436868 439168 258100 387102 462328 489380
7202 489380 678692 686433 563345 449474 488714 340070 286992 359500 245989 391648 697480
7191 697480 723999 738159 745277 757439 764187 789516 690732 1053767 908352 1098625 940415
7180 940415 926308 1229201 1103336 1109650 1198486 1147616 1171928 1180830 1029536 1055276 1040580
7169 1040580 1293862 1426183 1500342 1513391 1746280 1668755 1753613 1877387 1954931 1874469 1722091
7158 1722091 1627167 1738340 1796048 1955326 2193170 2157829 2062503 2156206 2187074 2397551 2334525
7147 2334525 2328124 2346223 2310842 2289702 2314279 2466873 2471023 2436507 2598233 2688490 2620090
7136 2620090 2709939 2882213 2911625 2975927 3070326 2957202 2859457 3223002 3357493 3233128
7126 3233128 3512741 3825522 3929854 4203096 4319228 4710699 4819477 4779099 5061945 5475066
7116 5475066 5905608 6130871 6339233 6613566 6929728 7311296 7775803 7914511 8356272 8957421
7106 8957421 9323812 9985299 10773768 11512362 12396353 13573782 14896453 16185972 17795555
7097 17795555 19452435 21675342 24285710 26986581 30397013 34519720 39908804 46576828
7089 46576828 54707546 64097584 74261761 83573162 88996354 88637885 82026525 70991346
7081 70991346 58607026 47758653 39203256 33279954 28737698 25478154 23039956 20823937
7073 20823937 19083250 17435575 16145081 14980245 14071988 13198202 12606393 11845011 11221921
7064 11221921 10653130 10137028 9945352 9460677 8891565 8478619 8202210 7819763 7442524
7055 7442524 7248256 7189861 7141986 6949727 6789500 6643226 6479970 6594567 6854588 6811784
7045 6811784 6868495 7011079 6958031 6830240 6591945 6248780 6136401 6145832 6151161 6166592 6155803
7034 6155803 6277869 6228562 5946788 5618602 5322945 4863629 4628380 4452623 4359904 4209411
7024 4209411 4041605 3964877 3989745 4045779 4006102 3844681 3688551 3499565 3396613 3475094
7014 3475094 3745940 3863076 3857496 4276455 4550951 4721229 5258195 5503210 5986001 6726741
7004 6726741 7355885 8001595 8904446 9727096 10389147 10411380 9934126 9048429 7864607 6882749
6994 6882749 6244452 5515472 5199315 4841455 4618171 4395334 4255874 4356798 4379919 4330867
6984 4330867 4444474 4926247 4756781 4793945 5125963 5391872 5717806 6052562 6717768 7137728
6974 7137728 7457373 7781111 7845036 8165471 8178177 7998607 7778543 7558422 7405668 7180415
6964 7180415 6565432 6515873 6337877 6175951 6424181 6468377 6554085 6976909 7294921 7397843
6954 7397843 7403076 7629895 7799575 8003676 7760320 7652051 7177416 6689868 6235441 5953416
6944 5953416 5437549 5105742 4763686 4482246 4329101 3840974 3654141 3316058 3265119 2944350
6934 2944350 2692749 2649125 2613392 2456803 2342748 2252984 2069282 2034107 1952191 1887493 1877233
6923 1877233 1643806 1663621 1638277 1618716 1512665 1398916 1384882 1255992 1157463 1120207 1052002
6912 1052002 951862 952646 1002301 916851 853791 676794 671238 600132 553614 670741 651750
6901 651750 830227 839480 778835 750977 751884 577269 437673 524105 664642 596493 466728
6890 466728 436641 381559 456152 495168 452344 526492 618049 412044 223949 245426 219120
6879 219120 279976 492604 590473 395913 341870 514435 468707 462708 353073 310806 211043
6868 211043 215767 191455 241501 58945 17558 137394 232293 283246 364203 440693 439167 324803
6856 324803 179882 240762 69550 26554 149468 122409 170704 192961 168940 139082 276452
6845 276452 444300 436631 266538 290693 273682 14444 -7952 155419 226890 206533 246226
6834 246226 108220 333154 348610 280681 171827 237172 187479 56438 -49906 -51483 111841
6823 111841 136321 99392 21390 17639 130160 132192 232150 373167 204134 101100 -3577
6812 -3577 97476 103255 100019 45835 162315 216386 166741 212379 213423 313792 422046 288884
6800 288884 209731 318066 229180 166635 108829 19906 165512 68079 55391 66721 100573
6789 100573 39712 102630 168192 126041 -163931 -16039 -86551 20043 358758 316496 37573
6778 37573 -159568 68822 56615 109769 -11343 29802 135733 137232 22373 -69562 -111025
6767 -111025 -22468 -88626 -42525 14845 -93754 -184155 -160964 -213768 -112782 24802 235339
6756 235339 242678 156477 47226 201765 312657 334566 173429 223184 50854 -44681 -191594
6745 -191594 -89755 -164351 -210059 -86547 -65479 62635 -119953 -82681 -70358 79110 146421
6734 146421 -59776 36945 174140 108270 200906 307448 303688 48453 97775 186976 148275
6723 148275 1119 32301 -52510 134741 288224 161133 77945 78813 -19611 -176513 -88930
6712 -88930 27035 -58270 -37606 -76965 17102 14758 -20702 38074 -107545 72335 363101
6701 363101 271010 188541 248118 243750 171000 58459 -187447 -75117 64177 -5075 37854
6690 37854 69551 230408 311175 345105 405737 363037 225005 355498 501137 455805 352815
6679 352815 377275 240705 188777 239666 276312 216681 5279 204177 147374 21655 121734
6668 121734 64475 -42875 57174 -57772 -148034 -65093 -45962 18095 19756 -87383 -104287
6657 -104287 -19925 84987 198534 -1035 45379 218346 151153 -48893 -141856 -67361 92531
6646 92531 108299 122897 159581 56989 39365 9034 117686 83466 -39931 -28718 157782
6635 157782 115009 -25674 136652 217569 79371 65237 154383 46755 2198 -90074 -167850
6624 -167850 -161412 -97090 104768 240337 168097 223252 167094 -17254 42780 60510 136296
6613 136296 208650 106942 147128 229305 333671 264877 212912 95834 110430 -97049 6946
6602 6946 21727 -51448 -19736 10688 49636 105102 212036 161148 243394 263773 71122 -1756
6590 -1756 -68008 -198307 -157038 -117399 -73085 29857 105832 100456 126337 -100021 -18852 134722
6578 134722 37750 -202822 -180396 -91887 -226440 -210829 -202988 -247525 15449 20975 37441
6567 37441 60606 105585 -61205 -71913 -40106 -56473 -101809 86534 204179 97244 243651
6556 243651 286992 265570 199952 -53744 -174155 -14407 86882 -102511 -266084 -134170
6546 -134170 -118729 -34059 -59775 17235 261533 271983 338828 270643 248452 162073 117728
6535 117728 94038 6170 -33293 1780 59926 102006 132252 187570 165945 -63488 -32792
6524 -32792 -70543 -43043 -55088 -142074 19682 100413 -5791 -199933 -101111 -43233 -119653
6513 -119653 146202 31439 -136187 -174093 -52384 65171 50627 30010 70822 -26546 -111260
6502 -111260 -157569 -158849 151983 196064 3589 -59085 80755 84997 139003 238687 111386
6491 111386 -43905 -116402 28718 -22607 -14604 -22644 -150184 -66976 -69798 -124819 -158785 -155777
6479 -155777 -213487 -269208 -251877 17476 103085 -75153 -36483 -92395 -198749 -139427 -4627
6468 -4627 -151995 -47524 -42379 81828 108677 49917 84624 -158920 -107800 51909 -46612
6457 -46612 166038 64116 139562 87895 -115069 -128328 -213354 23465 94158 57226 22009
6446 22009 -201818 -22234 -2268 71364 133905 51564 181524 155068 47941 76224 355873
6435 355873 254601 123145 67177 61425 -162747 -322675 -207554 -70334 -147960 139674
6425 139674 335340 288732 193358 51306 -17643 51541 -50779 -65480 -160544 28460 -60936
6414 -60936 -139439 156597 238111 171804 227757 323988 153881 97062 265820 321917 452037
6403 452037 453549 419276 368637 363963 184801 -87028 -140202 152405 367390 312188 143115
6392 143115 -127091 66704 82239 142758 235728 288200 199524 282011 172504 179763 94342
6381 94342 43089 90674 207041 50314 -26478 -58122 -160872 4966 211918 264551 301667
6370 301667 235081 160975 194184 180338 236398 129272 -25755 -145665 -2322 106965 21577
6359 21577 23981 317693 282821 63205 56785 144859 73041 -18484 37637 -74850 -41801 -64482
6347 -64482 -103919 17678 -76711 -117162 -172305 -91359 -33616 -137928 -31490 -51452 -115160
6336 -115160 -59786 -443 -58130 30192 141502 -25850 -9266 144999 177122 180527 158809
6325 158809 69075 -11964 -73704 32160 97674 198147 240173 367414 222799 88021 42976
6314 42976 149872 126898 156831 72727 100572 95730 71422 50192 -79910 -174334 -90722 -11982
6302 -11982 234843 340159 274218 36244 9552 85400 82815 204356 214403 169169 95243
6291 95243 272704 83723 108027 128377 112678 246890 208089 -23137 -147413 46599 -108386
6280 -108386 -137490 35506 81016 103906 -151639 -261117 -188030 100610 269750 194205 184867
6269 184867 176555 122700 354578 229726 360698 290128 158617 121483 156573 305288 290932
6258 290932 83065 85570 183306 91420 -13102 195959 144026 110869 -88567 -172538 157123
6247 157123 140917 139642 118150 78665 186498 336659 373481 237334 151257 50946 18453
6236 18453 -16560 44368 225803 219127 106349 200826 110307 183689 152166 138547 -60735
6225 -60735 -46167 -106954 15563 276735 157158 65372 75639 296339 174023 167597 45420
6214 45420 104216 88853 -39296 -143066 -83962 -17154 -76825 -107335 43403 279820 180643
6203 180643 201284 281405 283157 147453 66810 79852 148649 329962 425049 391200 467678
6192 467678 424773 137332 148650 24069 200479 292680 349448 273469 337041 94631 354690
6181 354690 521002 389710 223626 240986 256070 197882 234093 400622 427679 282326 143753
6170 143753 241102 338305 143628 289267 289833 274947 229814 7517 137849 283316 413118
6159 413118 327451 358385 647063 556154 730120 828557 727306 821412 795654 528686 439146
6148 439146 458832 323779 417778 500376 349291 332873 512891 469849 528667 317029 322762
6137 322762 455199 462085 273655 240441 328028 356534 344933 259264 228393 267511 472845
6126 472845 373271 572726 640762 582703 473559 418652 455309 487411 534315 514460 433643
6115 433643 493992 506565 442000 480548 754320 775654 828666 687804 515366 413533 405466
6104 405466 388943 601549 504345 421266 349025 190217 332045 515039 422629 354245 244719
6093 244719 246130 306927 265029 472328 572509 336681 412803 511977 514741 576177 503350
6082 503350 375804 536500 578505 465982 413923 484324 597013 460823 341720 513397
6072 513397 355372 438070 538315 563767 488129 586305 546127 448301 347682 97195 568393
6061 568393 657456 783437 615913 553303 461844 610152 731499 698090 639992 608608 651676
6050 651676 697654 559320 520379 669774 562366 498698 369544 421952 518105 552177 455423
6039 455423 556216 629649 459806 552235 570661 724058 559916 626798 703381 726132 732795
6028 732795 918036 765140 734625 924780 757356 606373 768030 817052 691417 653344
6018 653344 670005 655961 730512 651866 702490 864001 857277 640636 565793 810977 705739
6007 705739 688469 665833 680297 573597 657185 817597 906726 875938 749361 954704 961714
5996 961714 865932 974620 1100499 954986 841706 927392 933478 992721 1041872 1201058 928841
5985 928841 1014450 1090832 955951 857177 1020700 1189301 1183628 985674 970914 1190640 1243094
5974 1243094 1171465 1296751 1420033 1426548 1253845 1362595 1446970 1485341 1540765 1455174 1386530
5963 1386530 1538490 1579926 1313579 1350097 1481026 1343082 1368555 1573923 1640887 1767033
5953 1767033 1696821 1484273 1438503 1637336 1915868 1777866 1654809 1743503 1712041 1715551 1862488
5942 1862488 2005880 1950298 2005583 1927898 1997127 2171939 2080872 1810616 2145200 2457174
5932 2457174 2426756 2443991 2490359 2545992 2632441 2552081 2548824 2525848 2877921 2925865 2767928
5921 2767928 2971475 3073216 2990722 3086933 3107974 3112321 3242409 3381245 3523286 3443506 3527274
5910 3527274 3615373 3637915 3759909 3878449 4101443 4394874 4506321 4550885 4556908 4644230 4814868
5899 4814868 4891199 4929440 4830272 5013784 5406403 5554834 5510799 5556268 5826133 5974801
5889 5974801 6206682 6629579 6833280 7094283 7246079 7491957 7942279 8072491 8292426 8538564
5879 8538564 8972583 9473478 9824278 10122680 10268650 10244364 10591449 11307107 11831841 12215939
5869 12215939 12999561 13639841 14418668 15743980 17135518 18359969 19743556 21471275 23464690
5860 23464690 25936953 28692867 31881071 35630712 39737639 43981252 47809730 50060168
5852 50060168 50066911 47726636 43844804 39992655 37073712 34643669 32713031 31406184 30759011
5843 30759011 30146920 29618096 29636858 30037641 30790217 31972395 33726882 35703030 38349864
5834 38349864 41500285 45079044 49276810 54337699 60273712 67452574 75499385 83973097
5826 83973097 91674519 96093640 95395398 88795659 78578444 68546457 60649384 54862438
5818 54862438 50283712 46853906 43692118 40786878 38103722 35860459 34410514 33397305
5810 33397305 32904340 32725420 32635998 32997346 33879650 34889156 36583588 38556033 40805653
5801 40805653 43863109 47174382 50979391 55044865 57995658 59202772 57316332 52785758
5793 52785758 46997093 41295546 36697128 33117837 30130713 27821239 26143308 24504339
5785 24504339 23039216 21884752 20727514 19884669 19120308 18412611 18018616 17972879 17846397
5776 17846397 17430371 17143385 17059162 16737379 16611310 16380525 16082305 16164752 16098966 16076720
5766 16076720 15724329 15234843 14793379 14531961 14659369 14512456 14535214 14378335 14151024 13922804
5756 13922804 13732749 13828655 13394176 13375936 12988793 12565803 12312402 11952839 11911718 12108092
5746 12108092 12061966 11981785 11954973 11905483 11770980 11589279 11620857 11576910 11537769 11460384 11280398
5735 11280398 11017046 10963311 10820686 10844245 10905158 10894374 11164782 11394838 11573254 11565733
5725 11565733 11395712 10985204 10445058 10008719 9653925 9477817 9331631 9056649 8929857
5716 8929857 8712729 8657609 8536994 8197044 8244954 8255091 8306950 8347488 8270207 8337916 8335955
5705 8335955 8392885 8368486 8406401 8665856 8774692 8880671 9435772 9883144 9996048 10288749
5695 10288749 10443339 10535304 10735405 11006493 11346555 11749658 11962848 11975522 11948180 11880939
5685 11880939 11715352 11580104 11417378 11309826 11225656 10988267 10752060 10635910 10641281 10488669
5675 10488669 10431941 10827845 11212382 11502955 11946651 12570977 13146092 13797002 14656897 15419150
5665 15419150 16288309 17373385 18123923 18572351 18563127 18228067 17367798 16395582 15487162 14753453
5655 14753453 14175791 13566474 13069503 12740849 12168415 11894994 11492209 11280575 11132577
5646 11132577 10962911 11032439 11237529 11464203 11544408 11905391 12471431 13112240 13557403 13983558
5636 13983558 14244183 14378390 14226835 14125834 13561333 12996183 12598514 12217952 11927382
5627 11927382 11619309 11465741 11199134 10990199 10806914 10396151 10045970 9936065 9755895
5618 9755895 9656005 9540551 9346128 9596760 9609437 9767541 9896391 9871532 9757834 9709130
5608 9709130 9691004 9412633 9247463 8834506 8476887 8295652 8184992 8167659 7768207 7525852
5598 7525852 7572597 7376234 7240248 7189473 7163293 6896218 6762825 6836188 6642947 6570173
5588 6570173 6464462 6458339 6529336 6653461 6775915 6666665 6545586 6604274 6530659 6483919 6612378
5577 6612378 6624019 6391709 6545485 6705285 7032305 7668183 8089775 8828338 9828243 10364062
5567 10364062 10660683 10205560 9019305 8077765 7160473 6599301 6206959 6031094 5659303
5558 5659303 5413092 5433011 5394252 5275662 5220209 5028472 5035870 5091809 4985626 4991663 5003442
5547 5003442 5153294 5275435 5307101 5194917 5265402 5380560 5324843 5607130 5825886 5931299
5537 5931299 5950685 5905327 5866366 5801171 5744354 5551295 5537253 5432992 5312213 5360740 5624814
5526 5624814 5624413 5568639 5690793 5841130 6052635 6077846 5871780 6059435 6260139 6205322 6199706
5515 6199706 6336777 6468797 6361469 6465668 6475837 6499730 6634822 6755001 6964300 6902617
5505 6902617 7013629 7335714 7302023 7385795 7700334 7873116 8112183 8478802 9038527 9258227
5495 9258227 9453634 9751062 9901803 10328615 10715636 10874693 11536713 11875447 12170856 12837831
5485 12837831 13182091 13471552 13876465 14345861 14970155 15484225 16371248 17106535 18016165
5476 18016165 19571167 21326767 23197062 25099143 27418108 30243784 33339325 36967468
5468 36967468 40827817 44302960 46721066 47135788 45815467 42632201 39076536 35929577
5460 35929577 33374766 31580608 30373495 29757929 29668071 29387464 29727627 29962820 30134543
5451 30134543 30751795 31984015 33518576 35530097 37815296 40296748 43464118 46907511
5443 46907511 50993906 56065449 62079993 68650373 75078909 80549619 83123057 82205456
5435 82205456 77389010 69752155 62094325 55540627 50048571 45744738 42546966 39979744
5427 39979744 37702176 35900760 34436227 33411596 32940632 32781036 32797277 32823838 33359681
5418 33359681 34083175 35026581 36292833 37827294 39763627 42258369 44837656 47438482
5410 47438482 49425317 50398417 49745538 46729851 42995843 39140450 35537791 32626932
5402 32626932 30308180 28274194 26325399 24795244 23504675 22263026 21192612 20334901
5394 20334901 19360961 18670086 18006136 17356032 16654251 16229676 15771734 15312418 15106758
5385 15106758 14608587 14376320 14147814 13945572 13820777 13602228 13334290 13151571 12994986
5376 12994986 12848015 13023657 12935405 12926355 12914835 12825692 12820223 12935392 13014322 13224468 13228178
5365 13228178 13195478 13120451 13424494 13574798 13623446 13836008 14257094 14508323 14705125 14544117
5355 14544117 14388542 14346738 14246744 14049896 14053851 14138857 14185673 14138914 14104259 13806468 13605879
5344 13605879 13396037 12984095 12892028 12909255 13203138 13316218 13454592 13691186 14203972 14350029
5334 14350029 14801549 15409629 15825354 16311934 16952726 17391424 17652581 17912129 18174457
5325 18174457 18473283 18581990 18485243 18444923 18232166 17889435 17568898 17402624 17393452 17169565
5315 17169565 16683406 16345084 16210004 15993141 15770649 15341194 15244839 15253722 15009872 14819251
5305 14819251 14733694 15124723 15249236 15215823 15327010 15373666 15446575 15780016 16214783 16473738
5295 16473738 16491897 16530769 16417018 16224635 15930464 15495465 14939075 14668092 14485685 14221888
5285 14221888 14085400 13930887 13807176 13710002 13495297 13068543 12929598 12887807 12316228 12076249
5275 12076249 12041390 11894035 12036093 12038824 12088376 12569301 12755978 12950418 13485729 13677835
5265 13677835 13754939 13689981 13353223 12870421 12554815 12378060 12146701 12187553 12058381 11866476
5255 11866476 11788475 11829594 11922764 12008947 12260562 12364792 12780489 12860537 12700345 12883440
5245 12883440 12615868 12280314 12137056 12074211 12028576 11911310 12029573 12044031 11945490 11873516
5235 11873516 11677677 11530036 11382497 11353463 11253011 10861650 10397176 9774317 9185620 8839777
5225 8839777 8479895 8174801 7928836 7779811 7612574 7528837 7320697 7288502 7289445 7238619 7053280
5214 7053280 7170237 7186371 7220231 7238587 7043654 7252370 7244933 7083477 7231964 7197418 6843277
5203 6843277 6798870 6487886 6451596 6225771 5945053 5900840 5643874 5583664 5544127 5377274
5193 5377274 5385755 5388905 5196039 5201566 5201383 5095495 5044551 4875553 4999575 5108080 4913912
5182 4913912 4920093 4870526 4645898 4631254 4772281 4753443 4500734 4459791 4501510 4584413 4486566
5171 4486566 4533821 4361475 4169991 4188029 4261971 4244121 4331750 4308592 4300255 4295544 4162340
5160 4162340 4168382 4037933 3949343 3804172 3899133 3932678 3841908 3890161 3897167 4010032 4003233
5149 4003233 4090846 4126208 3957722 3785828 3836303 3701117 3616214 3778908 3658577 3517297
5139 3517297 3513818 3740501 3875465 3828484 3845503 3795159 3768484 3619880 3586329 3651061 3684163
5128 3684163 3546176 3551227 3495284 3615672 3587931 3505879 3494310 3334546 3453144 3546928 3566048
5117 3566048 3503923 3538615 3545532 3507117 3548135 3345382 3159838 3119441 2989190 3059355 3077206
5106 3077206 3119047 3100546 3033819 2865608 2995069 2930935 2924103 2963093 2820413 2725205 2966922
5095 2966922 2994136 2925778 2953207 3036549 3070933 2984908 2963437 2772230 2569800 2537396 2519032
5084 2519032 2530917 2443728 2339434 2184791 2347154 2454601 2452090 2363710 2313326 2368662 2315966
5073 2315966 2431939 2522615 2395670 2445897 2543538 2573239 2478486 2512743 2387679 2158529 2132191
5062 2132191 2249159 2498665 2483316 2646322 2603992 2465383 2357373 2135461 2276198 2201744
5052 2201744 2225758 2240609 2126018 2171072 2313000 2542979 2329560 2134674 2167498 2136242
5042 2136242 2171618 2347191 2406813 2328812 2378579 2521094 2218251 2148951 2338794 2473040
5032 2473040 2366704 2265224 2080123 1967866 2006529 1972548 1895848 1611446 1469071 1562960
5022 1562960 1785340 1646211 1616448 1565904 1413587 1504893 1332125 1342107 1323218 1212716 1206639
5011 1206639 1471494 1396080 1273197 1325700 1495441 1491946 1170599 1268837 1306345 1073969 1155639
5000 1155639 1258377 1120677 1059473 1099072 1170165 1055076 799661 756059 821977 921635 1208321
4989 1208321 1197021 1023944 914764 805234 614539 526543 658124 547065 811755 837314
4979 837314 696886 589610 571111 945178 921717 826237 818318 756112 658384 777501 692270
4968 692270 743954 899749 678106 711731 658589 711671 719914 879150 906786 806437 675130
4957 675130 890180 866116 730180 488095 410967 303280 374406 578739 602888 655718 735245
4946 735245 740836 573665 658041 698221 588475 620568 856744 669056 791339 884256 966703
4935 966703 658797 703173 739286 387616 477183 565476 430560 653899 618562 489875 534690
4924 534690 488669 413935 475530 551887 550240 298262 722286 615117 412291 474584 616633
4913 616633 773448 533120 446608 456360 584023 551030 407614 396249 468867 452317 480680
4902 480680 461426 498759 477296 413155 324808 565653 632175 624266 733722 670795 733489
4891 733489 710739 561487 444279 436804 378277 405019 521162 776113 761000 511238 581246
4880 581246 627867 433868 647407 756624 647155 742479 856752 730660 591701 482561
4870 482561 608368 661947 464455 231475 438347 718882 667168 698260 610369 684745 680925
4859 680925 1002264 788240 631837 724541 725712 484438 690847 926929 793301 670795
4849 670795 853390 889256 781999 665462 799692 1025373 986308 941762 844279 834275 1005779
4838 1005779 1070989 959192 985801 958900 1063063 997345 898463 800757 859775 1012921 1025808
4827 1025808 1043238 965473 1163456 1203825 1097886 1181633 1279535 1534469 1642728 1462755
4817 1462755 1549605 1742118 1911433 1857189 1798503 1931455 2217754 2259776 2216041 2232367 2371915
4806 2371915 2420061 2489191 2581823 2724178 3057354 3132860 3388985 3750839 4225609 4758080
4796 4758080 4979310 5577967 6131194 6945955 7972573 9124555 10698937 12409109 14622090
4787 14622090 17027059 19273490 20772000 20515105 18716748 15594230 12421431 10028039
4779 10028039 8219237 7037992 6271397 5502182 4851568 4536350 4250572 3828914 3453010
4770 3453010 3254209 3063077 2931758 2640813 2700801 2680926 2606402 2573789 2544632 2298976
4760 2298976 2220357 2298608 2503114 2419975 2408460 2426408 2457622 2457131 2461029 2254204 2468933
4749 2468933 2371904 2427378 2590091 2619677 2685890 2654743 2750733 2655561 2811275 3026655 3239788
4738 3239788 3366336 3559103 3856739 3987296 4195826 4535837 5040767 5468955 6013667 6778656
4728 6778656 7543886 8562040 10030674 11642081 13554127 15671708 17857818 19431296
4720 19431296 19792249 18749082 16888839 14424640 11873072 9526368 7832656 6712046
4712 6712046 5957690 5266416 4658023 4282630 3911862 3512527 3291855 3154317 2819480 2621960
4702 2621960 2552453 2296639 2133618 2204265 2050628 2214607 2119457 2025572 2031339 1921433 1793253
4691 1793253 1807013 1783495 1732646 1574452 1484544 1501628 1383215 1366665 1593280 1548012 1441005
4680 1441005 1559055 1570430 1436173 1466639 1323090 1407828 1345943 1330013 1215482 1246305 1160180
4669 1160180 993760 1034249 1118708 1161626 1053754 912914 1046580 1113150 1089929 1132428 1270221
4658 1270221 1081890 1171363 1064045 955453 1107878 914127 754813 1038163 1021899 728465
4648 728465 640297 756108 712398 711940 666886 696774 635371 701101 531259 455740 536378 611075
4636 611075 660582 692113 746760 747955 759355 860991 1032980 893953 694686 630862 620315
4625 620315 653042 747813 757191 808218 489697 542523 503698 756994 781789 735132 727106 653935
4613 653935 688397 676834 644561 807726 903019 851071 688538 580351 570559 592382 741599
4602 741599 614129 618677 682063 608277 728675 892204 1006383 964933 733874 697867 843700
4591 843700 927406 780199 728370 591851 485040 743961 752081 800828 784546 813576 666422
4580 666422 571489 722116 912350 872667 944860 801144 716760 773408 862588 810917 789615
4569 789615 938237 986290 792401 738017 579888 658815 567391 569872 704344 881940 861581
4558 861581 765390 669947 655584 730926 807075 812395 915800 1042317 991243 847439 933089
4547 933089 981366 645955 769739 967948 1004553 1098022 904563 828132 949624 963730 886288
4536 886288 881580 1004697 832425 811668 913573 778042 713842 722297 824842 881433 884085
4525 884085 775649 838294 1029065 893440 910723 943901 887791 924747 1168319 1059880 986676
4514 986676 946467 961345 939186 909691 822370 936118 1010382 1039234 1096414 1065212 1006336
4503 1006336 1063426 1100909 1104535 1117529 1172651 1000794 833509 825369 891638 1044465 1188327
4492 1188327 983718 958612 936031 1174040 1165203 1077814 1124848 1229456 1253833 1239666 1420412
4481 1420412 1328439 1238486 1356020 1330020 1587059 1547629 1324741 1354964 1393369 1524906 1637745
4470 1637745 1905472 2141403 2119011 2071495 1925809 2132575 2351442 2605013 2465742 2561445
4460 2561445 2814167 2853306 2565805 2061517 1688910 1640513 1848936 1778568 1826188 1865276
4450 1865276 1876768 1858176 1777662 1809047 1878527 1639354 1652614 1685968 1637639 1517192 1636113
4439 1636113 1822565 1712079 1682851 1747570 1571994 1539969 1766503 1939914 1754307 1674123
4429 1674123 1575839 1482026 1821740 1951797 1641779 1557531 1590916 1613692 1680661 1765211 1736804
4418 1736804 1780909 1804371 1851234 1866914 1989474 1858350 1893965 1813414 1572790 1640919 1817468
4407 1817468 1848352 1895197 1914447 1879858 1865028 1919448 1866549 1874817 1957208 1870840 1999848
4396 1999848 1892076 1948271 1870362 1821572 1872094 1801569 1919903 2039163 2051016 2004849 2154172
4385 2154172 2097710 2220056 2056149 1978253 2111047 2091228 2029808 2252941 2322294 2523002
4375 2523002 2642242 2506695 2434307 2631692 2723265 2654636 2796201 2897285 2980758 3058056
4365 3058056 3085010 3068984 3134009 3187936 2998510 3181654 3325726 3085929 3050331 3122718 3316578
4354 3316578 3410009 3459152 3383762 3468500 3590181 3424965 3386753 3494984 3799297 3736846 3780781
4343 3780781 3931935 3969204 4134858 4044224 4064621 4086227 4267239 4473177 4546414 4555628 4768802
4332 4768802 4899555 5090753 5018917 4930154 5236824 5304632 5358110 5304465 5246804 5498748 5570263
4321 5570263 5688989 5767324 5649841 5785774 5815799 5924890 6131162 6229448 6391321 6485793
4311 6485793 6629727 6613454 6836714 6990026 6983549 7262865 7574922 7790044 7981451 8198286
4301 8198286 8590582 8885120 9024235 9011119 9019277 9136139 9199308 9159753 9227188 9166956 9043846
4290 9043846 9040055 9204708 8990479 8994795 8955251 8930084 8924209 9250662 9231111 9089993 9226651
4279 9226651 9514558 9416693 9424787 9726040 9837366 9785738 9950931 10071396 10264625 10402053
4269 10402053 10682454 10789448 10524113 10686788 10604334 10791336 11097455 11279851 11263094 11337692
4259 11337692 11253223 11248509 11355619 11350782 11531939 11558845 11669382 11979090 11963064 11862402 11835375
4248 11835375 12114660 12260595 12386594 12545075 12720628 13008428 13299383 13383138 13732681 13906579
4238 13906579 13943392 14244040 14401782 14360888 14416527 14445293 14688746 14710317 14938179 14925550
4228 14925550 15096575 15219744 15422782 15754178 15813636 16281922 16832566 17256185 17425137 17769575
4218 17769575 18001132 18421677 18869266 19355667 19841231 20307830 20887695 21703563 22189581
4209 22189581 22769367 23789723 24778786 25567927 26394959 27581209 28718292 29846523 30822267
4200 30822267 31894560 33000540 34235107 35415619 36758006 38281641 40245945 42438836
4192 42438836 44637300 47130510 49982757 53864563 58306480 63238760 69054135 75550170
4184 75550170 83057963 91633561 102002764 114946562 130726412 150262868 175442479
4177 175442479 206113576 240962937 274741141 299491682 303861860 283241680 244352852
4170 244352852 201023061 166488486 142024023 124952946 112608789 103854068 97746830
4163 97746830 93257492 90630282 88711949 87269525 84965234 81343076 76710858 71294800
4155 71294800 66520667 62821753 60309575 58386272 56907571 55127595 53482731 51810151
4147 51810151 50451933 49372450 48921341 49116984 49809251 50937405 52752407 55564414 59058579
4138 59058579 62960963 66921903 69825602 70537856 68908857 65343703 61048757 56348684
4130 56348684 51783015 47323428 43440540 40263649 37644097 35683944 33942217 32537873
4122 32537873 31490128 30917951 30213043 29450893 28880740 28705183 28383959 27749527 27197876
4113 27197876 26710434 26003069 25540484 25312125 25234607 24991936 24632649 24247561 24092494 24055363
4103 24055363 23866212 23842064 23884846 24205512 24595685 25171762 25559489 25677226 25353278 24705376
4093 24705376 24112899 23488236 22862883 22352844 21895933 21234608 20740265 20207453 19710109
4084 19710109 19505914 19223588 19038223 18981176 18771352 18630056 18564800 18213082 17952711 17812879
4074 17812879 17599213 17252885 17172582 17170480 17065038 17085692 17137216 17257326 17208016 17227007 17219259
4063 17219259 17136559 17050951 17120953 17569613 17683219 17533829 17759780 18109876 18252784 18282323
4053 18282323 18732813 19389503 19821763 20646492 21511336 22468226 23433985 24516353 26001314
4044 26001314 27970200 30053085 31613608 33060385 33927380 33790588 32913827 31492264 29541298
4035 29541298 27274066 25009952 23487478 22320564 21336968 20604494 19958292 19539569 19213244
4026 19213244 18853666 18460442 18419707 18702847 18603564 18246333 18427577 18348143 18397305 18503875
4016 18503875 18738149 19120233 19246693 19655636 19963316 20371978 20996219 21384566 21776216
4007 21776216 22342199 23236905 24215752 25552230 27254796 29266152 31453368 33307302 34989838
3998 34989838 35692316 35201517 33506511 31382160 29798214 28712397 28212064 28000581 28135980
3989 28135980 28395249 28796457 29753649 30950869 31913386 32809147 33274519 33079561 32386613
3980 32386613 31773297 31312126 31160233 31433429 31692610 32080612 32772790 33694474 34683551
3971 34683551 35233900 35024338 34454490 33966592 33759322 33860824 34475395 35783410 37398290
3962 37398290 39251876 41553880 43539580 44557275 44610195 43308753 40540882 37382032
3954 37382032 34577283 32500565 30982367 29724730 28882070 28407578 27983664 27735085 27681969
3945 27681969 27783912 27942090 28582432 29113507 29642387 29820235 29705245 29690564 29709212 30382091
3935 30382091 31422481 32391998 33846508 36079357 38451238 41451068 44538058 47110228
3927 47110228 48722726 48451849 47729712 48207079 49517727 51733285 53519847 53883197 51123277
3918 51123277 46661690 43190460 41374123 40549448 39881981 39178400 37484189 35370084 33213732
3909 33213732 31108749 29338293 28206130 27323072 26737145 26365572 26038244 25785846 25659988
3900 25659988 25724632 25512205 25513548 25537187 25578080 25780031 25973927 26061784 26425459 26614542
3890 26614542 27099774 27556095 27490900 27482179 27547443 27828122 27895609 27667676 27094137 26475047
3880 26475047 25760073 25286634 24821140 24537875 24474733 24307137 24482611 24850750 25089855 25498110
3870 25498110 25906941 26466755 27063210 27964701 29228854 30594793 31974600 33537646 35372545
3861 35372545 37241356 38736790 39958787 40609495 41115758 41521232 41535399 41055205 40354102
3852 40354102 39246426 37859110 36590884 35397965 34439770 34042013 33836756 33926354 34438573
3843 34438573 35226021 36020159 36689441 37228280 37836641 38211704 38709319 39589689 40926095
3834 40926095 42460728 44072946 46140133 48177600 50149566 51454650 52004237 51931799 51749336
3825 51749336 51555128 51707515 51828838 51537893 51060959 50359273 49708395 49178324 48406263
3816 48406263 48060302 47965037 47623957 47299382 46912954 46048183 44515022 42957854 41815676
3807 41815676 41024920 40603162 40597747 40872098 41516807 42033022 42560884 43462415 44170366 44717582
3797 44717582 45816475 47169665 48789377 50971603 52634414 54050820 54738338 54423432
3789 54423432 53105033 51318339 49636108 47870778 46286063 45446379 44860207 43927635 42926746
3780 42926746 42096839 41442417 40816224 40627865 41055169 41495731 41971884 42192429 41976055
3771 41976055 41279617 40390318 39621763 38978322 38210517 37640345 37351684 37094389 36659556
3762 36659556 35762306 34654633 33390298 32392199 31411213 30408643 29512697 28605575 27689353
3753 27689353 26538566 25553989 24656344 23909942 23367996 23063846 22605671 22305473 22022340
3744 22022340 21602309 21583801 21481898 21293894 20897762 20757855 20600703 20697128 20629291 20209962
3734 20209962 20015342 19966805 19867122 19760548 19668791 19573164 19426464 19297901 19120691 19115191
3724 19115191 19173079 19077073 19280857 19463869 19857632 19896006 20325282 20791140 21254321 21721250
3714 21721250 22130874 22807746 23393887 24269701 25137731 26008697 26888744 27685458 28295717
3705 28295717 28980905 29462298 29678070 29988972 30665488 31046874 31394757 31445800 30852006 30325720
3695 30325720 29535089 28858769 28505481 28414565 28370299 28435512 28989041 29548035 30412155 31411221
3685 31411221 32548464 33887354 35484100 37505010 39648257 41595769 43085905 44693833
3677 44693833 46323733 47825451 49370232 51133205 52494516 53566358 53794298 53295483
3669 53295483 52360339 50789343 49406629 48321489 47438788 46891380 46358291 46280281 45963000
3660 45963000 45329923 45063716 44754323 44970244 45392399 46294565 47577461 49471385 51252432
3651 51252432 52693789 53744327 54221995 54502199 54567224 54868453 55580101 56300568 57004585
3642 57004585 57546271 58249680 58731272 59127571 59317888 59461103 59678228 59693629 59409496 58936871
3632 58936871 58098116 56463846 54269919 52425618 50713186 49768936 49009717 48359870 48207500
3623 48207500 47893658 47769687 47199246 46371870 45687658 45489329 45427313 45618788 46154380 47102364
3613 47102364 48274224 49391351 50616504 51602850 52292319 52519619 52686235 52767637 52364105
3604 52364105 51893251 51325229 50302933 49005576 47561937 45742513 44195761 42852041
3596 42852041 41569950 40392448 39588307 39043964 38645651 38347534 37982510 37825454 37459454
3587 37459454 37593144 37730233 37668146 37522386 37409516 37361943 37343544 37154784 36967957 36994057
3577 36994057 36476109 36145583 36009388 35954971 35700251 35532114 35224913 34405314 33723088 32955137
3567 32955137 32195902 31920930 31379640 30973825 30536679 30275403 30094273 29749044 29432123
3558 29432123 29223227 28862773 28656658 28314974 27790770 27389220 26995151 26823684 26458313
3549 26458313 25996777 25739267 25299162 25087232 24669264 24272088 23887945 23568620 23495689 23265679
3539 23265679 23001702 22821035 22630547 22399438 22018881 21778773 21581264 21346455 21056315
3530 21056315 20805591 20737402 20551315 20424434 20130203 19847848 19699160 19470196 19102678 18642962
3520 18642962 18224122 17913646 17717253 17281159 16920715 16606772 16203142 15961197 15808575
3511 15808575 15951687 15787098 15479077 15482618 15289504 14984637 14726393 14668206 14519011 14467910
3501 14467910 14229981 14010417 13993098 13906917 13547034 13363755 13453404 13356872 13180629 12896470
3491 12896470 12972360 12865805 12759453 12346782 12240826 11831558 11828581 11841400 11741945 12011955
3481 12011955 11817644 11734564 11919245 12067371 12048647 12020424 11812558 11743365 11778024 11619920
3471 11619920 11594538 11552521 11505652 11589981 11663992 11354071 11168249 11344426 11309440 11270185 11369827
3460 11369827 11401663 11471966 11387997 11191480 11183414 11157157 11153724 11281546 11143482 11071961 11304767
3449 11304767 11362100 11417645 11592254 11610799 11640710 11651431 11685460 11847684 11803856 11764782 11849817
3438 11849817 11782926 11840798 11918234 11898971 11766082 11472089 11386360 11538074 11472123 11528947 11548003
3427 11548003 11309768 11301511 11492367 11592331 11581110 11470164 11626755 11812083 12111584 12363896
3417 12363896 12536573 12822221 12877409 12823771 12836992 12796960 12817232 12887989 13031326 12920410
3407 12920410 12928168 12876594 13117004 13225323 12918895 12722523 12421752 12476452 12622230 12646458
3397 12646458 12912650 13084314 13250839 13471760 13517286 13628235 13554674 13525702 13501916 13696938
3387 13696938 13730714 13615889 13728442 13942776 13818320 13718012 13827148 14032832 13754824 13646000
3377 13646000 13581478 13325131 13186474 13131689 12838196 12828914 12715517 12758770 13057410 12806805
3367 12806805 12530761 12574833 12655121 12557975 12459212 12602443 12489513 12132763 11941837 11773630
3357 11773630 11519141 11459688 11358628 11140121 11291096 11156941 11206517 11108543 10892571 11264985
3347 11264985 11283111 11152385 11172295 11369029 11452143 11085293 11106269 11158543 11190520 11123369 10988134
3336 10988134 10895094 10823565 10802772 10871151 10737503 10764998 10681201 10454631 10356727 10168727 9893731
3325 9893731 9870589 9942232 9794862 9635078 9579977 9774714 9805905 9836648 9880347 10038421 9949376
3314 9949376 9823664 9730091 9617116 9555975 9681917 9631204 9579171 9640618 9596733 9746891 9880217
3303 9880217 9902946 9603040 9380400 9613193 9537135 9381374 9334358 9388726 9232454 9360260
3293 9360260 9428306 9565333 9698067 9665610 9725796 9902717 9965213 9675298 9707926 9860581
3283 9860581 9701197 9790631 9882171 9834734 9925281 10232720 10645740 10684527 10872949 11157628
3273 11157628 11455759 11524508 11744544 12061508 12496858 12779527 12871926 13403707 13969980 14655804
3263 14655804 15194435 15820805 16677697 17397755 18186093 18685527 19189454 19193537 18730007 18152829
3253 18152829 17402011 16332571 15306046 14411033 13634645 12856003 11739591 11154882 10551638
3244 10551638 9941275 9426353 9093949 8694530 8370162 8339785 8276414 8296997 8169951 8047767
3234 8047767 8016491 8066806 8211002 8241199 8375310 8695714 9009073 9384964 9637430 9679624
3224 9679624 9099920 8574704 7927414 7375588 6867905 6627509 6419739 6453101 6609662 6655759
3214 6655759 6217077 6034190 6148912 6066516 5953742 5849860 5823106 5960054 5946844 6004125
3204 6004125 5893626 5791380 6090013 6276180 6371283 6411132 6345876 6606600 6755782 6715684
3194 6715684 6894728 6877832 6607002 6431233 6352611 6203631 6093108 5802971 5786998 5580560
3184 5580560 5564141 5411037 5382865 5320793 5396737 5295012 5259327 5410368 5273950 5295628 5096239
3173 5096239 5237075 5224126 5265748 5357701 5416601 5316324 5369149 5329000 5513082 5796240 5743618
3162 5743618 5568504 5630434 5719796 5715091 5781784 5705130 5733314 5474591 5621210 5512064 5494547
3151 5494547 5558943 5213235 5110384 5263861 5259208 5292891 5223020 5105861 5203255 5162748 4982703
3140 4982703 5028486 5220916 5196203 5319669 5328320 5174141 5252646 5335789 5550441 5735481 5576848
3129 5576848 5438154 5608194 5653275 5589023 5394242 5267625 5315434 5210958 5124814 5077860
3119 5077860 5031269 5025261 5031605 4947944 4819890 4780593 4589918 4629996 4497329 4477859 4450736
3108 4450736 4506588 4333209 4223938 4317518 4333670 4297180 4313891 4136655 4016500 4069296 4196603
3097 4196603 4000133 3825785 3937896 3824644 3745536 3831787 3824510 3707803 3605379 3737037
3087 3737037 3780417 3745833 3720325 3581007 3489999 3313285 3239745 3234902 3253197 3140089 3215121
3076 3215121 3240751 2981281 2942151 3034428 2989890 2821547 2763584 2839919 2961894 2814303 2591757
3065 2591757 2368545 2299079 2274177 2290944 2308820 2071744 1983253 1923509 2122027 2147733 1991544
3054 1991544 1931594 1941695 2005979 1818012 1837415 1778958 1759471 1944129 1907490 1792752 1769958
3043 1769958 1692148 1613922 1589336 1654478 1473968 1300320 1330588 1693455 1753967 1412530 1400929
3032 1400929 1420140 1639399 1529761 1518906 1575590 1526477 1550487 1645344 1335023 1301508 1409103
3021 1409103 1326559 1240214 1170956 1303315 1304034 1127448 1167039 1040555 999792 670243 886651
3010 886651 1185942 1334902 1223359 1187366 1249354 1000675 794006 1035895 1036140 936863 1055163
2999 1055163 1078933 1129692 1072206 1020872 978174 848699 923734 745904 668528 716014 1000116
2988 1000116 1012601 1052488 1049373 951807 798161 696789 875774 1022420 843093 762383 704659
2977 704659 568861 662586 510651 522751 580170 660165 823933 897974 796278 833026 704361
2966 704361 827013 1026445 943008 729961 721927 702930 902382 908903 1043769 1050883 991368
2955 991368 782737 616040 962682 1006005 923778 947585 1021303 1112298 1072182 1199304 1161950
2944 1161950 1156521 933084 855855 881920 1034370 1155721 1146724 1288240 1023639 995685 1282708
2933 1282708 1323356 1356604 1196232 1054632 901220 1111720 1049426 1116102 1096686 891967
2923 891967 855089 1027068 1147271 1039601 1082468 1118449 1307805 1559869 1639470 1489183
2913 1489183 1261801 1282873 1272548 1208948 1041504 1142513 936293 697462 726405 743013
2903 743013 813292 668089 882443 1020323 845669 658317 731755 930370 992160 934821
2893 934821 985575 836546 929618 935174 933163 997092 1024902 1160636 1006171 929993 872483
2882 872483 898354 849702 849022 900771 951173 930341 832926 721172 604004 751067 669710
2871 669710 665827 527122 479576 720190 749655 774554 668161 666663 488240 577046 527428
2860 527428 432190 376137 279234 329536 416194 575890 438785 310210 263518 396173 375780
2849 375780 244265 348345 416193 353395 377994 126203 92735 352341 439687 363697 484660
2838 484660 293123 168858 416728 440042 413258 245861 200936 354056 354080 233318 110362
2827 110362 88481 244461 343693 463108 363489 369052 346580 398692 456014 403844 237755
2816 237755 247101 213714 202001 379726 175382 176877 129799 262429 201529 221939 284317
2805 284317 297971 328583 199982 34922 117788 214745 218349 188964 275801 50762 123519
2794 123519 384978 393282 388817 219044 16165 168931 178397 133976 225663 85154 80346
2783 80346 345773 279501 387333 407406 240636 246865 244433 167039 127013 299207 163058
2772 163058 268304 137417 -61680 255932 305026 308431 195849 141084 119554 -5468 86981
2761 86981 50282 -81513 -37499 -120552 -62223 -20177 -10635 126381 -30192 -44666 169592
2750 169592 374520 609645 489112 360027 336117 239204 291279 324806 351626 359091 259695
2739 259695 271714 86717 135677 145610 -58758 -136473 14675 148807 130344 83662 161413
2728 161413 405532 240914 265453 113106 103502 57787 -32603 102738 236218 382755 261266
2717 261266 145027 254146 357764 409591 272394 247129 267526 222750 89679 226536
2707 226536 268737 240617 201726 41712 -36087 -62171 -107633 -59697 34998 -52433 -323660
2696 -323660 -215898 -67415 -23351 -31081 78218 174452 268792 168266 116672 260187 360118
2685 360118 253904 151637 -51097 -210612 -179349 82053 -95688 -177576 -200776 -149091
2675 -149091 -104854 -1089 84917 64642 215863 215664 165593 36224 12983 -45586 -182679
2664 -182679 -175690 -78437 3940 -20036 -76384 -49999 -5953 10969 60096 153632 254208 106811
2652 106811 -116792 -163441 18858 153068 -66664 -252267 -181607 171419 165678 -14885
2642 -14885 3334 280402 260628 375347 221289 58554 83031 -79204 -71307 -73152 -162622
2631 -162622 -91062 36781 242433 402941 313209 137472 42178 -89225 91145 -23767
2621 -23767 4992 -78032 -111587 -256286 53650 307188 71370 86031 198284 81204 6160
2610 6160 79560 87599 -2616 -9573 161229 103485 90870 40865 -10898 97963 -52663 -152213
2598 -152213 -17544 213504 194896 -44677 215483 239160 127646 -184670 -79914 66011
2588 66011 -108950 -83160 281904 278271 92924 33679 -83727 100847 92636 111018 157195
2577 157195 -31550 19904 117418 160857 198434 132296 40191 97371 -29848 93610 202208
2566 202208 56471 -55231 14071 253036 276869 291867 103407 166032 -4759 42057 139070
2555 139070 194526 63121 -118884 -148972 -71884 65094 22633 -38791 -90331 -86269 -2837
2544 -2837 6338 100965 345572 83115 -151263 29569 116852 214016 241595 246354 153694 170751
2532 170751 214360 125640 277701 121848 3192 -186244 -175969 171623 124647 7657
2522 7657 -12508 -163792 -216583 -86563 111271 86299 -10321 17697 27912 18448 43441 127292
2510 127292 166757 39704 -60650 -191529 -42666 150103 58478 95493 -3462 131603
2500 131603 4974 -69537 76446 46347 -37808 -69751 53087 -74417 -184964 -345504
2490 -345504 -216202 -234434 -188269 -15071 -131804 -114428 61214 107738 -90791 -104973 -125321
2479 -125321 -33325 65895 227690 196020 -64110 76070 -42944 -12807 -8057 -425 -213608
2468 -213608 -53146 -85500 -221947 97246 12775 -65351 35479 80722 48043 -3915 -174755
2457 -174755 -116129 -189282 -48376 167392 89287 117757 223787 173791 296928 286581 4432
2446 4432 58181 -82549 18180 103152 204208 57199 76063 8270 225685 167045 -42166
2435 -42166 132288 66876 45996 50987 -120132 -164772 91065 157323 -2223 145500 167937
2424 167937 55031 90113 208980 343635 148721 206821 307208 424887 225701 69588
2414 69588 205819 56480 -83755 252566 -2711 -23289 13807 233049 445106 179826
2404 179826 44419 28944 -86274 -117577 -67245 -166367 -90781 83716 -94280 11814 143827
2393 143827 319158 342954 307795 335721 338768 440601 520526 692939 775476 738613 521155
2382 521155 424457 610659 461722 357125 303478 164581 54770 -20232 225215 192959
2372 192959 271204 298372 36632 11184 536 -755 -35564 35351 99360 -21813 -19962 79485
2360 79485 299244 308814 359223 241347 160089 333515 239284 -65787 25251 113060 57603
2349 57603 393398 311080 101553 234672 101560 -38184 100004 185667 158938 -17513
2339 -17513 -71722 85387 218410 266341 413544 524976 425326 416254 117207 251220 136577
2328 136577 55244 18794 -79668 149100 270876 289232 193451 169417 96039 115391 195874
2317 195874 98450 170905 226521 34211 -14074 82810 343026 284239 227612 379041 403418
2306 403418 491249 314593 241229 276204 218372 147688 155273 126885 30367 86822 139062 266640
2294 266640 343934 337485 256720 488967 441168 321970 208391 422934 417493 114458 253782
2283 253782 181562 463788 446955 183989 215160 3221 187269 256609 177426 247282 285800
2272 285800 191936 384348 375792 498697 479116 265861 449085 331843 135434 276802
2262 276802 402386 303554 110512 168667 243685 248559 297915 214386 260234 253154 244837 365703
2250 365703 375925 287275 404367 431456 522010 498411 632045 620061 521834 452749 429572
2239 429572 790100 689334 579706 474996 316570 409712 544721 544853 791422 840348 701374
2228 701374 655028 615304 815418 850203 700729 938992 951092 996938 1022638 1187470 1193795
2217 1193795 1038338 1175257 1283453 1331305 1215040 1329167 1245734 1036301 1094117 1449031
2207 1449031 1337258 1308939 1338081 1413190 1422813 1571966 1525334 1717948 1730151 1841283 1849366
2196 1849366 1844989 1940307 1955737 1946136 2055852 2108437 2281825 2348307 2318972 2105237 2183383
2185 2183383 2409996 2580456 2636680 2605973 2564440 2705515 2683007 2759020 2824348 2692550 2801167
2174 2801167 2686083 2831954 3094304 3224219 3179311 3207766 3177098 3369683 3415018 3688761
2164 3688761 3711911 3851839 3901969 4012490 4124545 4325971 4517931 4382117 4641406 4909531
2154 4909531 5249224 5647908 6083130 6440075 6529745 6883538 7455014 7967773 8345433 8548551
2144 8548551 9105645 9597223 10091919 10791631 11549333 12168010 12863052 14166374 15520320
2135 15520320 16963165 18525428 20318760 21885340 23446602 25402039 27900573 31147048
2127 31147048 35534041 40769723 47614172 55925042 66811355 81435075 98114108 113044219
2119 113044219 123601873 122034700 100860500 75092459 57896892 46894947 39163783
2112 39163783 33331856 29273994 25896843 23104206 21162907 19441204 18415379 17770890
2104 17770890 16997950 16118367 14707443 13400951 12341537 11503837 10563568 10102949 9623492
2095 9623492 8985570 8360046 7921929 7751073 7464279 7294256 7029620 6659537 6434302 6112711
2085 6112711 6141400 5860327 5601285 5386035 5270046 5050765 4614042 4279074 4317344 4227027
2075 4227027 4162250 4337788 4143334 3952508 3818045 3833210 3578821 3470904 3312314 3030022
2065 3030022 3171400 3277127 3096439 2998493 2739223 2506118 2503249 2466292 2428492 2481267 2343381
2054 2343381 2195412 2273978 2265743 1939915 2056737 2156829 2118701 1822704 1763863 1549519
2044 1549519 1581731 1693352 1593211 1516866 1457663 1476138 1617450 1622185 1457260 1484215 1364316
2033 1364316 1145585 1261703 1209570 1098115 1101826 1024332 1046965 1102295 1030008 902675 919439
2022 919439 1039818 1020700 1086987 1092510 950527 764434 808714 899370 910353 871107 893952
2011 893952 891846 879702 695322 677341 978718 892948 669743 545062 715306 625676 526085
2000 526085 488286 642572 1055377 978417 744873 834022 860296 593029 559223 700001 942965
1989 942965 721594 451123 566251 567046 530142 698881 480418 393820 587473 647875 552044
1978 552044 484838 705653 623884 554630 383455 463530 497094 432107 456273 547509 592142
1967 592142 594274 529064 559928 536676 511835 545231 504881 332629 383958 341410 348364 437514
1955 437514 350866 406905 375247 417203 342087 203878 225107 307345 199085 251072 202417
1944 202417 -6958 115099 172531 73065 101036 119346 212414 348891 500739 422515 490029
1933 490029 402411 316613 393538 230510 311119 406268 542320 290727 67947 273114 264449
1922 264449 50052 -54698 222847 331508 246677 231161 116472 149528 402607 456662
1912 456662 417125 486658 300733 158548 160963 306385 267795 64674 150744 175775 173991
1901 173991 217247 334851 238707 131467 78109 12886 184257 382060 313136 353569 354186
1890 354186 99148 85302 509191 683895 391715 194187 72560 192484 202878 141011
1880 141011 302112 204823 127174 239471 181668 36948 -124956 17107 42912 172686
1870 172686 150002 288106 274940 146985 48367 263327 323945 323815 331667 268936 329599 232813
1858 232813 142499 226153 243990 333983 377481 339943 423586 619731 771924 763328 559814
1847 559814 433668 417237 385095 484062 379846 506994 457759 298212 177850 353360
1837 353360 327581 117419 175583 110532 97457 140667 43202 60227 210980 233733 190600
1826 190600 100396 297831 128666 32017 -68684 -171644 -133204 73457 169925 88457 226361
1815 226361 224129 221158 213513 -36701 14210 42310 -26477 37780 37831 -33619 -107773 -261850
1803 -261850 -132324 -71703 -73735 224845 134725 28015 -214647 -250942 -300679 -57777 123402
1792 123402 120515 -44587 -61467 -190437 -148126 85478 -95765 -91916 26664 -273632 -248762
1781 -248762 -14037 -104046 -240423 -96041 -156283 -223685 -97287 6306 2022 25158 -29785
1770 -29785 -85620 19681 237059 88955 42164 4741 -108758 -115123 18312 74992 -1558
1759 -1558 -115740 -270324 -297911 -108019 -59437 129352 113516 12878 158498 103720 -197917
1748 -197917 -141031 -149956 12255 19679 -117007 33701 -12879 -140033 -25124 -23099 139647
1737 139647 126955 94556 -60202 -30673 43923 40698 205214 223978 248115 26738 -216149
1726 -216149 -318247 -96125 220748 182407 81782 153752 -92533 -69441 -175029 -187883
1716 -187883 -69214 59813 6459 24426 -288778 -53112 79612 -132316 -97819 -169401
1706 -169401 -174089 -44859 -60160 49038 46511 -10553 -82306 -57292 -5338 116926 110435 133279
1694 133279 48849 186681 146446 98408 87794 85468 -11960 -47473 -173471 -176886 -164487 -327995
1682 -327995 -197262 -78755 -73340 -135254 -392685 -237752 31117 55925 126972 66209 113954
1671 113954 -106055 -159942 -96609 -193845 -97614 -11110 118733 5406 25506 -13683 -27806
1660 -27806 33467 -83695 -278433 -196957 46212 138302 -35567 72367 169874 158465 91416
1649 91416 -3678 111354 79455 -18817 146541 284857 98604 56187 99484 50278 -98140
1638 -98140 -113158 -361413 -304440 -231235 -188142 -216819 -22280 -52293 -148853 115634 135604
1627 135604 25452 57034 -71150 -211918 -12167 -50389 -127842 -212800 -110400 -14725 -89242
1616 -89242 46397 -3203 -3379 -110931 -7290 -48986 25043 90912 75416 -27129 -18677 -24090
1604 -24090 -36679 40629 15263 -167077 -287075 -228202 -170659 -437630 -353590 -290331 -232036
1593 -232036 -162337 53139 107751 -45547 -115418 293978 305324 27990 -79082 -175491 -155337
1582 -155337 -33033 40623 -112853 -53157 -75710 -171726 3214 158389 -37735 -14024 18711
1571 18711 16190 -104539 -47491 61016 27734 4468 186907 86881 -93495 -80674 46531
1560 46531 176375 123937 155202 202936 114327 -39014 -137439 -10584 91906 226300 -12681
1549 -12681 46529 212755 190901 -65199 -114927 -32829 -225755 -242245 -45364 -231489 -183992
1538 -183992 76272 81957 -24025 -108641 -10935 14695 121376 59606 -44922 117187 -24147
1527 -24147 -224899 -137000 -139667 -202656 -162907 -12580 -86500 -44951 -48542 -33244 -187409 -167340
1515 -167340 -203207 -198277 38641 51555 -75439 -73319 -96978 167665 196845 -28405 -127965
1504 -127965 -95881 4452 -10072 -173021 -369772 -146585 27111 -25012 -113497 -98356 -50452
1493 -50452 -75616 -158002 -168215 45559 -110460 -48013 -14857 -293299 -165800 -115433 30716
1482 30716 -28087 -246774 -281861 -148957 -172473 -100574 16820 63224 -68847 -87307 -56664
1471 -56664 -191769 -175111 36499 93144 -50430 24613 117121 130255 125977 -7423 117914
1460 117914 193895 37448 -71095 -71470 164080 -36800 -78719 -47569 -220749 -191407 -115699
1449 -115699 -134217 -182485 8620 46451 85828 -15999 52793 69939 -41896 -166724 -7881
1438 -7881 29541 86516 162431 155446 274945 228647 -110903 -148054 -188796 -11604 213045
1427 213045 194122 93164 25694 8517 15344 109942 -16592 -126110 -2364 -48926 -72887
1416 -72887 119778 156675 164474 165551 300938 216406 11238 43847 110303 -11064 150997
1405 150997 38940 -49336 41545 31589 120318 211744 -194222 -178896 -108509 -123492 -90552
1394 -90552 -182039 -80891 -116338 -154216 -243399 -346925 -228265 -151620 -56473 53333 54706
1383 54706 -176081 -260485 -144541 -67280 -64222 -120266 -82124 102642 118461 -68516 -58912
1372 -58912 -87489 -4390 114377 107866 21090 2987 23772 -198462 -323703 -200194 -166897
1361 -166897 -75606 6166 63544 -106625 -268222 -199092 -86467 -37028 -107180 -152934 -221326
1350 -221326 -8725 -87276 -155484 -80184 -148144 -105107 -97497 13842 -37119 34346 -23410
1339 -23410 -200091 -37729 52874 -8955 226321 186411 4867 -107062 -91472 -76465 -302009
1328 -302009 1730 -7279 -112615 -49697 -59351 13109 -13650 -16754 -10462 -79137 22341 46308
1316 46308 25552 59472 293294 268700 -131635 -326816 -216776 -12167 -62483 -212147 -150842
1305 -150842 -93494 -62587 42073 15237 -15028 -73248 -183227 -155710 -3773 -7154 -174165
1294 -174165 -99206 -114982 121747 121094 -7347 -13362 1656 37847 31200 198996 -62899 -176221
1282 -176221 -145928 -151497 -166425 9243 206899 -8129 16899 -38769 -75315 -184109 -72914
1271 -72914 29206 -151085 29444 -19878 -123914 -87397 -125479 -106514 -280337 -236045 -99974
1260 -99974 110498 4843 84563 111961 7823 -85441 -196024 -78083 -222056 -51335
1250 -51335 -142960 -82452 -168100 -88037 -23694 -49229 -14389 -74386 163689 177164 -14154
1239 -14154 67114 -107824 -152886 -44990 -4464 123905 63472 6186 -13624 -445801 -402540
1228 -402540 -276950 35006 -6814 1109 -115633 29462 -110607 -314548 -50030 -24864
1218 -24864 133739 36837 -109765 10415 -59376 -211953 -156462 -250937 -259705 -240158 -227877
1207 -227877 -281067 -433181 -311175 31477 57108 -18128 91121 31087 -83084 49913
1197 49913 376051 147035 -50165 -32699 -9214 24918 26896 209097 82423 -12361 144034
1186 144034 251590 190491 229221 87701 146869 -77211 -23598 -257476 -136677 38903
1176 38903 99671 112067 -119605 -124224 -137167 -263106 -371240 -411533 -205809 33712 -43820
1165 -43820 -241614 -210228 -119412 20376 20176 -72796 -68709 -52488 -143127 -46984 287692 186348
1153 186348 80429 -78004 -127658 -230817 -39116 80921 -60758 61236 -56867 -177411
1143 -177411 -169336 -121556 -74744 -90152 -80445 17948 -80523 -158322 -150889 -216828 -29628 271330
1131 271330 90047 184893 24665 -16254 136942 28853 137638 -70384 -203951 -365657
1121 -365657 -248409 -66199 80891 105147 -101847 -192012 -116784 -139892 -312988 -160190
1111 -160190 -56351 67918 -94170 -214934 44006 -29788 -56031 -17282 -34182 -22073 -25613
1100 -25613 133210 -16438 -72640 79299 -32471 -78826 -54176 -13833 -9255 74745 57317
1089 57317 9454 126925 58948 154372 72640 -107948 -65642 -88356 -230260 -231661 -134179
1078 -134179 -74915 -160659 -291539 -179214 -291584 -219627 72046 -25977 -48707 31804 20219
1067 20219 40946 5540 98638 -13695 84935 82952 268406 198602 5451 78708 147979
1056 147979 61762 -82492 -55185 -126966 -127905 -160944 -32184 -39826 -47376 151553 196663 278156
1044 278156 146428 159332 269025 -4545 -131780 -47067 -60217 132605 96580 76612 21487
1033 21487 -195970 -279748 -148802 49816 163430 79225 133088 3819 41266 58746 -149539
1022 -149539 -183484 -198753 -176539 -95610 -63828 -98495 -15447 -272239 -288079 -6594 -145992
1011 -145992 -162537 -72029 -120244 -78002 -28794 -107456 -34403 -31703 -81911 -12945 73017 124148
999 124148 -67920 15703 -33532 121789 -54525 -84732 -157304 26739 -7750 76009 246957
988 246957 -30205 -117458 -8968 -38172 -128927 -136462 119108 -33687 -161702 -67532 -41175
977 -41175 35012 -61012 -116098 142337 281161 164297 134098 66116 56664 225102 193040
966 193040 78790 225666 101690 136599 308697 104373 1455 41694 14850 205239
956 205239 142540 111719 128441 62940 113454 238272 73201 42612 -70665 -28879 61927
945 61927 136173 -2855 54933 -23290 155165 98529 72926 -27895 -72702 -186612 10434
934 10434 4691 -147093 -27325 30605 70816 -66090 -192172 -228609 -145107 -62977 -51864
923 -51864 -119901 124987 129634 102326 49315 53284 42247 -23342 -95164 -122655 -33065 -122103
911 -122103 -196284 -51677 -121733 -144585 -74776 -150453 -62772 -30550 -132777 23732 -17264
900 -17264 60933 -67310 -4035 -110473 -1803 66164 55337 -90039 -122369 -89643 45671
889 45671 -5534 -28409 52694 47641 -42847 -103555 2003 -35567 -21828 196760 176578 165189
877 165189 62106 32788 106766 163566 74414 -58024 -32342 42117 172794 108530 -8183
866 -8183 -63674 -107528 -96937 52997 22607 -6116 -78097 -37557 -35216 -52868 -129067 -72488
854 -72488 69102 20607 68831 83621 -25352 159139 3267 6911 140658 -8481 84891
843 84891 -24517 -275003 41147 -114656 -151965 -38807 -123182 -146850 -139055 -70499 60424
832 60424 8148 11858 -26842 3069 64681 72437 62588 105592 187426 181589 199258 58444 54002
819 54002 239905 301086 58176 195549 92109 -260513 -257451 -110676 -82203 -235198 -63490
808 -63490 -26378 120813 368166 363234 179125 5418 45144 99721 -247 60947 386031
797 386031 62007 1253 -179108 -166368 -92147 -36595 -1247 76471 59987 -101654 100639
786 100639 102201 -19163 -92926 -139447 -123814 91730 6002 37099 -29957 23606 -48901 100547
774 100547 -30821 -160758 -63721 -15403 -158314 91592 46888 -75442 -123673 -91133 140504
763 140504 50305 -75086 -242726 -197783 -298974 -294356 -298964 89538 132812 -9832 -55860
752 -55860 82943 -1200 41806 168771 126851 81951 -183484 -343490 -66564 -143719 -249607
741 -249607 -228312 -27012 -27725 -105397 -21617 27103 18245 -263817 -219438 -101073 -20297 88604
729 88604 143849 -3015 -326174 -62339 292571 152864 174154 46658 -92495 21846
719 21846 93356 136507 72899 -161932 -266778 -36710 176907 137673 196307 91411 57180
708 57180 -138564 -205390 -167142 -140626 -163976 -104045 -12983 -58410 -77071 -147451 -46167 -62412
696 -62412 -25019 -105516 -75289 77211 -258 103380 -71302 -264192 -332275 -136003 178181
685 178181 305014 146970 114798 59767 45613 254313 272678 94005 53603 -15518 -248889
674 -248889 -225442 -141263 1115 -105757 17897 144132 51086 -21132 -18555 -19354 -31682 -69319
662 -69319 -140545 53717 86260 -10507 -113499 -84834 116193 204947 149331 33633 91668
651 91668 -105225 -76397 -1449 -10514 -161492 -85325 113032 -7379 -81072 23930 33396
640 33396 100034 43169 69361 -26277 -177999 -59926 -50899 -62328 -164686 -149044 -14717
629 -14717 155408 129021 105185 88986 111911 188359 -59170 116361 123339 23744 -18508 -148570
617 -148570 -142087 -243532 -147408 -77244 -6382 -54252 -175919 -127328 -81810 5486 151706
606 151706 293676 82286 210188 211378 153497 114604 10301 -131720 -275153 -333924 -312320
595 -312320 -104753 -162340 -3720 -119973 -35381 192292 3417 45624 153323 -10365
585 -10365 103522 76532 24291 33749 124317 288873 284775 145540 185852 239485 157394 166375
573 166375 193740 347191 220299 -89762 64985 176721 142669 -22626 -39256 -22709 41022
562 41022 -87292 -101635 -97982 136124 149736 113017 139174 19265 40166 169849 135630
551 135630 15532 7397 40595 237801 433088 210030 19764 -5678 -10379 -44797 -9406
540 -9406 105198 273723 339796 -10410 -42241 -130857 -86331 62301 -155843 -326694 -233759
529 -233759 29004 -45676 67684 91748 48438 14735 120046 59976 -47524 -144323 -98828
518 -98828 55337 -108474 -72463 -57146 -127347 -26141 122155 -55719 -103296 -82404 -50021
507 -50021 43692 146210 -98383 8324 7959 23330 -21880 43115 9168 -27396 45315 167946
495 167946 224567 141357 113324 121446 91721 -83269 -89569 -214876 -42487 146372 50372
484 50372 150341 -17521 121659 58777 110440 126927 -12267 -1379 -184395 -314584 -99736
473 -99736 124231 -75137 -108469 -23027 48750 184552 -30973 -136847 -25897 207300 -1833
462 -1833 62743 170367 78207 -39821 3665 57436 -75135 -4482 65824 -129502 -44483
451 -44483 34036 -148623 -98267 47358 23895 -44219 -18541 -4392 112706 12145 -17869
440 -17869 -126878 25316 170367 117183 86592 53079 62160 144475 13706 -208838 -68423
429 -68423 -69794 -244172 -43882 -59453 66072 126827 229547 188891 98615 43683 23878
418 23878 -52185 -142161 -163129 66079 193413 91120 23954 31595 166090 160366 109127 116092
406 116092 182571 -88914 -315925 -193580 -14775 32951 103366 1513 -154706 -89459 -144734
395 -144734 -129957 42204 338054 147816 147308 -117709 -284155 -98357 -23030 -46603 -66115
384 -66115 22488 126523 72687 53497 -46031 -17962 -67638 -9788 -49678 -70667 75270 134635
372 134635 128545 122099 271350 29871 -39120 192720 109368 -103851 -73821 67920 6446
361 6446 -23679 -48300 -98885 36108 197789 112218 55023 126302 51121 70021 -15274 74609
349 74609 159113 334918 187300 66510 32242 158400 291935 156262 66459 4489 -10743
338 -10743 282970 188037 9670 31521 -289463 -309052 -152421 -259725 -34896 -110671 97088
327 97088 51319 -193485 -210215 -233748 80977 206493 140677 -38265 -77184 -106051 -97543
316 -97543 130457 195216 57716 62205 79765 94515 -18939 -38196 60262 -262593 -187308
305 -187308 -37031 -46265 -111654 300 195056 115316 35301 -253373 -39511 -10683 -112622
294 -112622 -158418 -110744 -19983 -12135 19721 -99598 43996 69177 -9212 -97653 -144463 -27735
282 -27735 49936 320550 200257 75243 87106 15341 81463 216894 74861 41784 164921
271 164921 98676 211220 234789 262980 257292 223747 325553 181350 74396 -35445 -82925
260 -82925 63949 -100615 8542 -177193 55738 106774 -143275 -68662 9523 -32256 82078
249 82078 196191 202051 235417 72616 27028 -26901 -89552 -127574 -242781 -92608 10090
238 10090 176240 -31357 -298709 -321008 -102077 -144589 -78744 -16733 -98350 30118 -98773
227 -98773 -26339 -84019 194488 249379 135592 333736 126137 223008 320726 282036 159205
216 159205 -105289 -59399 -26970 102076 194965 132586 -118477 1726 38525 -28876 53277
205 53277 160274 -20807 43652 -25652 117770 60128 148982 91685 65463 26836 88457
194 88457 51518 -73985 -58437 -17913 -20823 71899 51749 104862 127054 69500 -37562 144029
182 144029 189975 -92282 -181881 -204972 -54406 -61586 56285 74318 -14770 284328 260387
171 260387 207380 27667 -48435 146592 118020 181490 -607 22092 189742 228506 -65387
160 -65387 118186 158939 6046 104142 -78081 -209032 66079 113398 -65649 -37127 104533
149 104533 -3974 113145 26113 -42217 177692 226763 100750 213629 172673 238495 183578
138 183578 195902 72661 79786 120290 85746 46383 1905 -1069 202011 311861 221057 177022
126 177022 -57998 -204615 -189128 -176918 -96481 187260 92630 -15857 165403 245870 180284
115 180284 97508 85015 117425 12207 106524 119567 73582 -16331 -67866 -580 23957 21759
103 21759 -25482 -180611 -168728 -144707 -37392 -6568 121595 17587 -107487 34042 -180018
92 -180018 -181969 -81825 74616 64943 -48257 -48504 -124179 -243330 -67732 84779 11561 77243
80 77243 201055 268301 79930 155970 238997 125627 90408 81340 5672 -26624 -29185 -7276
68 -7276 74636 92998 78294 158425 114391 7309 189620 237543 365149 121926 80162 6251
56 6251 -66374 22906 152390 83312 130907 281927 169807 60332 -33866 100079 155243
45 155243 77698 173604 126335 47436 44698 35993 38355 -27129 17681 79640 142742 114996 118198
32 118198 92973 185645 167729 58619 31706 87805 110018 131284 267413 273377 87882 -62871
20 -62871 -47169 123972 166510 132952 113203 68417 -30861 32301 56700 -71485 -111339 19415
8 19415 -53564 16329 105505 174031 160259 97979 -19424 16715
0 16715
$$ Imaginary data points
##PAGE= N=2
##DATA TABLE= (X++(I..I)), XYDATA
16383 -1270644 -1235621 -1158590 -1067684 -1163258 -1135925 -1163105 -1147438 -1022280 -1024800 -1011474 -1079086
16372 -1079086 -1201964 -897912 -897331 -921302 -841115 -802113 -848947 -908296 -774055 -705070 -624402
16361 -624402 -573893 -511349 -571610 -519340 -425442 -636589 -661971 -609867 -475760 -415016 -299496
16350 -299496 -327420 -299088 -263282 -254020 -347563 -400132 -355094 -359326 -214433 -241404 -195509 -322276
16338 -322276 -332754 -289219 -258031 -199000 -105217 -68880 62690 -21747 74159 56569 179380
16327 179380 165286 150550 254383 178636 193845 122481 274418 289058 136714 181838 311825
16316 311825 249840 269269 244334 233417 206700 347365 360374 463605 564057 605870 520232
16305 520232 537218 389854 288653 336373 396817 455671 705077 643037 687715 755840 655716
16294 655716 713603 777609 745437 782029 818943 966540 945221 745660 638220 805472 779285
16283 779285 704958 694294 756638 894035 857432 973399 1081329 1053494 1013330 1042224 1106439
16272 1106439 1150163 1210888 1247819 1104763 1114159 1262027 1336716 1266838 1231130 1134815 1185388
16261 1185388 1188352 1288329 1235153 1273774 1373488 1344376 1348362 1334338 1215869 1126283 1171551
16250 1171551 1229513 1249965 1439976 1461722 1343973 1358639 1425816 1326070 1445572 1297014
16240 1297014 1383618 1466607 1290939 1299662 1430859 1448498 1444950 1545024 1497255 1539939 1582458
16229 1582458 1672294 1788411 1751709 1782906 1784532 1568138 1555289 1619180 1633689 1653728 1616458
16218 1616458 1898241 1994173 1988008 2061224 2034725 1974260 1936753 1944997 1937287 2040676 1989361
16207 1989361 1839738 1788587 1702996 1837352 2165130 2143514 1851450 1809270 1941845 1956757
16197 1956757 1901794 1990922 2018130 1953076 1877598 1949489 1946170 2075182 2135254 2097554 2160738
16186 2160738 2247146 2150909 2093670 2006494 1727608 1898216 2008623 2011597 2044446 2117942 2162543
16175 2162543 2262515 2154507 2034632 2023550 2286961 2163883 2248043 2238159 2154243 2261583
16165 2261583 2265982 2293152 2334473 2110546 2147000 2253341 2169403 2195763 2264439 2269655 2209920
16154 2209920 2183180 2334629 2230190 2250281 2435388 2171375 2252884 2270620 2309809 2152765
16144 2152765 2124887 2067345 2220095 2364310 2303957 2257340 2125804 2201591 2460608 2529117
16134 2529117 2571015 2439773 2283629 2174282 2150964 2138518 2318444 2520151 2418448 2260127
16124 2260127 2256201 2302340 2397230 2347225 2539278 2563001 2410551 2546298 2578156 2464379 2468961
16113 2468961 2248327 2282951 2447714 2577038 2766477 2520707 2404783 2274958 2322631 2460858
16103 2460858 2343880 2264033 2400271 2418552 2546656 2455028 2529638 2538651 2501851 2429138 2437366
16092 2437366 2333989 2331306 2439109 2502977 2479921 2450557 2371140 2554092 2578897 2509014 2329192
16081 2329192 2361405 2495392 2390525 2359951 2358501 2483095 2447426 2474038 2563077 2619979 2677434
16070 2677434 2580960 2307425 2304049 2439154 2416796 2463989 2376250 2370036 2379224 2498639 2555202
16059 2555202 2552011 2567419 2515664 2554326 2403955 2474734 2370523 2223623 2413185 2475823 2608827
16048 2608827 2836545 2580205 2525055 2407773 2379350 2485270 2513215 2628447 2496087 2287133
16038 2287133 2250002 2246510 2327509 2402989 2584511 2447835 2449636 2482088 2513682 2554347 2388401
16027 2388401 2433043 2568132 2658795 2520250 2668262 2614792 2438700 2545979 2738774 2723090
16017 2723090 2607480 2601795 2464960 2278011 2382289 2471053 2709136 2481266 2285986 2341621
16007 2341621 2659480 2614168 2422297 2579528 2561333 2617679 2554510 2209945 2270420 2541432
15997 2541432 2652450 2838018 2459744 2312675 2457973 2467294 2594605 2633342 2536735 2378311
15987 2378311 2257156 2438483 2549474 2591748 2558927 2488957 2503291 2688829 2607459 2594709
15977 2594709 2390010 2598664 2698872 2638717 2680208 2683071 2606169 2415808 2463236 2595968
15967 2595968 2437051 2527644 2689215 2796438 2604821 2422163 2636728 2462157 2370425 2342008
15957 2342008 2208068 2411319 2555699 2760215 2700474 2605735 2584256 2541891 2607411 2491641
15947 2491641 2469200 2524787 2419528 2519314 2697768 2738307 2695829 2526447 2713991 2676699
15937 2676699 2658965 2545048 2278769 2400885 2638262 2788133 2775881 2600182 2500997 2360344
15927 2360344 2416166 2520715 2411936 2462215 2570400 2503720 2631554 2780628 2829837 2759914
15917 2759914 2642804 2654032 2585574 2519646 2530502 2650076 2695134 2598061 2572201 2584523 2594104
15906 2594104 2471564 2412762 2533075 2598203 2493642 2461951 2389603 2525437 2551120 2410047
15896 2410047 2433405 2590578 2678473 2617524 2636562 2852575 2544903 2601893 2651241 2373823
15886 2373823 2610789 2550427 2422765 2554413 2468346 2503718 2505164 2428010 2636284 2770336
15876 2770336 2670703 2433016 2508822 2760438 2733739 2776840 2577222 2762522 2670785 2584830
15866 2584830 2647896 2744924 2606399 2552843 2637436 2531882 2514984 2500565 2573789 2460790 2446671
15855 2446671 2521741 2557729 2482353 2621814 2625322 2510577 2392566 2362505 2422360 2578466 2630693
15844 2630693 2606840 2578609 2515570 2520143 2547836 2418957 2585172 2612134 2823577 2938297 2691541
15833 2691541 2565600 2642156 2559427 2422195 2537902 2678997 2643604 2591854 2529899 2496366
15823 2496366 2689367 2749343 2422810 2419697 2599523 2605681 2638695 2442936 2468913 2364879 2345971
15812 2345971 2521222 2597695 2659659 2631781 2616349 2589186 2507391 2475219 2520626 2536040 2516903
15801 2516903 2731625 2606539 2579514 2717512 2688694 2560418 2537038 2488770 2536167 2504886
15791 2504886 2604865 2887304 2661293 2596039 2683129 2794473 2589848 2499876 2460663 2576056
15781 2576056 2779378 2735499 2652553 2622494 2710479 2842996 2736422 2671931 2474461 2386899
15771 2386899 2617769 2574085 2519488 2509886 2462679 2347161 2247361 2452961 2598040 2559531 2544784
15760 2544784 2671915 2747212 2732255 2549621 2459499 2387106 2503586 2507863 2526157 2513465 2405514
15749 2405514 2382383 2341845 2443980 2432611 2511541 2502625 2524751 2775819 2865385 2582033 2531116
15738 2531116 2540038 2648401 2636898 2606488 2656450 2624968 2673293 2435744 2297457 2531526 2780783
15727 2780783 2588755 2507903 2630450 2862029 2866297 2764389 2616057 2397012 2436469 2531983
15717 2531983 2693087 2741292 2454863 2584561 2673490 2651142 2434601 2384076 2263233 2366016
15707 2366016 2622962 2690858 2646410 2647702 2619736 2476560 2624882 2636943 2621359 2542846 2460948
15696 2460948 2508222 2487664 2502726 2662137 2591160 2600413 2627830 2786903 2871446 2734208 2578437
15685 2578437 2601101 2537893 2783180 2707543 2468172 2400383 2420214 2575713 2844752 2825792
15675 2825792 2792695 2740367 2850078 2637455 2716845 2781939 2620099 2670259 2558064 2510466
15665 2510466 2589901 2369333 2408911 2429221 2661654 2862953 2862773 2767737 2423179 2366352 2504580
15654 2504580 2687196 2825057 2572158 2623996 2685456 2751135 2779519 2655024 2725716 2648297
15644 2648297 2556108 2467127 2484604 2584665 2772779 2565487 2633621 2669881 2705517 2573362
15634 2573362 2452650 2297024 2459067 2603597 2468335 2390170 2444923 2386445 2363561 2493885
15624 2493885 2526325 2573973 2621607 2683828 2645118 2479338 2553481 2553687 2577636 2745322 2622757
15613 2622757 2718121 2719351 2583314 2502466 2479608 2556160 2509799 2567620 2649861 2717548 2669031
15602 2669031 2477140 2469377 2402992 2476961 2838767 2785604 2649211 2664670 2604976 2382935 2384736
15591 2384736 2540637 2723140 2667408 2504961 2613414 2588150 2666474 2799052 2546358 2623936
15581 2623936 2462988 2465437 2651652 2797201 2654893 2556424 2675476 2654707 2805969 2793796
15571 2793796 2782241 2843260 2829779 2621680 2659165 2563353 2575392 2509209 2673190 2558766 2643886
15560 2643886 2894065 2778243 2619811 2526236 2568866 2714001 2852214 2701628 2519396 2407042
15550 2407042 2785187 2626872 2438970 2571204 2665123 2664928 2762862 2787348 2687178 2660199 2526071
15539 2526071 2682083 2745421 2851071 2691063 2543327 2822007 2779034 2630404 2672997 2810016
15529 2810016 2846968 2797290 2547614 2520749 2672909 2523684 2670774 2649465 2545240 2500642
15519 2500642 2489276 2458626 2520167 2545984 2565756 2700573 2823715 2722096 2387537 2740433
15509 2740433 2694664 2573428 2532485 2524390 2468740 2642850 2880726 2883317 2852991 2869112 2896870
15498 2896870 2872495 2619868 2481157 2711996 2895863 3047814 2705853 2581837 2762490 2735889
15488 2735889 2740753 2796672 2706374 2822478 2750675 2678871 2636818 2601469 2643032 2601342 2589348
15477 2589348 2606791 2713546 2785655 2640141 2621203 2861283 2728644 2546745 2624718 2601927
15467 2601927 2725129 2676338 2640512 2645279 2639444 2532199 2591308 2544531 2686130 2451110 2485642
15456 2485642 2578050 2598526 2693545 2635387 2458454 2325143 2612152 2651350 2610845 2343553
15446 2343553 2382085 2433552 2515267 2683412 2763919 2598313 2475273 2475218 2814526 3020302 2895936
15435 2895936 2847696 2792269 2777311 2781529 2761656 2706979 2411901 2491215 2617974 2587312 2745881
15424 2745881 2786154 2614973 2644016 2720242 2857801 2893212 2660844 2786455 2714358 2537035
15414 2537035 2611839 2736275 2763196 2637693 2625992 2897927 2856493 2973605 2828341 2645087
15404 2645087 2739273 2818227 2748237 2626039 2792662 2714973 2608590 2562703 2556168 2659195 2764310
15393 2764310 2699397 2824332 2710121 2562383 2654934 2713061 2656054 2670755 2753698 2644672
15383 2644672 2709488 2547732 2622022 2721725 2721462 2658729 2657109 2804270 2954170 2940893 2783676
15372 2783676 2894836 2959343 3192132 2910757 2758135 2734542 2574273 2688020 2917027 2884154
15362 2884154 2861418 2746139 2684493 2809148 2783767 2829381 2792274 2821101 2721776 2521366 2686528
15351 2686528 2692043 2796960 2874513 2727657 2664944 2404986 2661884 2786649 2786398 2755013 2671528
15340 2671528 2649876 2638884 2665235 2530004 2647805 2851170 2878939 2897187 2870396 2755457
15330 2755457 2640758 2800834 2891088 2847806 2763667 2801693 2926284 2722215 2696542 2777965
15320 2777965 2609803 2647537 2630742 2725033 2647442 2654813 2704957 2755631 2922485 2869144 2734116
15309 2734116 2707962 2594702 2638696 2682944 2555463 2687252 2805172 2689406 2458132 2584058
15299 2584058 2571007 2767025 2827838 2778694 2971323 2874696 2816853 2859316 2728198 2645554 2637136
15288 2637136 2730871 2750479 2488920 2253792 2381057 2495495 2601314 2673287 2454219 2614876
15278 2614876 2689294 2517079 2501113 2529064 2531649 2641540 2631648 2623160 2679301 2733186 2905190
15267 2905190 2956961 3161674 2871718 2766644 2721229 2721894 2733664 2583349 2473467 2673401
15257 2673401 2537330 2391317 2575043 2881984 2953057 2692384 2518441 2488367 2564576 2708039
15247 2708039 2620931 2502759 2479688 2641019 2790073 2713253 2797379 2772622 2798661 2665469
15237 2665469 2710035 2948429 2858597 2695947 2842752 2936167 2860424 2780209 2756302 2711904 2894056
$$ [...]
##END NTUPLES=NMR SPECTRUM
##END=
